[JENKINS] Lucene-Solr-Tests-7.0 - Build # 33 - Unstable

Previous Topic Next Topic
 
classic Classic list List threaded Threaded
1 message Options
Reply | Threaded
Open this post in threaded view
|  
Report Content as Inappropriate

[JENKINS] Lucene-Solr-Tests-7.0 - Build # 33 - Unstable

Apache Jenkins Server-2
Build: https://builds.apache.org/job/Lucene-Solr-Tests-7.0/33/

1 tests failed.
FAILED:  org.apache.solr.update.AutoCommitTest.testMaxTime

Error Message:
Exception during query

Stack Trace:
java.lang.RuntimeException: Exception during query
        at __randomizedtesting.SeedInfo.seed([15F6463553D20E97:8F023BD7CD4892AB]:0)
        at org.apache.solr.SolrTestCaseJ4.assertQ(SolrTestCaseJ4.java:878)
        at org.apache.solr.update.AutoCommitTest.testMaxTime(AutoCommitTest.java:270)
        at sun.reflect.NativeMethodAccessorImpl.invoke0(Native Method)
        at sun.reflect.NativeMethodAccessorImpl.invoke(NativeMethodAccessorImpl.java:62)
        at sun.reflect.DelegatingMethodAccessorImpl.invoke(DelegatingMethodAccessorImpl.java:43)
        at java.lang.reflect.Method.invoke(Method.java:498)
        at com.carrotsearch.randomizedtesting.RandomizedRunner.invoke(RandomizedRunner.java:1713)
        at com.carrotsearch.randomizedtesting.RandomizedRunner$8.evaluate(RandomizedRunner.java:907)
        at com.carrotsearch.randomizedtesting.RandomizedRunner$9.evaluate(RandomizedRunner.java:943)
        at com.carrotsearch.randomizedtesting.RandomizedRunner$10.evaluate(RandomizedRunner.java:957)
        at com.carrotsearch.randomizedtesting.rules.SystemPropertiesRestoreRule$1.evaluate(SystemPropertiesRestoreRule.java:57)
        at org.apache.lucene.util.TestRuleSetupTeardownChained$1.evaluate(TestRuleSetupTeardownChained.java:49)
        at org.apache.lucene.util.AbstractBeforeAfterRule$1.evaluate(AbstractBeforeAfterRule.java:45)
        at org.apache.lucene.util.TestRuleThreadAndTestName$1.evaluate(TestRuleThreadAndTestName.java:48)
        at org.apache.lucene.util.TestRuleIgnoreAfterMaxFailures$1.evaluate(TestRuleIgnoreAfterMaxFailures.java:64)
        at org.apache.lucene.util.TestRuleMarkFailure$1.evaluate(TestRuleMarkFailure.java:47)
        at com.carrotsearch.randomizedtesting.rules.StatementAdapter.evaluate(StatementAdapter.java:36)
        at com.carrotsearch.randomizedtesting.ThreadLeakControl$StatementRunner.run(ThreadLeakControl.java:368)
        at com.carrotsearch.randomizedtesting.ThreadLeakControl.forkTimeoutingTask(ThreadLeakControl.java:817)
        at com.carrotsearch.randomizedtesting.ThreadLeakControl$3.evaluate(ThreadLeakControl.java:468)
        at com.carrotsearch.randomizedtesting.RandomizedRunner.runSingleTest(RandomizedRunner.java:916)
        at com.carrotsearch.randomizedtesting.RandomizedRunner$5.evaluate(RandomizedRunner.java:802)
        at com.carrotsearch.randomizedtesting.RandomizedRunner$6.evaluate(RandomizedRunner.java:852)
        at com.carrotsearch.randomizedtesting.RandomizedRunner$7.evaluate(RandomizedRunner.java:863)
        at com.carrotsearch.randomizedtesting.rules.StatementAdapter.evaluate(StatementAdapter.java:36)
        at com.carrotsearch.randomizedtesting.rules.SystemPropertiesRestoreRule$1.evaluate(SystemPropertiesRestoreRule.java:57)
        at org.apache.lucene.util.AbstractBeforeAfterRule$1.evaluate(AbstractBeforeAfterRule.java:45)
        at com.carrotsearch.randomizedtesting.rules.StatementAdapter.evaluate(StatementAdapter.java:36)
        at org.apache.lucene.util.TestRuleStoreClassName$1.evaluate(TestRuleStoreClassName.java:41)
        at com.carrotsearch.randomizedtesting.rules.NoShadowingOrOverridesOnMethodsRule$1.evaluate(NoShadowingOrOverridesOnMethodsRule.java:40)
        at com.carrotsearch.randomizedtesting.rules.NoShadowingOrOverridesOnMethodsRule$1.evaluate(NoShadowingOrOverridesOnMethodsRule.java:40)
        at com.carrotsearch.randomizedtesting.rules.StatementAdapter.evaluate(StatementAdapter.java:36)
        at com.carrotsearch.randomizedtesting.rules.StatementAdapter.evaluate(StatementAdapter.java:36)
        at com.carrotsearch.randomizedtesting.rules.StatementAdapter.evaluate(StatementAdapter.java:36)
        at org.apache.lucene.util.TestRuleAssertionsRequired$1.evaluate(TestRuleAssertionsRequired.java:53)
        at org.apache.lucene.util.TestRuleMarkFailure$1.evaluate(TestRuleMarkFailure.java:47)
        at org.apache.lucene.util.TestRuleIgnoreAfterMaxFailures$1.evaluate(TestRuleIgnoreAfterMaxFailures.java:64)
        at org.apache.lucene.util.TestRuleIgnoreTestSuites$1.evaluate(TestRuleIgnoreTestSuites.java:54)
        at com.carrotsearch.randomizedtesting.rules.StatementAdapter.evaluate(StatementAdapter.java:36)
        at com.carrotsearch.randomizedtesting.ThreadLeakControl$StatementRunner.run(ThreadLeakControl.java:368)
        at java.lang.Thread.run(Thread.java:748)
Caused by: java.lang.RuntimeException: REQUEST FAILED: xpath=//result[@numFound=1]
        xml response was: <?xml version="1.0" encoding="UTF-8"?>
<response>
<lst name="responseHeader"><int name="status">0</int><int name="QTime">0</int></lst><result name="response" numFound="0" start="0"></result>
</response>

        request was:q=id:529&qt=&start=0&rows=20&version=2.2
        at org.apache.solr.SolrTestCaseJ4.assertQ(SolrTestCaseJ4.java:871)
        ... 40 more




Build Log:
[...truncated 10900 lines...]
   [junit4] Suite: org.apache.solr.update.AutoCommitTest
   [junit4]   2> Creating dataDir: /x1/jenkins/jenkins-slave/workspace/Lucene-Solr-Tests-7.0/solr/build/solr-core/test/J2/temp/solr.update.AutoCommitTest_15F6463553D20E97-001/init-core-data-001
   [junit4]   2> 77098 WARN  (SUITE-AutoCommitTest-seed#[15F6463553D20E97]-worker) [    ] o.a.s.SolrTestCaseJ4 startTrackingSearchers: numOpens=1 numCloses=1
   [junit4]   2> 77098 INFO  (SUITE-AutoCommitTest-seed#[15F6463553D20E97]-worker) [    ] o.a.s.SolrTestCaseJ4 Using PointFields (NUMERIC_POINTS_SYSPROP=true) w/NUMERIC_DOCVALUES_SYSPROP=false
   [junit4]   2> 77100 INFO  (SUITE-AutoCommitTest-seed#[15F6463553D20E97]-worker) [    ] o.a.s.SolrTestCaseJ4 Randomized ssl (true) and clientAuth (false) via: @org.apache.solr.util.RandomizeSSL(reason=, ssl=NaN, value=NaN, clientAuth=NaN)
   [junit4]   2> 77100 INFO  (SUITE-AutoCommitTest-seed#[15F6463553D20E97]-worker) [    ] o.a.s.SolrTestCaseJ4 ####initCore
   [junit4]   2> 77101 INFO  (SUITE-AutoCommitTest-seed#[15F6463553D20E97]-worker) [    ] o.a.s.c.SolrResourceLoader [null] Added 2 libs to classloader, from paths: [/x1/jenkins/jenkins-slave/workspace/Lucene-Solr-Tests-7.0/solr/core/src/test-files/solr/collection1/lib, /x1/jenkins/jenkins-slave/workspace/Lucene-Solr-Tests-7.0/solr/core/src/test-files/solr/collection1/lib/classes]
   [junit4]   2> 77138 INFO  (SUITE-AutoCommitTest-seed#[15F6463553D20E97]-worker) [    ] o.a.s.c.SolrConfig Using Lucene MatchVersion: 7.0.0
   [junit4]   2> 77180 INFO  (SUITE-AutoCommitTest-seed#[15F6463553D20E97]-worker) [    ] o.a.s.s.IndexSchema [null] Schema name=test
   [junit4]   2> 77415 INFO  (SUITE-AutoCommitTest-seed#[15F6463553D20E97]-worker) [    ] o.a.s.s.IndexSchema Loaded schema test/1.0 with uniqueid field id
   [junit4]   2> 77522 INFO  (SUITE-AutoCommitTest-seed#[15F6463553D20E97]-worker) [    ] o.a.s.m.r.SolrJmxReporter JMX monitoring for 'solr.node' (registry 'solr.node') enabled at server: com.sun.jmx.mbeanserver.JmxMBeanServer@233025d3
   [junit4]   2> 77525 INFO  (SUITE-AutoCommitTest-seed#[15F6463553D20E97]-worker) [    ] o.a.s.m.r.SolrJmxReporter JMX monitoring for 'solr.jvm' (registry 'solr.jvm') enabled at server: com.sun.jmx.mbeanserver.JmxMBeanServer@233025d3
   [junit4]   2> 77525 INFO  (SUITE-AutoCommitTest-seed#[15F6463553D20E97]-worker) [    ] o.a.s.m.r.SolrJmxReporter JMX monitoring for 'solr.jetty' (registry 'solr.jetty') enabled at server: com.sun.jmx.mbeanserver.JmxMBeanServer@233025d3
   [junit4]   2> 77546 INFO  (coreLoadExecutor-290-thread-1) [    x:collection1] o.a.s.c.SolrResourceLoader [null] Added 2 libs to classloader, from paths: [/x1/jenkins/jenkins-slave/workspace/Lucene-Solr-Tests-7.0/solr/core/src/test-files/solr/collection1/lib, /x1/jenkins/jenkins-slave/workspace/Lucene-Solr-Tests-7.0/solr/core/src/test-files/solr/collection1/lib/classes]
   [junit4]   2> 77596 INFO  (coreLoadExecutor-290-thread-1) [    x:collection1] o.a.s.c.SolrConfig Using Lucene MatchVersion: 7.0.0
   [junit4]   2> 77614 INFO  (coreLoadExecutor-290-thread-1) [    x:collection1] o.a.s.s.IndexSchema [collection1] Schema name=test
   [junit4]   2> 77874 INFO  (coreLoadExecutor-290-thread-1) [    x:collection1] o.a.s.s.IndexSchema Loaded schema test/1.0 with uniqueid field id
   [junit4]   2> 77904 INFO  (coreLoadExecutor-290-thread-1) [    x:collection1] o.a.s.c.CoreContainer Creating SolrCore 'collection1' using configuration from instancedir /x1/jenkins/jenkins-slave/workspace/Lucene-Solr-Tests-7.0/solr/core/src/test-files/solr/collection1, trusted=true
   [junit4]   2> 77904 INFO  (coreLoadExecutor-290-thread-1) [    x:collection1] o.a.s.m.r.SolrJmxReporter JMX monitoring for 'solr.core.collection1' (registry 'solr.core.collection1') enabled at server: com.sun.jmx.mbeanserver.JmxMBeanServer@233025d3
   [junit4]   2> 77904 INFO  (coreLoadExecutor-290-thread-1) [    x:collection1] o.a.s.c.SolrCore solr.RecoveryStrategy.Builder
   [junit4]   2> 77905 INFO  (coreLoadExecutor-290-thread-1) [    x:collection1] o.a.s.c.SolrCore [[collection1] ] Opening new SolrCore at [/x1/jenkins/jenkins-slave/workspace/Lucene-Solr-Tests-7.0/solr/core/src/test-files/solr/collection1], dataDir=[/x1/jenkins/jenkins-slave/workspace/Lucene-Solr-Tests-7.0/solr/build/solr-core/test/J2/temp/solr.update.AutoCommitTest_15F6463553D20E97-001/init-core-data-001/]
   [junit4]   2> 77913 INFO  (coreLoadExecutor-290-thread-1) [    x:collection1] o.a.s.u.RandomMergePolicy RandomMergePolicy wrapping class org.apache.lucene.index.TieredMergePolicy: [TieredMergePolicy: maxMergeAtOnce=45, maxMergeAtOnceExplicit=25, maxMergedSegmentMB=55.7314453125, floorSegmentMB=2.001953125, forceMergeDeletesPctAllowed=3.5241914125500085, segmentsPerTier=37.0, maxCFSSegmentSizeMB=8.796093022207999E12, noCFSRatio=0.5377018835537962
   [junit4]   2> 78019 INFO  (coreLoadExecutor-290-thread-1) [    x:collection1] o.a.s.u.UpdateHandler Using UpdateLog implementation: org.apache.solr.update.UpdateLog
   [junit4]   2> 78019 INFO  (coreLoadExecutor-290-thread-1) [    x:collection1] o.a.s.u.UpdateLog Initializing UpdateLog: dataDir= defaultSyncLevel=FLUSH numRecordsToKeep=100 maxNumLogsToKeep=10 numVersionBuckets=65536
   [junit4]   2> 78020 INFO  (coreLoadExecutor-290-thread-1) [    x:collection1] o.a.s.u.CommitTracker Hard AutoCommit: disabled
   [junit4]   2> 78020 INFO  (coreLoadExecutor-290-thread-1) [    x:collection1] o.a.s.u.CommitTracker Soft AutoCommit: disabled
   [junit4]   2> 78021 INFO  (coreLoadExecutor-290-thread-1) [    x:collection1] o.a.s.u.RandomMergePolicy RandomMergePolicy wrapping class org.apache.lucene.index.LogByteSizeMergePolicy: [LogByteSizeMergePolicy: minMergeSize=1677721, mergeFactor=37, maxMergeSize=2147483648, maxMergeSizeForForcedMerge=9223372036854775807, calibrateSizeByDeletes=true, maxMergeDocs=2147483647, maxCFSSegmentSizeMB=8.796093022207999E12, noCFSRatio=0.26047394131218937]
   [junit4]   2> 78022 INFO  (coreLoadExecutor-290-thread-1) [    x:collection1] o.a.s.s.SolrIndexSearcher Opening [Searcher@6d0b3fda[collection1] main]
   [junit4]   2> 78023 INFO  (coreLoadExecutor-290-thread-1) [    x:collection1] o.a.s.h.c.SpellCheckComponent Initializing spell checkers
   [junit4]   2> 78033 INFO  (coreLoadExecutor-290-thread-1) [    x:collection1] o.a.s.s.DirectSolrSpellChecker init: {name=direct,classname=DirectSolrSpellChecker,field=lowerfilt,minQueryLength=3}
   [junit4]   2> 78074 INFO  (coreLoadExecutor-290-thread-1) [    x:collection1] o.a.s.h.ReplicationHandler Commits will be reserved for  10000
   [junit4]   2> 78075 INFO  (searcherExecutor-291-thread-1-processing-x:collection1) [    x:collection1] o.a.s.h.c.SpellCheckComponent Loading spell index for spellchecker: default
   [junit4]   2> 78075 INFO  (coreLoadExecutor-290-thread-1) [    x:collection1] o.a.s.u.UpdateLog Could not find max version in index or recent updates, using new clock 1573131839809257472
   [junit4]   2> 78075 INFO  (searcherExecutor-291-thread-1-processing-x:collection1) [    x:collection1] o.a.s.h.c.SpellCheckComponent Loading spell index for spellchecker: direct
   [junit4]   2> 78075 INFO  (searcherExecutor-291-thread-1-processing-x:collection1) [    x:collection1] o.a.s.h.c.SpellCheckComponent Loading spell index for spellchecker: wordbreak
   [junit4]   2> 78075 INFO  (searcherExecutor-291-thread-1-processing-x:collection1) [    x:collection1] o.a.s.h.c.SpellCheckComponent Loading spell index for spellchecker: multipleFields
   [junit4]   2> 78075 INFO  (searcherExecutor-291-thread-1-processing-x:collection1) [    x:collection1] o.a.s.h.c.SpellCheckComponent Loading spell index for spellchecker: jarowinkler
   [junit4]   2> 78075 INFO  (searcherExecutor-291-thread-1-processing-x:collection1) [    x:collection1] o.a.s.h.c.SpellCheckComponent Loading spell index for spellchecker: external
   [junit4]   2> 78076 INFO  (searcherExecutor-291-thread-1-processing-x:collection1) [    x:collection1] o.a.s.h.c.SpellCheckComponent Loading spell index for spellchecker: freq
   [junit4]   2> 78076 INFO  (searcherExecutor-291-thread-1-processing-x:collection1) [    x:collection1] o.a.s.h.c.SpellCheckComponent Loading spell index for spellchecker: fqcn
   [junit4]   2> 78076 INFO  (searcherExecutor-291-thread-1-processing-x:collection1) [    x:collection1] o.a.s.h.c.SpellCheckComponent Loading spell index for spellchecker: perDict
   [junit4]   2> 78081 INFO  (searcherExecutor-291-thread-1-processing-x:collection1) [    x:collection1] o.a.s.c.SolrCore [collection1] Registered new searcher Searcher@6d0b3fda[collection1] main{ExitableDirectoryReader(UninvertingDirectoryReader())}
   [junit4]   2> 78082 INFO  (SUITE-AutoCommitTest-seed#[15F6463553D20E97]-worker) [    ] o.a.s.SolrTestCaseJ4 ####initCore end
   [junit4]   2> 78084 INFO  (TEST-AutoCommitTest.testMaxTime-seed#[15F6463553D20E97]) [    ] o.a.s.SolrTestCaseJ4 ###Starting testMaxTime
   [junit4]   2> 78085 INFO  (TEST-AutoCommitTest.testMaxTime-seed#[15F6463553D20E97]) [    ] o.a.s.u.DirectUpdateHandler2 [collection1] REMOVING ALL DOCUMENTS FROM INDEX
   [junit4]   2> 78086 INFO  (TEST-AutoCommitTest.testMaxTime-seed#[15F6463553D20E97]) [    ] o.a.s.s.SolrIndexSearcher Opening [Searcher@73ec43e7[collection1] realtime]
   [junit4]   2> 78086 INFO  (TEST-AutoCommitTest.testMaxTime-seed#[15F6463553D20E97]) [    ] o.a.s.u.p.LogUpdateProcessorFactory [collection1]  webapp=null path=null params={_version_=-9223372036854775807&update.distrib=FROMLEADER&versions=true&wt=json&indent=true}{deleteByQuery=*:* (-9223372036854775807)} 0 1
   [junit4]   2> 78086 ERROR (TEST-AutoCommitTest.testMaxTime-seed#[15F6463553D20E97]) [    ] o.a.s.c.CorePropertiesLocator Couldn't load core descriptor from /x1/jenkins/jenkins-slave/workspace/Lucene-Solr-Tests-7.0/solr/core/src/test-files/solr/collection1/core.properties:java.nio.file.NoSuchFileException: /x1/jenkins/jenkins-slave/workspace/Lucene-Solr-Tests-7.0/solr/core/src/test-files/solr/collection1/core.properties
   [junit4]   2> 78087 INFO  (TEST-AutoCommitTest.testMaxTime-seed#[15F6463553D20E97]) [    ] o.a.s.c.SolrResourceLoader [null] Added 2 libs to classloader, from paths: [/x1/jenkins/jenkins-slave/workspace/Lucene-Solr-Tests-7.0/solr/core/src/test-files/solr/collection1/lib, /x1/jenkins/jenkins-slave/workspace/Lucene-Solr-Tests-7.0/solr/core/src/test-files/solr/collection1/lib/classes]
   [junit4]   2> 78156 INFO  (TEST-AutoCommitTest.testMaxTime-seed#[15F6463553D20E97]) [    ] o.a.s.c.SolrConfig Using Lucene MatchVersion: 7.0.0
   [junit4]   2> 78179 INFO  (TEST-AutoCommitTest.testMaxTime-seed#[15F6463553D20E97]) [    ] o.a.s.s.IndexSchema [collection1] Schema name=test
   [junit4]   2> 78454 INFO  (TEST-AutoCommitTest.testMaxTime-seed#[15F6463553D20E97]) [    ] o.a.s.s.IndexSchema Loaded schema test/1.0 with uniqueid field id
   [junit4]   2> 78490 INFO  (TEST-AutoCommitTest.testMaxTime-seed#[15F6463553D20E97]) [    ] o.a.s.c.CoreContainer Reloading SolrCore 'collection1' using configuration from instancedir /x1/jenkins/jenkins-slave/workspace/Lucene-Solr-Tests-7.0/solr/core/src/test-files/solr/collection1
   [junit4]   2> 78533 INFO  (TEST-AutoCommitTest.testMaxTime-seed#[15F6463553D20E97]) [    x:collection1] o.a.s.m.r.SolrJmxReporter JMX monitoring for 'solr.core.collection1' (registry 'solr.core.collection1') enabled at server: com.sun.jmx.mbeanserver.JmxMBeanServer@233025d3
   [junit4]   2> 78533 INFO  (TEST-AutoCommitTest.testMaxTime-seed#[15F6463553D20E97]) [    x:collection1] o.a.s.c.SolrCore [[collection1] ] Opening new SolrCore at [/x1/jenkins/jenkins-slave/workspace/Lucene-Solr-Tests-7.0/solr/core/src/test-files/solr/collection1], dataDir=[/x1/jenkins/jenkins-slave/workspace/Lucene-Solr-Tests-7.0/solr/build/solr-core/test/J2/temp/solr.update.AutoCommitTest_15F6463553D20E97-001/init-core-data-001/]
   [junit4]   2> 78614 INFO  (TEST-AutoCommitTest.testMaxTime-seed#[15F6463553D20E97]) [    x:collection1] o.a.s.u.CommitTracker Hard AutoCommit: disabled
   [junit4]   2> 78614 INFO  (TEST-AutoCommitTest.testMaxTime-seed#[15F6463553D20E97]) [    x:collection1] o.a.s.u.CommitTracker Soft AutoCommit: disabled
   [junit4]   2> 78616 INFO  (TEST-AutoCommitTest.testMaxTime-seed#[15F6463553D20E97]) [    x:collection1] o.a.s.s.SolrIndexSearcher Opening [Searcher@49edcc59[collection1] main]
   [junit4]   2> 78616 INFO  (TEST-AutoCommitTest.testMaxTime-seed#[15F6463553D20E97]) [    x:collection1] o.a.s.h.c.SpellCheckComponent Initializing spell checkers
   [junit4]   2> 78617 INFO  (TEST-AutoCommitTest.testMaxTime-seed#[15F6463553D20E97]) [    x:collection1] o.a.s.s.DirectSolrSpellChecker init: {name=direct,classname=DirectSolrSpellChecker,field=lowerfilt,minQueryLength=3}
   [junit4]   2> 78620 INFO  (TEST-AutoCommitTest.testMaxTime-seed#[15F6463553D20E97]) [    x:collection1] o.a.s.h.ReplicationHandler Commits will be reserved for  10000
   [junit4]   2> 78620 INFO  (TEST-AutoCommitTest.testMaxTime-seed#[15F6463553D20E97]) [    x:collection1] o.a.s.u.UpdateLog Could not find max version in index or recent updates, using new clock 1573131840380731392
   [junit4]   2> 78641 INFO  (searcherExecutor-296-thread-1-processing-x:collection1) [    x:collection1] o.a.s.h.c.SpellCheckComponent Loading spell index for spellchecker: default
   [junit4]   2> 78642 INFO  (searcherExecutor-296-thread-1-processing-x:collection1) [    x:collection1] o.a.s.h.c.SpellCheckComponent Loading spell index for spellchecker: direct
   [junit4]   2> 78642 INFO  (searcherExecutor-296-thread-1-processing-x:collection1) [    x:collection1] o.a.s.h.c.SpellCheckComponent Loading spell index for spellchecker: wordbreak
   [junit4]   2> 78642 INFO  (searcherExecutor-296-thread-1-processing-x:collection1) [    x:collection1] o.a.s.h.c.SpellCheckComponent Loading spell index for spellchecker: multipleFields
   [junit4]   2> 78643 INFO  (searcherExecutor-296-thread-1-processing-x:collection1) [    x:collection1] o.a.s.h.c.SpellCheckComponent Loading spell index for spellchecker: jarowinkler
   [junit4]   2> 78643 INFO  (searcherExecutor-296-thread-1-processing-x:collection1) [    x:collection1] o.a.s.h.c.SpellCheckComponent Loading spell index for spellchecker: external
   [junit4]   2> 78643 INFO  (searcherExecutor-296-thread-1-processing-x:collection1) [    x:collection1] o.a.s.h.c.SpellCheckComponent Loading spell index for spellchecker: freq
   [junit4]   2> 78643 INFO  (searcherExecutor-296-thread-1-processing-x:collection1) [    x:collection1] o.a.s.h.c.SpellCheckComponent Loading spell index for spellchecker: fqcn
   [junit4]   2> 78643 INFO  (searcherExecutor-296-thread-1-processing-x:collection1) [    x:collection1] o.a.s.h.c.SpellCheckComponent Loading spell index for spellchecker: perDict
   [junit4]   2> 78644 INFO  (TEST-AutoCommitTest.testMaxTime-seed#[15F6463553D20E97]) [    x:collection1] o.a.s.u.RandomMergePolicy RandomMergePolicy wrapping class org.apache.lucene.index.TieredMergePolicy: [TieredMergePolicy: maxMergeAtOnce=30, maxMergeAtOnceExplicit=42, maxMergedSegmentMB=3.4365234375, floorSegmentMB=1.1279296875, forceMergeDeletesPctAllowed=19.406220480743038, segmentsPerTier=25.0, maxCFSSegmentSizeMB=8.796093022207999E12, noCFSRatio=0.0
   [junit4]   2> 78645 INFO  (TEST-AutoCommitTest.testMaxTime-seed#[15F6463553D20E97]) [    x:collection1] o.a.s.u.DefaultSolrCoreState New IndexWriter is ready to be used.
   [junit4]   2> 78652 INFO  (searcherExecutor-296-thread-1-processing-x:collection1) [    x:collection1] o.a.s.c.SolrCore [collection1] Registered new searcher Searcher@49edcc59[collection1] main{ExitableDirectoryReader(UninvertingDirectoryReader())}
   [junit4]   2> 78652 INFO  (TEST-AutoCommitTest.testMaxTime-seed#[15F6463553D20E97]) [    x:collection1] o.a.s.s.SolrIndexSearcher Opening [Searcher@6c9b2142[collection1] main]
   [junit4]   2> 78653 INFO  (TEST-AutoCommitTest.testMaxTime-seed#[15F6463553D20E97]) [    x:collection1] o.a.s.c.SolrCore [collection1]  CLOSING SolrCore org.apache.solr.core.SolrCore@7e0ee7bf
   [junit4]   2> 78653 INFO  (TEST-AutoCommitTest.testMaxTime-seed#[15F6463553D20E97]) [    x:collection1] o.a.s.m.SolrMetricManager Closing metric reporters for registry=solr.core.collection1, tag=2114906047
   [junit4]   2> 78672 INFO  (searcherExecutor-296-thread-1-processing-x:collection1) [    x:collection1] o.a.s.c.SolrCore [collection1] Registered new searcher Searcher@6c9b2142[collection1] main{ExitableDirectoryReader(UninvertingDirectoryReader())}
   [junit4]   2> 78678 INFO  (TEST-AutoCommitTest.testMaxTime-seed#[15F6463553D20E97]) [    x:collection1] o.a.s.u.p.LogUpdateProcessorFactory [collection1] {add=[529 (1573131840432111616)]} 0 9
   [junit4]   2> 78680 INFO  (TEST-AutoCommitTest.testMaxTime-seed#[15F6463553D20E97]) [    x:collection1] o.a.s.c.S.Request [collection1]  webapp=null path=null params={q=id:529&qt=&start=0&rows=20&version=2.2} hits=0 status=0 QTime=1
   [junit4]   2> 78683 INFO  (TEST-AutoCommitTest.testMaxTime-seed#[15F6463553D20E97]) [    x:collection1] o.a.s.u.p.LogUpdateProcessorFactory [collection1] {add=[530 (1573131840446791680)]} 0 14
   [junit4]   2> 78683 INFO  (TEST-AutoCommitTest.testMaxTime-seed#[15F6463553D20E97]) [    x:collection1] o.a.s.c.S.Request [collection1]  webapp=null path=null params={q=id:529&qt=&start=0&rows=20&version=2.2} hits=0 status=0 QTime=0
   [junit4]   2> 78684 ERROR (TEST-AutoCommitTest.testMaxTime-seed#[15F6463553D20E97]) [    x:collection1] o.a.s.SolrTestCaseJ4 REQUEST FAILED: xpath=//result[@numFound=1]
   [junit4]   2> xml response was: <?xml version="1.0" encoding="UTF-8"?>
   [junit4]   2> <response>
   [junit4]   2> <lst name="responseHeader"><int name="status">0</int><int name="QTime">0</int></lst><result name="response" numFound="0" start="0"></result>
   [junit4]   2> </response>
   [junit4]   2>
   [junit4]   2> request was:q=id:529&qt=&start=0&rows=20&version=2.2
   [junit4]   2> 78685 ERROR (TEST-AutoCommitTest.testMaxTime-seed#[15F6463553D20E97]) [    x:collection1] o.a.s.SolrTestCaseJ4 REQUEST FAILED: q=id:529&qt=&start=0&rows=20&version=2.2:java.lang.RuntimeException: REQUEST FAILED: xpath=//result[@numFound=1]
   [junit4]   2> xml response was: <?xml version="1.0" encoding="UTF-8"?>
   [junit4]   2> <response>
   [junit4]   2> <lst name="responseHeader"><int name="status">0</int><int name="QTime">0</int></lst><result name="response" numFound="0" start="0"></result>
   [junit4]   2> </response>
   [junit4]   2>
   [junit4]   2> request was:q=id:529&qt=&start=0&rows=20&version=2.2
   [junit4]   2> at org.apache.solr.SolrTestCaseJ4.assertQ(SolrTestCaseJ4.java:871)
   [junit4]   2> at org.apache.solr.update.AutoCommitTest.testMaxTime(AutoCommitTest.java:270)
   [junit4]   2> at sun.reflect.NativeMethodAccessorImpl.invoke0(Native Method)
   [junit4]   2> at sun.reflect.NativeMethodAccessorImpl.invoke(NativeMethodAccessorImpl.java:62)
   [junit4]   2> at sun.reflect.DelegatingMethodAccessorImpl.invoke(DelegatingMethodAccessorImpl.java:43)
   [junit4]   2> at java.lang.reflect.Method.invoke(Method.java:498)
   [junit4]   2> at com.carrotsearch.randomizedtesting.RandomizedRunner.invoke(RandomizedRunner.java:1713)
   [junit4]   2> at com.carrotsearch.randomizedtesting.RandomizedRunner$8.evaluate(RandomizedRunner.java:907)
   [junit4]   2> at com.carrotsearch.randomizedtesting.RandomizedRunner$9.evaluate(RandomizedRunner.java:943)
   [junit4]   2> at com.carrotsearch.randomizedtesting.RandomizedRunner$10.evaluate(RandomizedRunner.java:957)
   [junit4]   2> at com.carrotsearch.randomizedtesting.rules.SystemPropertiesRestoreRule$1.evaluate(SystemPropertiesRestoreRule.java:57)
   [junit4]   2> at org.apache.lucene.util.TestRuleSetupTeardownChained$1.evaluate(TestRuleSetupTeardownChained.java:49)
   [junit4]   2> at org.apache.lucene.util.AbstractBeforeAfterRule$1.evaluate(AbstractBeforeAfterRule.java:45)
   [junit4]   2> at org.apache.lucene.util.TestRuleThreadAndTestName$1.evaluate(TestRuleThreadAndTestName.java:48)
   [junit4]   2> at org.apache.lucene.util.TestRuleIgnoreAfterMaxFailures$1.evaluate(TestRuleIgnoreAfterMaxFailures.java:64)
   [junit4]   2> at org.apache.lucene.util.TestRuleMarkFailure$1.evaluate(TestRuleMarkFailure.java:47)
   [junit4]   2> at com.carrotsearch.randomizedtesting.rules.StatementAdapter.evaluate(StatementAdapter.java:36)
   [junit4]   2> at com.carrotsearch.randomizedtesting.ThreadLeakControl$StatementRunner.run(ThreadLeakControl.java:368)
   [junit4]   2> at com.carrotsearch.randomizedtesting.ThreadLeakControl.forkTimeoutingTask(ThreadLeakControl.java:817)
   [junit4]   2> at com.carrotsearch.randomizedtesting.ThreadLeakControl$3.evaluate(ThreadLeakControl.java:468)
   [junit4]   2> at com.carrotsearch.randomizedtesting.RandomizedRunner.runSingleTest(RandomizedRunner.java:916)
   [junit4]   2> at com.carrotsearch.randomizedtesting.RandomizedRunner$5.evaluate(RandomizedRunner.java:802)
   [junit4]   2> at com.carrotsearch.randomizedtesting.RandomizedRunner$6.evaluate(RandomizedRunner.java:852)
   [junit4]   2> at com.carrotsearch.randomizedtesting.RandomizedRunner$7.evaluate(RandomizedRunner.java:863)
   [junit4]   2> at com.carrotsearch.randomizedtesting.rules.StatementAdapter.evaluate(StatementAdapter.java:36)
   [junit4]   2> at com.carrotsearch.randomizedtesting.rules.SystemPropertiesRestoreRule$1.evaluate(SystemPropertiesRestoreRule.java:57)
   [junit4]   2> at org.apache.lucene.util.AbstractBeforeAfterRule$1.evaluate(AbstractBeforeAfterRule.java:45)
   [junit4]   2> at com.carrotsearch.randomizedtesting.rules.StatementAdapter.evaluate(StatementAdapter.java:36)
   [junit4]   2> at org.apache.lucene.util.TestRuleStoreClassName$1.evaluate(TestRuleStoreClassName.java:41)
   [junit4]   2> at com.carrotsearch.randomizedtesting.rules.NoShadowingOrOverridesOnMethodsRule$1.evaluate(NoShadowingOrOverridesOnMethodsRule.java:40)
   [junit4]   2> at com.carrotsearch.randomizedtesting.rules.NoShadowingOrOverridesOnMethodsRule$1.evaluate(NoShadowingOrOverridesOnMethodsRule.java:40)
   [junit4]   2> at com.carrotsearch.randomizedtesting.rules.StatementAdapter.evaluate(StatementAdapter.java:36)
   [junit4]   2> at com.carrotsearch.randomizedtesting.rules.StatementAdapter.evaluate(StatementAdapter.java:36)
   [junit4]   2> at com.carrotsearch.randomizedtesting.rules.StatementAdapter.evaluate(StatementAdapter.java:36)
   [junit4]   2> at org.apache.lucene.util.TestRuleAssertionsRequired$1.evaluate(TestRuleAssertionsRequired.java:53)
   [junit4]   2> at org.apache.lucene.util.TestRuleMarkFailure$1.evaluate(TestRuleMarkFailure.java:47)
   [junit4]   2> at org.apache.lucene.util.TestRuleIgnoreAfterMaxFailures$1.evaluate(TestRuleIgnoreAfterMaxFailures.java:64)
   [junit4]   2> at org.apache.lucene.util.TestRuleIgnoreTestSuites$1.evaluate(TestRuleIgnoreTestSuites.java:54)
   [junit4]   2> at com.carrotsearch.randomizedtesting.rules.StatementAdapter.evaluate(StatementAdapter.java:36)
   [junit4]   2> at com.carrotsearch.randomizedtesting.ThreadLeakControl$StatementRunner.run(ThreadLeakControl.java:368)
   [junit4]   2> at java.lang.Thread.run(Thread.java:748)
   [junit4]   2>
   [junit4]   2> 78685 INFO  (TEST-AutoCommitTest.testMaxTime-seed#[15F6463553D20E97]) [    x:collection1] o.a.s.SolrTestCaseJ4 ###Ending testMaxTime
   [junit4]   2> NOTE: reproduce with: ant test  -Dtestcase=AutoCommitTest -Dtests.method=testMaxTime -Dtests.seed=15F6463553D20E97 -Dtests.multiplier=2 -Dtests.slow=true -Dtests.locale=fr-CA -Dtests.timezone=America/Argentina/Catamarca -Dtests.asserts=true -Dtests.file.encoding=US-ASCII
   [junit4] ERROR   0.61s J2 | AutoCommitTest.testMaxTime <<<
   [junit4]    > Throwable #1: java.lang.RuntimeException: Exception during query
   [junit4]    > at __randomizedtesting.SeedInfo.seed([15F6463553D20E97:8F023BD7CD4892AB]:0)
   [junit4]    > at org.apache.solr.SolrTestCaseJ4.assertQ(SolrTestCaseJ4.java:878)
   [junit4]    > at org.apache.solr.update.AutoCommitTest.testMaxTime(AutoCommitTest.java:270)
   [junit4]    > at java.lang.Thread.run(Thread.java:748)
   [junit4]    > Caused by: java.lang.RuntimeException: REQUEST FAILED: xpath=//result[@numFound=1]
   [junit4]    > xml response was: <?xml version="1.0" encoding="UTF-8"?>
   [junit4]    > <response>
   [junit4]    > <lst name="responseHeader"><int name="status">0</int><int name="QTime">0</int></lst><result name="response" numFound="0" start="0"></result>
   [junit4]    > </response>
   [junit4]    > request was:q=id:529&qt=&start=0&rows=20&version=2.2
   [junit4]    > at org.apache.solr.SolrTestCaseJ4.assertQ(SolrTestCaseJ4.java:871)
   [junit4]    > ... 40 more
   [junit4]   2> 78691 INFO  (TEST-AutoCommitTest.testMaxDocs-seed#[15F6463553D20E97]) [    x:collection1] o.a.s.SolrTestCaseJ4 ###Starting testMaxDocs
   [junit4]   2> 78691 INFO  (TEST-AutoCommitTest.testMaxDocs-seed#[15F6463553D20E97]) [    x:collection1] o.a.s.u.DirectUpdateHandler2 [collection1] REMOVING ALL DOCUMENTS FROM INDEX
   [junit4]   2> 78691 INFO  (TEST-AutoCommitTest.testMaxDocs-seed#[15F6463553D20E97]) [    x:collection1] o.a.s.s.SolrIndexSearcher Opening [Searcher@48dab102[collection1] realtime]
   [junit4]   2> 78692 INFO  (TEST-AutoCommitTest.testMaxDocs-seed#[15F6463553D20E97]) [    x:collection1] o.a.s.u.p.LogUpdateProcessorFactory [collection1]  webapp=null path=null params={_version_=-9223372036854775807&update.distrib=FROMLEADER&versions=true&wt=json&indent=true}{deleteByQuery=*:* (-9223372036854775807)} 0 0
   [junit4]   2> 78692 ERROR (TEST-AutoCommitTest.testMaxDocs-seed#[15F6463553D20E97]) [    x:collection1] o.a.s.c.CorePropertiesLocator Couldn't load core descriptor from /x1/jenkins/jenkins-slave/workspace/Lucene-Solr-Tests-7.0/solr/core/src/test-files/solr/collection1/core.properties:java.nio.file.NoSuchFileException: /x1/jenkins/jenkins-slave/workspace/Lucene-Solr-Tests-7.0/solr/core/src/test-files/solr/collection1/core.properties
   [junit4]   2> 78692 INFO  (TEST-AutoCommitTest.testMaxDocs-seed#[15F6463553D20E97]) [    x:collection1] o.a.s.c.SolrResourceLoader [null] Added 2 libs to classloader, from paths: [/x1/jenkins/jenkins-slave/workspace/Lucene-Solr-Tests-7.0/solr/core/src/test-files/solr/collection1/lib, /x1/jenkins/jenkins-slave/workspace/Lucene-Solr-Tests-7.0/solr/core/src/test-files/solr/collection1/lib/classes]
   [junit4]   2> 78715 INFO  (TEST-AutoCommitTest.testMaxDocs-seed#[15F6463553D20E97]) [    x:collection1] o.a.s.c.SolrConfig Using Lucene MatchVersion: 7.0.0
   [junit4]   2> 78733 INFO  (TEST-AutoCommitTest.testMaxDocs-seed#[15F6463553D20E97]) [    x:collection1] o.a.s.s.IndexSchema [collection1] Schema name=test
   [junit4]   2> 78936 INFO  (TEST-AutoCommitTest.testMaxDocs-seed#[15F6463553D20E97]) [    x:collection1] o.a.s.s.IndexSchema Loaded schema test/1.0 with uniqueid field id
   [junit4]   2> 78948 INFO  (TEST-AutoCommitTest.testMaxDocs-seed#[15F6463553D20E97]) [    x:collection1] o.a.s.c.CoreContainer Reloading SolrCore 'collection1' using configuration from instancedir /x1/jenkins/jenkins-slave/workspace/Lucene-Solr-Tests-7.0/solr/core/src/test-files/solr/collection1
   [junit4]   2> 78962 INFO  (TEST-AutoCommitTest.testMaxDocs-seed#[15F6463553D20E97]) [    x:collection1] o.a.s.m.r.SolrJmxReporter JMX monitoring for 'solr.core.collection1' (registry 'solr.core.collection1') enabled at server: com.sun.jmx.mbeanserver.JmxMBeanServer@233025d3
   [junit4]   2> 78962 INFO  (TEST-AutoCommitTest.testMaxDocs-seed#[15F6463553D20E97]) [    x:collection1] o.a.s.c.SolrCore [[collection1] ] Opening new SolrCore at [/x1/jenkins/jenkins-slave/workspace/Lucene-Solr-Tests-7.0/solr/core/src/test-files/solr/collection1], dataDir=[/x1/jenkins/jenkins-slave/workspace/Lucene-Solr-Tests-7.0/solr/build/solr-core/test/J2/temp/solr.update.AutoCommitTest_15F6463553D20E97-001/init-core-data-001/]
   [junit4]   2> 79089 INFO  (TEST-AutoCommitTest.testMaxDocs-seed#[15F6463553D20E97]) [    x:collection1] o.a.s.u.CommitTracker Hard AutoCommit: disabled
   [junit4]   2> 79089 INFO  (TEST-AutoCommitTest.testMaxDocs-seed#[15F6463553D20E97]) [    x:collection1] o.a.s.u.CommitTracker Soft AutoCommit: disabled
   [junit4]   2> 79090 INFO  (TEST-AutoCommitTest.testMaxDocs-seed#[15F6463553D20E97]) [    x:collection1] o.a.s.s.SolrIndexSearcher Opening [Searcher@264ac6dc[collection1] main]
   [junit4]   2> 79091 INFO  (TEST-AutoCommitTest.testMaxDocs-seed#[15F6463553D20E97]) [    x:collection1] o.a.s.h.c.SpellCheckComponent Initializing spell checkers
   [junit4]   2> 79092 INFO  (TEST-AutoCommitTest.testMaxDocs-seed#[15F6463553D20E97]) [    x:collection1] o.a.s.s.DirectSolrSpellChecker init: {name=direct,classname=DirectSolrSpellChecker,field=lowerfilt,minQueryLength=3}
   [junit4]   2> 79100 INFO  (TEST-AutoCommitTest.testMaxDocs-seed#[15F6463553D20E97]) [    x:collection1] o.a.s.h.ReplicationHandler Commits will be reserved for  10000
   [junit4]   2> 79100 INFO  (searcherExecutor-300-thread-1-processing-x:collection1) [    x:collection1] o.a.s.h.c.SpellCheckComponent Loading spell index for spellchecker: default
   [junit4]   2> 79100 INFO  (searcherExecutor-300-thread-1-processing-x:collection1) [    x:collection1] o.a.s.h.c.SpellCheckComponent Loading spell index for spellchecker: direct
   [junit4]   2> 79100 INFO  (searcherExecutor-300-thread-1-processing-x:collection1) [    x:collection1] o.a.s.h.c.SpellCheckComponent Loading spell index for spellchecker: wordbreak
   [junit4]   2> 79100 INFO  (searcherExecutor-300-thread-1-processing-x:collection1) [    x:collection1] o.a.s.h.c.SpellCheckComponent Loading spell index for spellchecker: multipleFields
   [junit4]   2> 79101 INFO  (searcherExecutor-300-thread-1-processing-x:collection1) [    x:collection1] o.a.s.h.c.SpellCheckComponent Loading spell index for spellchecker: jarowinkler
   [junit4]   2> 79101 INFO  (searcherExecutor-300-thread-1-processing-x:collection1) [    x:collection1] o.a.s.h.c.SpellCheckComponent Loading spell index for spellchecker: external
   [junit4]   2> 79102 INFO  (searcherExecutor-300-thread-1-processing-x:collection1) [    x:collection1] o.a.s.h.c.SpellCheckComponent Loading spell index for spellchecker: freq
   [junit4]   2> 79102 INFO  (searcherExecutor-300-thread-1-processing-x:collection1) [    x:collection1] o.a.s.h.c.SpellCheckComponent Loading spell index for spellchecker: fqcn
   [junit4]   2> 79103 INFO  (searcherExecutor-300-thread-1-processing-x:collection1) [    x:collection1] o.a.s.h.c.SpellCheckComponent Loading spell index for spellchecker: perDict
   [junit4]   2> 79105 INFO  (TEST-AutoCommitTest.testMaxDocs-seed#[15F6463553D20E97]) [    x:collection1] o.a.s.u.RandomMergePolicy RandomMergePolicy wrapping class org.apache.lucene.index.TieredMergePolicy: [TieredMergePolicy: maxMergeAtOnce=47, maxMergeAtOnceExplicit=10, maxMergedSegmentMB=95.32421875, floorSegmentMB=0.4619140625, forceMergeDeletesPctAllowed=6.088486429875152, segmentsPerTier=20.0, maxCFSSegmentSizeMB=8.796093022207999E12, noCFSRatio=0.0
   [junit4]   2> 79106 INFO  (searcherExecutor-300-thread-1-processing-x:collection1) [    x:collection1] o.a.s.c.SolrCore [collection1] Registered new searcher Searcher@264ac6dc[collection1] main{ExitableDirectoryReader(UninvertingDirectoryReader())}
   [junit4]   2> 79107 INFO  (TEST-AutoCommitTest.testMaxDocs-seed#[15F6463553D20E97]) [    x:collection1] o.a.s.u.DefaultSolrCoreState New IndexWriter is ready to be used.
   [junit4]   2> 79107 INFO  (TEST-AutoCommitTest.testMaxDocs-seed#[15F6463553D20E97]) [    x:collection1] o.a.s.s.SolrIndexSearcher Opening [Searcher@13dbf335[collection1] main]
   [junit4]   2> 79107 INFO  (TEST-AutoCommitTest.testMaxDocs-seed#[15F6463553D20E97]) [    x:collection1] o.a.s.c.SolrCore [collection1]  CLOSING SolrCore org.apache.solr.core.SolrCore@27214c96
   [junit4]   2> 79108 INFO  (TEST-AutoCommitTest.testMaxDocs-seed#[15F6463553D20E97]) [    x:collection1] o.a.s.m.SolrMetricManager Closing metric reporters for registry=solr.core.collection1, tag=656493718
   [junit4]   2> 79110 INFO  (searcherExecutor-300-thread-1-processing-x:collection1) [    x:collection1] o.a.s.c.SolrCore [collection1] Registered new searcher Searcher@13dbf335[collection1] main{ExitableDirectoryReader(UninvertingDirectoryReader())}
   [junit4]   2> 79117 INFO  (TEST-AutoCommitTest.testMaxDocs-seed#[15F6463553D20E97]) [    x:collection1] o.a.s.u.p.LogUpdateProcessorFactory [collection1] {add=[0 (1573131840900825088)]} 0 1
   [junit4]   2> 79117 INFO  (TEST-AutoCommitTest.testMaxDocs-seed#[15F6463553D20E97]) [    x:collection1] o.a.s.u.p.LogUpdateProcessorFactory [collection1] {add=[1 (1573131840901873664)]} 0 1
   [junit4]   2> 79118 INFO  (TEST-AutoCommitTest.testMaxDocs-seed#[15F6463553D20E97]) [    x:collection1] o.a.s.u.p.LogUpdateProcessorFactory [collection1] {add=[2 (1573131840901873665)]} 0 1
   [junit4]   2> 79118 INFO  (TEST-AutoCommitTest.testMaxDocs-seed#[15F6463553D20E97]) [    x:collection1] o.a.s.u.p.LogUpdateProcessorFactory [collection1] {add=[3 (1573131840902922240)]} 0 2
   [junit4]   2> 79118 INFO  (TEST-AutoCommitTest.testMaxDocs-seed#[15F6463553D20E97]) [    x:collection1] o.a.s.u.p.LogUpdateProcessorFactory [collection1] {add=[4 (1573131840902922241)]} 0 2
   [junit4]   2> 79119 INFO  (TEST-AutoCommitTest.testMaxDocs-seed#[15F6463553D20E97]) [    x:collection1] o.a.s.u.p.LogUpdateProcessorFactory [collection1] {add=[5 (1573131840902922242)]} 0 2
   [junit4]   2> 79119 INFO  (TEST-AutoCommitTest.testMaxDocs-seed#[15F6463553D20E97]) [    x:collection1] o.a.s.u.p.LogUpdateProcessorFactory [collection1] {add=[6 (1573131840903970816)]} 0 3
   [junit4]   2> 79119 INFO  (TEST-AutoCommitTest.testMaxDocs-seed#[15F6463553D20E97]) [    x:collection1] o.a.s.u.p.LogUpdateProcessorFactory [collection1] {add=[7 (1573131840903970817)]} 0 3
   [junit4]   2> 79119 INFO  (TEST-AutoCommitTest.testMaxDocs-seed#[15F6463553D20E97]) [    x:collection1] o.a.s.u.p.LogUpdateProcessorFactory [collection1] {add=[8 (1573131840903970818)]} 0 3
   [junit4]   2> 79120 INFO  (TEST-AutoCommitTest.testMaxDocs-seed#[15F6463553D20E97]) [    x:collection1] o.a.s.u.p.LogUpdateProcessorFactory [collection1] {add=[9 (1573131840905019392)]} 0 4
   [junit4]   2> 79120 INFO  (TEST-AutoCommitTest.testMaxDocs-seed#[15F6463553D20E97]) [    x:collection1] o.a.s.u.p.LogUpdateProcessorFactory [collection1] {add=[10 (1573131840905019393)]} 0 4
   [junit4]   2> 79120 INFO  (TEST-AutoCommitTest.testMaxDocs-seed#[15F6463553D20E97]) [    x:collection1] o.a.s.u.p.LogUpdateProcessorFactory [collection1] {add=[11 (1573131840905019394)]} 0 4
   [junit4]   2> 79121 INFO  (TEST-AutoCommitTest.testMaxDocs-seed#[15F6463553D20E97]) [    x:collection1] o.a.s.u.p.LogUpdateProcessorFactory [collection1] {add=[12 (1573131840906067968)]} 0 5
   [junit4]   2> 79133 INFO  (TEST-AutoCommitTest.testMaxDocs-seed#[15F6463553D20E97]) [    x:collection1] o.a.s.u.p.LogUpdateProcessorFactory [collection1] {add=[13 (1573131840906067969)]} 0 17
   [junit4]   2> 79134 INFO  (TEST-AutoCommitTest.testMaxDocs-seed#[15F6463553D20E97]) [    x:collection1] o.a.s.c.S.Request [collection1]  webapp=null path=null params={q=id:1&qt=&start=0&rows=20&version=2.2} hits=0 status=0 QTime=0
   [junit4]   2> 79141 INFO  (TEST-AutoCommitTest.testMaxDocs-seed#[15F6463553D20E97]) [    x:collection1] o.a.s.u.p.LogUpdateProcessorFactory [collection1] {add=[14 (1573131840919699456)]} 0 25
   [junit4]   2> 79146 INFO  (commitScheduler-303-thread-1) [    x:collection1] o.a.s.u.DirectUpdateHandler2 start commit{,optimize=false,openSearcher=true,waitSearcher=true,expungeDeletes=false,softCommit=true,prepareCommit=false}
   [junit4]   2> 79166 INFO  (commitScheduler-303-thread-1) [    x:collection1] o.a.s.s.SolrIndexSearcher Opening [Searcher@8d7b755[collection1] main]
   [junit4]   2> 79168 INFO  (commitScheduler-303-thread-1) [    x:collection1] o.a.s.u.DirectUpdateHandler2 end_commit_flush
   [junit4]   2> 79169 INFO  (searcherExecutor-300-thread-1-processing-x:collection1) [    x:collection1] o.a.s.c.SolrCore [collection1] Registered new searcher Searcher@8d7b755[collection1] main{ExitableDirectoryReader(UninvertingDirectoryReader(Uninverting(_1(7.0.0):c15)))}
   [junit4]   2> 79404 INFO  (TEST-AutoCommitTest.testMaxDocs-seed#[15F6463553D20E97]) [    x:collection1] o.a.s.u.p.LogUpdateProcessorFactory [collection1] {add=[15 (1573131841201766400)]} 0 288
   [junit4]   2> 79405 INFO  (TEST-AutoCommitTest.testMaxDocs-seed#[15F6463553D20E97]) [    x:collection1] o.a.s.c.S.Request [collection1]  webapp=null path=null params={q=id:14&qt=&start=0&rows=20&version=2.2} hits=1 status=0 QTime=0
   [junit4]   2> 79407 INFO  (TEST-AutoCommitTest.testMaxDocs-seed#[15F6463553D20E97]) [    x:collection1] o.a.s.c.S.Request [collection1]  webapp=null path=null params={q=id:15&qt=&start=0&rows=20&version=2.2} hits=0 status=0 QTime=0
   [junit4]   2> 79407 INFO  (TEST-AutoCommitTest.testMaxDocs-seed#[15F6463553D20E97]) [    x:collection1] o.a.s.SolrTestCaseJ4 ###Ending testMaxDocs
   [junit4]   2> 79409 INFO  (TEST-AutoCommitTest.testCommitWithin-seed#[15F6463553D20E97]) [    x:collection1] o.a.s.SolrTestCaseJ4 ###Starting testCommitWithin
   [junit4]   2> 79409 INFO  (TEST-AutoCommitTest.testCommitWithin-seed#[15F6463553D20E97]) [    x:collection1] o.a.s.u.DirectUpdateHandler2 [collection1] REMOVING ALL DOCUMENTS FROM INDEX
   [junit4]   2> 79410 INFO  (TEST-AutoCommitTest.testCommitWithin-seed#[15F6463553D20E97]) [    x:collection1] o.a.s.s.SolrIndexSearcher Opening [Searcher@3092ffca[collection1] realtime]
   [junit4]   2> 79410 INFO  (TEST-AutoCommitTest.testCommitWithin-seed#[15F6463553D20E97]) [    x:collection1] o.a.s.u.p.LogUpdateProcessorFactory [collection1]  webapp=null path=null params={_version_=-9223372036854775807&update.distrib=FROMLEADER&versions=true&wt=json&indent=true}{deleteByQuery=*:* (-9223372036854775807)} 0 0
   [junit4]   2> 79410 ERROR (TEST-AutoCommitTest.testCommitWithin-seed#[15F6463553D20E97]) [    x:collection1] o.a.s.c.CorePropertiesLocator Couldn't load core descriptor from /x1/jenkins/jenkins-slave/workspace/Lucene-Solr-Tests-7.0/solr/core/src/test-files/solr/collection1/core.properties:java.nio.file.NoSuchFileException: /x1/jenkins/jenkins-slave/workspace/Lucene-Solr-Tests-7.0/solr/core/src/test-files/solr/collection1/core.properties
   [junit4]   2> 79411 INFO  (TEST-AutoCommitTest.testCommitWithin-seed#[15F6463553D20E97]) [    x:collection1] o.a.s.c.SolrResourceLoader [null] Added 2 libs to classloader, from paths: [/x1/jenkins/jenkins-slave/workspace/Lucene-Solr-Tests-7.0/solr/core/src/test-files/solr/collection1/lib, /x1/jenkins/jenkins-slave/workspace/Lucene-Solr-Tests-7.0/solr/core/src/test-files/solr/collection1/lib/classes]
   [junit4]   2> 79448 INFO  (TEST-AutoCommitTest.testCommitWithin-seed#[15F6463553D20E97]) [    x:collection1] o.a.s.c.SolrConfig Using Lucene MatchVersion: 7.0.0
   [junit4]   2> 79466 INFO  (TEST-AutoCommitTest.testCommitWithin-seed#[15F6463553D20E97]) [    x:collection1] o.a.s.s.IndexSchema [collection1] Schema name=test
   [junit4]   2> 79579 INFO  (TEST-AutoCommitTest.testCommitWithin-seed#[15F6463553D20E97]) [    x:collection1] o.a.s.s.IndexSchema Loaded schema test/1.0 with uniqueid field id
   [junit4]   2> 79592 INFO  (TEST-AutoCommitTest.testCommitWithin-seed#[15F6463553D20E97]) [    x:collection1] o.a.s.c.CoreContainer Reloading SolrCore 'collection1' using configuration from instancedir /x1/jenkins/jenkins-slave/workspace/Lucene-Solr-Tests-7.0/solr/core/src/test-files/solr/collection1
   [junit4]   2> 79608 INFO  (TEST-AutoCommitTest.testCommitWithin-seed#[15F6463553D20E97]) [    x:collection1] o.a.s.m.r.SolrJmxReporter JMX monitoring for 'solr.core.collection1' (registry 'solr.core.collection1') enabled at server: com.sun.jmx.mbeanserver.JmxMBeanServer@233025d3
   [junit4]   2> 79608 INFO  (TEST-AutoCommitTest.testCommitWithin-seed#[15F6463553D20E97]) [    x:collection1] o.a.s.c.SolrCore [[collection1] ] Opening new SolrCore at [/x1/jenkins/jenkins-slave/workspace/Lucene-Solr-Tests-7.0/solr/core/src/test-files/solr/collection1], dataDir=[/x1/jenkins/jenkins-slave/workspace/Lucene-Solr-Tests-7.0/solr/build/solr-core/test/J2/temp/solr.update.AutoCommitTest_15F6463553D20E97-001/init-core-data-001/]
   [junit4]   2> 79697 INFO  (TEST-AutoCommitTest.testCommitWithin-seed#[15F6463553D20E97]) [    x:collection1] o.a.s.u.CommitTracker Hard AutoCommit: disabled
   [junit4]   2> 79697 INFO  (TEST-AutoCommitTest.testCommitWithin-seed#[15F6463553D20E97]) [    x:collection1] o.a.s.u.CommitTracker Soft AutoCommit: disabled
   [junit4]   2> 79698 INFO  (TEST-AutoCommitTest.testCommitWithin-seed#[15F6463553D20E97]) [    x:collection1] o.a.s.s.SolrIndexSearcher Opening [Searcher@19eed919[collection1] main]
   [junit4]   2> 79699 INFO  (TEST-AutoCommitTest.testCommitWithin-seed#[15F6463553D20E97]) [    x:collection1] o.a.s.h.c.SpellCheckComponent Initializing spell checkers
   [junit4]   2> 79700 INFO  (TEST-AutoCommitTest.testCommitWithin-seed#[15F6463553D20E97]) [    x:collection1] o.a.s.s.DirectSolrSpellChecker init: {name=direct,classname=DirectSolrSpellChecker,field=lowerfilt,minQueryLength=3}
   [junit4]   2> 79704 INFO  (TEST-AutoCommitTest.testCommitWithin-seed#[15F6463553D20E97]) [    x:collection1] o.a.s.h.ReplicationHandler Commits will be reserved for  10000
   [junit4]   2> 79707 INFO  (searcherExecutor-304-thread-1-processing-x:collection1) [    x:collection1] o.a.s.h.c.SpellCheckComponent Loading spell index for spellchecker: default
   [junit4]   2> 79707 INFO  (searcherExecutor-304-thread-1-processing-x:collection1) [    x:collection1] o.a.s.h.c.SpellCheckComponent Loading spell index for spellchecker: direct
   [junit4]   2> 79707 INFO  (searcherExecutor-304-thread-1-processing-x:collection1) [    x:collection1] o.a.s.h.c.SpellCheckComponent Loading spell index for spellchecker: wordbreak
   [junit4]   2> 79707 INFO  (searcherExecutor-304-thread-1-processing-x:collection1) [    x:collection1] o.a.s.h.c.SpellCheckComponent Loading spell index for spellchecker: multipleFields
   [junit4]   2> 79707 INFO  (searcherExecutor-304-thread-1-processing-x:collection1) [    x:collection1] o.a.s.h.c.SpellCheckComponent Loading spell index for spellchecker: jarowinkler
   [junit4]   2> 79707 INFO  (searcherExecutor-304-thread-1-processing-x:collection1) [    x:collection1] o.a.s.h.c.SpellCheckComponent Loading spell index for spellchecker: external
   [junit4]   2> 79708 INFO  (searcherExecutor-304-thread-1-processing-x:collection1) [    x:collection1] o.a.s.h.c.SpellCheckComponent Loading spell index for spellchecker: freq
   [junit4]   2> 79708 INFO  (searcherExecutor-304-thread-1-processing-x:collection1) [    x:collection1] o.a.s.h.c.SpellCheckComponent Loading spell index for spellchecker: fqcn
   [junit4]   2> 79708 INFO  (TEST-AutoCommitTest.testCommitWithin-seed#[15F6463553D20E97]) [    x:collection1] o.a.s.u.RandomMergePolicy RandomMergePolicy wrapping class org.apache.lucene.index.LogByteSizeMergePolicy: [LogByteSizeMergePolicy: minMergeSize=1677721, mergeFactor=35, maxMergeSize=2147483648, maxMergeSizeForForcedMerge=9223372036854775807, calibrateSizeByDeletes=false, maxMergeDocs=2147483647, maxCFSSegmentSizeMB=8.796093022207999E12, noCFSRatio=1.0]
   [junit4]   2> 79708 INFO  (searcherExecutor-304-thread-1-processing-x:collection1) [    x:collection1] o.a.s.h.c.SpellCheckComponent Loading spell index for spellchecker: perDict
   [junit4]   2> 79711 INFO  (searcherExecutor-304-thread-1-processing-x:collection1) [    x:collection1] o.a.s.c.SolrCore [collection1] Registered new searcher Searcher@19eed919[collection1] main{ExitableDirectoryReader(UninvertingDirectoryReader())}
   [junit4]   2> 79711 INFO  (TEST-AutoCommitTest.testCommitWithin-seed#[15F6463553D20E97]) [    x:collection1] o.a.s.u.DefaultSolrCoreState New IndexWriter is ready to be used.
   [junit4]   2> 79711 INFO  (TEST-AutoCommitTest.testCommitWithin-seed#[15F6463553D20E97]) [    x:collection1] o.a.s.s.SolrIndexSearcher Opening [Searcher@d88959e[collection1] main]
   [junit4]   2> 79711 INFO  (TEST-AutoCommitTest.testCommitWithin-seed#[15F6463553D20E97]) [    x:collection1] o.a.s.c.SolrCore [collection1]  CLOSING SolrCore org.apache.solr.core.SolrCore@4d912b24
   [junit4]   2> 79712 INFO  (TEST-AutoCommitTest.testCommitWithin-seed#[15F6463553D20E97]) [    x:collection1] o.a.s.m.SolrMetricManager Closing metric reporters for registry=solr.core.collection1, tag=1301359396
   [junit4]   2> 79717 INFO  (searcherExecutor-304-thread-1-processing-x:collection1) [    x:collection1] o.a.s.c.SolrCore [collection1] Registered new searcher Searcher@d88959e[collection1] main{ExitableDirectoryReader(UninvertingDirectoryReader())}
   [junit4]   2> 79744 INFO  (TEST-AutoCommitTest.testCommitWithin-seed#[15F6463553D20E97]) [    x:collection1] o.a.s.u.p.LogUpdateProcessorFactory [collection1] {add=[529 (1573131841537310720)]} 0 20
   [junit4]   2> 79744 INFO  (TEST-AutoCommitTest.testCommitWithin-seed#[15F6463553D20E97]) [    x:collection1] o.a.s.c.S.Request [collection1]  webapp=null path=null params={q=id:529&qt=&start=0&rows=20&version=2.2} hits=0 status=0 QTime=0
   [junit4]   2> 83735 INFO  (commitScheduler-307-thread-1) [    x:collection1] o.a.s.u.DirectUpdateHandler2 start commit{,optimize=false,openSearcher=true,waitSearcher=true,expungeDeletes=false,softCommit=true,prepareCommit=false}
   [junit4]   2> 83739 INFO  (commitScheduler-307-thread-1) [    x:collection1] o.a.s.s.SolrIndexSearcher Opening [Searcher@27f8edf0[collection1] main]
   [junit4]   2> 83739 INFO  (commitScheduler-307-thread-1) [    x:collection1] o.a.s.u.DirectUpdateHandler2 end_commit_flush
   [junit4]   2> 83741 INFO  (searcherExecutor-304-thread-1-processing-x:collection1) [    x:collection1] o.a.s.c.SolrCore [collection1] Registered new searcher Searcher@27f8edf0[collection1] main{ExitableDirectoryReader(UninvertingDirectoryReader(Uninverting(_3(7.0.0):c1)))}
   [junit4]   2> 83810 INFO  (TEST-AutoCommitTest.testCommitWithin-seed#[15F6463553D20E97]) [    x:collection1] o.a.s.u.p.LogUpdateProcessorFactory [collection1] {add=[530 (1573131845821792256)]} 0 4087
   [junit4]   2> 83811 INFO  (TEST-AutoCommitTest.testCommitWithin-seed#[15F6463553D20E97]) [    x:collection1] o.a.s.c.S.Request [collection1]  webapp=null path=null params={q=id:530&qt=&start=0&rows=20&version=2.2} hits=0 status=0 QTime=0
   [junit4]   2> 83812 INFO  (TEST-AutoCommitTest.testCommitWithin-seed#[15F6463553D20E97]) [    x:collection1] o.a.s.u.p.LogUpdateProcessorFactory [collection1] {delete=[529 (-1573131845823889408)]} 0 4088
   [junit4]   2> 83812 INFO  (TEST-AutoCommitTest.testCommitWithin-seed#[15F6463553D20E97]) [    x:collection1] o.a.s.c.S.Request [collection1]  webapp=null path=null params={q=id:529&qt=&start=0&rows=20&version=2.2} hits=1 status=0 QTime=0
   [junit4]   2> 85812 INFO  (commitScheduler-307-thread-1) [    x:collection1] o.a.s.u.DirectUpdateHandler2 start commit{,optimize=false,openSearcher=true,waitSearcher=true,expungeDeletes=false,softCommit=true,prepareCommit=false}
   [junit4]   2> 85816 INFO  (commitScheduler-307-thread-1) [    x:collection1] o.a.s.s.SolrIndexSearcher Opening [Searcher@1c57551c[collection1] main]
   [junit4]   2> 85816 INFO  (commitScheduler-307-thread-1) [    x:collection1] o.a.s.u.DirectUpdateHandler2 end_commit_flush
   [junit4]   2> 85818 INFO  (searcherExecutor-304-thread-1-processing-x:collection1) [    x:collection1] o.a.s.c.SolrCore [collection1] Registered new searcher Searcher@1c57551c[collection1] main{ExitableDirectoryReader(UninvertingDirectoryReader(Uninverting(_4(7.0.0):c1)))}
   [junit4]   2> 86064 INFO  (TEST-AutoCommitTest.testCommitWithin-seed#[15F6463553D20E97]) [    x:collection1] o.a.s.c.S.Request [collection1]  webapp=null path=null params={q=id:529&qt=&start=0&rows=20&version=2.2} hits=0 status=0 QTime=0
   [junit4]   2> 86064 INFO  (TEST-AutoCommitTest.testCommitWithin-seed#[15F6463553D20E97]) [    x:collection1] o.a.s.c.S.Request [collection1]  webapp=null path=null params={q=id:530&qt=&start=0&rows=20&version=2.2} hits=1 status=0 QTime=0
   [junit4]   2> 86066 INFO  (TEST-AutoCommitTest.testCommitWithin-seed#[15F6463553D20E97]) [    x:collection1] o.a.s.u.p.LogUpdateProcessorFactory [collection1] {add=[500 (1573131848187379712)]} 0 6342
   [junit4]   2> 86066 INFO  (TEST-AutoCommitTest.testCommitWithin-seed#[15F6463553D20E97]) [    x:collection1] o.a.s.u.p.LogUpdateProcessorFactory [collection1] {add=[500 (1573131848188428288)]} 0 6342
   [junit4]   2> 86066 INFO  (TEST-AutoCommitTest.testCommitWithin-seed#[15F6463553D20E97]) [    x:collection1] o.a.s.u.p.LogUpdateProcessorFactory [collection1] {add=[500 (1573131848188428289)]} 0 6343
   [junit4]   2> 86066 INFO  (TEST-AutoCommitTest.testCommitWithin-seed#[15F6463553D20E97]) [    x:collection1] o.a.s.u.p.LogUpdateProcessorFactory [collection1] {add=[500 (1573131848188428290)]} 0 6343
   [junit4]   2> 86067 INFO  (TEST-AutoCommitTest.testCommitWithin-seed#[15F6463553D20E97]) [    x:collection1] o.a.s.u.p.LogUpdateProcessorFactory [collection1] {add=[500 (1573131848189476864)]} 0 6343
   [junit4]   2> 86067 INFO  (TEST-AutoCommitTest.testCommitWithin-seed#[15F6463553D20E97]) [    x:collection1] o.a.s.u.p.LogUpdateProcessorFactory [collection1] {add=[500 (1573131848189476865)]} 0 6344
   [junit4]   2> 86067 INFO  (TEST-AutoCommitTest.testCommitWithin-seed#[15F6463553D20E97]) [    x:collection1] o.a.s.u.p.LogUpdateProcessorFactory [collection1] {add=[500 (1573131848189476866)]} 0 6344
   [junit4]   2> 86068 INFO  (TEST-AutoCommitTest.testCommitWithin-seed#[15F6463553D20E97]) [    x:collection1] o.a.s.u.p.LogUpdateProcessorFactory [collection1] {add=[500 (1573131848189476867)]} 0 6344
   [junit4]   2> 86068 INFO  (TEST-AutoCommitTest.testCommitWithin-seed#[15F6463553D20E97]) [    x:collection1] o.a.s.u.p.LogUpdateProcessorFactory [collection1] {add=[500 (1573131848190525440)]} 0 6344
   [junit4]   2> 86068 INFO  (TEST-AutoCommitTest.testCommitWithin-seed#[15F6463553D20E97]) [    x:collection1] o.a.s.u.p.LogUpdateProcessorFactory [collection1] {add=[500 (1573131848190525441)]} 0 6345
   [junit4]   2> 86068 INFO  (TEST-AutoCommitTest.testCommitWithin-seed#[15F6463553D20E97]) [    x:collection1] o.a.s.c.S.Request [collection1]  webapp=null path=null params={q=id:500&qt=&start=0&rows=20&version=2.2} hits=0 status=0 QTime=0
   [junit4]   2> 86069 INFO  (TEST-AutoCommitTest.testCommitWithin-seed#[15F6463553D20E97]) [    x:collection1] o.a.s.u.p.LogUpdateProcessorFactory [collection1] {delete=[530 (-1573131848191574016)]} 0 6345
   [junit4]   2> 86069 INFO  (TEST-AutoCommitTest.testCommitWithin-seed#[15F6463553D20E97]) [    x:collection1] o.a.s.u.p.LogUpdateProcessorFactory [collection1] {delete=[530 (-1573131848191574017)]} 0 6346
   [junit4]   2> 86069 INFO  (TEST-AutoCommitTest.testCommitWithin-seed#[15F6463553D20E97]) [    x:collection1] o.a.s.u.p.LogUpdateProcessorFactory [collection1] {delete=[530 (-1573131848191574018)]} 0 6346
   [junit4]   2> 86069 INFO  (TEST-AutoCommitTest.testCommitWithin-seed#[15F6463553D20E97]) [    x:collection1] o.a.s.u.p.LogUpdateProcessorFactory [collection1] {delete=[530 (-1573131848191574019)]} 0 6346
   [junit4]   2> 86069 INFO  (TEST-AutoCommitTest.testCommitWithin-seed#[15F6463553D20E97]) [    x:collection1] o.a.s.u.p.LogUpdateProcessorFactory [collection1] {delete=[530 (-1573131848191574020)]} 0 6346
   [junit4]   2> 86069 INFO  (TEST-AutoCommitTest.testCommitWithin-seed#[15F6463553D20E97]) [    x:collection1] o.a.s.u.p.LogUpdateProcessorFactory [collection1] {delete=[530 (-1573131848191574021)]} 0 6346
   [junit4]   2> 86070 INFO  (TEST-AutoCommitTest.testCommitWithin-seed#[15F6463553D20E97]) [    x:collection1] o.a.s.u.p.LogUpdateProcessorFactory [collection1] {delete=[530 (-1573131848192622592)]} 0 6346
   [junit4]   2> 86070 INFO  (TEST-AutoCommitTest.testCommitWithin-seed#[15F6463553D20E97]) [    x:collection1] o.a.s.u.p.LogUpdateProcessorFactory [collection1] {delete=[530 (-1573131848192622593)]} 0 6346
   [junit4]   2> 86070 INFO  (TEST-AutoCommitTest.testCommitWithin-seed#[15F6463553D20E97]) [    x:collection1] o.a.s.u.p.LogUpdateProcessorFactory [collection1] {delete=[530 (-1573131848192622594)]} 0 6346
   [junit4]   2> 86070 INFO  (TEST-AutoCommitTest.testCommitWithin-seed#[15F6463553D20E97]) [    x:collection1] o.a.s.u.p.LogUpdateProcessorFactory [collection1] {delete=[530 (-1573131848192622595)]} 0 6347
   [junit4]   2> 86070 INFO  (TEST-AutoCommitTest.testCommitWithin-seed#[15F6463553D20E97]) [    x:collection1] o.a.s.c.S.Request [collection1]  webapp=null path=null params={q=id:530&qt=&start=0&rows=20&version=2.2} hits=1 status=0 QTime=0
   [junit4]   2> 87069 INFO  (commitScheduler-307-thread-1) [    x:collection1] o.a.s.u.DirectUpdateHandler2 start commit{,optimize=false,openSearcher=true,waitSearcher=true,expungeDeletes=false,softCommit=true,prepareCommit=false}
   [junit4]   2> 87073 INFO  (commitScheduler-307-thread-1) [    x:collection1] o.a.s.s.SolrIndexSearcher Opening [Searcher@782ff9fa[collection1] main]
   [junit4]   2> 87073 INFO  (commitScheduler-307-thread-1) [    x:collection1] o.a.s.u.DirectUpdateHandler2 end_commit_flush
   [junit4]   2> 87075 INFO  (searcherExecutor-304-thread-1-processing-x:collection1) [    x:collection1] o.a.s.c.SolrCore [collection1] Registered new searcher Searcher@782ff9fa[collection1] main{ExitableDirectoryReader(UninvertingDirectoryReader(Uninverting(_5(7.0.0):c10/9:delGen=1)))}
   [junit4]   2> 87322 INFO  (TEST-AutoCommitTest.testCommitWithin-seed#[15F6463553D20E97]) [    x:collection1] o.a.s.c.S.Request [collection1]  webapp=null path=null params={q=id:500&qt=&start=0&rows=20&version=2.2} hits=1 status=0 QTime=0
   [junit4]   2> 87323 INFO  (TEST-AutoCommitTest.testCommitWithin-seed#[15F6463553D20E97]) [    x:collection1] o.a.s.c.S.Request [collection1]  webapp=null path=null params={q=id:530&qt=&start=0&rows=20&version=2.2} hits=0 status=0 QTime=0
   [junit4]   2> 87323 INFO  (TEST-AutoCommitTest.testCommitWithin-seed#[15F6463553D20E97]) [    x:collection1] o.a.s.SolrTestCaseJ4 ###Ending testCommitWithin
   [junit4]   2> 87324 INFO  (SUITE-AutoCommitTest-seed#[15F6463553D20E97]-worker) [    x:collection1] o.a.s.SolrTestCaseJ4 ###deleteCore
   [junit4]   2> 87324 INFO  (SUITE-AutoCommitTest-seed#[15F6463553D20E97]-worker) [    x:collection1] o.a.s.c.CoreContainer Shutting down CoreContainer instance=83611166
   [junit4]   2> 87324 INFO  (SUITE-AutoCommitTest-seed#[15F6463553D20E97]-worker) [    x:collection1] o.a.s.m.SolrMetricManager Closing metric reporters for registry=solr.node, tag=null
   [junit4]   2> 87325 INFO  (SUITE-AutoCommitTest-seed#[15F6463553D20E97]-worker) [    x:collection1] o.a.s.m.SolrMetricManager Closing metric reporters for registry=solr.jvm, tag=null
   [junit4]   2> 87326 INFO  (SUITE-AutoCommitTest-seed#[15F6463553D20E97]-worker) [    x:collection1] o.a.s.m.SolrMetricManager Closing metric reporters for registry=solr.jetty, tag=null
   [junit4]   2> 87334 INFO  (SUITE-AutoCommitTest-seed#[15F6463553D20E97]-worker) [    x:collection1] o.a.s.c.TransientSolrCoreCacheDefault Allocating transient cache for 2147483647 transient cores
   [junit4]   2> 87334 INFO  (coreCloseExecutor-308-thread-1-processing-x:collection1) [    x:collection1] o.a.s.c.SolrCore [collection1]  CLOSING SolrCore org.apache.solr.core.SolrCore@63ab97cb
   [junit4]   2> 87334 INFO  (coreCloseExecutor-308-thread-1-processing-x:collection1) [    x:collection1] o.a.s.u.DirectUpdateHandler2 Committing on IndexWriter close.
   [junit4]   2> 87334 INFO  (coreCloseExecutor-308-thread-1-processing-x:collection1) [    x:collection1] o.a.s.u.SolrIndexWriter Calling setCommitData with IW:org.apache.solr.update.SolrIndexWriter@211b7a7b commitCommandVersion:0
   [junit4]   2> 87344 INFO  (coreCloseExecutor-308-thread-1-processing-x:collection1) [    x:collection1] o.a.s.m.SolrMetricManager Closing metric reporters for registry=solr.core.collection1, tag=1672189899
   [junit4]   2> NOTE: leaving temporary files on disk at: /x1/jenkins/jenkins-slave/workspace/Lucene-Solr-Tests-7.0/solr/build/solr-core/test/J2/temp/solr.update.AutoCommitTest_15F6463553D20E97-001
   [junit4]   2> NOTE: test params are: codec=Asserting(Lucene70): {field_t=Lucene50(blocksize=128), multiDefault=PostingsFormat(name=LuceneVarGapDocFreqInterval), subject=PostingsFormat(name=LuceneVarGapDocFreqInterval), id=Lucene50(blocksize=128), text=PostingsFormat(name=Direct)}, docValues:{range_facet_l_dv=DocValuesFormat(name=Memory), _version_=DocValuesFormat(name=Lucene70), range_facet_i_dv=DocValuesFormat(name=Asserting), intDvoDefault=DocValuesFormat(name=Memory), timestamp=DocValuesFormat(name=Asserting)}, maxPointsInLeafNode=1794, maxMBSortInHeap=5.7097795958962605, sim=RandomSimilarity(queryNorm=false): {}, locale=fr-CA, timezone=America/Argentina/Catamarca
   [junit4]   2> NOTE: Linux 3.13.0-88-generic amd64/Oracle Corporation 1.8.0_131 (64-bit)/cpus=4,threads=1,free=235386536,total=389545984
   [junit4]   2> NOTE: All tests run in this JVM: [DistributedFacetPivotSmallTest, SmileWriterTest, MoveReplicaHDFSTest, TimeZoneUtilsTest, UninvertDocValuesMergePolicyTest, CleanupOldIndexTest, TestPayloadCheckQParserPlugin, TestPseudoReturnFields, TestDynamicFieldCollectionResource, PreAnalyzedFieldTest, DataDrivenBlockJoinTest, NotRequiredUniqueKeyTest, AutoCommitTest]
   [junit4] Completed [36/727 (1!)] on J2 in 10.32s, 3 tests, 1 error <<< FAILURES!

[...truncated 45626 lines...]


---------------------------------------------------------------------
To unsubscribe, e-mail: [hidden email]
For additional commands, e-mail: [hidden email]
Loading...