[JENKINS] Lucene-Solr-Tests-7.5 - Build # 6 - Unstable

classic Classic list List threaded Threaded
1 message Options
Reply | Threaded
Open this post in threaded view
|

[JENKINS] Lucene-Solr-Tests-7.5 - Build # 6 - Unstable

Apache Jenkins Server-2
Build: https://builds.apache.org/job/Lucene-Solr-Tests-7.5/6/

1 tests failed.
FAILED:  org.apache.solr.cloud.autoscaling.sim.TestSimTriggerIntegration.testSearchRate

Error Message:
The trigger did not start in time

Stack Trace:
java.lang.AssertionError: The trigger did not start in time
        at __randomizedtesting.SeedInfo.seed([2A33227A19C6C9DE:777B3CF3D6006F91]:0)
        at org.junit.Assert.fail(Assert.java:93)
        at org.junit.Assert.assertTrue(Assert.java:43)
        at org.apache.solr.cloud.autoscaling.sim.TestSimTriggerIntegration.testSearchRate(TestSimTriggerIntegration.java:1262)
        at sun.reflect.NativeMethodAccessorImpl.invoke0(Native Method)
        at sun.reflect.NativeMethodAccessorImpl.invoke(NativeMethodAccessorImpl.java:62)
        at sun.reflect.DelegatingMethodAccessorImpl.invoke(DelegatingMethodAccessorImpl.java:43)
        at java.lang.reflect.Method.invoke(Method.java:498)
        at com.carrotsearch.randomizedtesting.RandomizedRunner.invoke(RandomizedRunner.java:1742)
        at com.carrotsearch.randomizedtesting.RandomizedRunner$8.evaluate(RandomizedRunner.java:935)
        at com.carrotsearch.randomizedtesting.RandomizedRunner$9.evaluate(RandomizedRunner.java:971)
        at com.carrotsearch.randomizedtesting.RandomizedRunner$10.evaluate(RandomizedRunner.java:985)
        at com.carrotsearch.randomizedtesting.rules.SystemPropertiesRestoreRule$1.evaluate(SystemPropertiesRestoreRule.java:57)
        at org.apache.lucene.util.TestRuleSetupTeardownChained$1.evaluate(TestRuleSetupTeardownChained.java:49)
        at org.apache.lucene.util.AbstractBeforeAfterRule$1.evaluate(AbstractBeforeAfterRule.java:45)
        at org.apache.lucene.util.TestRuleThreadAndTestName$1.evaluate(TestRuleThreadAndTestName.java:48)
        at org.apache.lucene.util.TestRuleIgnoreAfterMaxFailures$1.evaluate(TestRuleIgnoreAfterMaxFailures.java:64)
        at org.apache.lucene.util.TestRuleMarkFailure$1.evaluate(TestRuleMarkFailure.java:47)
        at com.carrotsearch.randomizedtesting.rules.StatementAdapter.evaluate(StatementAdapter.java:36)
        at com.carrotsearch.randomizedtesting.ThreadLeakControl$StatementRunner.run(ThreadLeakControl.java:368)
        at com.carrotsearch.randomizedtesting.ThreadLeakControl.forkTimeoutingTask(ThreadLeakControl.java:817)
        at com.carrotsearch.randomizedtesting.ThreadLeakControl$3.evaluate(ThreadLeakControl.java:468)
        at com.carrotsearch.randomizedtesting.RandomizedRunner.runSingleTest(RandomizedRunner.java:944)
        at com.carrotsearch.randomizedtesting.RandomizedRunner$5.evaluate(RandomizedRunner.java:830)
        at com.carrotsearch.randomizedtesting.RandomizedRunner$6.evaluate(RandomizedRunner.java:880)
        at com.carrotsearch.randomizedtesting.RandomizedRunner$7.evaluate(RandomizedRunner.java:891)
        at com.carrotsearch.randomizedtesting.rules.StatementAdapter.evaluate(StatementAdapter.java:36)
        at com.carrotsearch.randomizedtesting.rules.SystemPropertiesRestoreRule$1.evaluate(SystemPropertiesRestoreRule.java:57)
        at org.apache.lucene.util.AbstractBeforeAfterRule$1.evaluate(AbstractBeforeAfterRule.java:45)
        at com.carrotsearch.randomizedtesting.rules.StatementAdapter.evaluate(StatementAdapter.java:36)
        at org.apache.lucene.util.TestRuleStoreClassName$1.evaluate(TestRuleStoreClassName.java:41)
        at com.carrotsearch.randomizedtesting.rules.NoShadowingOrOverridesOnMethodsRule$1.evaluate(NoShadowingOrOverridesOnMethodsRule.java:40)
        at com.carrotsearch.randomizedtesting.rules.NoShadowingOrOverridesOnMethodsRule$1.evaluate(NoShadowingOrOverridesOnMethodsRule.java:40)
        at com.carrotsearch.randomizedtesting.rules.StatementAdapter.evaluate(StatementAdapter.java:36)
        at com.carrotsearch.randomizedtesting.rules.StatementAdapter.evaluate(StatementAdapter.java:36)
        at com.carrotsearch.randomizedtesting.rules.StatementAdapter.evaluate(StatementAdapter.java:36)
        at org.apache.lucene.util.TestRuleAssertionsRequired$1.evaluate(TestRuleAssertionsRequired.java:53)
        at org.apache.lucene.util.TestRuleMarkFailure$1.evaluate(TestRuleMarkFailure.java:47)
        at org.apache.lucene.util.TestRuleIgnoreAfterMaxFailures$1.evaluate(TestRuleIgnoreAfterMaxFailures.java:64)
        at org.apache.lucene.util.TestRuleIgnoreTestSuites$1.evaluate(TestRuleIgnoreTestSuites.java:54)
        at com.carrotsearch.randomizedtesting.rules.StatementAdapter.evaluate(StatementAdapter.java:36)
        at com.carrotsearch.randomizedtesting.ThreadLeakControl$StatementRunner.run(ThreadLeakControl.java:368)
        at java.lang.Thread.run(Thread.java:748)




Build Log:
[...truncated 13289 lines...]
   [junit4] Suite: org.apache.solr.cloud.autoscaling.sim.TestSimTriggerIntegration
   [junit4]   2> Creating dataDir: /home/jenkins/jenkins-slave/workspace/Lucene-Solr-Tests-7.5/solr/build/solr-core/test/J2/temp/solr.cloud.autoscaling.sim.TestSimTriggerIntegration_2A33227A19C6C9DE-001/init-core-data-001
   [junit4]   2> 1586090 WARN  (SUITE-TestSimTriggerIntegration-seed#[2A33227A19C6C9DE]-worker) [    ] o.a.s.SolrTestCaseJ4 startTrackingSearchers: numOpens=5 numCloses=5
   [junit4]   2> 1586090 INFO  (SUITE-TestSimTriggerIntegration-seed#[2A33227A19C6C9DE]-worker) [    ] o.a.s.SolrTestCaseJ4 Using TrieFields (NUMERIC_POINTS_SYSPROP=false) w/NUMERIC_DOCVALUES_SYSPROP=false
   [junit4]   2> 1586092 INFO  (SUITE-TestSimTriggerIntegration-seed#[2A33227A19C6C9DE]-worker) [    ] o.a.s.SolrTestCaseJ4 Randomized ssl (false) and clientAuth (false) via: @org.apache.solr.util.RandomizeSSL(reason=, ssl=NaN, value=NaN, clientAuth=NaN)
   [junit4]   2> 1586092 INFO  (SUITE-TestSimTriggerIntegration-seed#[2A33227A19C6C9DE]-worker) [    ] o.a.s.SolrTestCaseJ4 SecureRandom sanity checks: test.solr.allowed.securerandom=null & java.security.egd=file:/dev/./urandom
   [junit4]   2> 1586126 DEBUG (SUITE-TestSimTriggerIntegration-seed#[2A33227A19C6C9DE]-worker) [    ] o.a.s.c.a.s.SimClusterStateProvider --- new Overseer leader: 127.0.0.1:10001_solr
   [junit4]   2> 1586126 DEBUG (Simulated OverseerAutoScalingTriggerThread) [    ] o.a.s.c.a.OverseerTriggerThread Adding .auto_add_replicas and .scheduled_maintenance triggers
   [junit4]   2> 1586126 DEBUG (Simulated OverseerAutoScalingTriggerThread) [    ] o.a.s.c.a.OverseerTriggerThread Refreshing /autoscaling.json with znode version 0
   [junit4]   2> 1586127 DEBUG (Simulated OverseerAutoScalingTriggerThread) [    ] o.a.s.c.a.OverseerTriggerThread Current znodeVersion 0, lastZnodeVersion -1
   [junit4]   2> 1586127 DEBUG (Simulated OverseerAutoScalingTriggerThread) [    ] o.a.s.c.a.OverseerTriggerThread Processed trigger updates upto znodeVersion 0
   [junit4]   2> 1586127 DEBUG (Simulated OverseerAutoScalingTriggerThread) [    ] o.a.s.c.a.NodeLostTrigger NodeLostTrigger .auto_add_replicas - Initial livenodes: [127.0.0.1:10001_solr]
   [junit4]   2> 1586128 INFO  (SUITE-TestSimTriggerIntegration-seed#[2A33227A19C6C9DE]-worker) [    ] o.a.s.h.a.MetricsHistoryHandler No .system collection, keeping metrics history in memory.
   [junit4]   2> 1586128 DEBUG (ScheduledTrigger-3690-thread-1) [    ] o.a.s.c.a.NodeLostTrigger Running NodeLostTrigger: .auto_add_replicas with currently live nodes: 1
   [junit4]   2> 1586128 DEBUG (Simulated OverseerAutoScalingTriggerThread) [    ] o.a.s.c.a.OverseerTriggerThread -- clean old nodeAdded markers
   [junit4]   2> 1586128 DEBUG (Simulated OverseerAutoScalingTriggerThread) [    ] o.a.s.c.a.OverseerTriggerThread Current znodeVersion 0, lastZnodeVersion 0
   [junit4]   2> 1586166 DEBUG (ScheduledTrigger-3690-thread-1) [    ] o.a.s.c.a.NodeLostTrigger Running NodeLostTrigger: .auto_add_replicas with currently live nodes: 2
   [junit4]   2> 1586203 DEBUG (ScheduledTrigger-3690-thread-1) [    ] o.a.s.c.a.NodeLostTrigger Running NodeLostTrigger: .auto_add_replicas with currently live nodes: 2
   [junit4]   2> 1586204 INFO  (TEST-TestSimTriggerIntegration.testEventFromRestoredState-seed#[2A33227A19C6C9DE]) [    ] o.a.s.SolrTestCaseJ4 ###Starting testEventFromRestoredState
   [junit4]   2> 1586205 DEBUG (TEST-TestSimTriggerIntegration.testEventFromRestoredState-seed#[2A33227A19C6C9DE]) [    ] o.a.s.c.a.OverseerTriggerThread Refreshing /autoscaling.json with znode version 1
   [junit4]   2> 1586205 DEBUG (Simulated OverseerAutoScalingTriggerThread) [    ] o.a.s.c.a.OverseerTriggerThread Processed trigger updates upto znodeVersion 1
   [junit4]   2> 1586205 DEBUG (Simulated OverseerAutoScalingTriggerThread) [    ] o.a.s.c.a.OverseerTriggerThread -- clean old nodeLost markers
   [junit4]   2> 1586205 DEBUG (Simulated OverseerAutoScalingTriggerThread) [    ] o.a.s.c.a.OverseerTriggerThread -- clean old nodeAdded markers
   [junit4]   2> 1586205 DEBUG (Simulated OverseerAutoScalingTriggerThread) [    ] o.a.s.c.a.OverseerTriggerThread Current znodeVersion 1, lastZnodeVersion 1
   [junit4]   2> 1586206 INFO  (TEST-TestSimTriggerIntegration.testEventFromRestoredState-seed#[2A33227A19C6C9DE]) [    ] o.a.s.c.a.s.SimCloudManager === Restarting OverseerTriggerThread and clearing object cache...
   [junit4]   2> 1586206 WARN  (Simulated OverseerAutoScalingTriggerThread) [    ] o.a.s.c.a.OverseerTriggerThread OverseerTriggerThread woken up but we are closed, exiting.
   [junit4]   2> 1586215 DEBUG (TEST-TestSimTriggerIntegration.testEventFromRestoredState-seed#[2A33227A19C6C9DE]) [    ] o.a.s.c.a.ScheduledTriggers Shutting down scheduled thread pool executor now
   [junit4]   2> 1586304 DEBUG (TEST-TestSimTriggerIntegration.testEventFromRestoredState-seed#[2A33227A19C6C9DE]) [    ] o.a.s.c.a.ScheduledTriggers Shutting down action executor now
   [junit4]   2> 1586305 DEBUG (TEST-TestSimTriggerIntegration.testEventFromRestoredState-seed#[2A33227A19C6C9DE]) [    ] o.a.s.c.a.ScheduledTriggers Awaiting termination for action executor
   [junit4]   2> 1586305 DEBUG (TEST-TestSimTriggerIntegration.testEventFromRestoredState-seed#[2A33227A19C6C9DE]) [    ] o.a.s.c.a.ScheduledTriggers Awaiting termination for scheduled thread pool executor
   [junit4]   2> 1586305 DEBUG (TEST-TestSimTriggerIntegration.testEventFromRestoredState-seed#[2A33227A19C6C9DE]) [    ] o.a.s.c.a.ScheduledTriggers ScheduledTriggers closed completely
   [junit4]   2> 1586305 DEBUG (TEST-TestSimTriggerIntegration.testEventFromRestoredState-seed#[2A33227A19C6C9DE]) [    ] o.a.s.c.a.OverseerTriggerThread OverseerTriggerThread has been closed explicitly
   [junit4]   2> 1586306 DEBUG (Simulated OverseerAutoScalingTriggerThread) [    ] o.a.s.c.a.OverseerTriggerThread Adding .auto_add_replicas and .scheduled_maintenance triggers
   [junit4]   2> 1586306 DEBUG (Simulated OverseerAutoScalingTriggerThread) [    ] o.a.s.c.a.OverseerTriggerThread Refreshing /autoscaling.json with znode version 2
   [junit4]   2> 1586306 DEBUG (Simulated OverseerAutoScalingTriggerThread) [    ] o.a.s.c.a.OverseerTriggerThread Current znodeVersion 2, lastZnodeVersion -1
   [junit4]   2> 1586306 DEBUG (Simulated OverseerAutoScalingTriggerThread) [    ] o.a.s.c.a.OverseerTriggerThread Processed trigger updates upto znodeVersion 2
   [junit4]   2> 1586325 DEBUG (Simulated OverseerAutoScalingTriggerThread) [    ] o.a.s.c.a.NodeLostTrigger NodeLostTrigger .auto_add_replicas - Initial livenodes: [127.0.0.1:10001_solr, 127.0.0.1:10002_solr]
   [junit4]   2> 1586328 DEBUG (Simulated OverseerAutoScalingTriggerThread) [    ] o.a.s.c.a.OverseerTriggerThread -- clean old nodeAdded markers
   [junit4]   2> 1586329 DEBUG (Simulated OverseerAutoScalingTriggerThread) [    ] o.a.s.c.a.OverseerTriggerThread Current znodeVersion 2, lastZnodeVersion 2
   [junit4]   2> 1586329 DEBUG (ScheduledTrigger-3695-thread-2) [    ] o.a.s.c.a.NodeLostTrigger Running NodeLostTrigger: .auto_add_replicas with currently live nodes: 2
   [junit4]   2> 1586503 DEBUG (simCloudManagerPool-3694-thread-1) [    ] o.a.s.c.a.AutoScalingHandler Verified autoscaling configuration
   [junit4]   2> 1586504 DEBUG (simCloudManagerPool-3694-thread-1) [    ] o.a.s.c.a.OverseerTriggerThread Refreshing /autoscaling.json with znode version 3
   [junit4]   2> 1586593 DEBUG (ScheduledTrigger-3695-thread-4) [    ] o.a.s.c.a.NodeLostTrigger Running NodeLostTrigger: .auto_add_replicas with currently live nodes: 2
   [junit4]   2> 1586594 DEBUG (Simulated OverseerAutoScalingTriggerThread) [    ] o.a.s.c.a.OverseerTriggerThread Processed trigger updates upto znodeVersion 3
   [junit4]   2> 1586594 DEBUG (Simulated OverseerAutoScalingTriggerThread) [    ] o.a.s.c.a.OverseerTriggerThread -- clean old nodeAdded markers
   [junit4]   2> 1586594 DEBUG (Simulated OverseerAutoScalingTriggerThread) [    ] o.a.s.c.a.OverseerTriggerThread Current znodeVersion 3, lastZnodeVersion 3
   [junit4]   2> 1586614 DEBUG (ScheduledTrigger-3695-thread-2) [    ] o.a.s.c.a.NodeLostTrigger Running NodeLostTrigger: .auto_add_replicas with currently live nodes: 2
   [junit4]   2> 1586631 DEBUG (simCloudManagerPool-3694-thread-2) [    ] o.a.s.c.a.s.SimClusterStateProvider -- submit leader election for .system / shard1
   [junit4]   2> 1586632 DEBUG (simCloudManagerPool-3694-thread-3) [    ] o.a.s.c.a.s.SimClusterStateProvider Running leader election for .system / shard1
   [junit4]   2> 1586633 DEBUG (simCloudManagerPool-3694-thread-3) [    ] o.a.s.c.a.s.SimClusterStateProvider -- elected new leader for .system / shard1: core_node1
   [junit4]   2> 1586634 DEBUG (ScheduledTrigger-3695-thread-2) [    ] o.a.s.c.a.NodeLostTrigger Running NodeLostTrigger: .auto_add_replicas with currently live nodes: 2
   [junit4]   2> 1586638 DEBUG (simCloudManagerPool-3694-thread-4) [    ] o.a.s.c.a.AutoScalingHandler Verified autoscaling configuration
   [junit4]   2> 1586638 DEBUG (simCloudManagerPool-3694-thread-4) [    ] o.a.s.c.a.OverseerTriggerThread Refreshing /autoscaling.json with znode version 4
   [junit4]   2> 1586638 DEBUG (Simulated OverseerAutoScalingTriggerThread) [    ] o.a.s.c.a.OverseerTriggerThread Processed trigger updates upto znodeVersion 4
   [junit4]   2> 1586639 INFO  (Simulated OverseerAutoScalingTriggerThread) [    ] o.a.s.c.a.s.TestSimTriggerIntegration TestTriggerAction init
   [junit4]   2> 1586639 DEBUG (Simulated OverseerAutoScalingTriggerThread) [    ] o.a.s.c.a.NodeAddedTrigger NodeAddedTrigger node_added_trigger - Initial livenodes: [127.0.0.1:10001_solr, 127.0.0.1:10002_solr]
   [junit4]   2> 1586639 DEBUG (Simulated OverseerAutoScalingTriggerThread) [    ] o.a.s.c.a.NodeAddedTrigger NodeAddedTrigger node_added_trigger instantiated with properties: {event=nodeAdded, waitFor=10, actions=[{name=test, class=org.apache.solr.cloud.autoscaling.sim.TestSimTriggerIntegration$TestTriggerAction}], enabled=true}
   [junit4]   2> 1586639 DEBUG (Simulated OverseerAutoScalingTriggerThread) [    ] o.a.s.c.a.OverseerTriggerThread Current znodeVersion 4, lastZnodeVersion 4
   [junit4]   2> 1586639 DEBUG (ScheduledTrigger-3695-thread-4) [    ] o.a.s.c.a.NodeAddedTrigger Running NodeAddedTrigger node_added_trigger
   [junit4]   2> 1586639 DEBUG (ScheduledTrigger-3695-thread-4) [    ] o.a.s.c.a.NodeAddedTrigger Found livenodes: 2
   [junit4]   2> 1586654 DEBUG (ScheduledTrigger-3695-thread-2) [    ] o.a.s.c.a.NodeLostTrigger Running NodeLostTrigger: .auto_add_replicas with currently live nodes: 3
   [junit4]   2> 1586659 DEBUG (ScheduledTrigger-3695-thread-4) [    ] o.a.s.c.a.NodeAddedTrigger Running NodeAddedTrigger node_added_trigger
   [junit4]   2> 1586659 DEBUG (ScheduledTrigger-3695-thread-4) [    ] o.a.s.c.a.NodeAddedTrigger Found livenodes: 3
   [junit4]   2> 1586659 DEBUG (ScheduledTrigger-3695-thread-4) [    ] o.a.s.c.a.NodeAddedTrigger Tracking new node: 127.0.0.1:10003_solr at time 19286561546951658
   [junit4]   2> 1586674 DEBUG (ScheduledTrigger-3695-thread-4) [    ] o.a.s.c.a.NodeLostTrigger Running NodeLostTrigger: .auto_add_replicas with currently live nodes: 3
   [junit4]   2> 1586679 DEBUG (ScheduledTrigger-3695-thread-4) [    ] o.a.s.c.a.NodeAddedTrigger Running NodeAddedTrigger node_added_trigger
   [junit4]   2> 1586679 DEBUG (ScheduledTrigger-3695-thread-4) [    ] o.a.s.c.a.NodeAddedTrigger Found livenodes: 3
   [junit4]   2> 1586694 DEBUG (ScheduledTrigger-3695-thread-4) [    ] o.a.s.c.a.NodeLostTrigger Running NodeLostTrigger: .auto_add_replicas with currently live nodes: 3
   [junit4]   2> 1586700 DEBUG (ScheduledTrigger-3695-thread-4) [    ] o.a.s.c.a.NodeAddedTrigger Running NodeAddedTrigger node_added_trigger
   [junit4]   2> 1586700 DEBUG (ScheduledTrigger-3695-thread-4) [    ] o.a.s.c.a.NodeAddedTrigger Found livenodes: 3
   [junit4]   2> 1586715 DEBUG (ScheduledTrigger-3695-thread-4) [    ] o.a.s.c.a.NodeLostTrigger Running NodeLostTrigger: .auto_add_replicas with currently live nodes: 3
   [junit4]   2> 1586720 DEBUG (ScheduledTrigger-3695-thread-4) [    ] o.a.s.c.a.NodeAddedTrigger Running NodeAddedTrigger node_added_trigger
   [junit4]   2> 1586720 DEBUG (ScheduledTrigger-3695-thread-4) [    ] o.a.s.c.a.NodeAddedTrigger Found livenodes: 3
   [junit4]   2> 1586735 DEBUG (ScheduledTrigger-3695-thread-4) [    ] o.a.s.c.a.NodeLostTrigger Running NodeLostTrigger: .auto_add_replicas with currently live nodes: 3
   [junit4]   2> 1586740 DEBUG (ScheduledTrigger-3695-thread-4) [    ] o.a.s.c.a.NodeAddedTrigger Running NodeAddedTrigger node_added_trigger
   [junit4]   2> 1586740 DEBUG (ScheduledTrigger-3695-thread-4) [    ] o.a.s.c.a.NodeAddedTrigger Found livenodes: 3
   [junit4]   2> 1586755 DEBUG (ScheduledTrigger-3695-thread-4) [    ] o.a.s.c.a.NodeLostTrigger Running NodeLostTrigger: .auto_add_replicas with currently live nodes: 3
   [junit4]   2> 1586760 DEBUG (ScheduledTrigger-3695-thread-4) [    ] o.a.s.c.a.NodeAddedTrigger Running NodeAddedTrigger node_added_trigger
   [junit4]   2> 1586760 DEBUG (ScheduledTrigger-3695-thread-4) [    ] o.a.s.c.a.NodeAddedTrigger Found livenodes: 3
   [junit4]   2> 1586775 DEBUG (ScheduledTrigger-3695-thread-4) [    ] o.a.s.c.a.NodeLostTrigger Running NodeLostTrigger: .auto_add_replicas with currently live nodes: 3
   [junit4]   2> 1586781 DEBUG (ScheduledTrigger-3695-thread-4) [    ] o.a.s.c.a.NodeAddedTrigger Running NodeAddedTrigger node_added_trigger
   [junit4]   2> 1586781 DEBUG (ScheduledTrigger-3695-thread-4) [    ] o.a.s.c.a.NodeAddedTrigger Found livenodes: 3
   [junit4]   2> 1586796 DEBUG (ScheduledTrigger-3695-thread-4) [    ] o.a.s.c.a.NodeLostTrigger Running NodeLostTrigger: .auto_add_replicas with currently live nodes: 3
   [junit4]   2> 1586801 DEBUG (ScheduledTrigger-3695-thread-4) [    ] o.a.s.c.a.NodeAddedTrigger Running NodeAddedTrigger node_added_trigger
   [junit4]   2> 1586801 DEBUG (ScheduledTrigger-3695-thread-4) [    ] o.a.s.c.a.NodeAddedTrigger Found livenodes: 3
   [junit4]   2> 1586816 DEBUG (ScheduledTrigger-3695-thread-4) [    ] o.a.s.c.a.NodeLostTrigger Running NodeLostTrigger: .auto_add_replicas with currently live nodes: 3
   [junit4]   2> 1586821 DEBUG (ScheduledTrigger-3695-thread-4) [    ] o.a.s.c.a.NodeAddedTrigger Running NodeAddedTrigger node_added_trigger
   [junit4]   2> 1586821 DEBUG (ScheduledTrigger-3695-thread-4) [    ] o.a.s.c.a.NodeAddedTrigger Found livenodes: 3
   [junit4]   2> 1586836 DEBUG (ScheduledTrigger-3695-thread-4) [    ] o.a.s.c.a.NodeLostTrigger Running NodeLostTrigger: .auto_add_replicas with currently live nodes: 3
   [junit4]   2> 1586842 DEBUG (ScheduledTrigger-3695-thread-4) [    ] o.a.s.c.a.NodeAddedTrigger Running NodeAddedTrigger node_added_trigger
   [junit4]   2> 1586842 DEBUG (ScheduledTrigger-3695-thread-4) [    ] o.a.s.c.a.NodeAddedTrigger Found livenodes: 3
   [junit4]   2> 1586856 DEBUG (ScheduledTrigger-3695-thread-4) [    ] o.a.s.c.a.NodeLostTrigger Running NodeLostTrigger: .auto_add_replicas with currently live nodes: 3
   [junit4]   2> 1586864 DEBUG (ScheduledTrigger-3695-thread-1) [    ] o.a.s.c.a.NodeAddedTrigger Running NodeAddedTrigger node_added_trigger
   [junit4]   2> 1586864 DEBUG (ScheduledTrigger-3695-thread-1) [    ] o.a.s.c.a.NodeAddedTrigger Found livenodes: 3
   [junit4]   2> 1586864 DEBUG (ScheduledTrigger-3695-thread-1) [    ] o.a.s.c.a.NodeAddedTrigger NodeAddedTrigger node_added_trigger firing registered processor for nodes: [127.0.0.1:10003_solr] added at times [19286561546951658], now=19286571812396208
   [junit4]   2> 1586865 DEBUG (ScheduledTrigger-3695-thread-1) [    ] o.a.s.c.a.ScheduledTriggers ++++++++ Cooldown inactive - processing event: {
   [junit4]   2>   "id":"44850689f1dbeaT13ca0reag2d7zd2llshyxadkr",
   [junit4]   2>   "source":"node_added_trigger",
   [junit4]   2>   "eventTime":19286561546951658,
   [junit4]   2>   "eventType":"NODEADDED",
   [junit4]   2>   "properties":{
   [junit4]   2>     "eventTimes":[19286561546951658],
   [junit4]   2>     "preferredOperation":"movereplica",
   [junit4]   2>     "nodeNames":["127.0.0.1:10003_solr"]}}
   [junit4]   2> 1586866 DEBUG (ScheduledTrigger-3695-thread-1) [    ] o.a.s.c.a.ScheduledTriggers Pausing all triggers: [.auto_add_replicas, node_added_trigger]
   [junit4]   2> 1586867 DEBUG (ScheduledTrigger-3695-thread-1) [    ] o.a.s.c.a.NodeAddedTrigger NodeAddedTrigger node_added_trigger - removing marker path: /autoscaling/nodeAdded/127.0.0.1:10003_solr
   [junit4]   2> 1586867 DEBUG (AutoscalingActionExecutor-3696-thread-1) [    ] o.a.s.c.a.ScheduledTriggers -- processing actions for {
   [junit4]   2>   "id":"44850689f1dbeaT13ca0reag2d7zd2llshyxadkr",
   [junit4]   2>   "source":"node_added_trigger",
   [junit4]   2>   "eventTime":19286561546951658,
   [junit4]   2>   "eventType":"NODEADDED",
   [junit4]   2>   "properties":{
   [junit4]   2>     "eventTimes":[19286561546951658],
   [junit4]   2>     "preferredOperation":"movereplica",
   [junit4]   2>     "_enqueue_time_":19286571876082958,
   [junit4]   2>     "nodeNames":["127.0.0.1:10003_solr"]}}
   [junit4]   2> 1586885 DEBUG (AutoscalingActionExecutor-3696-thread-1) [    ] o.a.s.c.a.ScheduledTriggers Resuming trigger: .auto_add_replicas after 100ms
   [junit4]   2> 1586885 DEBUG (AutoscalingActionExecutor-3696-thread-1) [    ] o.a.s.c.a.ScheduledTriggers Resuming trigger: node_added_trigger after 100ms
   [junit4]   2> 1586885 DEBUG (AutoscalingActionExecutor-3696-thread-1) [    ] o.a.s.c.a.ScheduledTriggers -- processing took 895 ms for event id=44850689f1dbeaT13ca0reag2d7zd2llshyxadkr
   [junit4]   2> 1586985 DEBUG (ScheduledTrigger-3695-thread-3) [    ] o.a.s.c.a.NodeLostTrigger Running NodeLostTrigger: .auto_add_replicas with currently live nodes: 4
   [junit4]   2> 1586985 DEBUG (ScheduledTrigger-3695-thread-3) [    ] o.a.s.c.a.NodeAddedTrigger Running NodeAddedTrigger node_added_trigger
   [junit4]   2> 1586985 DEBUG (ScheduledTrigger-3695-thread-3) [    ] o.a.s.c.a.NodeAddedTrigger Found livenodes: 4
   [junit4]   2> 1586985 DEBUG (ScheduledTrigger-3695-thread-3) [    ] o.a.s.c.a.NodeAddedTrigger Tracking new node: 127.0.0.1:10004_solr at time 19286577860250808
   [junit4]   2> 1587005 DEBUG (ScheduledTrigger-3695-thread-3) [    ] o.a.s.c.a.NodeLostTrigger Running NodeLostTrigger: .auto_add_replicas with currently live nodes: 4
   [junit4]   2> 1587006 DEBUG (ScheduledTrigger-3695-thread-2) [    ] o.a.s.c.a.NodeAddedTrigger Running NodeAddedTrigger node_added_trigger
   [junit4]   2> 1587006 DEBUG (ScheduledTrigger-3695-thread-2) [    ] o.a.s.c.a.NodeAddedTrigger Found livenodes: 4
   [junit4]   2> 1587026 DEBUG (ScheduledTrigger-3695-thread-2) [    ] o.a.s.c.a.NodeAddedTrigger Running NodeAddedTrigger node_added_trigger
   [junit4]   2> 1587026 DEBUG (ScheduledTrigger-3695-thread-2) [    ] o.a.s.c.a.NodeAddedTrigger Found livenodes: 4
   [junit4]   2> 1587026 DEBUG (ScheduledTrigger-3695-thread-2) [    ] o.a.s.c.a.NodeLostTrigger Running NodeLostTrigger: .auto_add_replicas with currently live nodes: 4
   [junit4]   2> 1587046 DEBUG (ScheduledTrigger-3695-thread-2) [    ] o.a.s.c.a.NodeAddedTrigger Running NodeAddedTrigger node_added_trigger
   [junit4]   2> 1587046 DEBUG (ScheduledTrigger-3695-thread-2) [    ] o.a.s.c.a.NodeAddedTrigger Found livenodes: 4
   [junit4]   2> 1587046 DEBUG (ScheduledTrigger-3695-thread-2) [    ] o.a.s.c.a.NodeLostTrigger Running NodeLostTrigger: .auto_add_replicas with currently live nodes: 4
   [junit4]   2> 1587066 DEBUG (ScheduledTrigger-3695-thread-2) [    ] o.a.s.c.a.NodeAddedTrigger Running NodeAddedTrigger node_added_trigger
   [junit4]   2> 1587066 DEBUG (ScheduledTrigger-3695-thread-2) [    ] o.a.s.c.a.NodeAddedTrigger Found livenodes: 4
   [junit4]   2> 1587066 DEBUG (ScheduledTrigger-3695-thread-2) [    ] o.a.s.c.a.NodeLostTrigger Running NodeLostTrigger: .auto_add_replicas with currently live nodes: 4
   [junit4]   2> 1587068 INFO  (TEST-TestSimTriggerIntegration.testEventFromRestoredState-seed#[2A33227A19C6C9DE]) [    ] o.a.s.c.a.s.SimCloudManager === Restarting OverseerTriggerThread and clearing object cache...
   [junit4]   2> 1587068 DEBUG (TEST-TestSimTriggerIntegration.testEventFromRestoredState-seed#[2A33227A19C6C9DE]) [    ] o.a.s.c.a.ScheduledTriggers Shutting down scheduled thread pool executor now
   [junit4]   2> 1587068 DEBUG (TEST-TestSimTriggerIntegration.testEventFromRestoredState-seed#[2A33227A19C6C9DE]) [    ] o.a.s.c.a.ScheduledTriggers Shutting down action executor now
   [junit4]   2> 1587068 DEBUG (TEST-TestSimTriggerIntegration.testEventFromRestoredState-seed#[2A33227A19C6C9DE]) [    ] o.a.s.c.a.ScheduledTriggers Awaiting termination for action executor
   [junit4]   2> 1587068 WARN  (Simulated OverseerAutoScalingTriggerThread) [    ] o.a.s.c.a.OverseerTriggerThread OverseerTriggerThread woken up but we are closed, exiting.
   [junit4]   2> 1587080 DEBUG (TEST-TestSimTriggerIntegration.testEventFromRestoredState-seed#[2A33227A19C6C9DE]) [    ] o.a.s.c.a.ScheduledTriggers Awaiting termination for scheduled thread pool executor
   [junit4]   2> 1587080 DEBUG (TEST-TestSimTriggerIntegration.testEventFromRestoredState-seed#[2A33227A19C6C9DE]) [    ] o.a.s.c.a.ScheduledTriggers ScheduledTriggers closed completely
   [junit4]   2> 1587080 DEBUG (TEST-TestSimTriggerIntegration.testEventFromRestoredState-seed#[2A33227A19C6C9DE]) [    ] o.a.s.c.a.OverseerTriggerThread OverseerTriggerThread has been closed explicitly
   [junit4]   2> 1587081 DEBUG (Simulated OverseerAutoScalingTriggerThread) [    ] o.a.s.c.a.OverseerTriggerThread Refreshing /autoscaling.json with znode version 4
   [junit4]   2> 1587081 DEBUG (Simulated OverseerAutoScalingTriggerThread) [    ] o.a.s.c.a.OverseerTriggerThread Current znodeVersion 4, lastZnodeVersion -1
   [junit4]   2> 1587081 DEBUG (Simulated OverseerAutoScalingTriggerThread) [    ] o.a.s.c.a.OverseerTriggerThread Processed trigger updates upto znodeVersion 4
   [junit4]   2> 1587082 DEBUG (Simulated OverseerAutoScalingTriggerThread) [    ] o.a.s.c.a.NodeLostTrigger NodeLostTrigger .auto_add_replicas - Initial livenodes: [127.0.0.1:10001_solr, 127.0.0.1:10004_solr, 127.0.0.1:10002_solr, 127.0.0.1:10003_solr]
   [junit4]   2> 1587082 INFO  (Simulated OverseerAutoScalingTriggerThread) [    ] o.a.s.c.a.s.TestSimTriggerIntegration TestTriggerAction init
   [junit4]   2> 1587082 DEBUG (Simulated OverseerAutoScalingTriggerThread) [    ] o.a.s.c.a.NodeAddedTrigger NodeAddedTrigger node_added_trigger - Initial livenodes: [127.0.0.1:10001_solr, 127.0.0.1:10004_solr, 127.0.0.1:10002_solr, 127.0.0.1:10003_solr]
   [junit4]   2> 1587082 DEBUG (Simulated OverseerAutoScalingTriggerThread) [    ] o.a.s.c.a.NodeAddedTrigger NodeAddedTrigger node_added_trigger instantiated with properties: {event=nodeAdded, waitFor=10, actions=[{name=test, class=org.apache.solr.cloud.autoscaling.sim.TestSimTriggerIntegration$TestTriggerAction}], enabled=true}
   [junit4]   2> 1587082 DEBUG (Simulated OverseerAutoScalingTriggerThread) [    ] o.a.s.c.a.NodeAddedTrigger Adding node from marker path: 127.0.0.1:10004_solr
   [junit4]   2> 1587082 DEBUG (Simulated OverseerAutoScalingTriggerThread) [    ] o.a.s.c.a.NodeAddedTrigger NodeAddedTrigger node_added_trigger - removing marker path: /autoscaling/nodeAdded/127.0.0.1:10004_solr
   [junit4]   2> 1587082 DEBUG (ScheduledTrigger-3698-thread-1) [    ] o.a.s.c.a.NodeLostTrigger Running NodeLostTrigger: .auto_add_replicas with currently live nodes: 4
   [junit4]   2> 1587083 DEBUG (Simulated OverseerAutoScalingTriggerThread) [    ] o.a.s.c.a.OverseerTriggerThread Current znodeVersion 4, lastZnodeVersion 4
   [junit4]   2> 1587083 DEBUG (ScheduledTrigger-3698-thread-2) [    ] o.a.s.c.a.NodeAddedTrigger Running NodeAddedTrigger node_added_trigger
   [junit4]   2> 1587083 DEBUG (ScheduledTrigger-3698-thread-2) [    ] o.a.s.c.a.NodeAddedTrigger Found livenodes: 4
   [junit4]   2> 1587104 DEBUG (ScheduledTrigger-3698-thread-1) [    ] o.a.s.c.a.NodeLostTrigger Running NodeLostTrigger: .auto_add_replicas with currently live nodes: 4
   [junit4]   2> 1587128 DEBUG (ScheduledTrigger-3698-thread-1) [    ] o.a.s.c.a.NodeAddedTrigger Running NodeAddedTrigger node_added_trigger
   [junit4]   2> 1587128 DEBUG (ScheduledTrigger-3698-thread-1) [    ] o.a.s.c.a.NodeAddedTrigger Found livenodes: 4
   [junit4]   2> 1587129 DEBUG (ScheduledTrigger-3698-thread-2) [    ] o.a.s.c.a.NodeLostTrigger Running NodeLostTrigger: .auto_add_replicas with currently live nodes: 4
   [junit4]   2> 1587149 DEBUG (ScheduledTrigger-3698-thread-1) [    ] o.a.s.c.a.NodeAddedTrigger Running NodeAddedTrigger node_added_trigger
   [junit4]   2> 1587149 DEBUG (ScheduledTrigger-3698-thread-1) [    ] o.a.s.c.a.NodeAddedTrigger Found livenodes: 4
   [junit4]   2> 1587160 DEBUG (ScheduledTrigger-3698-thread-3) [    ] o.a.s.c.a.NodeLostTrigger Running NodeLostTrigger: .auto_add_replicas with currently live nodes: 4
   [junit4]   2> 1587169 DEBUG (ScheduledTrigger-3698-thread-1) [    ] o.a.s.c.a.NodeAddedTrigger Running NodeAddedTrigger node_added_trigger
   [junit4]   2> 1587169 DEBUG (ScheduledTrigger-3698-thread-1) [    ] o.a.s.c.a.NodeAddedTrigger Found livenodes: 4
   [junit4]   2> 1587181 DEBUG (ScheduledTrigger-3698-thread-1) [    ] o.a.s.c.a.NodeLostTrigger Running NodeLostTrigger: .auto_add_replicas with currently live nodes: 4
   [junit4]   2> 1587189 DEBUG (ScheduledTrigger-3698-thread-1) [    ] o.a.s.c.a.NodeAddedTrigger Running NodeAddedTrigger node_added_trigger
   [junit4]   2> 1587189 DEBUG (ScheduledTrigger-3698-thread-1) [    ] o.a.s.c.a.NodeAddedTrigger Found livenodes: 4
   [junit4]   2> 1587189 DEBUG (ScheduledTrigger-3698-thread-1) [    ] o.a.s.c.a.NodeAddedTrigger NodeAddedTrigger node_added_trigger firing registered processor for nodes: [127.0.0.1:10004_solr] added at times [19286577860250808], now=19286588052836208
   [junit4]   2> 1587189 DEBUG (ScheduledTrigger-3698-thread-1) [    ] o.a.s.c.a.ScheduledTriggers ++++++++ Cooldown inactive - processing event: {
   [junit4]   2>   "id":"44850a564b0cb8T13ca0reag2d7zd2llshyxadku",
   [junit4]   2>   "source":"node_added_trigger",
   [junit4]   2>   "eventTime":19286577860250808,
   [junit4]   2>   "eventType":"NODEADDED",
   [junit4]   2>   "properties":{
   [junit4]   2>     "eventTimes":[19286577860250808],
   [junit4]   2>     "preferredOperation":"movereplica",
   [junit4]   2>     "nodeNames":["127.0.0.1:10004_solr"]}}
   [junit4]   2> 1587190 DEBUG (ScheduledTrigger-3698-thread-1) [    ] o.a.s.c.a.ScheduledTriggers Pausing all triggers: [.auto_add_replicas, node_added_trigger]
   [junit4]   2> 1587191 DEBUG (ScheduledTrigger-3698-thread-1) [    ] o.a.s.c.a.NodeAddedTrigger NodeAddedTrigger node_added_trigger - removing marker path: /autoscaling/nodeAdded/127.0.0.1:10004_solr
   [junit4]   2> 1587191 DEBUG (AutoscalingActionExecutor-3699-thread-1) [    ] o.a.s.c.a.ScheduledTriggers -- processing actions for {
   [junit4]   2>   "id":"44850a564b0cb8T13ca0reag2d7zd2llshyxadku",
   [junit4]   2>   "source":"node_added_trigger",
   [junit4]   2>   "eventTime":19286577860250808,
   [junit4]   2>   "eventType":"NODEADDED",
   [junit4]   2>   "properties":{
   [junit4]   2>     "eventTimes":[19286577860250808],
   [junit4]   2>     "preferredOperation":"movereplica",
   [junit4]   2>     "_enqueue_time_":19286588082893158,
   [junit4]   2>     "nodeNames":["127.0.0.1:10004_solr"]}}
   [junit4]   2> 1587201 INFO  (TEST-TestSimTriggerIntegration.testEventFromRestoredState-seed#[2A33227A19C6C9DE]) [    ] o.a.s.SolrTestCaseJ4 ###Ending testEventFromRestoredState
   [junit4]   2> 1587219 INFO  (TEST-TestSimTriggerIntegration.testEventFromRestoredState-seed#[2A33227A19C6C9DE]) [    ] o.a.s.c.a.s.SimSolrCloudTestCase #######################################
   [junit4]   2> ############ CLUSTER STATE ############
   [junit4]   2> #######################################
   [junit4]   2> ## Live nodes: 4
   [junit4]   2> ## Empty nodes: 3
   [junit4]   2> ## Dead nodes: 0
   [junit4]   2> ## Collections: [.system]
   [junit4]   2> ## Max replicas per node: 1
   [junit4]   2> ## Min replicas per node: 0
   [junit4]   2> ## Total replicas: 1
   [junit4]   2> ## * .system 1
   [junit4]   2> ## - active           1
   [junit4]   2> ######### Solr op counts ##########
   [junit4]   2> ## - autoscaling        2
   [junit4]   2> ## - update             3
   [junit4]   2> ######### Autoscaling event counts ###########
   [junit4]   2> ## * Trigger: node_added_trigger
   [junit4]   2> ## - STARTED         2
   [junit4]   2> ## - SUCCEEDED       1
   [junit4]   2>
   [junit4] IGNOR/A 0.00s J2 | TestSimTriggerIntegration.testCooldown
   [junit4]    > Assumption #1: 'badapple' test group is disabled (@BadApple(bugUrl=https://issues.apache.org/jira/browse/SOLR-12028))
   [junit4]   2> 1587238 DEBUG (AutoscalingActionExecutor-3699-thread-1) [    ] o.a.s.c.a.ScheduledTriggers Resuming trigger: .auto_add_replicas after 100ms
   [junit4]   2> 1587238 DEBUG (AutoscalingActionExecutor-3699-thread-1) [    ] o.a.s.c.a.ScheduledTriggers Resuming trigger: node_added_trigger after 100ms
   [junit4]   2> 1587238 DEBUG (AutoscalingActionExecutor-3699-thread-1) [    ] o.a.s.c.a.ScheduledTriggers -- processing took 2360 ms for event id=44850a564b0cb8T13ca0reag2d7zd2llshyxadku
   [junit4]   2> 1587368 INFO  (TEST-TestSimTriggerIntegration.testSearchRate-seed#[2A33227A19C6C9DE]) [    ] o.a.s.SolrTestCaseJ4 ###Starting testSearchRate
   [junit4]   2> 1587369 DEBUG (TEST-TestSimTriggerIntegration.testSearchRate-seed#[2A33227A19C6C9DE]) [    ] o.a.s.c.a.OverseerTriggerThread Refreshing /autoscaling.json with znode version 5
   [junit4]   2> 1587369 DEBUG (TEST-TestSimTriggerIntegration.testSearchRate-seed#[2A33227A19C6C9DE]) [    ] o.a.s.c.a.s.SimNodeStateProvider --removing value for 127.0.0.1:10002_solr
   [junit4]   2> 1587369 DEBUG (TEST-TestSimTriggerIntegration.testSearchRate-seed#[2A33227A19C6C9DE]) [    ] o.a.s.c.a.s.SimClusterStateProvider --- new Overseer leader: 127.0.0.1:10004_solr
   [junit4]   2> 1587369 DEBUG (TEST-TestSimTriggerIntegration.testSearchRate-seed#[2A33227A19C6C9DE]) [    ] o.a.s.c.a.s.SimNodeStateProvider --removing value for 127.0.0.1:10001_solr
   [junit4]   2> 1587369 INFO  (TEST-TestSimTriggerIntegration.testSearchRate-seed#[2A33227A19C6C9DE]) [    ] o.a.s.c.a.s.SimCloudManager === Restarting OverseerTriggerThread and clearing object cache...
   [junit4]   2> 1587369 DEBUG (TEST-TestSimTriggerIntegration.testSearchRate-seed#[2A33227A19C6C9DE]) [    ] o.a.s.c.a.ScheduledTriggers Shutting down scheduled thread pool executor now
   [junit4]   2> 1587369 DEBUG (TEST-TestSimTriggerIntegration.testSearchRate-seed#[2A33227A19C6C9DE]) [    ] o.a.s.c.a.ScheduledTriggers Shutting down action executor now
   [junit4]   2> 1587369 DEBUG (TEST-TestSimTriggerIntegration.testSearchRate-seed#[2A33227A19C6C9DE]) [    ] o.a.s.c.a.ScheduledTriggers Awaiting termination for action executor
   [junit4]   2> 1587375 WARN  (Simulated OverseerAutoScalingTriggerThread) [    ] o.a.s.c.a.OverseerTriggerThread OverseerTriggerThread woken up but we are closed, exiting.
   [junit4]   2> 1587418 DEBUG (TEST-TestSimTriggerIntegration.testSearchRate-seed#[2A33227A19C6C9DE]) [    ] o.a.s.c.a.ScheduledTriggers Awaiting termination for scheduled thread pool executor
   [junit4]   2> 1587418 DEBUG (TEST-TestSimTriggerIntegration.testSearchRate-seed#[2A33227A19C6C9DE]) [    ] o.a.s.c.a.ScheduledTriggers ScheduledTriggers closed completely
   [junit4]   2> 1587418 DEBUG (TEST-TestSimTriggerIntegration.testSearchRate-seed#[2A33227A19C6C9DE]) [    ] o.a.s.c.a.OverseerTriggerThread OverseerTriggerThread has been closed explicitly
   [junit4]   2> 1587450 DEBUG (Simulated OverseerAutoScalingTriggerThread) [    ] o.a.s.c.a.OverseerTriggerThread Adding .auto_add_replicas and .scheduled_maintenance triggers
   [junit4]   2> 1587450 DEBUG (Simulated OverseerAutoScalingTriggerThread) [    ] o.a.s.c.a.OverseerTriggerThread Refreshing /autoscaling.json with znode version 6
   [junit4]   2> 1587450 DEBUG (Simulated OverseerAutoScalingTriggerThread) [    ] o.a.s.c.a.OverseerTriggerThread Current znodeVersion 6, lastZnodeVersion -1
   [junit4]   2> 1587450 DEBUG (Simulated OverseerAutoScalingTriggerThread) [    ] o.a.s.c.a.OverseerTriggerThread Processed trigger updates upto znodeVersion 6
   [junit4]   2> 1587451 DEBUG (Simulated OverseerAutoScalingTriggerThread) [    ] o.a.s.c.a.NodeLostTrigger NodeLostTrigger .auto_add_replicas - Initial livenodes: [127.0.0.1:10004_solr, 127.0.0.1:10003_solr]
   [junit4]   2> 1587458 DEBUG (Simulated OverseerAutoScalingTriggerThread) [    ] o.a.s.c.a.OverseerTriggerThread -- clean old nodeAdded markers
   [junit4]   2> 1587458 DEBUG (Simulated OverseerAutoScalingTriggerThread) [    ] o.a.s.c.a.OverseerTriggerThread Current znodeVersion 6, lastZnodeVersion 6
   [junit4]   2> 1587460 DEBUG (ScheduledTrigger-3701-thread-2) [    ] o.a.s.c.a.NodeLostTrigger Running NodeLostTrigger: .auto_add_replicas with currently live nodes: 2
   [junit4]   2> 1587547 DEBUG (ScheduledTrigger-3701-thread-1) [    ] o.a.s.c.a.NodeLostTrigger Running NodeLostTrigger: .auto_add_replicas with currently live nodes: 2
   [junit4]   2> 1587570 DEBUG (ScheduledTrigger-3701-thread-3) [    ] o.a.s.c.a.NodeLostTrigger Running NodeLostTrigger: .auto_add_replicas with currently live nodes: 2
   [junit4]   2> 1587571 DEBUG (simCloudManagerPool-3700-thread-1) [    ] o.a.s.c.a.AutoScalingHandler Verified autoscaling configuration
   [junit4]   2> 1587571 DEBUG (simCloudManagerPool-3700-thread-1) [    ] o.a.s.c.a.OverseerTriggerThread Refreshing /autoscaling.json with znode version 7
   [junit4]   2> 1587599 DEBUG (Simulated OverseerAutoScalingTriggerThread) [    ] o.a.s.c.a.OverseerTriggerThread Processed trigger updates upto znodeVersion 7
   [junit4]   2> 1587599 DEBUG (Simulated OverseerAutoScalingTriggerThread) [    ] o.a.s.c.a.OverseerTriggerThread -- clean old nodeAdded markers
   [junit4]   2> 1587599 DEBUG (ScheduledTrigger-3701-thread-4) [    ] o.a.s.c.a.NodeLostTrigger Running NodeLostTrigger: .auto_add_replicas with currently live nodes: 2
   [junit4]   2> 1587600 DEBUG (Simulated OverseerAutoScalingTriggerThread) [    ] o.a.s.c.a.OverseerTriggerThread Current znodeVersion 7, lastZnodeVersion 7
   [junit4]   2> 1587620 DEBUG (ScheduledTrigger-3701-thread-4) [    ] o.a.s.c.a.NodeLostTrigger Running NodeLostTrigger: .auto_add_replicas with currently live nodes: 2
   [junit4]   2> 1587644 DEBUG (ScheduledTrigger-3701-thread-4) [    ] o.a.s.c.a.NodeLostTrigger Running NodeLostTrigger: .auto_add_replicas with currently live nodes: 2
   [junit4]   2> 1587644 DEBUG (simCloudManagerPool-3700-thread-2) [    ] o.a.s.c.a.s.SimClusterStateProvider -- submit leader election for .system / shard1
   [junit4]   2> 1587656 DEBUG (simCloudManagerPool-3700-thread-3) [    ] o.a.s.c.a.s.SimClusterStateProvider Running leader election for .system / shard1
   [junit4]   2> 1587656 DEBUG (simCloudManagerPool-3700-thread-3) [    ] o.a.s.c.a.s.SimClusterStateProvider -- elected new leader for .system / shard1: core_node2
   [junit4]   2> 1587672 DEBUG (ScheduledTrigger-3701-thread-4) [    ] o.a.s.c.a.NodeLostTrigger Running NodeLostTrigger: .auto_add_replicas with currently live nodes: 2
   [junit4]   2> 1587679 DEBUG (simCloudManagerPool-3700-thread-5) [    ] o.a.s.c.a.s.SimClusterStateProvider -- submit leader election for collection1 / shard1
   [junit4]   2> 1587705 DEBUG (ScheduledTrigger-3701-thread-2) [    ] o.a.s.c.a.NodeLostTrigger Running NodeLostTrigger: .auto_add_replicas with currently live nodes: 2
   [junit4]   2> 1587725 DEBUG (ScheduledTrigger-3701-thread-2) [    ] o.a.s.c.a.NodeLostTrigger Running NodeLostTrigger: .auto_add_replicas with currently live nodes: 2
   [junit4]   2> 1587725 DEBUG (simCloudManagerPool-3700-thread-6) [    ] o.a.s.c.a.s.SimClusterStateProvider -- submit leader election for collection1 / shard1
   [junit4]   2> 1587728 DEBUG (simCloudManagerPool-3700-thread-7) [    ] o.a.s.c.a.s.SimClusterStateProvider Running leader election for collection1 / shard1
   [junit4]   2> 1587728 DEBUG (simCloudManagerPool-3700-thread-7) [    ] o.a.s.c.a.s.SimClusterStateProvider -- elected new leader for collection1 / shard1: core_node1
   [junit4]   2> 1587741 DEBUG (simCloudManagerPool-3700-thread-8) [    ] o.a.s.c.a.s.SimClusterStateProvider Running leader election for collection1 / shard1
   [junit4]   2> 1587814 DEBUG (ScheduledTrigger-3701-thread-2) [    ] o.a.s.c.a.NodeLostTrigger Running NodeLostTrigger: .auto_add_replicas with currently live nodes: 2
   [junit4]   2> 1587871 DEBUG (ScheduledTrigger-3701-thread-4) [    ] o.a.s.c.a.NodeLostTrigger Running NodeLostTrigger: .auto_add_replicas with currently live nodes: 2
   [junit4]   2> 1587907 DEBUG (ScheduledTrigger-3701-thread-4) [    ] o.a.s.c.a.NodeLostTrigger Running NodeLostTrigger: .auto_add_replicas with currently live nodes: 2
   [junit4]   2> 1587925 DEBUG (simCloudManagerPool-3700-thread-8) [    ] o.a.s.c.a.s.SimClusterStateProvider -- already has leader collection1 / shard1: shard1:{
   [junit4]   2>   "replicas":{
   [junit4]   2>     "core_node1":{
   [junit4]   2>       "core":"collection1_shard1_replica_n1",
   [junit4]   2>       "SEARCHER.searcher.maxDoc":0,
   [junit4]   2>       "SEARCHER.searcher.deletedDocs":0,
   [junit4]   2>       "INDEX.sizeInBytes":10240,
   [junit4]   2>       "node_name":"127.0.0.1:10004_solr",
   [junit4]   2>       "state":"active",
   [junit4]   2>       "type":"NRT",
   [junit4]   2>       "INDEX.sizeInGB":9.5367431640625E-6,
   [junit4]   2>       "SEARCHER.searcher.numDocs":0},
   [junit4]   2>     "core_node2":{
   [junit4]   2>       "core":"collection1_shard1_replica_n2",
   [junit4]   2>       "SEARCHER.searcher.maxDoc":0,
   [junit4]   2>       "SEARCHER.searcher.deletedDocs":0,
   [junit4]   2>       "INDEX.sizeInBytes":10240,
   [junit4]   2>       "node_name":"127.0.0.1:10003_solr",
   [junit4]   2>       "state":"active",
   [junit4]   2>       "type":"NRT",
   [junit4]   2>       "INDEX.sizeInGB":9.5367431640625E-6,
   [junit4]   2>       "SEARCHER.searcher.numDocs":0}},
   [junit4]   2>   "range":"80000000-7fffffff",
   [junit4]   2>   "state":"active"}
   [junit4]   2> 1587984 DEBUG (ScheduledTrigger-3701-thread-4) [    ] o.a.s.c.a.NodeLostTrigger Running NodeLostTrigger: .auto_add_replicas with currently live nodes: 2
   [junit4]   2> 1588005 DEBUG (ScheduledTrigger-3701-thread-4) [    ] o.a.s.c.a.NodeLostTrigger Running NodeLostTrigger: .auto_add_replicas with currently live nodes: 2
   [junit4]   2> 1588045 DEBUG (ScheduledTrigger-3701-thread-4) [    ] o.a.s.c.a.NodeLostTrigger Running NodeLostTrigger: .auto_add_replicas with currently live nodes: 2
   [junit4]   2> 1588062 DEBUG (simCloudManagerPool-3700-thread-9) [    ] o.a.s.c.a.AutoScalingHandler Verified autoscaling configuration
   [junit4]   2> 1588062 DEBUG (simCloudManagerPool-3700-thread-9) [    ] o.a.s.c.a.OverseerTriggerThread Refreshing /autoscaling.json with znode version 8
   [junit4]   2> 1588073 DEBUG (Simulated OverseerAutoScalingTriggerThread) [    ] o.a.s.c.a.OverseerTriggerThread Processed trigger updates upto znodeVersion 8
   [junit4]   2> 1588073 DEBUG (ScheduledTrigger-3701-thread-4) [    ] o.a.s.c.a.NodeLostTrigger Running NodeLostTrigger: .auto_add_replicas with currently live nodes: 2
   [junit4]   2> 1588074 DEBUG (Simulated OverseerAutoScalingTriggerThread) [    ] o.a.s.c.a.OverseerTriggerThread -- clean old nodeAdded markers
   [junit4]   2> 1588074 DEBUG (Simulated OverseerAutoScalingTriggerThread) [    ] o.a.s.c.a.OverseerTriggerThread Current znodeVersion 8, lastZnodeVersion 8
   [junit4]   2> 1588075 DEBUG (simCloudManagerPool-3700-thread-10) [    ] o.a.s.c.a.AutoScalingHandler Verified autoscaling configuration
   [junit4]   2> 1588075 DEBUG (simCloudManagerPool-3700-thread-10) [    ] o.a.s.c.a.OverseerTriggerThread Refreshing /autoscaling.json with znode version 9
   [junit4]   2> 1588076 DEBUG (Simulated OverseerAutoScalingTriggerThread) [    ] o.a.s.c.a.OverseerTriggerThread Processed trigger updates upto znodeVersion 9
   [junit4]   2> 1588076 DEBUG (Simulated OverseerAutoScalingTriggerThread) [    ] o.a.s.c.a.OverseerTriggerThread -- clean old nodeAdded markers
   [junit4]   2> 1588076 DEBUG (Simulated OverseerAutoScalingTriggerThread) [    ] o.a.s.c.a.OverseerTriggerThread Current znodeVersion 9, lastZnodeVersion 9
   [junit4]   2> 1588181 DEBUG (ScheduledTrigger-3701-thread-4) [    ] o.a.s.c.a.NodeLostTrigger Running NodeLostTrigger: .auto_add_replicas with currently live nodes: 2
   [junit4]   2> 1588270 DEBUG (ScheduledTrigger-3701-thread-4) [    ] o.a.s.c.a.NodeLostTrigger Running NodeLostTrigger: .auto_add_replicas with currently live nodes: 2
   [junit4]   2> 1588271 DEBUG (ScheduledTrigger-3701-thread-2) [    ] o.a.s.c.a.SearchRateTrigger ### rates for node 127.0.0.1:10004_solr
   [junit4]   2> 1588271 DEBUG (ScheduledTrigger-3701-thread-2) [    ] o.a.s.c.a.SearchRateTrigger ###  metrics:solr.core.collection1.shard1.replica_n1:QUERY./select.requestTimes:1minRate 250
   [junit4]   2> 1588290 DEBUG (ScheduledTrigger-3701-thread-4) [    ] o.a.s.c.a.NodeLostTrigger Running NodeLostTrigger: .auto_add_replicas with currently live nodes: 2
   [junit4]   2> 1588292 DEBUG (ScheduledTrigger-3701-thread-2) [    ] o.a.s.c.a.SearchRateTrigger ### rates for node 127.0.0.1:10003_solr
   [junit4]   2> 1588292 DEBUG (ScheduledTrigger-3701-thread-2) [    ] o.a.s.c.a.SearchRateTrigger ###  metrics:solr.core.collection1.shard1.replica_n2:QUERY./select.requestTimes:1minRate 250
   [junit4]   2> 1588292 DEBUG (ScheduledTrigger-3701-thread-2) [    ] o.a.s.c.a.SearchRateTrigger ## Collection: collection1
   [junit4]   2> 1588293 DEBUG (ScheduledTrigger-3701-thread-2) [    ] o.a.s.c.a.SearchRateTrigger ##  - shard1
   [junit4]   2> 1588293 DEBUG (ScheduledTrigger-3701-thread-2) [    ] o.a.s.c.a.SearchRateTrigger ##     collection1_shard1_replica_n1  250.0
   [junit4]   2> 1588293 DEBUG (ScheduledTrigger-3701-thread-2) [    ] o.a.s.c.a.SearchRateTrigger ##     collection1_shard1_replica_n2  250.0
   [junit4]   2> 1588317 DEBUG (ScheduledTrigger-3701-thread-4) [    ] o.a.s.c.a.NodeLostTrigger Running NodeLostTrigger: .auto_add_replicas with currently live nodes: 2
   [junit4]   2> 1588345 DEBUG (ScheduledTrigger-3701-thread-4) [    ] o.a.s.c.a.NodeLostTrigger Running NodeLostTrigger: .auto_add_replicas with currently live nodes: 2
   [junit4]   2> 1588382 DEBUG (ScheduledTrigger-3701-thread-4) [    ] o.a.s.c.a.NodeLostTrigger Running NodeLostTrigger: .auto_add_replicas with currently live nodes: 2
   [junit4]   2> 1588398 DEBUG (ScheduledTrigger-3701-thread-2) [    ] o.a.s.c.a.SearchRateTrigger -- collection1.shard1: totalShardRate=500.0, shardRate=250.0
   [junit4]   2> 1588402 DEBUG (ScheduledTrigger-3701-thread-4) [    ] o.a.s.c.a.NodeLostTrigger Running NodeLostTrigger: .auto_add_replicas with currently live nodes: 2
   [junit4]   2> 1588422 DEBUG (ScheduledTrigger-3701-thread-1) [    ] o.a.s.c.a.NodeLostTrigger Running NodeLostTrigger: .auto_add_replicas with currently live nodes: 2
   [junit4]   2> 1588437 DEBUG (ScheduledTrigger-3701-thread-3) [    ] o.a.s.c.a.SearchRateTrigger ### rates for node 127.0.0.1:10004_solr
   [junit4]   2> 1588437 DEBUG (ScheduledTrigger-3701-thread-3) [    ] o.a.s.c.a.SearchRateTrigger ###  metrics:solr.core.collection1.shard1.replica_n1:QUERY./select.requestTimes:1minRate 250
   [junit4]   2> 1588437 DEBUG (ScheduledTrigger-3701-thread-3) [    ] o.a.s.c.a.SearchRateTrigger ### rates for node 127.0.0.1:10003_solr
   [junit4]   2> 1588437 DEBUG (ScheduledTrigger-3701-thread-3) [    ] o.a.s.c.a.SearchRateTrigger ###  metrics:solr.core.collection1.shard1.replica_n2:QUERY./select.requestTimes:1minRate 250
   [junit4]   2> 1588437 DEBUG (ScheduledTrigger-3701-thread-3) [    ] o.a.s.c.a.SearchRateTrigger ## Collection: collection1
   [junit4]   2> 1588437 DEBUG (ScheduledTrigger-3701-thread-3) [    ] o.a.s.c.a.SearchRateTrigger ##  - shard1
   [junit4]   2> 1588437 DEBUG (ScheduledTrigger-3701-thread-3) [    ] o.a.s.c.a.SearchRateTrigger ##     collection1_shard1_replica_n1  250.0
   [junit4]   2> 1588437 DEBUG (ScheduledTrigger-3701-thread-3) [    ] o.a.s.c.a.SearchRateTrigger ##     collection1_shard1_replica_n2  250.0
   [junit4]   2> 1588437 DEBUG (ScheduledTrigger-3701-thread-3) [    ] o.a.s.c.a.SearchRateTrigger -- collection1.shard1: totalShardRate=500.0, shardRate=250.0
   [junit4]   2> 1588442 DEBUG (ScheduledTrigger-3701-thread-4) [    ] o.a.s.c.a.NodeLostTrigger Running NodeLostTrigger: .auto_add_replicas with currently live nodes: 2
   [junit4]   2> 1588467 DEBUG (ScheduledTrigger-3701-thread-2) [    ] o.a.s.c.a.NodeLostTrigger Running NodeLostTrigger: .auto_add_replicas with currently live nodes: 2
   [junit4]   2> 1588480 INFO  (TEST-TestSimTriggerIntegration.testSearchRate-seed#[2A33227A19C6C9DE]) [    ] o.a.s.SolrTestCaseJ4 ###Ending testSearchRate
   [junit4]   2> 1588480 INFO  (TEST-TestSimTriggerIntegration.testSearchRate-seed#[2A33227A19C6C9DE]) [    ] o.a.s.c.a.s.SimSolrCloudTestCase #######################################
   [junit4]   2> ############ CLUSTER STATE ############
   [junit4]   2> #######################################
   [junit4]   2> ## Live nodes: 2
   [junit4]   2> ## Empty nodes: 0
   [junit4]   2> ## Dead nodes: 0
   [junit4]   2> ## Collections: [collection1, .system]
   [junit4]   2> ## Max replicas per node: 2
   [junit4]   2> ## Min replicas per node: 1
   [junit4]   2> ## Total replicas: 3
   [junit4]   2> ## * .system 1
   [junit4]   2> ## - active           1
   [junit4]   2> ## * collection1 2
   [junit4]   2> ## - active           2
   [junit4]   2> ######### Solr op counts ##########
   [junit4]   2> ## - CREATE             1
   [junit4]   2> ## - autoscaling        3
   [junit4]   2> ######### Autoscaling event counts ###########
   [junit4]   2>
   [junit4]   2> 1588481 DEBUG (ScheduledTrigger-3701-thread-3) [    ] o.a.s.c.a.ScheduledTriggers ++++++++ Cooldown inactive - processing event: {
   [junit4]   2>   "id":"4485198ee1ef88T13ca0reag2d7zd2llshyxadkx",
   [junit4]   2>   "source":"search_rate_trigger",
   [junit4]   2>   "eventTime":19286643234172808,
   [junit4]   2>   "eventType":"SEARCHRATE",
   [junit4]   2>   "properties":{
   [junit4]   2>     "hotReplicas":[
   [junit4]   2>       {"core_node1":{
   [junit4]   2>           "core":"collection1_shard1_replica_n1",
   [junit4]   2>           "shard":"shard1",
   [junit4]   2>           "collection":"collection1",
   [junit4]   2>           "node_name":"127.0.0.1:10004_solr",
   [junit4]   2>           "type":"NRT",
   [junit4]   2>           "leader":"true",
   [junit4]   2>           "SEARCHER.searcher.maxDoc":0,
   [junit4]   2>           "SEARCHER.searcher.deletedDocs":0,
   [junit4]   2>           "INDEX.sizeInBytes":10240,
   [junit4]   2>           "rate":250.0,
   [junit4]   2>           "state":"active",
   [junit4]   2>           "QUERY./select.requestTimes:1minRate":250,
   [junit4]   2>           "INDEX.sizeInGB":9.5367431640625E-6,
   [junit4]   2>           "SEARCHER.searcher.numDocs":0}},
   [junit4]   2>       {"core_node2":{
   [junit4]   2>           "core":"collection1_shard1_replica_n2",
   [junit4]   2>           "shard":"shard1",
   [junit4]   2>           "collection":"collection1",
   [junit4]   2>           "node_name":"127.0.0.1:10003_solr",
   [junit4]   2>           "type":"NRT",
   [junit4]   2>           "SEARCHER.searcher.maxDoc":0,
   [junit4]   2>           "SEARCHER.searcher.deletedDocs":0,
   [junit4]   2>           "INDEX.sizeInBytes":10240,
   [junit4]   2>           "rate":250.0,
   [junit4]   2>           "state":"active",
   [junit4]   2>           "QUERY./select.requestTimes:1minRate":250,
   [junit4]   2>           "INDEX.sizeInGB":9.5367431640625E-6,
   [junit4]   2>           "SEARCHER.searcher.numDocs":0}}],
   [junit4]   2>     "coldNodes":{},
   [junit4]   2>     "coldShards":{},
   [junit4]   2>     "coldReplicas":[],
   [junit4]   2>     "violationType":["hotShards"],
   [junit4]   2>     "coldCollections":{},
   [junit4]   2>     "hotShards":{"collection1":{"shard1":250.0}},
   [junit4]   2>     "hotCollections":{"collection1":500.0},
   [junit4]   2>     "hotNodes":{
   [junit4]   2>       "127.0.0.1:10004_solr":250.0,
   [junit4]   2>       "127.0.0.1:10003_solr":250.0},
   [junit4]   2>     "requestedOps":[
   [junit4]   2>       {
   [junit4]   2>         "action":"ADDREPLICA",
   [junit4]   2>         "hints":{"COLL_SHARD":[{
   [junit4]   2>               "first":"collection1",
   [junit4]   2>               "second":"shard1"}]}},
   [junit4]   2>       {
   [junit4]   2>         "action":"ADDREPLICA",
   [junit4]   2>         "hints":{"COLL_SHARD":[{
   [junit4]   2>               "first":"collection1",
   [junit4]   2>               "second":"shard1"}]}},
   [junit4]   2>       {
   [junit4]   2>         "action":"ADDREPLICA",
   [junit4]   2>         "hints":{"COLL_SHARD":[{
   [junit4]   2>               "first":"collection1",
   [junit4]   2>               "second":"shard1"}]}}]}}
   [junit4]   2> NOTE: reproduce with: ant test  -Dtestcase=TestSimTriggerIntegration -Dtests.method=testSearchRate -Dtests.seed=2A33227A19C6C9DE -Dtests.multiplier=2 -Dtests.slow=true -Dtests.locale=sr-RS -Dtests.timezone=GB -Dtests.asserts=true -Dtests.file.encoding=UTF-8
   [junit4] FAILURE 1.26s J2 | TestSimTriggerIntegration.testSearchRate <<<
   [junit4]    > Throwable #1: java.lang.AssertionError: The trigger did not start in time
   [junit4]    > at __randomizedtesting.SeedInfo.seed([2A33227A19C6C9DE:777B3CF3D6006F91]:0)
   [junit4]    > at org.apache.solr.cloud.autoscaling.sim.TestSimTriggerIntegration.testSearchRate(TestSimTriggerIntegration.java:1262)
   [junit4]    > at java.lang.Thread.run(Thread.java:748)
   [junit4] IGNOR/A 0.00s J2 | TestSimTriggerIntegration.testNodeAddedTriggerRestoreState
   [junit4]    > Assumption #1: 'badapple' test group is disabled (@BadApple(bugUrl=https://issues.apache.org/jira/browse/SOLR-12028))
   [junit4] IGNOR/A 0.00s J2 | TestSimTriggerIntegration.testTriggerThrottling
   [junit4]    > Assumption #1: 'badapple' test group is disabled (@BadApple(bugUrl=https://issues.apache.org/jira/browse/SOLR-12028))
   [junit4]   2> 1588508 DEBUG (ScheduledTrigger-3701-thread-3) [    ] o.a.s.c.a.ScheduledTriggers Pausing all triggers: [.auto_add_replicas, search_rate_trigger]
   [junit4]   2> 1588552 INFO  (TEST-TestSimTriggerIntegration.testNodeLostTrigger-seed#[2A33227A19C6C9DE]) [    ] o.a.s.SolrTestCaseJ4 ###Starting testNodeLostTrigger
   [junit4]   2> 1588568 DEBUG (TEST-TestSimTriggerIntegration.testNodeLostTrigger-seed#[2A33227A19C6C9DE]) [    ] o.a.s.c.a.OverseerTriggerThread Refreshing /autoscaling.json with znode version 10
   [junit4]   2> 1588568 DEBUG (Simulated OverseerAutoScalingTriggerThread) [    ] o.a.s.c.a.OverseerTriggerThread Processed trigger updates upto znodeVersion 10
   [junit4]   2> 1588591 DEBUG (Simulated OverseerAutoScalingTriggerThread) [    ] o.a.s.c.a.OverseerTriggerThread -- clean old nodeLost markers
   [junit4]   2> 1588591 DEBUG (Simulated OverseerAutoScalingTriggerThread) [    ] o.a.s.c.a.OverseerTriggerThread -- clean old nodeAdded markers
   [junit4]   2> 1588591 DEBUG (Simulated OverseerAutoScalingTriggerThread) [    ] o.a.s.c.a.OverseerTriggerThread Current znodeVersion 10, lastZnodeVersion 10
   [junit4]   2> 1588591 INFO  (TEST-TestSimTriggerIntegration.testNodeLostTrigger-seed#[2A33227A19C6C9DE]) [    ] o.a.s.c.a.s.SimCloudManager === Restarting OverseerTriggerThread and clearing object cache...
   [junit4]   2> 1588591 DEBUG (TEST-TestSimTriggerIntegration.testNodeLostTrigger-seed#[2A33227A19C6C9DE]) [    ] o.a.s.c.a.ScheduledTriggers Shutting down scheduled thread pool executor now
   [junit4]   2> 1588591 DEBUG (TEST-TestSimTriggerIntegration.testNodeLostTrigger-seed#[2A33227A19C6C9DE]) [    ] o.a.s.c.a.ScheduledTriggers Shutting down action executor now
   [junit4]   2> 1588591 DEBUG (TEST-TestSimTriggerIntegration.testNodeLostTrigger-seed#[2A33227A19C6C9DE]) [    ] o.a.s.c.a.ScheduledTriggers Awaiting termination for action executor
   [junit4]   2> 1588591 DEBUG (TEST-TestSimTriggerIntegration.testNodeLostTrigger-seed#[2A33227A19C6C9DE]) [    ] o.a.s.c.a.ScheduledTriggers Awaiting termination for scheduled thread pool executor
   [junit4]   2> 1588591 WARN  (Simulated OverseerAutoScalingTriggerThread) [    ] o.a.s.c.a.OverseerTriggerThread OverseerTriggerThread woken up but we are closed, exiting.
   [junit4]   2> 1588601 WARN  (ScheduledTrigger-3701-thread-3) [    ] o.a.s.c.a.SystemLogListener Exception sending event to collection .system
   [junit4]   2> java.io.IOException: java.lang.InterruptedException
   [junit4]   2> at org.apache.solr.cloud.autoscaling.sim.SimCloudManager.request(SimCloudManager.java:632) ~[test/:?]
   [junit4]   2> at org.apache.solr.cloud.autoscaling.SystemLogListener.onEvent(SystemLogListener.java:118) ~[java/:?]
   [junit4]   2> at org.apache.solr.cloud.autoscaling.ScheduledTriggers$TriggerListeners.fireListeners(ScheduledTriggers.java:793) ~[java/:?]
   [junit4]   2> at org.apache.solr.cloud.autoscaling.ScheduledTriggers$TriggerListeners.fireListeners(ScheduledTriggers.java:760) ~[java/:?]
   [junit4]   2> at org.apache.solr.cloud.autoscaling.ScheduledTriggers.lambda$add$4(ScheduledTriggers.java:283) ~[java/:?]
   [junit4]   2> at org.apache.solr.cloud.autoscaling.SearchRateTrigger.run(SearchRateTrigger.java:578) [java/:?]
   [junit4]   2> at org.apache.solr.cloud.autoscaling.ScheduledTriggers$TriggerWrapper.run(ScheduledTriggers.java:592) [java/:?]
   [junit4]   2> at java.util.concurrent.Executors$RunnableAdapter.call(Executors.java:511) [?:1.8.0_172]
   [junit4]   2> at java.util.concurrent.FutureTask.runAndReset(FutureTask.java:308) [?:1.8.0_172]
   [junit4]   2> at java.util.concurrent.ScheduledThreadPoolExecutor$ScheduledFutureTask.access$301(ScheduledThreadPoolExecutor.java:180) [?:1.8.0_172]
   [junit4]   2> at java.util.concurrent.ScheduledThreadPoolExecutor$ScheduledFutureTask.run(ScheduledThreadPoolExecutor.java:294) [?:1.8.0_172]
   [junit4]   2> at java.util.concurrent.ThreadPoolExecutor.runWorker(ThreadPoolExecutor.java:1149) [?:1.8.0_172]
   [junit4]   2> at java.util.concurrent.ThreadPoolExecutor$Worker.run(ThreadPoolExecutor.java:624) [?:1.8.0_172]
   [junit4]   2> at java.lang.Thread.run(Thread.java:748) [?:1.8.0_172]
   [junit4]   2> Caused by: java.lang.InterruptedException
   [junit4]   2> at java.util.concurrent.FutureTask.awaitDone(FutureTask.java:404) ~[?:1.8.0_172]
   [junit4]   2> at java.util.concurrent.FutureTask.get(FutureTask.java:191) ~[?:1.8.0_172]
   [junit4]   2> at org.apache.solr.cloud.autoscaling.sim.SimCloudManager.request(SimCloudManager.java:630) ~[test/:?]
   [junit4]   2> ... 13 more
   [junit4]   2> 1588646 DEBUG (simCloudManagerPool-3700-thread-12) [    ] o.a.s.c.a.s.SimClusterStateProvider -- submit leader election for .system / shard1
   [junit4]   2> 1588654 DEBUG (simCloudManagerPool-3700-thread-14) [    ] o.a.s.c.a.s.SimClusterStateProvider Running leader election for .system / shard1
   [junit4]   2> 1588666 DEBUG (simCloudManagerPool-3700-thread-13) [    ] o.a.s.c.a.s.SimClusterStateProvider -- no leader in shard1:{
   [junit4]   2>   "replicas":{"core_node3":{
   [junit4]   2>       "core":".system_shard1_replica_n1",
   [junit4]   2>       "SEARCHER.searcher.maxDoc":0,
   [junit4]   2>       "SEARCHER.searcher.deletedDocs":0,
   [junit4]   2>       "INDEX.sizeInBytes":10240,
   [junit4]   2>       "node_name":"127.0.0.1:10003_solr",
   [junit4]   2>       "state":"active",
   [junit4]   2>       "type":"NRT",
   [junit4]   2>       "INDEX.sizeInGB":9.5367431640625E-6,
   [junit4]   2>       "SEARCHER.searcher.numDocs":0}},
   [junit4]   2>   "range":"80000000-7fffffff",
   [junit4]   2>   "state":"active"}
   [junit4]   2> 1588666 DEBUG (simCloudManagerPool-3700-thread-14) [    ] o.a.s.c.a.s.SimClusterStateProvider -- elected new leader for .system / shard1: core_node3
   [junit4]   2> 1588667 WARN  (ScheduledTrigger-3701-thread-3) [    ] o.a.s.c.a.ScheduledTriggers Ignoring autoscaling event {
   [junit4]   2>   "id":"4485198ee1ef88T13ca0reag2d7zd2llshyxadkx",
   [junit4]   2>   "source":"search_rate_trigger",
   [junit4]   2>   "eventTime":19286643234172808,
   [junit4]   2>   "eventType":"SEARCHRATE",
   [junit4]   2>   "properties":{
   [junit4]   2>     "hotReplicas":[
   [junit4]   2>       {"core_node1":{
   [junit4]   2>           "core":"collection1_shard1_replica_n1",
   [junit4]   2>           "shard":"shard1",
   [junit4]   2>           "collection":"collection1",
   [junit4]   2>           "node_name":"127.0.0.1:10004_solr",
   [junit4]   2>           "type":"NRT",
   [junit4]   2>           "leader":"true",
   [junit4]   2>           "SEARCHER.searcher.maxDoc":0,
   [junit4]   2>           "SEARCHER.searcher.deletedDocs":0,
   [junit4]   2>           "INDEX.sizeInBytes":10240,
   [junit4]   2>           "rate":250.0,
   [junit4]   2>           "state":"active",
   [junit4]   2>           "QUERY./select.requestTimes:1minRate":250,
   [junit4]   2>           "INDEX.sizeInGB":9.5367431640625E-6,
   [junit4]   2>           "SEARCHER.searcher.numDocs":0}},
   [junit4]   2>       {"core_node2":{
   [junit4]   2>           "core":"collection1_shard1_replica_n2",
   [junit4]   2>           "shard":"shard1",
   [junit4]   2>           "collection":"collection1",
   [junit4]   2>           "node_name":"127.0.0.1:10003_solr",
   [junit4]   2>           "type":"NRT",
   [junit4]   2>           "SEARCHER.searcher.maxDoc":0,
   [junit4]   2>           "SEARCHER.searcher.deletedDocs":0,
   [junit4]   2>           "INDEX.sizeInBytes":10240,
   [junit4]   2>           "rate":250.0,
   [junit4]   2>           "state":"active",
   [junit4]   2>           "QUERY./select.requestTimes:1minRate":250,
   [junit4]   2>           "INDEX.sizeInGB":9.5367431640625E-6,
   [junit4]   2>           "SEARCHER.searcher.numDocs":0}}],
   [junit4]   2>     "coldNodes":{},
   [junit4]   2>     "coldShards":{},
   [junit4]   2>     "coldReplicas":[],
   [junit4]   2>     "violationType":["hotShards"],
   [junit4]   2>     "coldCollections":{},
   [junit4]   2>     "hotShards":{"collection1":{"shard1":250.0}},
   [junit4]   2>     "hotCollections":{"collection1":500.0},
   [junit4]   2>     "hotNodes":{
   [junit4]   2>       "127.0.0.1:10004_solr":250.0,
   [junit4]   2>       "127.0.0.1:10003_solr":250.0},
   [junit4]   2>     "_enqueue_time_":19286653979025108,
   [junit4]   2>     "requestedOps":[
   [junit4]   2>       {
   [junit4]   2>         "action":"ADDREPLICA",
   [junit4]   2>         "hints":{"COLL_SHARD":[{
   [junit4]   2>               "first":"collection1",
   [junit4]   2>               "second":"shard1"}]}},
   [junit4]   2>       {
   [junit4]   2>         "action":"ADDREPLICA",
   [junit4]   2>         "hints":{"COLL_SHARD":[{
   [junit4]   2>               "first":"collection1",
   [junit4]   2>               "second":"shard1"}]}},
   [junit4]   2>       {
   [junit4]   2>         "action":"ADDREPLICA",
   [junit4]   2>         "hints":{"COLL_SHARD":[{
   [junit4]   2>               "first":"collection1",
   [junit4]   2>               "second":"shard1"}]}}]}} from trigger org.apache.solr.cloud.autoscaling.SearchRateTrigger@3aed726e because the executor has already been closed
   [junit4]   2> 1588667 DEBUG (TEST-TestSimTriggerIntegration.testNodeLostTrigger-seed#[2A33227A19C6C9DE]) [    ] o.a.s.c.a.ScheduledTriggers ScheduledTriggers closed completely
   [junit4]   2> 1588667 DEBUG (TEST-TestSimTriggerIntegration.testNodeLostTrigger-seed#[2A33227A19C6C9DE]) [    ] o.a.s.c.a.OverseerTriggerThread OverseerTriggerThread has been closed explicitly
   [junit4]   2> 1588669 DEBUG (Simulated OverseerAutoScalingTriggerThread) [    ] o.a.s.c.a.OverseerTriggerThread Adding .auto_add_replicas and .scheduled_maintenance triggers
   [junit4]   2> 1588669 DEBUG (Simulated OverseerAutoScalingTriggerThread) [    ] o.a.s.c.a.OverseerTriggerThread Refreshing /autoscaling.json with znode version 11
   [junit4]   2> 1588669 DEBUG (Simulated OverseerAutoScalingTriggerThread) [    ] o.a.s.c.a.OverseerTriggerThread Current znodeVersion 11, lastZnodeVersion -1
   [junit4]   2> 1588669 DEBUG (Simulated OverseerAutoScalingTriggerThread) [    ] o.a.s.c.a.OverseerTriggerThread Processed trigger updates upto znodeVersion 11
   [junit4]   2> 1588669 DEBUG (Simulated OverseerAutoScalingTriggerThread) [    ] o.a.s.c.a.NodeLostTrigger NodeLostTrigger .auto_add_replicas - Initial livenodes: [127.0.0.1:10004_solr, 127.0.0.1:10003_solr]
   [junit4]   2> 1588670 DEBUG (Simulated OverseerAutoScalingTriggerThread) [    ] o.a.s.c.a.OverseerTriggerThread -- clean old nodeAdded markers
   [junit4]   2> 1588670 DEBUG (Simulated OverseerAutoScalingTriggerThread) [    ] o.a.s.c.a.OverseerTriggerThread Current znodeVersion 11, lastZnodeVersion 11
   [junit4]   2> 1588670 DEBUG (ScheduledTrigger-3704-thread-2) [    ] o.a.s.c.a.NodeLostTrigger Running NodeLostTrigger: .auto_add_replicas with currently live nodes: 2
   [junit4]   2> 1588702 DEBUG (ScheduledTrigger-3704-thread-1) [    ] o.a.s.c.a.NodeLostTrigger Running NodeLostTrigger: .auto_add_replicas with currently live nodes: 2
   [junit4]   2> 1588780 DEBUG (ScheduledTrigger-3704-thread-2) [    ] o.a.s.c.a.NodeLostTrigger Running NodeLostTrigger: .auto_add_replicas with currently live nodes: 2
   [junit4]   2> 1588781 DEBUG (simCloudManagerPool-3703-thread-1) [    ] o.a.s.c.a.AutoScalingHandler Verified autoscaling configuration
   [junit4]   2> 1588781 DEBUG (simCloudManagerPool-3703-thread-1) [    ] o.a.s.c.a.OverseerTriggerThread Refreshing /autoscaling.json with znode version 12
   [junit4]   2> 1588783 DEBUG (Simulated OverseerAutoScalingTriggerThread) [    ] o.a.s.c.a.OverseerTriggerThread Processed trigger updates upto znodeVersion 12
   [junit4]   2> 1588800 DEBUG (ScheduledTrigger-3704-thread-1) [    ] o.a.s.c.a.NodeLostTrigger Running NodeLostTrigger: .auto_add_replicas with currently live nodes: 2
   [junit4]   2> 1588785 DEBUG (simCloudManagerPool-3703-thread-2) [    ] o.a.s.c.a.AutoScalingHandler Verified autoscaling configuration
   [junit4]   2> 1588801 DEBUG (Simulated OverseerAutoScalingTriggerThread) [    ] o.a.s.c.a.OverseerTriggerThread -- clean old nodeAdded markers
   [junit4]   2> 1588801 DEBUG (simCloudManagerPool-3703-thread-2) [    ] o.a.s.c.a.OverseerTriggerThread Refreshing /autoscaling.json with znode version 13
   [junit4]   2> 1588801 DEBUG (Simulated OverseerAutoScalingTriggerThread) [    ] o.a.s.c.a.OverseerTriggerThread Current znodeVersion 13, lastZnodeVersion 12
   [junit4]   2> 1588801 DEBUG (Simulated OverseerAutoScalingTriggerThread) [    ] o.a.s.c.a.OverseerTriggerThread Processed trigger updates upto znodeVersion 13
   [junit4]   2> 1588818 INFO  (Simulated OverseerAutoScalingTriggerThread) [    ] o.a.s.c.a.s.TestSimTriggerIntegration TestTriggerAction init
   [junit4]   2> 1588818 DEBUG (Simulated OverseerAutoScalingTriggerThread) [    ] o.a.s.c.a.NodeLostTrigger NodeLostTrigger node_lost_trigger - Initial livenodes: [127.0.0.1:10004_solr, 127.0.0.1:10003_solr]
   [junit4]   2> 1588818 DEBUG (ScheduledTrigger-3704-thread-3) [    ] o.a.s.c.a.NodeLostTrigger Running NodeLostTrigger: node_lost_trigger with currently live nodes: 1
   [junit4]   2> 1588818 DEBUG (ScheduledTrigger-3704-thread-3) [    ] o.a.s.c.a.NodeLostTrigger Tracking lost node: 127.0.0.1:10003_solr
   [junit4]   2> 1588819 DEBUG (Simulated OverseerAutoScalingTriggerThread) [    ] o.a.s.c.a.OverseerTriggerThread -- clean old nodeAdded markers
   [junit4]   2> 1588819 DEBUG (Simulated OverseerAutoScalingTriggerThread) [    ] o.a.s.c.a.OverseerTriggerThread Current znodeVersion 13, lastZnodeVersion 13
   [junit4]   2> 1588819 DEBUG (TEST-TestSimTriggerIntegration.testNodeLostTrigger-seed#[2A33227A19C6C9DE]) [    ] o.a.s.c.a.s.SimClusterStateProvider -- submit leader election for .system / shard1
   [junit4]   2> 1588819 DEBUG (simCloudManagerPool-3703-thread-3) [    ] o.a.s.c.a.s.SimClusterStateProvider Running leader election for .system / shard1
   [junit4]   2> 1588820 WARN  (simCloudManagerPool-3703-thread-3) [    ] o.a.s.c.a.s.SimClusterStateProvider Can't find any active replicas for .system / shard1: shard1:{
   [junit4]   2>   "replicas":{"core_node3":{
   [junit4]   2>       "core":".system_shard1_replica_n1",
   [junit4]   2>       "SEARCHER.searcher.maxDoc":1,
   [junit4]   2>       "SEARCHER.searcher.deletedDocs":0,
   [junit4]   2>       "INDEX.sizeInBytes":10740,
   [junit4]   2>       "node_name":"127.0.0.1:10003_solr",
   [junit4]   2>       "state":"down",
   [junit4]   2>       "type":"NRT",
   [junit4]   2>       "INDEX.sizeInGB":1.000240445137024E-5,
   [junit4]   2>       "SEARCHER.searcher.numDocs":1}},
   [junit4]   2>   "range":"80000000-7fffffff",
   [junit4]   2>   "state":"active"}
   [junit4]   2> 1588820 DEBUG (simCloudManagerPool-3703-thread-3) [    ] o.a.s.c.a.s.SimClusterStateProvider -- liveNodes: [127.0.0.1:10004_solr]
   [junit4]   2> 1588832 DEBUG (ScheduledTrigger-3704-thread-3) [    ] o.a.s.c.a.NodeLostTrigger Running NodeLostTrigger: .auto_add_replicas with currently live nodes: 1
   [junit4]   2> 1588835 DEBUG (ScheduledTrigger-3704-thread-3) [    ] o.a.s.c.a.NodeLostTrigger Tracking lost node: 127.0.0.1:10003_solr
   [junit4]   2> 1588839 DEBUG (ScheduledTrigger-3704-thread-4) [    ] o.a.s.c.a.NodeLostTrigger Running NodeLostTrigger: node_lost_trigger with currently live nodes: 1
   [junit4]   2> 1588839 DEBUG (ScheduledTrigger-3704-thread-4) [    ] o.a.s.c.a.NodeLostTrigger NodeLostTrigger firing registered processor for lost nodes: [127.0.0.1:10003_solr]
   [junit4]   2> 1588840 DEBUG (ScheduledTrigger-3704-thread-4) [    ] o.a.s.c.a.ScheduledTriggers ++++++++ Cooldown inactive - processing event: {
   [junit4]   2>   "id":"44851facadf862T13ca0reag2d7zd2llshyxadl0",
   [junit4]   2>   "source":"node_lost_trigger",
   [junit4]   2>   "eventTime":19286669503887458,
   [junit4]   2>   "eventType":"NODELOST",
   [junit4]   2>   "properties":{
   [junit4]   2>     "eventTimes":[19286669503887458],
   [junit4]   2>     "preferredOperation":"movereplica",
   [junit4]   2>     "nodeNames":["127.0.0.1:10003_solr"]}}
   [junit4]   2> 1588840 DEBUG (ScheduledTrigger-3704-thread-4) [    ] o.a.s.c.a.ScheduledTriggers Pausing all triggers: [.auto_add_replicas, node_lost_trigger]
   [junit4]   2> 1588841 DEBUG (simCloudManagerPool-3703-thread-4) [    ] o.a.s.c.a.s.SimClusterStateProvider -- no leader in shard1:{
   [junit4]   2>   "replicas":{"core_node3":{
   [junit4]   2>       "core":".system_shard1_replica_n1",
   [junit4]   2>       "SEARCHER.searcher.maxDoc":1,
   [junit4]   2>       "SEARCHER.searcher.deletedDocs":0,
   [junit4]   2>       "INDEX.sizeInBytes":10740,
   [junit4]   2>       "node_name":"127.0.0.1:10003_solr",
   [junit4]   2>       "state":"down",
   [junit4]   2>       "type":"NRT",
   [junit4]   2>       "INDEX.sizeInGB":1.000240445137024E-5,
   [junit4]   2>       "SEARCHER.searcher.numDocs":1}},
   [junit4]   2>   "range":"80000000-7fffffff",
   [junit4]   2>   "state":"active"}
   [junit4]   2> 1588861 DEBUG (AutoscalingActionExecutor-3705-thread-1) [    ] o.a.s.c.a.ScheduledTriggers -- processing actions for {
   [junit4]   2>   "id":"44851facadf862T13ca0reag2d7zd2llshyxadl0",
   [junit4]   2>   "source":"node_lost_trigger",
   [junit4]   2>   "eventTime":19286669503887458,
   [junit4]   2>   "eventType":"NODELOST",
   [junit4]   2>   "properties":{
   [junit4]   2>     "eventTimes":[19286669503887458],
   [junit4]   2>     "preferredOperation":"movereplica",
   [junit4]   2>     "_enqueue_time_":19286670590754008,
   [junit4]   2>     "nodeNames":["127.0.0.1:10003_solr"]}}
   [junit4]   2> 1588865 DEBUG (simCloudManagerPool-3703-thread-5) [    ] o.a.s.c.a.AutoScalingHandler Verified autoscaling configuration
   [junit4]   2> 1588865 DEBUG (simCloudManagerPool-3703-thread-5) [    ] o.a.s.c.a.OverseerTriggerThread Refreshing /autoscaling.json with znode version 14
   [junit4]   2> 1588866 DEBUG (simCloudManagerPool-3703-thread-6) [    ] o.a.s.c.a.s.SimClusterStateProvider -- no leader in shard1:{
   [junit4]   2>   "replicas":{"core_node3":{
   [junit4]   2>       "core":".system_shard1_replica_n1",
   [junit4]   2>       "SEARCHER.searcher.maxDoc":1,
   [junit4]   2>       "SEARCHER.searcher.deletedDocs":0,
   [junit4]   2>       "INDEX.sizeInBytes":10740,
   [junit4]   2>       "node_name":"127.0.0.1:10003_solr",
   [junit4]   2>       "state":"down",
   [junit4]   2>       "type":"NRT",
   [junit4]   2>       "INDEX.sizeInGB":1.000240445137024E-5,
   [junit4]   2>       "SEARCHER.searcher.numDocs":1}},
   [junit4]   2>   "range":"80000000-7fffffff",
   [junit4]   2>   "state":"active"}
   [junit4]   2> 1588866 DEBUG (AutoscalingActionExecutor-3705-thread-1) [    ] o.a.s.c.a.ScheduledTriggers Resuming trigger: .auto_add_replicas after 100ms
   [junit4]   2> 1588866 DEBUG (AutoscalingActionExecutor-3705-thread-1) [    ] o.a.s.c.a.ScheduledTriggers Resuming trigger: node_lost_trigger after 100ms
   [junit4]   2> 1588866 DEBUG (AutoscalingActionExecutor-3705-thread-1) [    ] o.a.s.c.a.ScheduledTriggers -- processing took 236 ms for event id=44851facadf862T13ca0reag2d7zd2llshyxadl0
   [junit4]   2> 1588877 DEBUG (Simulated OverseerAutoScalingTriggerThread) [    ] o.a.s.c.a.OverseerTriggerThread Processed trigger updates upto znodeVersion 14
   [junit4]   2> 1588877 DEBUG (Simulated OverseerAutoScalingTriggerThread) [    ] o.a.s.c.a.OverseerTriggerThread -- clean old nodeAdded markers
   [junit4]   2> 1588877 DEBUG (Simulated OverseerAutoScalingTriggerThread) [    ] o.a.s.c.a.OverseerTriggerThread Current znodeVersion 14, lastZnodeVersion 14
   [junit4]   2> 1588906 INFO  (TEST-TestSimTriggerIntegration.testNodeLostTrigger-seed#[2A33227A19C6C9DE]) [    ] o.a.s.SolrTestCaseJ4 ###Ending testNodeLostTrigger
   [junit4]   2> 1588906 INFO  (TEST-TestSimTriggerIntegration.testNodeLostTrigger-seed#[2A33227A19C6C9DE]) [    ] o.a.s.c.a.s.SimSolrCloudTestCase #######################################
   [junit4]   2> ############ CLUSTER STATE ############
   [junit4]   2> #######################################
   [junit4]   2> ## Live nodes: 1
   [junit4]   2> ## Empty nodes: 1
   [junit4]   2> ## Dead nodes: 1
   [junit4]   2> ## 127.0.0.1:10003_solr
   [junit4]   2> ## Collections: [.system]
   [junit4]   2> ## Max replicas per node: 0
   [junit4]   2> ## Min replicas per node: 0
   [junit4]   2> ## Total replicas: 0
   [junit4]   2> ######### Solr op counts ##########
   [junit4]   2> ## - autoscaling        3
   [junit4]   2> ## - update             2
   [junit4]   2> ######### Autoscaling event counts ###########
   [junit4]   2> ## * Trigger: node_lost_trigger
   [junit4]   2> ## - STARTED         1
   [junit4]   2> ## - SUCCEEDED       1
   [junit4]   2> ## * Trigger: search_rate_trigger
   [junit4]   2> ## - ABORTED         1
   [junit4]   2> ## - STARTED         1
   [junit4]   2>
   [junit4]   2> 1588911 INFO  (TEST-TestSimTriggerIntegration.testEventQueue-seed#[2A33227A19C6C9DE]) [    ] o.a.s.SolrTestCaseJ4 ###Starting testEventQueue
   [junit4]   2> 1588911 DEBUG (TEST-TestSimTriggerIntegration.testEventQueue-seed#[2A33227A19C6C9DE]) [    ] o.a.s.c.a.OverseerTriggerThread Refreshing /autoscaling.json with znode version 15
   [junit4]   2> 1588911 DEBUG (Simulated OverseerAutoScalingTriggerThread) [    ] o.a.s.c.a.OverseerTriggerThread Processed trigger updates upto znodeVersion 15
   [junit4]   2> 1588911 DEBUG (TEST-TestSimTriggerIntegration.testEventQueue-seed#[2A33227A19C6C9DE]) [    ] o.a.s.c.a.s.SimNodeStateProvider - removing dead node values: 127.0.0.1:10003_solr
   [junit4]   2> 1588911 DEBUG (Simulated OverseerAutoScalingTriggerThread) [    ] o.a.s.c.a.OverseerTriggerThread -- clean old nodeLost markers
   [junit4]   2> 1588911 DEBUG (Simulated OverseerAutoScalingTriggerThread) [    ] o.a.s.c.a.OverseerTriggerThread -- clean old nodeAdded markers
   [junit4]   2> 1588911 INFO  (TEST-TestSimTriggerIntegration.testEventQueue-seed#[2A33227A19C6C9DE]) [    ] o.a.s.c.a.s.SimCloudManager === Restarting OverseerTriggerThread and clearing object cache...
   [junit4]   2> 1588911 DEBUG (Simulated OverseerAutoScalingTriggerThread) [    ] o.a.s.c.a.OverseerTriggerThread Current znodeVersion 15, lastZnodeVersion 15
   [junit4]   2> 1588911 WARN  (Simulated OverseerAutoScalingTriggerThread) [    ] o.a.s.c.a.OverseerTriggerThread Interrupted
   [junit4]   2> java.lang.InterruptedException: null
   [junit4]   2> at java.util.concurrent.locks.AbstractQueuedSynchronizer$ConditionObject.await(AbstractQueuedSynchronizer.java:2034) ~[?:1.8.0_172]
   [junit4]   2> at org.apache.solr.cloud.autoscaling.OverseerTriggerThread.run(OverseerTriggerThread.java:189) [java/:?]
   [junit4]   2> at java.lang.Thread.run(Thread.java:748) [?:1.8.0_172]
   [junit4]   2> 1588912 DEBUG (TEST-TestSimTriggerIntegration.testEventQueue-seed#[2A33227A19C6C9DE]) [    ] o.a.s.c.a.ScheduledTriggers Shutting down scheduled thread pool executor now
   [junit4]   2> 1588912 DEBUG (TEST-TestSimTriggerIntegration.testEventQueue-seed#[2A33227A19C6C9DE]) [    ] o.a.s.c.a.ScheduledTriggers Shutting down action executor now
   [junit4]   2> 1588912 DEBUG (TEST-TestSimTriggerIntegration.testEventQueue-seed#[2A33227A19C6C9DE]) [    ] o.a.s.c.a.ScheduledTriggers Awaiting termination for action executor
   [junit4]   2> 1588912 DEBUG (TEST-TestSimTriggerIntegration.testEventQueue-seed#[2A33227A19C6C9DE]) [    ] o.a.s.c.a.ScheduledTriggers Awaiting termination for scheduled thread pool executor
   [junit4]   2> 1588913 DEBUG (TEST-TestSimTriggerIntegration.testEventQueue-seed#[2A33227A19C6C9DE]) [    ] o.a.s.c.a.ScheduledTriggers ScheduledTriggers closed completely
   [junit4]   2> 1588913 DEBUG (TEST-TestSimTriggerIntegration.testEventQueue-seed#[2A33227A19C6C9DE]) [    ] o.a.s.c.a.OverseerTriggerThread OverseerTriggerThread has been closed explicitly
   [junit4]   2> 1588946 DEBUG (Simulated OverseerAutoScalingTriggerThread) [    ] o.a.s.c.a.OverseerTriggerThread Adding .auto_add_replicas and .scheduled_maintenance triggers
   [junit4]   2> 1588946 DEBUG (Simulated OverseerAutoScalingTriggerThread) [    ] o.a.s.c.a.OverseerTriggerThread Refreshing /autoscaling.json with znode version 16
   [junit4]   2> 1588946 DEBUG (Simulated OverseerAutoScalingTriggerThread) [    ] o.a.s.c.a.OverseerTriggerThread Current znodeVersion 16, lastZnodeVersion -1
   [junit4]   2> 1588946 DEBUG (Simulated OverseerAutoScalingTriggerThread) [    ] o.a.s.c.a.OverseerTriggerThread Processed trigger updates upto znodeVersion 16
   [junit4]   2> 1588954 DEBUG (Simulated OverseerAutoScalingTriggerThread) [    ] o.a.s.c.a.NodeLostTrigger NodeLostTrigger .auto_add_replicas - Initial livenodes: [127.0.0.1:10004_solr, 127.0.0.1:10005_solr]
   [junit4]   2> 1588954 DEBUG (Simulated OverseerAutoScalingTriggerThread) [    ] o.a.s.c.a.OverseerTriggerThread -- clean old nodeAdded markers
   [junit4]   2> 1588954 DEBUG (Simulated OverseerAutoScalingTriggerThread) [    ] o.a.s.c.a.OverseerTriggerThread Current znodeVersion 16, lastZnodeVersion 16
   [junit4]   2> 1588954 DEBUG (ScheduledTrigger-3707-thread-1) [    ] o.a.s.c.a.NodeLostTrigger Running NodeLostTrigger: .auto_add_replicas with currently live nodes: 2
   [junit4]   2> 1588975 DEBUG (ScheduledTrigger-3707-thread-1) [    ] o.a.s.c.a.NodeLostTrigger Running NodeLostTrigger: .auto_add_replicas with currently live nodes: 2
   [junit4]   2> 1588996 DEBUG (ScheduledTrigger-3707-thread-4) [    ] o.a.s.c.a.NodeLostTrigger Running NodeLostTrigger: .auto_add_replicas with currently live nodes: 2
   [junit4]   2> 1589016 DEBUG (ScheduledTrigger-3707-thread-1) [    ] o.a.s.c.a.NodeLostTrigger Running NodeLostTrigger: .auto_add_replicas with currently live nodes: 2
   [junit4]   2> 1589036 DEBUG (ScheduledTrigger-3707-thread-4) [    ] o.a.s.c.a.NodeLostTrigger Running NodeLostTrigger: .auto_add_replicas with currently live nodes: 2
   [junit4]   2> 1589043 DEBUG (simCloudManagerPool-3706-thread-1) [    ] o.a.s.c.a.AutoScalingHandler Verified autoscaling configuration
   [junit4]   2> 1589043 DEBUG (simCloudManagerPool-3706-thread-1) [    ] o.a.s.c.a.OverseerTriggerThread Refreshing /autoscaling.json with znode version 17
   [junit4]   2> 1589044 DEBUG (Simulated OverseerAutoScalingTriggerThread) [    ] o.a.s.c.a.OverseerTriggerThread Processed trigger updates upto znodeVersion 17
   [junit4]   2> 1589044 DEBUG (Simulated OverseerAutoScalingTriggerThread) [    ] o.a.s.c.a.OverseerTriggerThread -- clean old nodeAdded markers
   [junit4]   2> 1589044 DEBUG (Simulated OverseerAutoScalingTriggerThread) [    ] o.a.s.c.a.OverseerTriggerThread Current znodeVersion 17, lastZnodeVersion 17
   [junit4]   2> 1589056 DEBUG (ScheduledTrigger-3707-thread-2) [    ] o.a.s.c.a.NodeLostTrigger Running NodeLostTrigger: .auto_add_replicas with currently live nodes: 2
   [junit4]   2> 1589066 DEBUG (simCloudManagerPool-3706-thread-2) [    ] o.a.s.c.a.s.SimClusterStateProvider -- submit leader election for .system / shard1
   [junit4]   2> 1589066 DEBUG (simCloudManagerPool-3706-thread-3) [    ] o.a.s.c.a.s.SimClusterStateProvider Running leader election for .system / shard1
   [junit4]   2> 1589066 DEBUG (simCloudManagerPool-3706-thread-3) [    ] o.a.s.c.a.s.SimClusterStateProvider -- elected new leader for .system / shard1: core_node4
   [junit4]   2> 1589068 INFO  (simCloudManagerPool-3706-thread-4) [    ] o.a.s.c.a.s.TestSimTriggerIntegration TestEventQueueAction instantiated
   [junit4]   2> 1589068 DEBUG (simCloudManagerPool-3706-thread-4) [    ] o.a.s.c.a.s.TestSimTriggerIntegration TestTriggerAction init
   [junit4]   2> 1589069 DEBUG (simCloudManagerPool-3706-thread-4) [    ] o.a.s.c.a.AutoScalingHandler Verified autoscaling configuration
   [junit4]   2> 1589069 DEBUG (simCloudManagerPool-3706-thread-4) [    ] o.a.s.c.a.OverseerTriggerThread Refreshing /autoscaling.json with znode version 18
   [junit4]   2> 1589069 INFO  (simCloudManagerPool-3706-thread-4) [    ] o.a.s.c.a.s.TestSimTriggerIntegration TestEventQueueAction instantiated
   [junit4]   2> 1589069 DEBUG (simCloudManagerPool-3706-thread-4) [    ] o.a.s.c.a.s.TestSimTriggerIntegration TestTriggerAction init
   [junit4]   2> 1589069 DEBUG (Simulated OverseerAutoScalingTriggerThread) [    ] o.a.s.c.a.OverseerTriggerThread Processed trigger updates upto znodeVersion 18
   [junit4]   2> 1589069 DEBUG (Simulated OverseerAutoScalingTriggerThread) [    ] o.a.s.c.a.NodeAddedTrigger NodeAddedTrigger node_added_trigger1 - Initial livenodes: [127.0.0.1:10004_solr, 127.0.0.1:10005_solr]
   [junit4]   2> 1589069 DEBUG (Simulated OverseerAutoScalingTriggerThread) [    ] o.a.s.c.a.NodeAddedTrigger NodeAddedTrigger node_added_trigger1 instantiated with properties: {event=nodeAdded, waitFor=1, actions=[{name=test, class=org.apache.solr.cloud.autoscaling.sim.TestSimTriggerIntegration$TestEventQueueAction}], enabled=true}
   [junit4]   2> 1589070 DEBUG (Simulated OverseerAutoScalingTriggerThread) [    ] o.a.s.c.a.OverseerTriggerThread Current znodeVersion 18, lastZnodeVersion 18
   [junit4]   2> 1589070 DEBUG (ScheduledTrigger-3707-thread-3) [    ] o.a.s.c.a.NodeAddedTrigger Running NodeAddedTrigger node_added_trigger1
   [junit4]   2> 1589070 DEBUG (ScheduledTrigger-3707-thread-3) [    ] o.a.s.c.a.NodeAddedTrigger Found livenodes: 3
   [junit4]   2> 1589070 DEBUG (ScheduledTrigger-3707-thread-3) [    ] o.a.s.c.a.NodeAddedTrigger Tracking new node: 127.0.0.1:10006_solr at time 19286682074005608
   [junit4]   2> 1589077 DEBUG (ScheduledTrigger-3707-thread-3) [    ] o.a.s.c.a.NodeLostTrigger Running NodeLostTrigger: .auto_add_replicas with currently live nodes: 3
   [junit4]   2> 1589091 DEBUG (ScheduledTrigger-3707-thread-2) [    ] o.a.s.c.a.NodeAddedTrigger Running NodeAddedTrigger node_added_trigger1
   [junit4]   2> 1589091 DEBUG (ScheduledTrigger-3707-thread-2) [    ] o.a.s.c.a.NodeAddedTrigger Found livenodes: 3
   [junit4]   2> 1589091 DEBUG (ScheduledTrigger-3707-thread-2) [    ] o.a.s.c.a.NodeAddedTrigger NodeAddedTrigger node_added_trigger1 firing registered processor for nodes: [127.0.0.1:10006_solr] added at times [19286682074005608], now=19286683124114958
   [junit4]   2> 1589091 DEBUG (ScheduledTrigger-3707-thread-2) [    ] o.a.s.c.a.ScheduledTriggers ++++++++ Cooldown inactive - processing event: {
   [junit4]   2>   "id":"44852299eac068T13ca0reag2d7zd2llshyxadl3",
   [junit4]   2>   "source":"node_added_trigger1",
   [junit4]   2>   "eventTime":19286682074005608,
   [junit4]   2>   "eventType":"NODEADDED",
   [junit4]   2>   "properties":{
   [junit4]   2>     "eventTimes":[19286682074005608],
   [junit4]   2>     "preferredOperation":"movereplica",
   [junit4]   2>     "nodeNames":["127.0.0.1:10006_solr"]}}
   [junit4]   2> 1589091 DEBUG (ScheduledTrigger-3707-thread-2) [    ] o.a.s.c.a.ScheduledTriggers Pausing all triggers: [.auto_add_replicas, node_added_trigger1]
   [junit4]   2> 1589092 DEBUG (ScheduledTrigger-3707-thread-2) [    ] o.a.s.c.a.NodeAddedTrigger NodeAddedTrigger node_added_trigger1 - removing marker path: /autoscaling/nodeAdded/127.0.0.1:10006_solr
   [junit4]   2> 1589093 DEBUG (AutoscalingActionExecutor-3708-thread-1) [    ] o.a.s.c.a.ScheduledTriggers -- processing actions for {
   [junit4]   2>   "id":"44852299eac068T13ca0reag2d7zd2llshyxadl3",
   [junit4]   2>   "source":"node_added_trigger1",
   [junit4]   2>   "eventTime":19286682074005608,
   [junit4]   2>   "eventType":"NODEADDED",
   [junit4]   2>   "properties":{
   [junit4]   2>     "eventTimes":[19286682074005608],
   [junit4]   2>     "preferredOperation":"movereplica",
   [junit4]   2>     "_enqueue_time_":19286683143699008,
   [junit4]   2>     "nodeNames":["127.0.0.1:10006_solr"]}}
   [junit4]   2> 1589093 INFO  (AutoscalingActionExecutor-3708-thread-1) [    ] o.a.s.c.a.s.TestSimTriggerIntegration -- event: {
   [junit4]   2>   "id":"44852299eac068T13ca0reag2d7zd2llshyxadl3",
   [junit4]   2>   "source":"node_added_trigger1",
   [junit4]   2>   "eventTime":19286682074005608,
   [junit4]   2>   "eventType":"NODEADDED",
   [junit4]   2>   "properties":{
   [junit4]   2>     "eventTimes":[19286682074005608],
   [junit4]   2>     "preferredOperation":"movereplica",
   [junit4]   2>     "_enqueue_time_":19286683143699008,
   [junit4]   2>     "nodeNames":["127.0.0.1:10006_solr"]}}
   [junit4]   2> 1589093 INFO  (TEST-TestSimTriggerIntegration.testEventQueue-seed#[2A33227A19C6C9DE]) [    ] o.a.s.c.a.s.SimCloudManager === Restarting OverseerTriggerThread and clearing object cache...
   [junit4]   2> 1589093 DEBUG (TEST-TestSimTriggerIntegration.testEventQueue-seed#[2A33227A19C6C9DE]) [    ] o.a.s.c.a.ScheduledTriggers Shutting down scheduled thread pool executor now
   [junit4]   2> 1589093 WARN  (Simulated OverseerAutoScalingTriggerThread) [    ] o.a.s.c.a.OverseerTriggerThread OverseerTriggerThread woken up but we are closed, exiting.
   [junit4]   2> 1589093 DEBUG (TEST-TestSimTriggerIntegration.testEventQueue-seed#[2A33227A19C6C9DE]) [    ] o.a.s.c.a.ScheduledTriggers Shutting down action executor now
   [junit4]   2> 1589093 DEBUG (TEST-TestSimTriggerIntegration.testEventQueue-seed#[2A33227A19C6C9DE]) [    ] o.a.s.c.a.ScheduledTriggers Awaiting termination for action executor
   [junit4]   2> 1589094 WARN  (AutoscalingActionExecutor-3708-thread-1) [    ] o.a.s.c.a.ScheduledTriggers Unhandled exception executing actions
   [junit4]   2> org.apache.lucene.store.AlreadyClosedException: ScheduledTrigger node_added_trigger1 has been closed.
   [junit4]   2> at org.apache.solr.cloud.autoscaling.ScheduledTriggers$TriggerWrapper.dequeue(ScheduledTriggers.java:549) ~[java/:?]
   [junit4]   2> at org.apache.solr.cloud.autoscaling.ScheduledTriggers.lambda$null$3(ScheduledTriggers.java:319) ~[java/:?]
   [junit4]   2> at java.util.concurrent.Executors$RunnableAdapter.call(Executors.java:511) ~[?:1.8.0_172]
   [junit4]   2> at java.util.concurrent.FutureTask.run(FutureTask.java:266) ~[?:1.8.0_172]
   [junit4]   2> at org.apache.solr.common.util.ExecutorUtil$MDCAwareThreadPoolExecutor.lambda$execute$0(ExecutorUtil.java:209) ~[java/:?]
   [junit4]   2> at java.util.concurrent.ThreadPoolExecutor.runWorker(ThreadPoolExecutor.java:1149) [?:1.8.0_172]
   [junit4]   2> at java.util.concurrent.ThreadPoolExecutor$Worker.run(ThreadPoolExecutor.java:624) [?:1.8.0_172]
   [junit4]   2> at java.lang.Thread.run(Thread.java:748) [?:1.8.0_172]
   [junit4]   2> 1589095 DEBUG (AutoscalingActionExecutor-3708-thread-1) [    ] o.a.s.c.a.ScheduledTriggers -- processing took 95 ms for event id=44852299eac068T13ca0reag2d7zd2llshyxadl3
   [junit4]   2> 1589095 DEBUG (TEST-TestSimTriggerIntegration.testEventQueue-seed#[2A33227A19C6C9DE]) [    ] o.a.s.c.a.ScheduledTriggers Awaiting termination for scheduled thread pool executor
   [junit4]   2> 1589095 DEBUG (TEST-TestSimTriggerIntegration.testEventQueue-seed#[2A33227A19C6C9DE]) [    ] o.a.s.c.a.ScheduledTriggers ScheduledTriggers closed completely
   [junit4]   2> 1589095 DEBUG (TEST-TestSimTriggerIntegration.testEventQueue-seed#[2A33227A19C6C9DE]) [    ] o.a.s.c.a.OverseerTriggerThread OverseerTriggerThread has been closed explicitly
   [junit4]   2> 1589095 DEBUG (TEST-TestSimTriggerIntegration.testEventQueue-seed#[2A33227A19C6C9DE]) [    ]

[...truncated too long message...]

operty disallowed.ivy.jars.list as its length is 0.

-ivy-fail-disallowed-ivy-version:

ivy-fail:

ivy-fail:

ivy-configure:
[ivy:configure] :: loading settings :: file = /home/jenkins/jenkins-slave/workspace/Lucene-Solr-Tests-7.5/lucene/top-level-ivy-settings.xml

resolve:

ivy-availability-check:
[loadresource] Do not set property disallowed.ivy.jars.list as its length is 0.

-ivy-fail-disallowed-ivy-version:

ivy-fail:

ivy-configure:
[ivy:configure] :: loading settings :: file = /home/jenkins/jenkins-slave/workspace/Lucene-Solr-Tests-7.5/lucene/top-level-ivy-settings.xml

resolve:

ivy-availability-check:
[loadresource] Do not set property disallowed.ivy.jars.list as its length is 0.

-ivy-fail-disallowed-ivy-version:

ivy-fail:

ivy-fail:

ivy-configure:
[ivy:configure] :: loading settings :: file = /home/jenkins/jenkins-slave/workspace/Lucene-Solr-Tests-7.5/lucene/top-level-ivy-settings.xml

resolve:

ivy-availability-check:
[loadresource] Do not set property disallowed.ivy.jars.list as its length is 0.

-ivy-fail-disallowed-ivy-version:

ivy-fail:

ivy-configure:
[ivy:configure] :: loading settings :: file = /home/jenkins/jenkins-slave/workspace/Lucene-Solr-Tests-7.5/lucene/top-level-ivy-settings.xml

resolve:

ivy-availability-check:
[loadresource] Do not set property disallowed.ivy.jars.list as its length is 0.

-ivy-fail-disallowed-ivy-version:

ivy-fail:

ivy-fail:

ivy-configure:
[ivy:configure] :: loading settings :: file = /home/jenkins/jenkins-slave/workspace/Lucene-Solr-Tests-7.5/lucene/top-level-ivy-settings.xml

resolve:

ivy-availability-check:
[loadresource] Do not set property disallowed.ivy.jars.list as its length is 0.

-ivy-fail-disallowed-ivy-version:

ivy-fail:

ivy-fail:

ivy-configure:
[ivy:configure] :: loading settings :: file = /home/jenkins/jenkins-slave/workspace/Lucene-Solr-Tests-7.5/lucene/top-level-ivy-settings.xml

resolve:

ivy-availability-check:
[loadresource] Do not set property disallowed.ivy.jars.list as its length is 0.

-ivy-fail-disallowed-ivy-version:

ivy-fail:

ivy-fail:

ivy-configure:
[ivy:configure] :: loading settings :: file = /home/jenkins/jenkins-slave/workspace/Lucene-Solr-Tests-7.5/lucene/top-level-ivy-settings.xml

resolve:

ivy-availability-check:
[loadresource] Do not set property disallowed.ivy.jars.list as its length is 0.

-ivy-fail-disallowed-ivy-version:

ivy-fail:

ivy-fail:

ivy-configure:
[ivy:configure] :: loading settings :: file = /home/jenkins/jenkins-slave/workspace/Lucene-Solr-Tests-7.5/lucene/top-level-ivy-settings.xml

resolve:

ivy-availability-check:
[loadresource] Do not set property disallowed.ivy.jars.list as its length is 0.

-ivy-fail-disallowed-ivy-version:

ivy-fail:

ivy-fail:

ivy-configure:
[ivy:configure] :: loading settings :: file = /home/jenkins/jenkins-slave/workspace/Lucene-Solr-Tests-7.5/lucene/top-level-ivy-settings.xml

resolve:

ivy-availability-check:
[loadresource] Do not set property disallowed.ivy.jars.list as its length is 0.

-ivy-fail-disallowed-ivy-version:

ivy-fail:

ivy-fail:

ivy-configure:
[ivy:configure] :: loading settings :: file = /home/jenkins/jenkins-slave/workspace/Lucene-Solr-Tests-7.5/lucene/top-level-ivy-settings.xml

resolve:

ivy-availability-check:
[loadresource] Do not set property disallowed.ivy.jars.list as its length is 0.

-ivy-fail-disallowed-ivy-version:

ivy-fail:

ivy-fail:

ivy-configure:
[ivy:configure] :: loading settings :: file = /home/jenkins/jenkins-slave/workspace/Lucene-Solr-Tests-7.5/lucene/top-level-ivy-settings.xml

resolve:

ivy-availability-check:
[loadresource] Do not set property disallowed.ivy.jars.list as its length is 0.

-ivy-fail-disallowed-ivy-version:

ivy-fail:

ivy-fail:

ivy-configure:
[ivy:configure] :: loading settings :: file = /home/jenkins/jenkins-slave/workspace/Lucene-Solr-Tests-7.5/lucene/top-level-ivy-settings.xml

resolve:

ivy-availability-check:
[loadresource] Do not set property disallowed.ivy.jars.list as its length is 0.

-ivy-fail-disallowed-ivy-version:

ivy-fail:

ivy-fail:

ivy-configure:
[ivy:configure] :: loading settings :: file = /home/jenkins/jenkins-slave/workspace/Lucene-Solr-Tests-7.5/lucene/top-level-ivy-settings.xml

resolve:

ivy-availability-check:
[loadresource] Do not set property disallowed.ivy.jars.list as its length is 0.

-ivy-fail-disallowed-ivy-version:

ivy-fail:

ivy-fail:

ivy-configure:
[ivy:configure] :: loading settings :: file = /home/jenkins/jenkins-slave/workspace/Lucene-Solr-Tests-7.5/lucene/top-level-ivy-settings.xml

resolve:

jar-checksums:
    [mkdir] Created dir: /home/jenkins/jenkins-slave/workspace/Lucene-Solr-Tests-7.5/solr/null424635978
     [copy] Copying 239 files to /home/jenkins/jenkins-slave/workspace/Lucene-Solr-Tests-7.5/solr/null424635978
   [delete] Deleting directory /home/jenkins/jenkins-slave/workspace/Lucene-Solr-Tests-7.5/solr/null424635978

check-working-copy:
[ivy:cachepath] :: resolving dependencies :: org.eclipse.jgit#org.eclipse.jgit-caller;working
[ivy:cachepath] confs: [default]
[ivy:cachepath] found org.eclipse.jgit#org.eclipse.jgit;4.6.0.201612231935-r in public
[ivy:cachepath] found com.jcraft#jsch;0.1.53 in public
[ivy:cachepath] found com.googlecode.javaewah#JavaEWAH;1.1.6 in public
[ivy:cachepath] found org.apache.httpcomponents#httpclient;4.3.6 in public
[ivy:cachepath] found org.apache.httpcomponents#httpcore;4.3.3 in public
[ivy:cachepath] found commons-logging#commons-logging;1.1.3 in public
[ivy:cachepath] found commons-codec#commons-codec;1.6 in public
[ivy:cachepath] found org.slf4j#slf4j-api;1.7.2 in public
[ivy:cachepath] :: resolution report :: resolve 20ms :: artifacts dl 1ms
        ---------------------------------------------------------------------
        |                  |            modules            ||   artifacts   |
        |       conf       | number| search|dwnlded|evicted|| number|dwnlded|
        ---------------------------------------------------------------------
        |      default     |   8   |   0   |   0   |   0   ||   8   |   0   |
        ---------------------------------------------------------------------
[wc-checker] Initializing working copy...
[wc-checker] SLF4J: Failed to load class "org.slf4j.impl.StaticLoggerBinder".
[wc-checker] SLF4J: Defaulting to no-operation (NOP) logger implementation
[wc-checker] SLF4J: See http://www.slf4j.org/codes.html#StaticLoggerBinder for further details.
[wc-checker] Checking working copy status...

-jenkins-base:

BUILD SUCCESSFUL
Total time: 206 minutes 26 seconds
Archiving artifacts
java.lang.InterruptedException: no matches found within 10000
        at hudson.FilePath$34.hasMatch(FilePath.java:2678)
        at hudson.FilePath$34.invoke(FilePath.java:2557)
        at hudson.FilePath$34.invoke(FilePath.java:2547)
        at hudson.FilePath$FileCallableWrapper.call(FilePath.java:2918)
Also:   hudson.remoting.Channel$CallSiteStackTrace: Remote call to lucene2
                at hudson.remoting.Channel.attachCallSiteStackTrace(Channel.java:1741)
                at hudson.remoting.UserRequest$ExceptionResponse.retrieve(UserRequest.java:357)
                at hudson.remoting.Channel.call(Channel.java:955)
                at hudson.FilePath.act(FilePath.java:1036)
                at hudson.FilePath.act(FilePath.java:1025)
                at hudson.FilePath.validateAntFileMask(FilePath.java:2547)
                at hudson.tasks.ArtifactArchiver.perform(ArtifactArchiver.java:243)
                at hudson.tasks.BuildStepCompatibilityLayer.perform(BuildStepCompatibilityLayer.java:81)
                at hudson.tasks.BuildStepMonitor$1.perform(BuildStepMonitor.java:20)
                at hudson.model.AbstractBuild$AbstractBuildExecution.perform(AbstractBuild.java:744)
                at hudson.model.AbstractBuild$AbstractBuildExecution.performAllBuildSteps(AbstractBuild.java:690)
                at hudson.model.Build$BuildExecution.post2(Build.java:186)
                at hudson.model.AbstractBuild$AbstractBuildExecution.post(AbstractBuild.java:635)
                at hudson.model.Run.execute(Run.java:1819)
                at hudson.model.FreeStyleBuild.run(FreeStyleBuild.java:43)
                at hudson.model.ResourceController.execute(ResourceController.java:97)
                at hudson.model.Executor.run(Executor.java:429)
Caused: hudson.FilePath$TunneledInterruptedException
        at hudson.FilePath$FileCallableWrapper.call(FilePath.java:2920)
        at hudson.remoting.UserRequest.perform(UserRequest.java:212)
        at hudson.remoting.UserRequest.perform(UserRequest.java:54)
        at hudson.remoting.Request$2.run(Request.java:369)
        at hudson.remoting.InterceptingExecutorService$1.call(InterceptingExecutorService.java:72)
        at java.util.concurrent.FutureTask.run(FutureTask.java:266)
        at java.util.concurrent.ThreadPoolExecutor.runWorker(ThreadPoolExecutor.java:1142)
        at java.util.concurrent.ThreadPoolExecutor$Worker.run(ThreadPoolExecutor.java:617)
        at java.lang.Thread.run(Thread.java:748)
Caused: java.lang.InterruptedException: java.lang.InterruptedException: no matches found within 10000
        at hudson.FilePath.act(FilePath.java:1038)
        at hudson.FilePath.act(FilePath.java:1025)
        at hudson.FilePath.validateAntFileMask(FilePath.java:2547)
        at hudson.tasks.ArtifactArchiver.perform(ArtifactArchiver.java:243)
        at hudson.tasks.BuildStepCompatibilityLayer.perform(BuildStepCompatibilityLayer.java:81)
        at hudson.tasks.BuildStepMonitor$1.perform(BuildStepMonitor.java:20)
        at hudson.model.AbstractBuild$AbstractBuildExecution.perform(AbstractBuild.java:744)
        at hudson.model.AbstractBuild$AbstractBuildExecution.performAllBuildSteps(AbstractBuild.java:690)
        at hudson.model.Build$BuildExecution.post2(Build.java:186)
        at hudson.model.AbstractBuild$AbstractBuildExecution.post(AbstractBuild.java:635)
        at hudson.model.Run.execute(Run.java:1819)
        at hudson.model.FreeStyleBuild.run(FreeStyleBuild.java:43)
        at hudson.model.ResourceController.execute(ResourceController.java:97)
        at hudson.model.Executor.run(Executor.java:429)
No artifacts found that match the file pattern "**/*.events,heapdumps/**,**/hs_err_pid*". Configuration error?
Recording test results
Build step 'Publish JUnit test result report' changed build result to UNSTABLE
Email was triggered for: Unstable (Test Failures)
Sending email for trigger: Unstable (Test Failures)


---------------------------------------------------------------------
To unsubscribe, e-mail: [hidden email]
For additional commands, e-mail: [hidden email]