[JENKINS] Lucene-Solr-Tests-7.x - Build # 51 - Unstable

Previous Topic Next Topic
 
classic Classic list List threaded Threaded
1 message Options
Reply | Threaded
Open this post in threaded view
|  
Report Content as Inappropriate

[JENKINS] Lucene-Solr-Tests-7.x - Build # 51 - Unstable

Apache Jenkins Server-2
Build: https://builds.apache.org/job/Lucene-Solr-Tests-7.x/51/

1 tests failed.
FAILED:  org.apache.solr.client.solrj.TestSolrJErrorHandling.testWithXml

Error Message:
expected:<180> but was:<170>

Stack Trace:
java.lang.AssertionError: expected:<180> but was:<170>
        at __randomizedtesting.SeedInfo.seed([4B436208B3C7DB39:E0A1DBFE31C1C254]:0)
        at org.junit.Assert.fail(Assert.java:93)
        at org.junit.Assert.failNotEquals(Assert.java:647)
        at org.junit.Assert.assertEquals(Assert.java:128)
        at org.junit.Assert.assertEquals(Assert.java:472)
        at org.junit.Assert.assertEquals(Assert.java:456)
        at org.apache.solr.client.solrj.TestSolrJErrorHandling.doThreads(TestSolrJErrorHandling.java:185)
        at org.apache.solr.client.solrj.TestSolrJErrorHandling.doIt(TestSolrJErrorHandling.java:200)
        at org.apache.solr.client.solrj.TestSolrJErrorHandling.testWithXml(TestSolrJErrorHandling.java:110)
        at sun.reflect.NativeMethodAccessorImpl.invoke0(Native Method)
        at sun.reflect.NativeMethodAccessorImpl.invoke(NativeMethodAccessorImpl.java:62)
        at sun.reflect.DelegatingMethodAccessorImpl.invoke(DelegatingMethodAccessorImpl.java:43)
        at java.lang.reflect.Method.invoke(Method.java:498)
        at com.carrotsearch.randomizedtesting.RandomizedRunner.invoke(RandomizedRunner.java:1713)
        at com.carrotsearch.randomizedtesting.RandomizedRunner$8.evaluate(RandomizedRunner.java:907)
        at com.carrotsearch.randomizedtesting.RandomizedRunner$9.evaluate(RandomizedRunner.java:943)
        at com.carrotsearch.randomizedtesting.RandomizedRunner$10.evaluate(RandomizedRunner.java:957)
        at com.carrotsearch.randomizedtesting.rules.SystemPropertiesRestoreRule$1.evaluate(SystemPropertiesRestoreRule.java:57)
        at org.apache.lucene.util.TestRuleSetupTeardownChained$1.evaluate(TestRuleSetupTeardownChained.java:49)
        at org.apache.lucene.util.AbstractBeforeAfterRule$1.evaluate(AbstractBeforeAfterRule.java:45)
        at org.apache.lucene.util.TestRuleThreadAndTestName$1.evaluate(TestRuleThreadAndTestName.java:48)
        at org.apache.lucene.util.TestRuleIgnoreAfterMaxFailures$1.evaluate(TestRuleIgnoreAfterMaxFailures.java:64)
        at org.apache.lucene.util.TestRuleMarkFailure$1.evaluate(TestRuleMarkFailure.java:47)
        at com.carrotsearch.randomizedtesting.rules.StatementAdapter.evaluate(StatementAdapter.java:36)
        at com.carrotsearch.randomizedtesting.ThreadLeakControl$StatementRunner.run(ThreadLeakControl.java:368)
        at com.carrotsearch.randomizedtesting.ThreadLeakControl.forkTimeoutingTask(ThreadLeakControl.java:817)
        at com.carrotsearch.randomizedtesting.ThreadLeakControl$3.evaluate(ThreadLeakControl.java:468)
        at com.carrotsearch.randomizedtesting.RandomizedRunner.runSingleTest(RandomizedRunner.java:916)
        at com.carrotsearch.randomizedtesting.RandomizedRunner$5.evaluate(RandomizedRunner.java:802)
        at com.carrotsearch.randomizedtesting.RandomizedRunner$6.evaluate(RandomizedRunner.java:852)
        at com.carrotsearch.randomizedtesting.RandomizedRunner$7.evaluate(RandomizedRunner.java:863)
        at com.carrotsearch.randomizedtesting.rules.StatementAdapter.evaluate(StatementAdapter.java:36)
        at com.carrotsearch.randomizedtesting.rules.SystemPropertiesRestoreRule$1.evaluate(SystemPropertiesRestoreRule.java:57)
        at org.apache.lucene.util.AbstractBeforeAfterRule$1.evaluate(AbstractBeforeAfterRule.java:45)
        at com.carrotsearch.randomizedtesting.rules.StatementAdapter.evaluate(StatementAdapter.java:36)
        at org.apache.lucene.util.TestRuleStoreClassName$1.evaluate(TestRuleStoreClassName.java:41)
        at com.carrotsearch.randomizedtesting.rules.NoShadowingOrOverridesOnMethodsRule$1.evaluate(NoShadowingOrOverridesOnMethodsRule.java:40)
        at com.carrotsearch.randomizedtesting.rules.NoShadowingOrOverridesOnMethodsRule$1.evaluate(NoShadowingOrOverridesOnMethodsRule.java:40)
        at com.carrotsearch.randomizedtesting.rules.StatementAdapter.evaluate(StatementAdapter.java:36)
        at com.carrotsearch.randomizedtesting.rules.StatementAdapter.evaluate(StatementAdapter.java:36)
        at com.carrotsearch.randomizedtesting.rules.StatementAdapter.evaluate(StatementAdapter.java:36)
        at org.apache.lucene.util.TestRuleAssertionsRequired$1.evaluate(TestRuleAssertionsRequired.java:53)
        at org.apache.lucene.util.TestRuleMarkFailure$1.evaluate(TestRuleMarkFailure.java:47)
        at org.apache.lucene.util.TestRuleIgnoreAfterMaxFailures$1.evaluate(TestRuleIgnoreAfterMaxFailures.java:64)
        at org.apache.lucene.util.TestRuleIgnoreTestSuites$1.evaluate(TestRuleIgnoreTestSuites.java:54)
        at com.carrotsearch.randomizedtesting.rules.StatementAdapter.evaluate(StatementAdapter.java:36)
        at com.carrotsearch.randomizedtesting.ThreadLeakControl$StatementRunner.run(ThreadLeakControl.java:368)
        at java.lang.Thread.run(Thread.java:748)




Build Log:
[...truncated 13945 lines...]
   [junit4] Suite: org.apache.solr.client.solrj.TestSolrJErrorHandling
   [junit4]   2> Creating dataDir: /home/jenkins/jenkins-slave/workspace/Lucene-Solr-Tests-7.x/solr/build/solr-solrj/test/J1/temp/solr.client.solrj.TestSolrJErrorHandling_4B436208B3C7DB39-001/init-core-data-001
   [junit4]   2> 270243 INFO  (SUITE-TestSolrJErrorHandling-seed#[4B436208B3C7DB39]-worker) [    ] o.a.s.SolrTestCaseJ4 Using TrieFields (NUMERIC_POINTS_SYSPROP=false) w/NUMERIC_DOCVALUES_SYSPROP=false
   [junit4]   2> 270243 INFO  (SUITE-TestSolrJErrorHandling-seed#[4B436208B3C7DB39]-worker) [    ] o.a.s.SolrTestCaseJ4 Randomized ssl (false) and clientAuth (false) via: @org.apache.solr.SolrTestCaseJ4$SuppressSSL(bugUrl=https://issues.apache.org/jira/browse/SOLR-5776)
   [junit4]   2> 270299 INFO  (SUITE-TestSolrJErrorHandling-seed#[4B436208B3C7DB39]-worker) [    ] o.a.s.SolrTestCaseJ4 ####initCore
   [junit4]   2> 270299 INFO  (SUITE-TestSolrJErrorHandling-seed#[4B436208B3C7DB39]-worker) [    ] o.a.s.SolrTestCaseJ4 ####initCore end
   [junit4]   2> 270299 INFO  (SUITE-TestSolrJErrorHandling-seed#[4B436208B3C7DB39]-worker) [    ] o.a.s.SolrTestCaseJ4 Writing core.properties file to /home/jenkins/jenkins-slave/workspace/Lucene-Solr-Tests-7.x/solr/build/solr-solrj/test/J1/temp/solr.client.solrj.TestSolrJErrorHandling_4B436208B3C7DB39-001/tempDir-002/cores/core
   [junit4]   2> 270312 INFO  (SUITE-TestSolrJErrorHandling-seed#[4B436208B3C7DB39]-worker) [    ] o.e.j.s.Server jetty-9.3.14.v20161028
   [junit4]   2> 270314 INFO  (SUITE-TestSolrJErrorHandling-seed#[4B436208B3C7DB39]-worker) [    ] o.e.j.s.h.ContextHandler Started o.e.j.s.ServletContextHandler@13ad69e3{/solr,null,AVAILABLE}
   [junit4]   2> 270350 INFO  (SUITE-TestSolrJErrorHandling-seed#[4B436208B3C7DB39]-worker) [    ] o.e.j.s.AbstractConnector Started ServerConnector@7a3f70e9{HTTP/1.1,[http/1.1]}{127.0.0.1:44393}
   [junit4]   2> 270350 INFO  (SUITE-TestSolrJErrorHandling-seed#[4B436208B3C7DB39]-worker) [    ] o.e.j.s.Server Started @278983ms
   [junit4]   2> 270350 INFO  (SUITE-TestSolrJErrorHandling-seed#[4B436208B3C7DB39]-worker) [    ] o.a.s.c.s.e.JettySolrRunner Jetty properties: {hostContext=/solr, hostPort=44393, configSetBaseDir=/home/jenkins/jenkins-slave/workspace/Lucene-Solr-Tests-7.x/solr/build/solr-solrj/test/J1/temp/solr.client.solrj.TestSolrJErrorHandling_4B436208B3C7DB39-001/tempDir-001, coreRootDirectory=/home/jenkins/jenkins-slave/workspace/Lucene-Solr-Tests-7.x/solr/build/solr-solrj/test/J1/temp/solr.client.solrj.TestSolrJErrorHandling_4B436208B3C7DB39-001/tempDir-002/cores}
   [junit4]   2> 270350 ERROR (SUITE-TestSolrJErrorHandling-seed#[4B436208B3C7DB39]-worker) [    ] o.a.s.s.StartupLoggingUtils Missing Java Option solr.log.dir. Logging may be missing or incomplete.
   [junit4]   2> 270350 INFO  (SUITE-TestSolrJErrorHandling-seed#[4B436208B3C7DB39]-worker) [    ] o.a.s.s.SolrDispatchFilter  ___      _       Welcome to Apache Solr? version 7.1.0
   [junit4]   2> 270350 INFO  (SUITE-TestSolrJErrorHandling-seed#[4B436208B3C7DB39]-worker) [    ] o.a.s.s.SolrDispatchFilter / __| ___| |_ _   Starting in standalone mode on port null
   [junit4]   2> 270350 INFO  (SUITE-TestSolrJErrorHandling-seed#[4B436208B3C7DB39]-worker) [    ] o.a.s.s.SolrDispatchFilter \__ \/ _ \ | '_|  Install dir: null, Default config dir: null
   [junit4]   2> 270350 INFO  (SUITE-TestSolrJErrorHandling-seed#[4B436208B3C7DB39]-worker) [    ] o.a.s.s.SolrDispatchFilter |___/\___/_|_|    Start time: 2017-07-15T19:05:22.654Z
   [junit4]   2> 270351 INFO  (SUITE-TestSolrJErrorHandling-seed#[4B436208B3C7DB39]-worker) [    ] o.a.s.c.SolrXmlConfig Loading container configuration from /home/jenkins/jenkins-slave/workspace/Lucene-Solr-Tests-7.x/solr/build/solr-solrj/test/J1/temp/solr.client.solrj.TestSolrJErrorHandling_4B436208B3C7DB39-001/tempDir-001/solr.xml
   [junit4]   2> 270390 INFO  (SUITE-TestSolrJErrorHandling-seed#[4B436208B3C7DB39]-worker) [    ] o.a.s.c.SolrXmlConfig MBean server found: com.sun.jmx.mbeanserver.JmxMBeanServer@403424f2, but no JMX reporters were configured - adding default JMX reporter.
   [junit4]   2> 270509 INFO  (SUITE-TestSolrJErrorHandling-seed#[4B436208B3C7DB39]-worker) [    ] o.a.s.m.r.SolrJmxReporter JMX monitoring for 'solr.node' (registry 'solr.node') enabled at server: com.sun.jmx.mbeanserver.JmxMBeanServer@403424f2
   [junit4]   2> 270525 INFO  (SUITE-TestSolrJErrorHandling-seed#[4B436208B3C7DB39]-worker) [    ] o.a.s.m.r.SolrJmxReporter JMX monitoring for 'solr.jvm' (registry 'solr.jvm') enabled at server: com.sun.jmx.mbeanserver.JmxMBeanServer@403424f2
   [junit4]   2> 270525 INFO  (SUITE-TestSolrJErrorHandling-seed#[4B436208B3C7DB39]-worker) [    ] o.a.s.m.r.SolrJmxReporter JMX monitoring for 'solr.jetty' (registry 'solr.jetty') enabled at server: com.sun.jmx.mbeanserver.JmxMBeanServer@403424f2
   [junit4]   2> 270546 INFO  (SUITE-TestSolrJErrorHandling-seed#[4B436208B3C7DB39]-worker) [    ] o.a.s.c.CorePropertiesLocator Found 1 core definitions underneath /home/jenkins/jenkins-slave/workspace/Lucene-Solr-Tests-7.x/solr/build/solr-solrj/test/J1/temp/solr.client.solrj.TestSolrJErrorHandling_4B436208B3C7DB39-001/tempDir-001
   [junit4]   2> 270546 INFO  (SUITE-TestSolrJErrorHandling-seed#[4B436208B3C7DB39]-worker) [    ] o.a.s.c.CorePropertiesLocator Cores are: [collection1]
   [junit4]   2> 270617 WARN  (coreLoadExecutor-764-thread-1) [    x:collection1] o.a.s.c.SolrConfig Couldn't add files from /home/jenkins/jenkins-slave/workspace/Lucene-Solr-Tests-7.x/solr/build/solr-solrj/test/J1/temp/solr.client.solrj.TestSolrJErrorHandling_4B436208B3C7DB39-001/tempDir-001/collection1/../../../../contrib/extraction/lib filtered by .*\.jar to classpath: /home/jenkins/jenkins-slave/workspace/Lucene-Solr-Tests-7.x/solr/build/solr-solrj/test/J1/temp/solr.client.solrj.TestSolrJErrorHandling_4B436208B3C7DB39-001/tempDir-001/collection1/../../../../contrib/extraction/lib
   [junit4]   2> 270657 WARN  (coreLoadExecutor-764-thread-1) [    x:collection1] o.a.s.c.SolrConfig Couldn't add files from /home/jenkins/jenkins-slave/workspace/Lucene-Solr-Tests-7.x/solr/build/solr-solrj/test/J1/temp/solr.client.solrj.TestSolrJErrorHandling_4B436208B3C7DB39-001/tempDir-001/collection1/../../../../dist filtered by solr-cell-\d.*\.jar to classpath: /home/jenkins/jenkins-slave/workspace/Lucene-Solr-Tests-7.x/solr/build/solr-solrj/test/J1/temp/solr.client.solrj.TestSolrJErrorHandling_4B436208B3C7DB39-001/tempDir-001/collection1/../../../../dist
   [junit4]   2> 270657 WARN  (coreLoadExecutor-764-thread-1) [    x:collection1] o.a.s.c.SolrConfig Couldn't add files from /home/jenkins/jenkins-slave/workspace/Lucene-Solr-Tests-7.x/solr/build/solr-solrj/test/J1/temp/solr.client.solrj.TestSolrJErrorHandling_4B436208B3C7DB39-001/tempDir-001/collection1/../../../../contrib/clustering/lib filtered by .*\.jar to classpath: /home/jenkins/jenkins-slave/workspace/Lucene-Solr-Tests-7.x/solr/build/solr-solrj/test/J1/temp/solr.client.solrj.TestSolrJErrorHandling_4B436208B3C7DB39-001/tempDir-001/collection1/../../../../contrib/clustering/lib
   [junit4]   2> 270657 WARN  (coreLoadExecutor-764-thread-1) [    x:collection1] o.a.s.c.SolrConfig Couldn't add files from /home/jenkins/jenkins-slave/workspace/Lucene-Solr-Tests-7.x/solr/build/solr-solrj/test/J1/temp/solr.client.solrj.TestSolrJErrorHandling_4B436208B3C7DB39-001/tempDir-001/collection1/../../../../dist filtered by solr-clustering-\d.*\.jar to classpath: /home/jenkins/jenkins-slave/workspace/Lucene-Solr-Tests-7.x/solr/build/solr-solrj/test/J1/temp/solr.client.solrj.TestSolrJErrorHandling_4B436208B3C7DB39-001/tempDir-001/collection1/../../../../dist
   [junit4]   2> 270658 WARN  (coreLoadExecutor-764-thread-1) [    x:collection1] o.a.s.c.SolrConfig Couldn't add files from /home/jenkins/jenkins-slave/workspace/Lucene-Solr-Tests-7.x/solr/build/solr-solrj/test/J1/temp/solr.client.solrj.TestSolrJErrorHandling_4B436208B3C7DB39-001/tempDir-001/collection1/../../../../contrib/langid/lib filtered by .*\.jar to classpath: /home/jenkins/jenkins-slave/workspace/Lucene-Solr-Tests-7.x/solr/build/solr-solrj/test/J1/temp/solr.client.solrj.TestSolrJErrorHandling_4B436208B3C7DB39-001/tempDir-001/collection1/../../../../contrib/langid/lib
   [junit4]   2> 270658 WARN  (coreLoadExecutor-764-thread-1) [    x:collection1] o.a.s.c.SolrConfig Couldn't add files from /home/jenkins/jenkins-slave/workspace/Lucene-Solr-Tests-7.x/solr/build/solr-solrj/test/J1/temp/solr.client.solrj.TestSolrJErrorHandling_4B436208B3C7DB39-001/tempDir-001/collection1/../../../../dist filtered by solr-langid-\d.*\.jar to classpath: /home/jenkins/jenkins-slave/workspace/Lucene-Solr-Tests-7.x/solr/build/solr-solrj/test/J1/temp/solr.client.solrj.TestSolrJErrorHandling_4B436208B3C7DB39-001/tempDir-001/collection1/../../../../dist
   [junit4]   2> 270658 WARN  (coreLoadExecutor-764-thread-1) [    x:collection1] o.a.s.c.SolrConfig Couldn't add files from /home/jenkins/jenkins-slave/workspace/Lucene-Solr-Tests-7.x/solr/build/solr-solrj/test/J1/temp/solr.client.solrj.TestSolrJErrorHandling_4B436208B3C7DB39-001/tempDir-001/collection1/../../../../contrib/ltr/lib filtered by .*\.jar to classpath: /home/jenkins/jenkins-slave/workspace/Lucene-Solr-Tests-7.x/solr/build/solr-solrj/test/J1/temp/solr.client.solrj.TestSolrJErrorHandling_4B436208B3C7DB39-001/tempDir-001/collection1/../../../../contrib/ltr/lib
   [junit4]   2> 270658 WARN  (coreLoadExecutor-764-thread-1) [    x:collection1] o.a.s.c.SolrConfig Couldn't add files from /home/jenkins/jenkins-slave/workspace/Lucene-Solr-Tests-7.x/solr/build/solr-solrj/test/J1/temp/solr.client.solrj.TestSolrJErrorHandling_4B436208B3C7DB39-001/tempDir-001/collection1/../../../../dist filtered by solr-ltr-\d.*\.jar to classpath: /home/jenkins/jenkins-slave/workspace/Lucene-Solr-Tests-7.x/solr/build/solr-solrj/test/J1/temp/solr.client.solrj.TestSolrJErrorHandling_4B436208B3C7DB39-001/tempDir-001/collection1/../../../../dist
   [junit4]   2> 270658 WARN  (coreLoadExecutor-764-thread-1) [    x:collection1] o.a.s.c.SolrConfig Couldn't add files from /home/jenkins/jenkins-slave/workspace/Lucene-Solr-Tests-7.x/solr/build/solr-solrj/test/J1/temp/solr.client.solrj.TestSolrJErrorHandling_4B436208B3C7DB39-001/tempDir-001/collection1/../../../../contrib/velocity/lib filtered by .*\.jar to classpath: /home/jenkins/jenkins-slave/workspace/Lucene-Solr-Tests-7.x/solr/build/solr-solrj/test/J1/temp/solr.client.solrj.TestSolrJErrorHandling_4B436208B3C7DB39-001/tempDir-001/collection1/../../../../contrib/velocity/lib
   [junit4]   2> 270658 WARN  (coreLoadExecutor-764-thread-1) [    x:collection1] o.a.s.c.SolrConfig Couldn't add files from /home/jenkins/jenkins-slave/workspace/Lucene-Solr-Tests-7.x/solr/build/solr-solrj/test/J1/temp/solr.client.solrj.TestSolrJErrorHandling_4B436208B3C7DB39-001/tempDir-001/collection1/../../../../dist filtered by solr-velocity-\d.*\.jar to classpath: /home/jenkins/jenkins-slave/workspace/Lucene-Solr-Tests-7.x/solr/build/solr-solrj/test/J1/temp/solr.client.solrj.TestSolrJErrorHandling_4B436208B3C7DB39-001/tempDir-001/collection1/../../../../dist
   [junit4]   2> 270690 INFO  (coreLoadExecutor-764-thread-1) [    x:collection1] o.a.s.u.SolrIndexConfig IndexWriter infoStream solr logging is enabled
   [junit4]   2> 270690 INFO  (coreLoadExecutor-764-thread-1) [    x:collection1] o.a.s.c.SolrConfig Using Lucene MatchVersion: 7.1.0
   [junit4]   2> 270785 INFO  (coreLoadExecutor-764-thread-1) [    x:collection1] o.a.s.s.IndexSchema [collection1] Schema name=example
   [junit4]   2> 271519 INFO  (coreLoadExecutor-764-thread-1) [    x:collection1] o.a.s.r.RestManager Registered ManagedResource impl org.apache.solr.rest.schema.analysis.ManagedWordSetResource for path /schema/analysis/stopwords/english
   [junit4]   2> 271519 INFO  (coreLoadExecutor-764-thread-1) [    x:collection1] o.a.s.r.RestManager Registered ManagedResource impl org.apache.solr.rest.schema.analysis.ManagedSynonymGraphFilterFactory$SynonymManager for path /schema/analysis/synonyms/english
   [junit4]   2> 271519 INFO  (coreLoadExecutor-764-thread-1) [    x:collection1] o.a.s.r.RestManager Added observer of type org.apache.solr.rest.schema.analysis.ManagedStopFilterFactory to existing ManagedResource /schema/analysis/stopwords/english
   [junit4]   2> 271519 INFO  (coreLoadExecutor-764-thread-1) [    x:collection1] o.a.s.r.RestManager Added observer of type org.apache.solr.rest.schema.analysis.ManagedSynonymGraphFilterFactory to existing ManagedResource /schema/analysis/synonyms/english
   [junit4]   2> 271520 INFO  (coreLoadExecutor-764-thread-1) [    x:collection1] o.a.s.s.IndexSchema Loaded schema example/1.6 with uniqueid field id
   [junit4]   2> 271520 INFO  (coreLoadExecutor-764-thread-1) [    x:collection1] o.a.s.r.RestManager Added observer of type org.apache.solr.rest.schema.analysis.ManagedStopFilterFactory to existing ManagedResource /schema/analysis/stopwords/english
   [junit4]   2> 271520 INFO  (coreLoadExecutor-764-thread-1) [    x:collection1] o.a.s.r.RestManager Added observer of type org.apache.solr.rest.schema.analysis.ManagedSynonymGraphFilterFactory to existing ManagedResource /schema/analysis/synonyms/english
   [junit4]   2> 271520 INFO  (coreLoadExecutor-764-thread-1) [    x:collection1] o.a.s.r.RestManager Added observer of type org.apache.solr.rest.schema.analysis.ManagedStopFilterFactory to existing ManagedResource /schema/analysis/stopwords/english
   [junit4]   2> 271520 INFO  (coreLoadExecutor-764-thread-1) [    x:collection1] o.a.s.r.RestManager Added observer of type org.apache.solr.rest.schema.analysis.ManagedSynonymGraphFilterFactory to existing ManagedResource /schema/analysis/synonyms/english
   [junit4]   2> 271750 INFO  (coreLoadExecutor-764-thread-1) [    x:collection1] o.a.s.c.CoreContainer Creating SolrCore 'collection1' using configuration from instancedir /home/jenkins/jenkins-slave/workspace/Lucene-Solr-Tests-7.x/solr/build/solr-solrj/test/J1/temp/solr.client.solrj.TestSolrJErrorHandling_4B436208B3C7DB39-001/tempDir-001/collection1, trusted=true
   [junit4]   2> 271750 INFO  (coreLoadExecutor-764-thread-1) [    x:collection1] o.a.s.m.r.SolrJmxReporter JMX monitoring for 'solr.core.collection1' (registry 'solr.core.collection1') enabled at server: com.sun.jmx.mbeanserver.JmxMBeanServer@403424f2
   [junit4]   2> 271751 INFO  (coreLoadExecutor-764-thread-1) [    x:collection1] o.a.s.c.SolrCore solr.RecoveryStrategy.Builder
   [junit4]   2> 271751 INFO  (coreLoadExecutor-764-thread-1) [    x:collection1] o.a.s.c.SolrCore [[collection1] ] Opening new SolrCore at [/home/jenkins/jenkins-slave/workspace/Lucene-Solr-Tests-7.x/solr/build/solr-solrj/test/J1/temp/solr.client.solrj.TestSolrJErrorHandling_4B436208B3C7DB39-001/tempDir-001/collection1], dataDir=[/home/jenkins/jenkins-slave/workspace/Lucene-Solr-Tests-7.x/solr/build/solr-solrj/test/J1/temp/solr.client.solrj.TestSolrJErrorHandling_4B436208B3C7DB39-001/tempDir-001/collection1/data/]
   [junit4]   2> 271801 INFO  (coreLoadExecutor-764-thread-1) [    x:collection1] o.a.s.u.LoggingInfoStream [IFD][coreLoadExecutor-764-thread-1]: init: current segments file is "segments"; deletionPolicy=org.apache.solr.core.IndexDeletionPolicyWrapper@58d89599
   [junit4]   2> 271801 INFO  (coreLoadExecutor-764-thread-1) [    x:collection1] o.a.s.u.LoggingInfoStream [IFD][coreLoadExecutor-764-thread-1]: now checkpoint "" [0 segments ; isCommit = false]
   [junit4]   2> 271801 INFO  (coreLoadExecutor-764-thread-1) [    x:collection1] o.a.s.u.LoggingInfoStream [IFD][coreLoadExecutor-764-thread-1]: 0 msec to checkpoint
   [junit4]   2> 271801 INFO  (coreLoadExecutor-764-thread-1) [    x:collection1] o.a.s.u.LoggingInfoStream [IW][coreLoadExecutor-764-thread-1]: init: create=true
   [junit4]   2> 271801 INFO  (coreLoadExecutor-764-thread-1) [    x:collection1] o.a.s.u.LoggingInfoStream [IW][coreLoadExecutor-764-thread-1]:
   [junit4]   2> dir=MockDirectoryWrapper(RAMDirectory@ac29700 lockFactory=org.apache.lucene.store.SingleInstanceLockFactory@19ac8ece)
   [junit4]   2> index=
   [junit4]   2> version=7.1.0
   [junit4]   2> analyzer=org.apache.solr.update.SolrIndexConfig$DelayedSchemaAnalyzer
   [junit4]   2> ramBufferSizeMB=100.0
   [junit4]   2> maxBufferedDocs=-1
   [junit4]   2> mergedSegmentWarmer=null
   [junit4]   2> delPolicy=org.apache.solr.core.IndexDeletionPolicyWrapper
   [junit4]   2> commit=null
   [junit4]   2> openMode=CREATE
   [junit4]   2> similarity=org.apache.solr.search.similarities.SchemaSimilarityFactory$SchemaSimilarity
   [junit4]   2> mergeScheduler=ConcurrentMergeScheduler: maxThreadCount=-1, maxMergeCount=-1, ioThrottle=true
   [junit4]   2> codec=Lucene70
   [junit4]   2> infoStream=org.apache.solr.update.LoggingInfoStream
   [junit4]   2> mergePolicy=[TieredMergePolicy: maxMergeAtOnce=10, maxMergeAtOnceExplicit=30, maxMergedSegmentMB=5120.0, floorSegmentMB=2.0, forceMergeDeletesPctAllowed=10.0, segmentsPerTier=10.0, maxCFSSegmentSizeMB=8.796093022207999E12, noCFSRatio=0.1
   [junit4]   2> indexerThreadPool=org.apache.lucene.index.DocumentsWriterPerThreadPool@24ac6952
   [junit4]   2> readerPooling=true
   [junit4]   2> perThreadHardLimitMB=1945
   [junit4]   2> useCompoundFile=false
   [junit4]   2> commitOnClose=true
   [junit4]   2> indexSort=null
   [junit4]   2> writer=org.apache.solr.update.SolrIndexWriter@3a489050
   [junit4]   2>
   [junit4]   2> 271801 INFO  (coreLoadExecutor-764-thread-1) [    x:collection1] o.a.s.u.LoggingInfoStream [IW][coreLoadExecutor-764-thread-1]: MMapDirectory.UNMAP_SUPPORTED=true
   [junit4]   2> 271801 INFO  (coreLoadExecutor-764-thread-1) [    x:collection1] o.a.s.u.LoggingInfoStream [IW][coreLoadExecutor-764-thread-1]: now flush at close
   [junit4]   2> 271801 INFO  (coreLoadExecutor-764-thread-1) [    x:collection1] o.a.s.u.LoggingInfoStream [IW][coreLoadExecutor-764-thread-1]:   start flush: applyAllDeletes=true
   [junit4]   2> 271801 INFO  (coreLoadExecutor-764-thread-1) [    x:collection1] o.a.s.u.LoggingInfoStream [IW][coreLoadExecutor-764-thread-1]:   index before flush
   [junit4]   2> 271801 INFO  (coreLoadExecutor-764-thread-1) [    x:collection1] o.a.s.u.LoggingInfoStream [DW][coreLoadExecutor-764-thread-1]: startFullFlush
   [junit4]   2> 271801 INFO  (coreLoadExecutor-764-thread-1) [    x:collection1] o.a.s.u.LoggingInfoStream [DW][coreLoadExecutor-764-thread-1]: coreLoadExecutor-764-thread-1 finishFullFlush success=true
   [junit4]   2> 271801 INFO  (coreLoadExecutor-764-thread-1) [    x:collection1] o.a.s.u.LoggingInfoStream [IW][coreLoadExecutor-764-thread-1]: now apply all deletes for all segments buffered updates bytesUsed=0 reader pool bytesUsed=0
   [junit4]   2> 271801 INFO  (coreLoadExecutor-764-thread-1) [    x:collection1] o.a.s.u.LoggingInfoStream [BD][coreLoadExecutor-764-thread-1]: waitApply: no deletes to apply
   [junit4]   2> 271801 INFO  (coreLoadExecutor-764-thread-1) [    x:collection1] o.a.s.u.LoggingInfoStream [MS][coreLoadExecutor-764-thread-1]: initDynamicDefaults spins=true maxThreadCount=1 maxMergeCount=6
   [junit4]   2> 271801 INFO  (coreLoadExecutor-764-thread-1) [    x:collection1] o.a.s.u.LoggingInfoStream [MS][coreLoadExecutor-764-thread-1]: updateMergeThreads ioThrottle=true targetMBPerSec=10240.0 MB/sec
   [junit4]   2> 271801 INFO  (coreLoadExecutor-764-thread-1) [    x:collection1] o.a.s.u.LoggingInfoStream [MS][coreLoadExecutor-764-thread-1]: now merge
   [junit4]   2> 271801 INFO  (coreLoadExecutor-764-thread-1) [    x:collection1] o.a.s.u.LoggingInfoStream [MS][coreLoadExecutor-764-thread-1]:   index:
   [junit4]   2> 271801 INFO  (coreLoadExecutor-764-thread-1) [    x:collection1] o.a.s.u.LoggingInfoStream [MS][coreLoadExecutor-764-thread-1]:   no more merges pending; now return
   [junit4]   2> 271801 INFO  (coreLoadExecutor-764-thread-1) [    x:collection1] o.a.s.u.LoggingInfoStream [IW][coreLoadExecutor-764-thread-1]: waitForMerges
   [junit4]   2> 271801 INFO  (coreLoadExecutor-764-thread-1) [    x:collection1] o.a.s.u.LoggingInfoStream [IW][coreLoadExecutor-764-thread-1]: waitForMerges done
   [junit4]   2> 271801 INFO  (coreLoadExecutor-764-thread-1) [    x:collection1] o.a.s.u.LoggingInfoStream [IW][coreLoadExecutor-764-thread-1]: commit: start
   [junit4]   2> 271801 INFO  (coreLoadExecutor-764-thread-1) [    x:collection1] o.a.s.u.LoggingInfoStream [IW][coreLoadExecutor-764-thread-1]: commit: enter lock
   [junit4]   2> 271801 INFO  (coreLoadExecutor-764-thread-1) [    x:collection1] o.a.s.u.LoggingInfoStream [IW][coreLoadExecutor-764-thread-1]: commit: now prepare
   [junit4]   2> 271801 INFO  (coreLoadExecutor-764-thread-1) [    x:collection1] o.a.s.u.LoggingInfoStream [IW][coreLoadExecutor-764-thread-1]: prepareCommit: flush
   [junit4]   2> 271801 INFO  (coreLoadExecutor-764-thread-1) [    x:collection1] o.a.s.u.LoggingInfoStream [IW][coreLoadExecutor-764-thread-1]:   index before flush
   [junit4]   2> 271801 INFO  (coreLoadExecutor-764-thread-1) [    x:collection1] o.a.s.u.LoggingInfoStream [DW][coreLoadExecutor-764-thread-1]: startFullFlush
   [junit4]   2> 271801 INFO  (coreLoadExecutor-764-thread-1) [    x:collection1] o.a.s.u.LoggingInfoStream [IW][coreLoadExecutor-764-thread-1]: now apply all deletes for all segments buffered updates bytesUsed=0 reader pool bytesUsed=0
   [junit4]   2> 271801 INFO  (coreLoadExecutor-764-thread-1) [    x:collection1] o.a.s.u.LoggingInfoStream [BD][coreLoadExecutor-764-thread-1]: waitApply: no deletes to apply
   [junit4]   2> 271801 INFO  (coreLoadExecutor-764-thread-1) [    x:collection1] o.a.s.u.LoggingInfoStream [DW][coreLoadExecutor-764-thread-1]: coreLoadExecutor-764-thread-1 finishFullFlush success=true
   [junit4]   2> 271801 INFO  (coreLoadExecutor-764-thread-1) [    x:collection1] o.a.s.u.LoggingInfoStream [IW][coreLoadExecutor-764-thread-1]: startCommit(): start
   [junit4]   2> 271801 INFO  (coreLoadExecutor-764-thread-1) [    x:collection1] o.a.s.u.LoggingInfoStream [IW][coreLoadExecutor-764-thread-1]: startCommit index= changeCount=2
   [junit4]   2> 271802 INFO  (coreLoadExecutor-764-thread-1) [    x:collection1] o.a.s.u.LoggingInfoStream [IW][coreLoadExecutor-764-thread-1]: startCommit: wrote pending segments file "pending_segments_1"
   [junit4]   2> 271802 INFO  (coreLoadExecutor-764-thread-1) [    x:collection1] o.a.s.u.LoggingInfoStream [IW][coreLoadExecutor-764-thread-1]: done all syncs: []
   [junit4]   2> 271802 INFO  (coreLoadExecutor-764-thread-1) [    x:collection1] o.a.s.u.LoggingInfoStream [IW][coreLoadExecutor-764-thread-1]: commit: pendingCommit != null
   [junit4]   2> 271802 INFO  (coreLoadExecutor-764-thread-1) [    x:collection1] o.a.s.u.LoggingInfoStream [IW][coreLoadExecutor-764-thread-1]: commit: done writing segments file "segments_1"
   [junit4]   2> 271802 INFO  (coreLoadExecutor-764-thread-1) [    x:collection1] o.a.s.u.LoggingInfoStream [IFD][coreLoadExecutor-764-thread-1]: now checkpoint "" [0 segments ; isCommit = true]
   [junit4]   2> 271802 INFO  (coreLoadExecutor-764-thread-1) [    x:collection1] o.a.s.u.LoggingInfoStream [IFD][coreLoadExecutor-764-thread-1]: 0 msec to checkpoint
   [junit4]   2> 271802 INFO  (coreLoadExecutor-764-thread-1) [    x:collection1] o.a.s.u.LoggingInfoStream [IW][coreLoadExecutor-764-thread-1]: commit: took 0.4 msec
   [junit4]   2> 271802 INFO  (coreLoadExecutor-764-thread-1) [    x:collection1] o.a.s.u.LoggingInfoStream [IW][coreLoadExecutor-764-thread-1]: commit: done
   [junit4]   2> 271802 INFO  (coreLoadExecutor-764-thread-1) [    x:collection1] o.a.s.u.LoggingInfoStream [IW][coreLoadExecutor-764-thread-1]: rollback
   [junit4]   2> 271802 INFO  (coreLoadExecutor-764-thread-1) [    x:collection1] o.a.s.u.LoggingInfoStream [IW][coreLoadExecutor-764-thread-1]: all running merges have aborted
   [junit4]   2> 271802 INFO  (coreLoadExecutor-764-thread-1) [    x:collection1] o.a.s.u.LoggingInfoStream [IW][coreLoadExecutor-764-thread-1]: rollback: done finish merges
   [junit4]   2> 271802 INFO  (coreLoadExecutor-764-thread-1) [    x:collection1] o.a.s.u.LoggingInfoStream [DW][coreLoadExecutor-764-thread-1]: abort
   [junit4]   2> 271802 INFO  (coreLoadExecutor-764-thread-1) [    x:collection1] o.a.s.u.LoggingInfoStream [DW][coreLoadExecutor-764-thread-1]: done abort success=true
   [junit4]   2> 271802 INFO  (coreLoadExecutor-764-thread-1) [    x:collection1] o.a.s.u.LoggingInfoStream [IW][coreLoadExecutor-764-thread-1]: rollback: infos=
   [junit4]   2> 271802 INFO  (coreLoadExecutor-764-thread-1) [    x:collection1] o.a.s.u.LoggingInfoStream [IFD][coreLoadExecutor-764-thread-1]: now checkpoint "" [0 segments ; isCommit = false]
   [junit4]   2> 271802 INFO  (coreLoadExecutor-764-thread-1) [    x:collection1] o.a.s.u.LoggingInfoStream [IFD][coreLoadExecutor-764-thread-1]: 0 msec to checkpoint
   [junit4]   2> 271828 INFO  (coreLoadExecutor-764-thread-1) [    x:collection1] o.a.s.r.XSLTResponseWriter xsltCacheLifetimeSeconds=5
   [junit4]   2> 272093 INFO  (coreLoadExecutor-764-thread-1) [    x:collection1] o.a.s.u.UpdateHandler Using UpdateLog implementation: org.apache.solr.update.UpdateLog
   [junit4]   2> 272093 INFO  (coreLoadExecutor-764-thread-1) [    x:collection1] o.a.s.u.UpdateLog Initializing UpdateLog: dataDir= defaultSyncLevel=FLUSH numRecordsToKeep=100 maxNumLogsToKeep=10 numVersionBuckets=65536
   [junit4]   2> 272093 INFO  (coreLoadExecutor-764-thread-1) [    x:collection1] o.a.s.u.CommitTracker Hard AutoCommit: if uncommited for 15000ms;
   [junit4]   2> 272094 INFO  (coreLoadExecutor-764-thread-1) [    x:collection1] o.a.s.u.CommitTracker Soft AutoCommit: disabled
   [junit4]   2> 272094 INFO  (coreLoadExecutor-764-thread-1) [    x:collection1] o.a.s.u.LoggingInfoStream [IFD][coreLoadExecutor-764-thread-1]: init: current segments file is "segments_1"; deletionPolicy=org.apache.solr.core.IndexDeletionPolicyWrapper@58d89599
   [junit4]   2> 272094 INFO  (coreLoadExecutor-764-thread-1) [    x:collection1] o.a.s.u.LoggingInfoStream [IFD][coreLoadExecutor-764-thread-1]: init: load commit "segments_1"
   [junit4]   2> 272094 INFO  (coreLoadExecutor-764-thread-1) [    x:collection1] o.a.s.u.LoggingInfoStream [IFD][coreLoadExecutor-764-thread-1]: now checkpoint "" [0 segments ; isCommit = false]
   [junit4]   2> 272094 INFO  (coreLoadExecutor-764-thread-1) [    x:collection1] o.a.s.u.LoggingInfoStream [IFD][coreLoadExecutor-764-thread-1]: 0 msec to checkpoint
   [junit4]   2> 272095 INFO  (coreLoadExecutor-764-thread-1) [    x:collection1] o.a.s.u.LoggingInfoStream [IW][coreLoadExecutor-764-thread-1]: init: create=false
   [junit4]   2> 272095 INFO  (coreLoadExecutor-764-thread-1) [    x:collection1] o.a.s.u.LoggingInfoStream [IW][coreLoadExecutor-764-thread-1]:
   [junit4]   2> dir=MockDirectoryWrapper(RAMDirectory@ac29700 lockFactory=org.apache.lucene.store.SingleInstanceLockFactory@19ac8ece)
   [junit4]   2> index=
   [junit4]   2> version=7.1.0
   [junit4]   2> analyzer=org.apache.solr.update.SolrIndexConfig$DelayedSchemaAnalyzer
   [junit4]   2> ramBufferSizeMB=100.0
   [junit4]   2> maxBufferedDocs=-1
   [junit4]   2> mergedSegmentWarmer=null
   [junit4]   2> delPolicy=org.apache.solr.core.IndexDeletionPolicyWrapper
   [junit4]   2> commit=null
   [junit4]   2> openMode=APPEND
   [junit4]   2> similarity=org.apache.solr.search.similarities.SchemaSimilarityFactory$SchemaSimilarity
   [junit4]   2> mergeScheduler=ConcurrentMergeScheduler: maxThreadCount=-1, maxMergeCount=-1, ioThrottle=true
   [junit4]   2> codec=Lucene70
   [junit4]   2> infoStream=org.apache.solr.update.LoggingInfoStream
   [junit4]   2> mergePolicy=[TieredMergePolicy: maxMergeAtOnce=10, maxMergeAtOnceExplicit=30, maxMergedSegmentMB=5120.0, floorSegmentMB=2.0, forceMergeDeletesPctAllowed=10.0, segmentsPerTier=10.0, maxCFSSegmentSizeMB=8.796093022207999E12, noCFSRatio=0.1
   [junit4]   2> indexerThreadPool=org.apache.lucene.index.DocumentsWriterPerThreadPool@4505ef53
   [junit4]   2> readerPooling=true
   [junit4]   2> perThreadHardLimitMB=1945
   [junit4]   2> useCompoundFile=false
   [junit4]   2> commitOnClose=true
   [junit4]   2> indexSort=null
   [junit4]   2> writer=org.apache.solr.update.SolrIndexWriter@9d747d2
   [junit4]   2>
   [junit4]   2> 272095 INFO  (coreLoadExecutor-764-thread-1) [    x:collection1] o.a.s.u.LoggingInfoStream [IW][coreLoadExecutor-764-thread-1]: MMapDirectory.UNMAP_SUPPORTED=true
   [junit4]   2> 272095 INFO  (coreLoadExecutor-764-thread-1) [    x:collection1] o.a.s.u.LoggingInfoStream [IW][coreLoadExecutor-764-thread-1]: flush at getReader
   [junit4]   2> 272095 INFO  (coreLoadExecutor-764-thread-1) [    x:collection1] o.a.s.u.LoggingInfoStream [DW][coreLoadExecutor-764-thread-1]: startFullFlush
   [junit4]   2> 272095 INFO  (coreLoadExecutor-764-thread-1) [    x:collection1] o.a.s.u.LoggingInfoStream [IW][coreLoadExecutor-764-thread-1]: now apply all deletes for all segments buffered updates bytesUsed=0 reader pool bytesUsed=0
   [junit4]   2> 272095 INFO  (coreLoadExecutor-764-thread-1) [    x:collection1] o.a.s.u.LoggingInfoStream [BD][coreLoadExecutor-764-thread-1]: waitApply: no deletes to apply
   [junit4]   2> 272095 INFO  (coreLoadExecutor-764-thread-1) [    x:collection1] o.a.s.u.LoggingInfoStream [IW][coreLoadExecutor-764-thread-1]: incRefDeleter for NRT reader version=2 segments=
   [junit4]   2> 272095 INFO  (coreLoadExecutor-764-thread-1) [    x:collection1] o.a.s.u.LoggingInfoStream [IW][coreLoadExecutor-764-thread-1]: return reader version=2 reader=StandardDirectoryReader(segments_1:2:nrt)
   [junit4]   2> 272095 INFO  (coreLoadExecutor-764-thread-1) [    x:collection1] o.a.s.u.LoggingInfoStream [DW][coreLoadExecutor-764-thread-1]: coreLoadExecutor-764-thread-1 finishFullFlush success=true
   [junit4]   2> 272095 INFO  (coreLoadExecutor-764-thread-1) [    x:collection1] o.a.s.u.LoggingInfoStream [IW][coreLoadExecutor-764-thread-1]: getReader took 0 msec
   [junit4]   2> 272095 INFO  (coreLoadExecutor-764-thread-1) [    x:collection1] o.a.s.s.SolrIndexSearcher Opening [Searcher@78e7e7cf[collection1] main]
   [junit4]   2> 272095 INFO  (coreLoadExecutor-764-thread-1) [    x:collection1] o.a.s.r.ManagedResourceStorage File-based storage initialized to use dir: /home/jenkins/jenkins-slave/workspace/Lucene-Solr-Tests-7.x/solr/build/solr-solrj/test/J1/temp/solr.client.solrj.TestSolrJErrorHandling_4B436208B3C7DB39-001/tempDir-001/collection1/conf
   [junit4]   2> 272095 INFO  (coreLoadExecutor-764-thread-1) [    x:collection1] o.a.s.r.ManagedResourceStorage Loaded LinkedHashMap at path _rest_managed.json using file:dir=/home/jenkins/jenkins-slave/workspace/Lucene-Solr-Tests-7.x/solr/build/solr-solrj/test/J1/temp/solr.client.solrj.TestSolrJErrorHandling_4B436208B3C7DB39-001/tempDir-001/collection1/conf
   [junit4]   2> 272095 INFO  (coreLoadExecutor-764-thread-1) [    x:collection1] o.a.s.r.ManagedResource Loaded initArgs {} for /rest/managed
   [junit4]   2> 272096 INFO  (coreLoadExecutor-764-thread-1) [    x:collection1] o.a.s.r.ManagedResourceStorage Loaded LinkedHashMap at path _schema_analysis_stopwords_english.json using file:dir=/home/jenkins/jenkins-slave/workspace/Lucene-Solr-Tests-7.x/solr/build/solr-solrj/test/J1/temp/solr.client.solrj.TestSolrJErrorHandling_4B436208B3C7DB39-001/tempDir-001/collection1/conf
   [junit4]   2> 272096 INFO  (coreLoadExecutor-764-thread-1) [    x:collection1] o.a.s.r.ManagedResource Loaded initArgs {ignoreCase=true} for /schema/analysis/stopwords/english
   [junit4]   2> 272096 INFO  (coreLoadExecutor-764-thread-1) [    x:collection1] o.a.s.r.s.a.ManagedWordSetResource Loaded 35 words for /schema/analysis/stopwords/english
   [junit4]   2> 272096 INFO  (coreLoadExecutor-764-thread-1) [    x:collection1] o.a.s.r.ManagedResource Notified 4 observers of /schema/analysis/stopwords/english
   [junit4]   2> 272096 INFO  (coreLoadExecutor-764-thread-1) [    x:collection1] o.a.s.r.ManagedResourceStorage Loaded LinkedHashMap at path _schema_analysis_synonyms_english.json using file:dir=/home/jenkins/jenkins-slave/workspace/Lucene-Solr-Tests-7.x/solr/build/solr-solrj/test/J1/temp/solr.client.solrj.TestSolrJErrorHandling_4B436208B3C7DB39-001/tempDir-001/collection1/conf
   [junit4]   2> 272096 INFO  (coreLoadExecutor-764-thread-1) [    x:collection1] o.a.s.r.ManagedResource Loaded initArgs {ignoreCase=true,format=solr} for /schema/analysis/synonyms/english
   [junit4]   2> 272096 INFO  (coreLoadExecutor-764-thread-1) [    x:collection1] o.a.s.r.s.a.ManagedSynonymGraphFilterFactory Loaded 3 synonym mappings for /schema/analysis/synonyms/english
   [junit4]   2> 272129 INFO  (coreLoadExecutor-764-thread-1) [    x:collection1] o.a.s.r.ManagedResource Notified 4 observers of /schema/analysis/synonyms/english
   [junit4]   2> 272130 INFO  (coreLoadExecutor-764-thread-1) [    x:collection1] o.a.s.h.c.SpellCheckComponent Initializing spell checkers
   [junit4]   2> 272130 INFO  (coreLoadExecutor-764-thread-1) [    x:collection1] o.a.s.s.DirectSolrSpellChecker init: {name=default,field=text,classname=solr.DirectSolrSpellChecker,distanceMeasure=internal,accuracy=0.5,maxEdits=2,minPrefix=1,maxInspections=5,minQueryLength=4,maxQueryFrequency=0.01}
   [junit4]   2> 272130 INFO  (coreLoadExecutor-764-thread-1) [    x:collection1] o.a.s.h.c.SuggestComponent Initializing SuggestComponent
   [junit4]   2> 272130 INFO  (coreLoadExecutor-764-thread-1) [    x:collection1] o.a.s.s.s.SolrSuggester init: {name=mySuggester,lookupImpl=FuzzyLookupFactory,dictionaryImpl=DocumentDictionaryFactory,field=cat,weightField=price,suggestAnalyzerFieldType=string,buildOnStartup=false}
   [junit4]   2> 272130 INFO  (coreLoadExecutor-764-thread-1) [    x:collection1] o.a.s.s.s.SolrSuggester Dictionary loaded with params: {name=mySuggester,lookupImpl=FuzzyLookupFactory,dictionaryImpl=DocumentDictionaryFactory,field=cat,weightField=price,suggestAnalyzerFieldType=string,buildOnStartup=false}
   [junit4]   2> 272130 INFO  (coreLoadExecutor-764-thread-1) [    x:collection1] o.a.s.h.c.QueryElevationComponent Loading QueryElevation from: /home/jenkins/jenkins-slave/workspace/Lucene-Solr-Tests-7.x/solr/build/solr-solrj/test/J1/temp/solr.client.solrj.TestSolrJErrorHandling_4B436208B3C7DB39-001/tempDir-001/collection1/conf/elevate.xml
   [junit4]   2> 272187 INFO  (coreLoadExecutor-764-thread-1) [    x:collection1] o.a.s.h.ReplicationHandler Commits will be reserved for  10000
   [junit4]   2> 272187 INFO  (searcherExecutor-765-thread-1-processing-x:collection1) [    x:collection1] o.a.s.c.QuerySenderListener QuerySenderListener sending requests to Searcher@78e7e7cf[collection1] main{ExitableDirectoryReader(UninvertingDirectoryReader())}
   [junit4]   2> 272188 INFO  (searcherExecutor-765-thread-1-processing-x:collection1) [    x:collection1] o.a.s.c.S.Request [collection1]  webapp=null path=null params={q=static+firstSearcher+warming+in+solrconfig.xml&distrib=false&event=firstSearcher} hits=0 status=0 QTime=0
   [junit4]   2> 272188 INFO  (searcherExecutor-765-thread-1-processing-x:collection1) [    x:collection1] o.a.s.c.QuerySenderListener QuerySenderListener done.
   [junit4]   2> 272188 INFO  (searcherExecutor-765-thread-1-processing-x:collection1) [    x:collection1] o.a.s.h.c.SpellCheckComponent Loading spell index for spellchecker: default
   [junit4]   2> 272188 INFO  (searcherExecutor-765-thread-1-processing-x:collection1) [    x:collection1] o.a.s.h.c.SpellCheckComponent Loading spell index for spellchecker: wordbreak
   [junit4]   2> 272189 INFO  (searcherExecutor-765-thread-1-processing-x:collection1) [    x:collection1] o.a.s.c.SolrCore [collection1] Registered new searcher Searcher@78e7e7cf[collection1] main{ExitableDirectoryReader(UninvertingDirectoryReader())}
   [junit4]   2> 272190 INFO  (coreLoadExecutor-764-thread-1) [    x:collection1] o.a.s.u.UpdateLog Could not find max version in index or recent updates, using new clock 1573016593491820544
   [junit4]   2> 272649 INFO  (SUITE-TestSolrJErrorHandling-seed#[4B436208B3C7DB39]-worker) [    ] o.a.s.SolrJettyTestBase Jetty Assigned Port#44393
   [junit4]   2> 272684 INFO  (TEST-TestSolrJErrorHandling.testWithXml-seed#[4B436208B3C7DB39]) [    ] o.a.s.SolrTestCaseJ4 ###Starting testWithXml
   [junit4]   2> 272761 INFO  (qtp1829491958-1600) [    x:collection1] o.a.s.u.LoggingInfoStream [DW][qtp1829491958-1600]: anyChanges? numDocsInRam=0 deletes=true hasTickets:false pendingChangesInFullFlush: false
   [junit4]   2> 272761 INFO  (qtp1829491958-1600) [    x:collection1] o.a.s.u.LoggingInfoStream [DW][qtp1829491958-1600]: anyChanges? numDocsInRam=0 deletes=true hasTickets:false pendingChangesInFullFlush: false
   [junit4]   2> 272761 INFO  (qtp1829491958-1600) [    x:collection1] o.a.s.u.LoggingInfoStream [IW][qtp1829491958-1600]: nrtIsCurrent: infoVersion matches: true; DW changes: true; BD changes: false
   [junit4]   2> 272761 INFO  (qtp1829491958-1600) [    x:collection1] o.a.s.u.LoggingInfoStream [IW][qtp1829491958-1600]: flush at getReader
   [junit4]   2> 272761 INFO  (qtp1829491958-1600) [    x:collection1] o.a.s.u.LoggingInfoStream [DW][qtp1829491958-1600]: startFullFlush
   [junit4]   2> 272761 INFO  (qtp1829491958-1600) [    x:collection1] o.a.s.u.LoggingInfoStream [DW][qtp1829491958-1600]: anyChanges? numDocsInRam=0 deletes=true hasTickets:false pendingChangesInFullFlush: false
   [junit4]   2> 272762 INFO  (qtp1829491958-1600) [    x:collection1] o.a.s.u.LoggingInfoStream [DW][qtp1829491958-1600]: qtp1829491958-1600: flush naked frozen global deletes
   [junit4]   2> 272762 INFO  (qtp1829491958-1600) [    x:collection1] o.a.s.u.LoggingInfoStream [BD][qtp1829491958-1600]: compressed 76 to 48 bytes (63.16%) for deletes/updates; private segment null
   [junit4]   2> 272762 INFO  (qtp1829491958-1600) [    x:collection1] o.a.s.u.LoggingInfoStream [BD][qtp1829491958-1600]: push new packet (delGen=1 numDeleteQuerys=1 bytesUsed=48), packetCount=1, bytesUsed=0.000 MB
   [junit4]   2> 272762 INFO  (qtp1829491958-1600) [    x:collection1] o.a.s.u.LoggingInfoStream [DW][qtp1829491958-1600]: flush: push buffered updates: delGen=1 numDeleteQuerys=1 bytesUsed=48
   [junit4]   2> 272762 INFO  (qtp1829491958-1600) [    x:collection1] o.a.s.u.LoggingInfoStream [BD][qtp1829491958-1600]: packet matches no segments
   [junit4]   2> 272762 INFO  (qtp1829491958-1600) [    x:collection1] o.a.s.u.LoggingInfoStream [BD][qtp1829491958-1600]: finished packet delGen=1 now completedDelGen=1
   [junit4]   2> 272762 INFO  (qtp1829491958-1600) [    x:collection1] o.a.s.u.LoggingInfoStream [BD][qtp1829491958-1600]: done apply del packet (delGen=1 numDeleteQuerys=1 bytesUsed=48) to 0 segments; 0 new deletes/updates; took 0.000 sec; 0 packets remain
   [junit4]   2> 272762 INFO  (qtp1829491958-1600) [    x:collection1] o.a.s.u.LoggingInfoStream [IW][qtp1829491958-1600]: now apply all deletes for all segments buffered updates bytesUsed=0 reader pool bytesUsed=0
   [junit4]   2> 272762 INFO  (qtp1829491958-1600) [    x:collection1] o.a.s.u.LoggingInfoStream [BD][qtp1829491958-1600]: waitApply: no deletes to apply
   [junit4]   2> 272762 INFO  (qtp1829491958-1600) [    x:collection1] o.a.s.u.LoggingInfoStream [IW][qtp1829491958-1600]: incRefDeleter for NRT reader version=2 segments=
   [junit4]   2> 272762 INFO  (qtp1829491958-1600) [    x:collection1] o.a.s.u.LoggingInfoStream [IW][qtp1829491958-1600]: return reader version=2 reader=StandardDirectoryReader(segments_1:2:nrt)
   [junit4]   2> 272762 INFO  (qtp1829491958-1600) [    x:collection1] o.a.s.u.LoggingInfoStream [DW][qtp1829491958-1600]: qtp1829491958-1600 finishFullFlush success=true
   [junit4]   2> 272762 INFO  (qtp1829491958-1600) [    x:collection1] o.a.s.u.LoggingInfoStream [IW][qtp1829491958-1600]: getReader took 1 msec
   [junit4]   2> 272762 INFO  (qtp1829491958-1600) [    x:collection1] o.a.s.u.LoggingInfoStream [IW][qtp1829491958-1600]: decRefDeleter for NRT reader version=2 segments=
   [junit4]   2> 272772 INFO  (qtp1829491958-1600) [    x:collection1] o.a.s.u.p.LogUpdateProcessorFactory [collection1]  webapp=/solr path=/update params={wt=javabin&version=2}{deleteByQuery=*:* (-1573016594089508864)} 0 12
   [junit4]   2> 272773 INFO  (qtp1829491958-1601) [    x:collection1] o.a.s.u.LoggingInfoStream [DW][qtp1829491958-1601]: anyChanges? numDocsInRam=0 deletes=true hasTickets:false pendingChangesInFullFlush: false
   [junit4]   2> 272773 INFO  (qtp1829491958-1601) [    x:collection1] o.a.s.u.LoggingInfoStream [DW][qtp1829491958-1601]: anyChanges? numDocsInRam=0 deletes=true hasTickets:false pendingChangesInFullFlush: false
   [junit4]   2> 272773 INFO  (qtp1829491958-1601) [    x:collection1] o.a.s.u.LoggingInfoStream [IW][qtp1829491958-1601]: nrtIsCurrent: infoVersion matches: true; DW changes: true; BD changes: false
   [junit4]   2> 272773 INFO  (qtp1829491958-1601) [    x:collection1] o.a.s.u.LoggingInfoStream [IW][qtp1829491958-1601]: flush at getReader
   [junit4]   2> 272773 INFO  (qtp1829491958-1601) [    x:collection1] o.a.s.u.LoggingInfoStream [DW][qtp1829491958-1601]: startFullFlush
   [junit4]   2> 272773 INFO  (qtp1829491958-1601) [    x:collection1] o.a.s.u.LoggingInfoStream [DW][qtp1829491958-1601]: anyChanges? numDocsInRam=0 deletes=true hasTickets:false pendingChangesInFullFlush: false
   [junit4]   2> 272773 INFO  (qtp1829491958-1601) [    x:collection1] o.a.s.u.LoggingInfoStream [DW][qtp1829491958-1601]: qtp1829491958-1601: flush naked frozen global deletes
   [junit4]   2> 272773 INFO  (qtp1829491958-1601) [    x:collection1] o.a.s.u.LoggingInfoStream [BD][qtp1829491958-1601]: compressed 76 to 48 bytes (63.16%) for deletes/updates; private segment null
   [junit4]   2> 272773 INFO  (qtp1829491958-1601) [    x:collection1] o.a.s.u.LoggingInfoStream [BD][qtp1829491958-1601]: push new packet (delGen=2 numDeleteQuerys=1 bytesUsed=48), packetCount=1, bytesUsed=0.000 MB
   [junit4]   2> 272773 INFO  (qtp1829491958-1601) [    x:collection1] o.a.s.u.LoggingInfoStream [DW][qtp1829491958-1601]: flush: push buffered updates: delGen=2 numDeleteQuerys=1 bytesUsed=48
   [junit4]   2> 272774 INFO  (qtp1829491958-1601) [    x:collection1] o.a.s.u.LoggingInfoStream [BD][qtp1829491958-1601]: packet matches no segments
   [junit4]   2> 272808 INFO  (qtp1829491958-1601) [    x:collection1] o.a.s.u.LoggingInfoStream [BD][qtp1829491958-1601]: finished packet delGen=2 now completedDelGen=2
   [junit4]   2> 272808 INFO  (qtp1829491958-1601) [    x:collection1] o.a.s.u.LoggingInfoStream [BD][qtp1829491958-1601]: done apply del packet (delGen=2 numDeleteQuerys=1 bytesUsed=48) to 0 segments; 0 new deletes/updates; took 0.034 sec; 0 packets remain
   [junit4]   2> 272808 INFO  (qtp1829491958-1601) [    x:collection1] o.a.s.u.LoggingInfoStream [IW][qtp1829491958-1601]: now apply all deletes for all segments buffered updates bytesUsed=0 reader pool bytesUsed=0
   [junit4]   2> 272808 INFO  (qtp1829491958-1601) [    x:collection1] o.a.s.u.LoggingInfoStream [BD][qtp1829491958-1601]: waitApply: no deletes to apply
   [junit4]   2> 272808 INFO  (qtp1829491958-1601) [    x:collection1] o.a.s.u.LoggingInfoStream [IW][qtp1829491958-1601]: incRefDeleter for NRT reader version=2 segments=
   [junit4]   2> 272808 INFO  (qtp1829491958-1601) [    x:collection1] o.a.s.u.LoggingInfoStream [IW][qtp1829491958-1601]: return reader version=2 reader=StandardDirectoryReader(segments_1:2:nrt)
   [junit4]   2> 272808 INFO  (qtp1829491958-1601) [    x:collection1] o.a.s.u.LoggingInfoStream [DW][qtp1829491958-1601]: qtp1829491958-1601 finishFullFlush success=true
   [junit4]   2> 272808 INFO  (qtp1829491958-1601) [    x:collection1] o.a.s.u.LoggingInfoStream [IW][qtp1829491958-1601]: getReader took 35 msec
   [junit4]   2> 272808 INFO  (qtp1829491958-1601) [    x:collection1] o.a.s.u.LoggingInfoStream [IW][qtp1829491958-1601]: decRefDeleter for NRT reader version=2 segments=
   [junit4]   2> 272808 INFO  (qtp1829491958-1601) [    x:collection1] o.a.s.u.p.LogUpdateProcessorFactory [collection1]  webapp=/solr path=/update params={wt=javabin&version=2}{deleteByQuery=*:* (-1573016594103140352)} 0 35
   [junit4]   2> 273103 INFO  (qtp1829491958-1602) [    x:collection1] o.a.s.u.p.LogUpdateProcessorFactory [collection1]  webapp=/solr path=/update params={wt=javabin&version=2}{add=[test (1573016594238406656)]} 0 201
   [junit4]   2> 273103 INFO  (qtp1829491958-1602) [    x:collection1] o.a.s.h.RequestHandlerBase Ignoring exception matching ignore_exception
   [junit4]   2> 273163 INFO  (qtp1829491958-1627) [    x:collection1] o.a.s.u.p.LogUpdateProcessorFactory [collection1]  webapp=/solr path=/update params={wt=javabin&version=2}{add=[test (1573016594456510464)]} 0 53
   [junit4]   2> 273163 INFO  (qtp1829491958-1627) [    x:collection1] o.a.s.h.RequestHandlerBase Ignoring exception matching ignore_exception
   [junit4]   2> 273182 INFO  (qtp1829491958-1626) [    x:collection1] o.a.s.u.p.LogUpdateProcessorFactory [collection1]  webapp=/solr path=/update params={wt=javabin&version=2}{add=[test (1573016594532007936)]} 0 93
   [junit4]   2> 273183 INFO  (qtp1829491958-1626) [    x:collection1] o.a.s.h.RequestHandlerBase Ignoring exception matching ignore_exception
   [junit4]   2> 273199 INFO  (qtp1829491958-1601) [    x:collection1] o.a.s.u.p.LogUpdateProcessorFactory [collection1]  webapp=/solr path=/update params={wt=javabin&version=2}{add=[test (1573016594548785152)]} 0 110
   [junit4]   2> 273199 INFO  (qtp1829491958-1601) [    x:collection1] o.a.s.h.RequestHandlerBase Ignoring exception matching ignore_exception
   [junit4]   2> 273219 INFO  (qtp1829491958-1600) [    x:collection1] o.a.s.u.p.LogUpdateProcessorFactory [collection1]  webapp=/solr path=/update params={wt=javabin&version=2}{add=[test (1573016594570805248)]} 0 146
   [junit4]   2> 273219 INFO  (qtp1829491958-1600) [    x:collection1] o.a.s.h.RequestHandlerBase Ignoring exception matching ignore_exception
   [junit4]   2> 273235 INFO  (qtp1829491958-1597) [    x:collection1] o.a.s.u.p.LogUpdateProcessorFactory [collection1]  webapp=/solr path=/update params={wt=javabin&version=2}{add=[test (1573016594587582464)]} 0 162
   [junit4]   2> 273235 INFO  (qtp1829491958-1597) [    x:collection1] o.a.s.h.RequestHandlerBase Ignoring exception matching ignore_exception
   [junit4]   2> 273239 INFO  (qtp1829491958-1603) [    x:collection1] o.a.s.u.p.LogUpdateProcessorFactory [collection1]  webapp=/solr path=/update params={wt=javabin&version=2}{add=[test (1573016594591776768)]} 0 174
   [junit4]   2> 273239 INFO  (qtp1829491958-1603) [    x:collection1] o.a.s.h.RequestHandlerBase Ignoring exception matching ignore_exception
   [junit4]   2> 273251 INFO  (qtp1829491958-1598) [    x:collection1] o.a.s.u.p.LogUpdateProcessorFactory [collection1]  webapp=/solr path=/update params={wt=javabin&version=2}{add=[test (1573016594604359680)]} 0 298
   [junit4]   2> 273251 INFO  (qtp1829491958-1598) [    x:collection1] o.a.s.h.RequestHandlerBase Ignoring exception matching ignore_exception
   [junit4]   2> 273634 INFO  (qtp1829491958-1604) [    x:collection1] o.a.s.u.p.LogUpdateProcessorFactory [collection1]  webapp=/solr path=/update params={wt=javabin&version=2}{add=[test (1573016595005964288)]} 0 0
   [junit4]   2> 273634 INFO  (qtp1829491958-1604) [    x:collection1] o.a.s.h.RequestHandlerBase Ignoring exception matching ignore_exception
   [junit4]   2> 273802 INFO  (qtp1829491958-1628) [    x:collection1] o.a.s.u.p.LogUpdateProcessorFactory [collection1]  webapp=/solr path=/update params={wt=javabin&version=2}{add=[test (1573016595182125056)]} 0 0
   [junit4]   2> 273803 INFO  (qtp1829491958-1628) [    x:collection1] o.a.s.h.RequestHandlerBase Ignoring exception matching ignore_exception
   [junit4]   2> 273817 INFO  (qtp1829491958-1631) [    x:collection1] o.a.s.u.p.LogUpdateProcessorFactory [collection1]  webapp=/solr path=/update params={wt=javabin&version=2}{add=[test (1573016595197853696)]} 0 0
   [junit4]   2> 273817 INFO  (qtp1829491958-1631) [    x:collection1] o.a.s.h.RequestHandlerBase Ignoring exception matching ignore_exception
   [junit4]   2> 273955 INFO  (qtp1829491958-1627) [    x:collection1] o.a.s.u.p.LogUpdateProcessorFactory [collection1]  webapp=/solr path=/update params={wt=javabin&version=2}{add=[test (1573016595342557184)]} 0 0
   [junit4]   2> 273955 INFO  (qtp1829491958-1627) [    x:collection1] o.a.s.h.RequestHandlerBase Ignoring exception matching ignore_exception
   [junit4]   2> 273972 INFO  (qtp1829491958-1602) [    x:collection1] o.a.s.u.p.LogUpdateProcessorFactory [collection1]  webapp=/solr path=/update params={wt=javabin&version=2}{add=[test (1573016595360382976)]} 0 0
   [junit4]   2> 274064 INFO  (qtp1829491958-1602) [    x:collection1] o.a.s.h.RequestHandlerBase Ignoring exception matching ignore_exception
   [junit4]   2> 274138 INFO  (qtp1829491958-1632) [    x:collection1] o.a.s.u.p.LogUpdateProcessorFactory [collection1]  webapp=/solr path=/update params={wt=javabin&version=2}{add=[test (1573016595534446592)]} 0 0
   [junit4]   2> 274138 INFO  (qtp1829491958-1632) [    x:collection1] o.a.s.h.RequestHandlerBase Ignoring exception matching ignore_exception
   [junit4]   2> 274223 INFO  (qtp1829491958-1601) [    x:collection1] o.a.s.u.p.LogUpdateProcessorFactory [collection1]  webapp=/solr path=/update params={wt=javabin&version=2}{add=[test (1573016595568001024)]} 0 53
   [junit4]   2> 274223 INFO  (qtp1829491958-1601) [    x:collection1] o.a.s.h.RequestHandlerBase Ignoring exception matching ignore_exception
   [junit4]   2> 274234 INFO  (qtp1829491958-1597) [    x:collection1] o.a.s.u.p.LogUpdateProcessorFactory [collection1]  webapp=/solr path=/update params={wt=javabin&version=2}{add=[test (1573016595634061312)]} 0 0
   [junit4]   2> 274234 INFO  (qtp1829491958-1597) [    x:collection1] o.a.s.h.RequestHandlerBase Ignoring exception matching ignore_exception
   [junit4]   2> 274321 INFO  (qtp1829491958-1598) [    x:collection1] o.a.s.u.p.LogUpdateProcessorFactory [collection1]  webapp=/solr path=/update params={wt=javabin&version=2}{add=[test (1573016595726336000)]} 0 0
   [junit4]   2> 274321 INFO  (qtp1829491958-1598) [    x:collection1] o.a.s.h.RequestHandlerBase Ignoring exception matching ignore_exception
   [junit4]   2> 274425 INFO  (qtp1829491958-1630) [    x:collection1] o.a.s.u.p.LogUpdateProcessorFactory [collection1]  webapp=/solr path=/update params={wt=javabin&version=2}{add=[test (1573016595834339328)]} 0 0
   [junit4]   2> 274425 INFO  (qtp1829491958-1630) [    x:collection1] o.a.s.h.RequestHandlerBase Ignoring exception matching ignore_exception
   [junit4]   2> 274665 INFO  (qtp1829491958-1603) [    x:collection1] o.a.s.u.p.LogUpdateProcessorFactory [collection1]  webapp=/solr path=/update params={wt=javabin&version=2}{add=[test (1573016596087046144)]} 0 0
   [junit4]   2> 274666 INFO  (qtp1829491958-1603) [    x:collection1] o.a.s.h.RequestHandlerBase Ignoring exception matching ignore_exception
   [junit4]   2> 274701 INFO  (qtp1829491958-1604) [    x:collection1] o.a.s.u.p.LogUpdateProcessorFactory [collection1]  webapp=/solr path=/update params={wt=javabin&version=2}{add=[test (1573016596124794880)]} 0 0
   [junit4]   2> 274702 INFO  (qtp1829491958-1604) [    x:collection1] o.a.s.h.RequestHandlerBase Ignoring exception matching ignore_exception
   [junit4]   2> 274735 INFO  (qtp1829491958-1601) [    x:collection1] o.a.s.u.p.LogUpdateProcessorFactory [collection1]  webapp=/solr path=/update params={wt=javabin&version=2}{add=[test (1573016596160446464)]} 0 0
   [junit4]   2> 274736 INFO  (qtp1829491958-1601) [    x:collection1] o.a.s.h.RequestHandlerBase Ignoring exception matching ignore_exception
   [junit4]   2> 274743 INFO  (qtp1829491958-1632) [    x:collection1] o.a.s.u.p.LogUpdateProcessorFactory [collection1]  webapp=/solr path=/update params={wt=javabin&version=2}{add=[test (1573016596168835072)]} 0 0
   [junit4]   2> 274744 INFO  (qtp1829491958-1632) [    x:collection1] o.a.s.h.RequestHandlerBase Ignoring exception matching ignore_exception
   [junit4]   2> 274854 INFO  (qtp1829491958-1626) [    x:collection1] o.a.s.u.p.LogUpdateProcessorFactory [collection1]  webapp=/solr path=/update params={wt=javabin&version=2}{add=[test (1573016596284178432)]} 0 0
   [junit4]   2> 274854 INFO  (qtp1829491958-1626) [    x:collection1] o.a.s.h.RequestHandlerBase Ignoring exception matching ignore_exception
   [junit4]   2> 274899 INFO  (qtp1829491958-1631) [    x:collection1] o.a.s.u.p.LogUpdateProcessorFactory [collection1]  webapp=/solr path=/update params={wt=javabin&version=2}{add=[test (1573016596331364352)]} 0 0
   [junit4]   2> 274899 INFO  (qtp1829491958-1631) [    x:collection1] o.a.s.h.RequestHandlerBase Ignoring exception matching ignore_exception
   [junit4]   2> 274929 INFO  (qtp1829491958-1597) [    x:collection1] o.a.s.u.p.LogUpdateProcessorFactory [collection1]  webapp=/solr path=/update params={wt=javabin&version=2}{add=[test (1573016596363870208)]} 0 0
   [junit4]   2> 274929 INFO  (qtp1829491958-1597) [    x:collection1] o.a.s.h.RequestHandlerBase Ignoring exception matching ignore_exception
   [junit4]   2> 274967 INFO  (qtp1829491958-1602) [    x:collection1] o.a.s.u.p.LogUpdateProcessorFactory [collection1]  webapp=/solr path=/update params={wt=javabin&version=2}{add=[test (1573016596402667520)]} 0 0
   [junit4]   2> 275015 INFO  (qtp1829491958-1602) [    x:collection1] o.a.s.h.RequestHandlerBase Ignoring exception matching ignore_exception
   [junit4]   2> 275082 INFO  (qtp1829491958-1600) [    x:collection1] o.a.s.u.p.LogUpdateProcessorFactory [collection1]  webapp=/solr path=/update params={wt=javabin&version=2}{add=[test (1573016596523253760)]} 0 0
   [junit4]   2> 275082 INFO  (qtp1829491958-1627) [    x:collection1] o.a.s.u.p.LogUpdateProcessorFactory [collection1]  webapp=/solr path=/update params={wt=javabin&version=2}{add=[test (1573016596524302337)]} 0 0
   [junit4]   2> 275082 INFO  (qtp1829491958-1600) [    x:collection1] o.a.s.h.RequestHandlerBase Ignoring exception matching ignore_exception
   [junit4]   2> 275082 INFO  (qtp1829491958-1627) [    x:collection1] o.a.s.h.RequestHandlerBase Ignoring exception matching ignore_exception
   [junit4]   2> 275118 INFO  (qtp1829491958-1628) [    x:collection1] o.a.s.u.p.LogUpdateProcessorFactory [collection1]  webapp=/solr path=/update params={wt=javabin&version=2}{add=[test (1573016596562051072)]} 0 0
   [junit4]   2> 275118 INFO  (qtp1829491958-1628) [    x:collection1] o.a.s.h.RequestHandlerBase Ignoring exception matching ignore_exception
   [junit4]   2> 275438 INFO  (qtp1829491958-1632) [    x:collection1] o.a.s.u.p.LogUpdateProcessorFactory [collection1]  webapp=/solr path=/update params={wt=javabin&version=2}{add=[test (1573016596846215168)]} 0 49
   [junit4]   2> 275438 INFO  (qtp1829491958-1632) [    x:collection1] o.a.s.h.RequestHandlerBase Ignoring exception matching ignore_exception
   [junit4]   2> 275490 INFO  (qtp1829491958-1601) [    x:collection1] o.a.s.u.p.LogUpdateProcessorFactory [collection1]  webapp=/solr path=/update params={wt=javabin&version=2}{add=[test (1573016596952121344)]} 0 0
   [junit4]   2> 275491 INFO  (qtp1829491958-1601) [    x:collection1] o.a.s.h.RequestHandlerBase Ignoring exception matching ignore_exception
   [junit4]   2> 275979 INFO  (qtp1829491958-1601) [    x:collection1] o.a.s.u.p.LogUpdateProcessorFactory [collection1]  webapp=/solr path=/update params={wt=javabin&version=2}{add=[test (1573016597391474688)]} 0 69
   [junit4]   2> 275979 INFO  (qtp1829491958-1601) [    x:collection1] o.a.s.h.RequestHandlerBase Ignoring exception matching ignore_exception
   [junit4]   2> 275995 INFO  (qtp1829491958-1632) [    x:collection1] o.a.s.u.p.LogUpdateProcessorFactory [collection1]  webapp=/solr path=/update params={wt=javabin&version=2}{add=[test (1573016597480603648)]} 0 0
   [junit4]   2> 276081 INFO  (qtp1829491958-1632) [    x:collection1] o.a.s.h.RequestHandlerBase Ignoring exception matching ignore_exception
   [junit4]   2> 276191 INFO  (qtp1829491958-1631) [    x:collection1] o.a.s.u.p.LogUpdateProcessorFactory [collection1]  webapp=/solr path=/update params={wt=javabin&version=2}{add=[test (1573016597687173120)]} 0 0
   [junit4]   2> 276191 INFO  (qtp1829491958-1631) [    x:collection1] o.a.s.h.RequestHandlerBase Ignoring exception matching ignore_exception
   [junit4]   2> 276264 INFO  (qtp1829491958-1630) [    x:collection1] o.a.s.u.p.LogUpdateProcessorFactory [collection1]  webapp=/solr path=/update params={wt=javabin&version=2}{add=[test (1573016597763719168)]} 0 0
   [junit4]   2> 276264 INFO  (qtp1829491958-1630) [    x:collection1] o.a.s.h.RequestHandlerBase Ignoring exception matching ignore_exception
   [junit4]   2> 276276 INFO  (qtp1829491958-1626) [    x:collection1] o.a.s.u.p.LogUpdateProcessorFactory [collection1]  webapp=/solr path=/update params={wt=javabin&version=2}{add=[test (1573016597776302080)]} 0 0
   [junit4]   2> 276276 INFO  (qtp1829491958-1626) [    x:collection1] o.a.s.h.RequestHandlerBase Ignoring exception matching ignore_exception
   [junit4]   2> 276288 INFO  (qtp1829491958-1600) [    x:collection1] o.a.s.u.p.LogUpdateProcessorFactory [collection1]  webapp=/solr path=/update params={wt=javabin&version=2}{add=[test (1573016597788884992)]} 0 0
   [junit4]   2> 276288 INFO  (qtp1829491958-1600) [    x:collection1] o.a.s.h.RequestHandlerBase Ignoring exception matching ignore_exception
   [junit4]   2> 276310 INFO  (qtp1829491958-1604) [    x:collection1] o.a.s.u.p.LogUpdateProcessorFactory [collection1]  webapp=/solr path=/update params={wt=javabin&version=2}{add=[test (1573016597810905088)]} 0 0
   [junit4]   2> 276310 INFO  (qtp1829491958-1604) [    x:collection1] o.a.s.h.RequestHandlerBase Ignoring exception matching ignore_exception
   [junit4]   2> 276401 INFO  (qtp1829491958-1603) [    x:collection1] o.a.s.u.p.LogUpdateProcessorFactory [collection1]  webapp=/solr path=/update params={wt=javabin&version=2}{add=[test (1573016597906325504)]} 0 0
   [junit4]   2> 276401 INFO  (qtp1829491958-1603) [    x:collection1] o.a.s.h.RequestHandlerBase Ignoring exception matching ignore_exception
   [junit4]   2> 276714 INFO  (qtp1829491958-1597) [    x:collection1] o.a.s.u.p.LogUpdateProcessorFactory [collection1]  webapp=/solr path=/update params={wt=javabin&version=2}{add=[test (1573016598235578368)]} 0 0
   [junit4]   2> 276714 INFO  (qtp1829491958-1597) [    x:collection1] o.a.s.h.RequestHandlerBase Ignoring exception matching ignore_exception
   [junit4]   2> 276760 INFO  (qtp1829491958-1627) [    x:collection1] o.a.s.u.p.LogUpdateProcessorFactory [collection1]  webapp=/solr path=/update params={wt=javabin&version=2}{add=[test (1573016598283812864)]} 0 0
   [junit4]   2> 276760 INFO  (qtp1829491958-1627) [    x:collection1] o.a.s.h.RequestHandlerBase Ignoring exception matching ignore_exception
   [junit4]   2> 276796 INFO  (qtp1829491958-1602) [    x:collection1] o.a.s.u.p.LogUpdateProcessorFactory [collection1]  webapp=/solr path=/update params={wt=javabin&version=2}{add=[test (1573016598321561600)]} 0 0
   [junit4]   2> 276797 INFO  (qtp1829491958-1602) [    x:collection1] o.a.s.h.RequestHandlerBase Ignoring exception matching ignore_exception
   [junit4]   2> 276823 INFO  (qtp1829491958-1632) [    x:collection1] o.a.s.u.p.LogUpdateProcessorFactory [collection1]  webapp=/solr path=/update params={wt=javabin&version=2}{add=[test (1573016598349873152)]} 0 0
   [junit4]   2> 276824 INFO  (qtp1829491958-1632) [    x:collection1] o.a.s.h.RequestHandlerBase Ignoring exception matching ignore_exception
   [junit4]   2> 276939 INFO  (qtp1829491958-1628) [    x:collection1] o.a.s.u.p.LogUpdateProcessorFactory [collection1]  webapp=/solr path=/update params={wt=javabin&version=2}{add=[test (1573016598471507968)]} 0 0
   [junit4]   2> 276939 INFO  (qtp1829491958-1628) [    x:collection1] o.a.s.h.RequestHandlerBase Ignoring exception matching ignore_exception
   [junit4]   2> 277089 INFO  (qtp1829491958-1600) [    x:collection1] o.a.s.u.p.LogUpdateProcessorFactory [collection1]  webapp=/solr path=/update params={wt=javabin&version=2}{add=[test (1573016598555394048)]} 0 69
   [junit4]   2> 277089 INFO  (qtp1829491958-1600) [    x:collection1] o.a.s.h.RequestHandlerBase Ignoring exception matching ignore_exception
   [junit4]   2> 277174 INFO  (qtp1829491958-1597) [    x:collection1] o.a.s.u.p.LogUpdateProcessorFactory [collection1]  webapp=/solr path=/update params={wt=javabin&version=2}{add=[test (1573016598717923328)]} 0 0
   [junit4]   2> 277226 INFO  (qtp1829491958-1631) [    x:collection1] o.a.s.u.p.LogUpdateProcessorFactory [collection1]  webapp=/solr path=/update params={wt=javabin&version=2}{add=[test (1573016598772449280)]} 0 0
   [junit4]   2> 277226 INFO  (qtp1829491958-1631) [    x:collection1] o.a.s.h.RequestHandlerBase Ignoring exception matching ignore_exception
   [junit4]   2> 277226 INFO  (qtp1829491958-1597) [    x:collection1] o.a.s.h.RequestHandlerBase Ignoring exception matching ignore_exception
   [junit4]   2> 277345 INFO  (qtp1829491958-1628) [    x:collection1] o.a.s.u.p.LogUpdateProcessorFactory [collection1]  webapp=/solr path=/update params={wt=javabin&version=2}{add=[test (1573016598897229824)]} 0 0
   [junit4]   2> 277345 INFO  (qtp1829491958-1626) [    x:collection1] o.a.s.u.p.LogUpdateProcessorFactory [collection1]  webapp=/solr path=/update params={wt=javabin&version=2}{add=[test (1573016598883598336)]} 0 13
   [junit4]   2> 277346 INFO  (qtp1829491958-1626) [    x:collection1] o.a.s.h.RequestHandlerBase Ignoring exception matching ignore_exception
   [junit4]   2> 277365 INFO  (qtp1829491958-1604) [    x:collection1] o.a.s.u.p.LogUpdateProcessorFactory [collection1]  webapp=/solr path=/update params={wt=javabin&version=2}{add=[test (1573016598918201344)]} 0 0
   [junit4]   2> 277365 INFO  (qtp1829491958-1604) [    x:collection1] o.a.s.h.RequestHandlerBase Ignoring exception matching ignore_exception
   [junit4]   2> 277426 INFO  (qtp1829491958-1628) [    x:collection1] o.a.s.h.RequestHandlerBase Ignoring exception matching ignore_exception
   [junit4]   2> 277556 INFO  (qtp1829491958-1632) [    x:collection1] o.a.s.u.p.LogUpdateProcessorFactory [collection1]  webapp=/solr path=/update params={wt=javabin&version=2}{add=[test (1573016599117430784)]} 0 0
   [junit4]   2> 277556 INFO  (qtp1829491958-1632) [    x:collection1] o.a.s.h.RequestHandlerBase Ignoring exception matching ignore_exception
   [junit4]   2> 277586 INFO  (qtp1829491958-1600) [    x:collection1] o.a.s.u.p.LogUpdateProcessorFactory [collection1]  webapp=/solr path=/update params={wt=javabin&version=2}{add=[test (1573016599148888064)]} 0 0
   [junit4]   2> 277586 INFO  (qtp1829491958-1600) [    x:collection1] o.a.s.h.RequestHandlerBase Ignoring exception matching ignore_exception
   [junit4]   2> 277682 INFO  (qtp1829491958-1601) [    x:collection1] o.a.s.u.p.LogUpdateProcessorFactory [collection1]  webapp=/solr path=/update params={wt=javabin&version=2}{add=[test (1573016599250599936)]} 0 0
   [junit4]   2> 277682 INFO  (qtp1829491958-1601) [    x:collection1] o.a.s.h.RequestHandlerBase Ignoring exception matching ignore_exception
   [junit4]   2> 277789 INFO  (qtp1829491958-1603) [    x:collection1] o.a.s.u.p.LogUpdateProcessorFactory [collection1]  webapp=/solr path=/update params={wt=javabin&version=2}{add=[test (1573016599362797568)]} 0 0
   [junit4]   2> 277789 INFO  (qtp1829491958-1603) [    x:collection1] o.a.s.h.RequestHandlerBase Ignoring exception matching ignore_exception
   [junit4]   2> 278045 INFO  (qtp1829491958-1597) [    x:collection1] o.a.s.u.p.LogUpdateProcessorFactory [collection1]  webapp=/solr path=/update params={wt=javabin&version=2}{add=[test (1573016599631233024)]} 0 0
   [junit4]   2> 278045 INFO  (qtp1829491958-1597) [    x:collection1] o.a.s.h.RequestHandlerBase Ignoring exception matching ignore_exception
   [junit4]   2> 278064 INFO  (qtp1829491958-1626) [    x:collection1] o.a.s.u.p.LogUpdateProcessorFactory [collection1]  webapp=/solr path=/update params={wt=javabin&version=2}{add=[test (1573016599651155968)]} 0 0
   [junit4]   2> 278064 INFO  (qtp1829491958-1626) [    x:collection1] o.a.s.h.RequestHandlerBase Ignoring exception matching ignore_exception
   [junit4]   2> 278146 INFO  (qtp1829491958-1628) [    x:collection1] o.a.s.u.p.LogUpdateProcessorFactory [collection1]  webapp=/solr path=/update params={wt=javabin&version=2}{add=[test (1573016599664787456)]} 0 69
   [junit4]   2> 278146 INFO  (qtp1829491958-1628) [    x:collection1] o.a.s.h.RequestHandlerBase Ignoring exception matching ignore_exception
   [junit4]   2> 278172 INFO  (qtp1829491958-1627) [    x:collection1] o.a.s.u.p.LogUpdateProcessorFactory [collection1]  webapp=/solr path=/update params={wt=javabin&version=2}{add=[test (1573016599764402176)]} 0 0
   [junit4]   2> 278173 INFO  (qtp1829491958-1627) [    x:collection1] o.a.s.h.RequestHandlerBase Ignoring exception matching ignore_exception
   [junit4]   2> 278220 INFO  (qtp1829491958-1632) [    x:collection1] o.a.s.u.p.LogUpdateProcessorFactory [collection1]  webapp=/solr path=/update params={wt=javabin&version=2}{add=[test (1573016599814733824)]} 0 0
   [junit4]   2> 278220 INFO  (qtp1829491958-1632) [    x:collection1] o.a.s.h.RequestHandlerBase Ignoring exception matching ignore_exception
   [junit4]   2> 278340 INFO  (qtp1829491958-1602) [    x:collection1] o.a.s.u.p.LogUpdateProcessorFactory [collection1]  webapp=/solr path=/update params={wt=javabin&version=2}{add=[test (1573016599940562944)]} 0 0
   [junit4]   2> 278340 INFO  (qtp1829491958-1602) [    x:collection1] o.a.s.h.RequestHandlerBase Ignoring exception matching ignore_exception
   [junit4]   2> 278461 INFO  (qtp1829491958-1630) [    x:collection1] o.a.s.u.p.LogUpdateProcessorFactory [collection1]  webapp=/solr path=/update params={wt=javabin&version=2}{add=[test (1573016600066392064)]} 0 0
   [junit4]   2> 278461 INFO  (qtp1829491958-1630) [    x:collection1] o.a.s.h.RequestHandlerBase Ignoring exception matching ignore_exception
   [junit4]   2> 278504 INFO  (qtp1829491958-1626) [    x:collection1] o.a.s.u.p.LogUpdateProcessorFactory [collection1]  webapp=/solr path=/update params={wt=javabin&version=2}{add=[test (1573016600112529408)]} 0 0
   [junit4]   2> 278505 INFO  (qtp1829491958-1626) [    x:collection1] o.a.s.h.RequestHandlerBase Ignoring exception matching ignore_exception
   [junit4]   2> 278513 INFO  (qtp1829491958-1604) [    x:collection1] o.a.s.u.p.LogUpdateProcessorFactory [collection1]  webapp=/solr path=/update params={wt=javabin&version=2}{add=[test (1573016600120918016)]} 0 0
   [junit4]   2> 278513 INFO  (qtp1829491958-1604) [    x:collection1] o.a.s.h.RequestHandlerBase Ignoring exception matching ignore_exception
   [junit4]   2> 278580 INFO  (qtp1829491958-1598) [    x:collection1] o.a.s.u.p.LogUpdateProcessorFactory [collection1]  webapp=/solr path=/update params={wt=javabin&version=2}{add=[test (1573016600192221184)]} 0 0
   [junit4]   2> 278580 INFO  (qtp1829491958-1598) [    x:collection1] o.a.s.h.RequestHandlerBase Ignoring exception matching ignore_exception
   [junit4]   2> 278732 INFO  (qtp1829491958-1628) [    x:collection1] o.a.s.u.p.LogUpdateProcessorFactory [collection1]  webapp=/solr path=/update params={wt=javabin&version=2}{add=[test (1573016600300224512)]} 0 49
   [junit4]   2> 278732 INFO  (qtp1829491958-1628) [    x:collection1] o.a.s.h.RequestHandlerBase Ignoring exception matching ignore_exception
   [junit4]   2> 278735 INFO  (qtp1829491958-1603) [    x:collection1] o.a.s.u.p.LogUpdateProcessorFactory [collection1]  webapp=/solr path=/update params={wt=javabin&version=2}{add=[test (1573016600353701888)]} 0 0
   [junit4]   2> 278735 INFO  (qtp1829491958-1603) [    x:collection1] o.a.s.h.RequestHandlerBase Ignoring exception matching ignore_exception
   [junit4]   2> 279070 INFO  (qtp1829491958-1601) [    x:collection1] o.a.s.u.p.LogUpdateProcessorFactory [collection1]  webapp=/solr path=/update params={wt=javabin&version=2}{add=[test (1573016600704974848)]} 0 0
   [junit4]   2> 279070 INFO  (qtp1829491958-1601) [    x:collection1] o.a.s.h.RequestHandlerBase Ignoring exception matching ignore_exception
   [junit4]   2> 279464 INFO  (qtp1829491958-1600) [    x:collection1] o.a.s.u.p.LogUpdateProcessorFactory [collection1]  webapp=/solr path=/update params={wt=javabin&version=2}{add=[test (1573016601119162368)]} 0 0
   [junit4]   2> 279464 INFO  (qtp1829491958-1600) [    x:collection1] o.a.s.h.RequestHandlerBase Ignoring exception matching ignore_exception
   [junit4]   2> 279557 INFO  (qtp1829491958-1597) [    x:collection1] o.a.s.u.p.LogUpdateProcessorFactory [collection1]  webapp=/solr path=/update params={wt=javabin&version=2}{add=[test (1573016601216679936)]} 0 0
   [junit4]   2> 279557 INFO  (qtp1829491958-1597) [    x:collection1] o.a.s.h.RequestHandlerBase Ignoring exception matching ignore_exception
   [junit4]   2> 279727 INFO  (qtp1829491958-1601) [    x:collection1] o.a.s.u.p.LogUpdateProcessorFactory [collection1]  webapp=/solr path=/update params={wt=javabin&version=2}{add=[test (1573016601394937856)]} 0 0
   [junit4]   2> 279728 INFO  (qtp1829491958-1601) [    x:collection1] o.a.s.h.RequestHandlerBase Ignoring exception matching ignore_exception
   [junit4]   2> 279747 INFO  (qtp1829491958-1631) [    x:collection1] o.a.s.u.p.LogUpdateProcessorFactory [collection1]  webapp=/solr path=/update params={wt=javabin&version=2}{add=[test (1573016601415909376)]} 0 0
   [junit4]   2> 279820 INFO  (qtp1829491958-1631) [    x:collection1] o.a.s.h.RequestHandlerBase Ignoring exception matching ignore_exception
   [junit4]   2> 279835 INFO  (qtp1829491958-1602) [    x:collection1] o.a.s.u.p.LogUpdateProcessorFactory [collection1]  webapp=/solr path=/update params={wt=javabin&version=2}{add=[test (1573016601508184064)]} 0 0
   [junit4]   2> 279835 INFO  (qtp1829491958-1602) [    x:collection1] o.a.s.h.RequestHandlerBase Ignoring exception matching ignore_exception
   [junit4]   2> 279836 INFO  (qtp1829491958-1627) [    x:collection1] o.a.s.u.p.LogUpdateProcessorFactory [collection1]  webapp=/solr path=/update params={wt=javabin&version=2}{add=[test (1573016601415909378)]} 0 89
   [junit4]   2> 279837 INFO  (qtp1829491958-1627) [    x:collection1] o.a.s.h.RequestHandlerBase Ignoring exception matching ignore_exception
   [junit4]   2> 279876 INFO  (qtp1829491958-1632) [    x:collection1] o.a.s.u.p.LogUpdateProcessorFactory [collection1]  webapp=/solr path=/update params={wt=javabin&version=2}{add=[test (1573016601551175680)]} 0 0
   [junit4]   2> 279876 INFO  (qtp1829491958-1632) [    x:collection1] o.a.s.h.RequestHandlerBase Ignoring exception matching ignore_exception
   [junit4]   2> 280161 INFO  (qtp1829491958-1598) [    x:collection1] o.a.s.u.p.LogUpdateProcessorFactory [collection1]  webapp=/solr path=/update params={wt=javabin&version=2}{add=[test (1573016601850019840)]} 0 0
   [junit4]   2> 280162 INFO  (qtp1829491958-1598) [    x:collection1] o.a.s.h.RequestHandlerBase Ignoring exception matching ignore_exception
   [junit4]   2> 280178 INFO  (qtp1829491958-1630) [    x:collection1] o.a.s.u.p.LogUpdateProcessorFactory [collection1]  webapp=/solr path=/update params={wt=javabin&version=2}{add=[test (1573016601867845632)]} 0 37
   [junit4]   2> 280179 INFO  (qtp1829491958-1630) [    x:collection1] o.a.s.h.RequestHandlerBase Ignoring exception matching ignore_exception
   [junit4]   2> 280407 INFO  (qtp1829491958-1604) [    x:collection1] o.a.s.u.p.LogUpdateProcessorFactory [collection1]  webapp=/solr path=/update params={wt=javabin&version=2}{add=[test (1573016602107969536)]} 0 0
   [junit4]   2> 280407 INFO  (qtp1829491958-1604) [    x:collection1] o.a.s.h.RequestHandlerBase Ignoring exception matching ignore_exception
   [junit4]   2> 280709 INFO  (qtp1829491958-1601) [    x:collection1] o.a.s.u.p.LogUpdateProcessorFactory [collection1]  webapp=/solr path=/update params={wt=javabin&version=2}{add=[test (1573016602424639488)]} 0 69
   [junit4]   2> 280709 INFO  (qtp1829491958-1601) [    x:collection1] o.a.s.h.RequestHandlerBase Ignoring exception matching ignore_exception
   [junit4]   2> 280868 INFO  (qtp1829491958-1600) [    x:collection1] o.a.s.u.p.LogUpdateProcessorFactory [collection1]  webapp=/solr path=/update params={wt=javabin&version=2}{add=[test (1573016602591363072)]} 0 70
   [junit4]   2> 280868 INFO  (qtp1829491958-1600) [    x:collection1] o.a.s.h.RequestHandlerBase Ignoring exception matching ignore_exception
   [junit4]   2> 280905 INFO  (qtp1829491958-1597) [    x:collection1] o.a.s.u.p.LogUpdateProcessorFactory [collection1]  webapp=/solr path=/update params={wt=javabin&version=2}{add=[test (1573016602630160384)]} 0 0
   [junit4]   2> 280906 INFO  (qtp1829491958-1597) [    x:collection1] o.a.s.h.RequestHandlerBase Ignoring exception matching ignore_exception
   [junit4]   2> 280966 INFO  (qtp1829491958-1628) [    x:collection1] o.a.s.u.p.LogUpdateProcessorFactory [collection1]  webapp=/solr path=/update params={wt=javabin&version=2}{add=[test (1573016602694123520)]} 0 0
   [junit4]   2> 280966 INFO  (qtp1829491958-1628) [    x:collection1] o.a.s.h.RequestHandlerBase Ignoring exception matching ignore_exception
   [junit4]   2> 281311 INFO  (qtp1829491958-1626) [    x:collection1] o.a.s.u.p.LogUpdateProcessorFactory [collection1]  webapp=/solr path=/update params={wt=javabin&version=2}{add=[test (1573016603054833664)]} 0 0
   [junit4]   2> 281311 INFO  (qtp1829491958-1626) [    x:collection1] o.a.s.h.RequestHandlerBase Ignoring exception matching ignore_exception
   [junit4]   2> 281459 INFO  (qtp1829491958-1631) [    x:collection1] o.a.s.u.p.LogUpdateProcessorFactory [collection1]  webapp=/solr path=/update params={wt=javabin&version=2}{add=[test (1573016603211071488)]} 0 0
   [junit4]   2> 281460 INFO  (qtp1829491958-1631) [    x:collection1] o.a.s.h.RequestHandlerBase Ignoring exception matching ignore_exception
   [junit4]   2> 281474 INFO  (qtp1829491958-1630) [    x:collection1] o.a.s.u.p.LogUpdateProcessorFactory [collection1]  webapp=/solr path=/update params={wt=javabin&version=2}{add=[test (1573016603226800128)]} 0 0
   [junit4]   2> 281474 INFO  (qtp1829491958-1630) [    x:collection1] o.a.s.h.RequestHandlerBase Ignoring exception matching ignore_exception
   [junit4]   2> 281599 INFO  (qtp1829491958-1627) [    x:collection1] o.a.s.u.p.LogUpdateProcessorFactory [collection1]  webapp=/solr path=/update params={wt=javabin&version=2}{add=[test (1573016603357872128)]} 0 0
   [junit4]   2> 281600 INFO  (qtp1829491958-1627) [    x:collection1] o.a.s.h.RequestHandlerBase Ignoring exception matching ignore_exception
   [junit4]   2> 281601 INFO  (qtp1829491958-1601) [    x:collection1] o.a.s.u.p.LogUpdateProcessorFactory [collection1]  webapp=/solr path=/update params={wt=javabin&version=2}{add=[test (1573016603359969280)]} 0 0
   [junit4]   2> 281601 INFO  (qtp1829491958-1601) [    x:collection1] o.a.s.h.RequestHandlerBase Ignoring exception matching ignore_exception
   [junit4]   2> 281656 INFO  (qtp1829491958-1604) [    x:collection1] o.a.s.u.p.LogUpdateProcessorFactory [collection1]  webapp=/solr path=/update params={wt=javabin&version=2}{add=[test (1573016603417640960)]} 0 0
   [junit4]   2> 281657 INFO  (qtp1829491958-1604) [    x:collection1] o.a.s.h.RequestHandlerBase Ignoring exception matching ignore_exception
   [junit4]   2> 281765 INFO  (qtp1829491958-1602) [    x:collection1] o.a.s.u.p.LogUpdateProcessorFactory [collection1]  webapp=/solr path=/update params={wt=javabin&version=2}{add=[test (1573016603531935744)]} 0 69
   [junit4]   2> 281766 INFO  (qtp1829491958-1602) [    x:collection1] o.a.s.h.RequestHandlerBase Ignoring exception matching ignore_exception
   [junit4]   2> 282478 INFO  (qtp1829491958-1598) [    x:collection1] o.a.s.u.p.LogUpdateProcessorFactory [collection1]  webapp=/solr path=/update params={wt=javabin&version=2}{add=[test (1573016604279570432)]} 0 19
   [junit4]   2> 282479 INFO  (qtp1829491958-1628) [    x:collection1] o.a.s.u.p.LogUpdateProcessorFactory [collection1]  webapp=/solr path=/update params={wt=javabin&version=2}{add=[test (1573016604279570434)]} 0 17
   [junit4]   2> 282479 INFO  (qtp1829491958-1598) [    x:collection1] o.a.s.h.RequestHandlerBase Ignoring exception matching ignore_exception
   [junit4]   2> 282479 INFO  (qtp1829491958-1628) [    x:collection1] o.a.s.h.RequestHandlerBase Ignoring exception matching ignore_exception
   [junit4]   2> 282555 INFO  (qtp1829491958-1632) [    x:collection1] o.a.s.u.p.LogUpdateProcessorFactory [collection1]  webapp=/solr path=/update params={wt=javabin&version=2}{add=[test (1573016604359262208)]} 0 0
   [junit4]   2> 282555 INFO  (qtp1829491958-1632) [    x:collection1] o.a.s.h.RequestHandlerBase Ignoring exception matching ignore_exception
   [junit4]   2> 282649 INFO  (qtp1829491958-1626) [    x:collection1] o.a.s.u.p.LogUpdateProcessorFactory [collection1]  webapp=/solr path=/update params={wt=javabin&version=2}{add=[test (1573016604458876928)]} 0 0
   [junit4]   2> 282649 INFO  (qtp1829491958-1626) [    x:collection1] o.a.s.h.RequestHandlerBase Ignoring exception matching ignore_exception
   [junit4]   2> 282960 INFO  (qtp1829491958-1597) [    x:collection1] o.a.s.u.p.LogUpdateProcessorFactory [collection1]  webapp=/solr path=/update params={wt=javabin&version=2}{add=[test (1573016604784984064)]} 0 0
   [junit4]   2> 282961 INFO  (qtp1829491958-1597) [    x:collection1] o.a.s.h.RequestHandlerBase Ignoring exception matching ignore_exception
   [junit4]   2> 283104 INFO  (qtp1829491958-1603) [    x:collection1] o.a.s.u.p.LogUpdateProcessorFactory [collection1]  webapp=/solr path=/update params={wt=javabin&version=2}{add=[test (1573016604935979008)]} 0 0
   [junit4]   2> 283105 INFO  (qtp1829491958-1603) [    x:collection1] o.a.s.h.RequestHandlerBase Ignoring exception matching ignore_exception
   [junit4]   2> 283113 INFO  (qtp1829491958-1600) [    x:collection1] o.a.s.u.p.LogUpdateProcessorFactory [collection1]  webapp=/solr path=/update params={wt=javabin&version=2}{add=[test (1573016604945416192)]} 0 0
   [junit4]   2> 283113 INFO  (qtp1829491958-1600) [    x:collection1] o.a.s.h.RequestHandlerBase Ignoring exception matching ignore_exception
   [junit4]   2> 283156 INFO  (qtp1829491958-1598) [    x:collection1] o.a.s.u.p.LogUpdateProcessorFactory [collection1]  webapp=/solr path=/update params={wt=javabin&version=2}{add=[test (1573016604990504960)]} 0 54
   [junit4]   2> 283157 INFO  (qtp1829491958-1598) [    x:collection1] o.a.s.h.RequestHandlerBase Ignoring exception matching ignore_exception
   [junit4]   2> 283230 INFO  (qtp1829491958-1628) [    x:collection1] o.a.s.u.p.LogUpdateProcessorFactory [collection1]  webapp=/solr path=/update params={wt=javabin&version=2}{add=[test (1573016605068099584)]} 0 0
   [junit4]   2> 283230 INFO  (qtp1829491958-1628) [    x:collection1] o.a.s.h.RequestHandlerBase Ignoring exception matching ignore_exception
   [junit4]   2> 283326 INFO  (qtp1829491958-1631) [    x:collection1] o.a.s.u.p.LogUpdateProcessorFactory [collection1]  webapp=/solr path=/update params={wt=javabin&version=2}{add=[test (1573016605168762880)]} 0 0
   [junit4]   2> 283327 INFO  (qtp1829491958-1631) [    x:collection1] o.a.s.h.RequestHandlerBase Ignoring exception matching ignore_exception
   [junit4]   2> 283381 INFO  (qtp1829491958-1601) [    x:collection1] o.a.s.u.p.LogUpdateProcessorFactory [collection1]  webapp=/solr path=/update params={wt=javabin&version=2}{add=[test (1573016605226434560)]} 0 0
   [junit4]   2> 283381 INFO  (qtp1829491958-1601) [    x:collection1] o.a.s.h.RequestHandlerBase Ignoring exception matching ignore_exception
   [junit4]   2> 283542 INFO  (qtp1829491958-1598) [    x:collection1] o.a.s.u.p.LogUpdateProcessorFactory [collection1]  webapp=/solr path=/update params={wt=javabin&version=2}{add=[test (1573016605394206720)]} 0 0
   [junit4]   2> 283542 INFO  (qtp1829491958-1598) [    x:collection1] o.a.s.h.RequestHandlerBase Ignoring exception matching ignore_exception
   [junit4]   2> 283617 INFO  (qtp1829491958-1604) [    x:collection1] o.a.s.u.p.LogUpdateProcessorFactory [collection1]  webapp=/solr path=/update params={wt=javabin&version=2}{add=[test (1573016605473898496)]} 0 0
   [junit4]   2> 283617 INFO  (qtp1829491958-1604) [    x:collection1] o.a.s.h.RequestHandlerBase Ignoring exception matching ignore_exception
   [junit4]   2> 283668 INFO  (qtp1829491958-1603) [    x:collection1] o.a.s.u.p.LogUpdateProcessorFactory [collection1]  webapp=/solr path=/update params={wt=javabin&version=2}{add=[test (1573016605526327296)]} 0 0
   [junit4]   2> 283668 INFO  (qtp1829491958-1603) [    x:collection1] o.a.s.h.RequestHandlerBase Ignoring exception matching ignore_exception
   [junit4]   2> 283692 INFO  (qtp1829491958-1597) [    x:collection1] o.a.s.u.p.LogUpdateProcessorFactory [collection1]  webapp=/solr path=/update params={wt=javabin&version=2}{add=[test (1573016605552541696)]} 0 0
   [junit4]   2> 283692 INFO  (qtp1829491958-1597) [    x:collection1] o.a.s.h.RequestHandlerBase Ignoring exception matching ignore_exception
   [junit4]   2> 283713 INFO  (qtp1829491958-1626) [    x:collection1] o.a.s.u.p.LogUpdateProcessorFactory [collection1]  webapp=/solr path=/update params={wt=javabin&version=2}{add=[test (1573016605574561792)]} 0 0
   [junit4]   2> 283714 INFO  (qtp1829491958-1626) [    x:collection1] o.a.s.h.RequestHandlerBase Ignoring exception matching ignore_exception
   [junit4]   2> 283786 INFO  (qtp1829491958-1602) [    x:collection1] o.a.s.u.p.LogUpdateProcessorFactory [collection1]  webapp=/solr path=/update params={wt=javabin&version=2}{add=[test (1573016605650059264)]} 0 0
   [junit4]   2> 283786 INFO  (qtp1829491958-1602) [    x:collection1] o.a.s.h.RequestHandlerBase Ignoring exception matching ignore_exception
   [junit4]   2> 283852 INFO  (qtp1829491958-1627) [    x:collection1] o.a.s.u.p.LogUpdateProcessorFactory [collection1]  webapp=/solr path=/update params={wt=javabin&version=2}{add=[test (1573016605719265280)]} 0 0
   [junit4]   2> 283852 INFO  (qtp1829491958-1627) [    x:collection1] o.a.s.h.RequestHandlerBase Ignoring exception matching ignore_exception
   [junit4]   2> 283915 INFO  (qtp1829491958-1631) [    x:collection1] o.a.s.u.p.LogUpdateProcessorFactory [collection1]  webapp=/solr path=/update params={wt=javabin&version=2}{add=[test (1573016605786374144)]} 0 0
   [junit4]   2> 283916 INFO  (qtp1829491958-1631) [    x:collection1] o.a.s.h.RequestHandlerBase Ignoring exception matching ignore_exception
   [junit4]   2> 283961 INFO  (qtp1829491958-1632) [    x:collection1] o.a.s.u.p.LogUpdateProcessorFactory [collection1]  webapp=/solr path=/update params={wt=javabin&version=2}{add=[test (1573016605834608640)]} 0 0
   [junit4]   2> 283961 INFO  (qtp1829491958-1632) [    x:collection1] o.a.s.h.RequestHandlerBase Ignoring exception matching ignore_exception
   [junit4]   2> 284035 INFO  (qtp1829491958-1601) [    x:collection1] o.a.s.u.p.LogUpdateProcessorFactory [collection1]  webapp=/solr path=/update params={wt=javabin&version=2}{add=[test (1573016605912203264)]} 0 0
   [junit4]   2> 284036 INFO  (qtp1829491958-1601) [    x:collection1] o.a.s.h.RequestHandlerBase Ignoring exception matching ignore_exception
   [junit4]   2> 284070 INFO  (qtp1829491958-1604) [    x:collection1] o.a.s.u.p.LogUpdateProcessorFactory [collection1]  webapp=/solr path=/update params={wt=javabin&version=2}{add=[test (1573016605948903424)]} 0 0
   [junit4]   2> 284070 INFO  (qtp1829491958-1604) [    x:collection1] o.a.s.h.RequestHandlerBase Ignoring exception matching ignore_exception
   [junit4]   2> 284154 INFO  (qtp1829491958-1628) [    x:collection1] o.a.s.u.p.LogUpdateProcessorFactory [collection1]  webapp=/solr path=/update params={wt=javabin&version=2}{add=[test (1573016606036983808)]} 0 0
   [junit4]   2> 284154 INFO  (qtp1829491958-1628) [    x:collection1] o.a.s.h.RequestHandlerBase Ignoring exception matching ignore_exception
   [junit4]   2> 284163 INFO  (qtp1829491958-1603) [    x:collection1] o.a.s.u.p.LogUpdateProcessorFactory [collection1]  webapp=/solr path=/update params={wt=javabin&version=2}{add=[test (1573016606046420992)]} 0 0
   [junit4]   2> 284163 INFO  (qtp1829491958-1603) [    x:collection1] o.a.s.h.RequestHandlerBase Ignoring exception matching ignore_exception
   [junit4]   2> 284203 INFO  (qtp1829491958-1600) [    x:collection1] o.a.s.u.p.LogUpdateProcessorFactory [collection1]  webapp=/solr path=/update params={wt=javabin&version=2}{add=[test (1573016606088364032)]} 0 0
   [junit4]   2> 284203 INFO  (qtp1829491958-1600) [    x:collection1] o.a.s.h.RequestHandlerBase Ignoring exception matching ignore_exception
   [junit4]   2> 284245 INFO  (qtp1829491958-1631) [    x:collection1] o.a.s.u.p.LogUpdateProcessorFactory [collection1]  webapp=/solr path=/update params={wt=javabin&version=2}{add=[test (1573016606131355648)]} 0 0
   [junit4]   2> 284245 INFO  (qtp1829491958-1631) [    x:collection1] o.a.s.h.RequestHandlerBase Ignoring exception matching ignore_exception
   [junit4]   2> 284289 INFO  (qtp1829491958-1597) [    x:collection1] o.a.s.u.p.LogUpdateProcessorFactory [collection1]  webapp=/solr path=/update params={wt=javabin&version=2}{add=[test (1573016606178541568)]} 0 0
   [junit4]   2> 284289 INFO  (qtp1829491958-1597) [    x:collection1]

[...truncated too long message...]

    ] o.a.s.c.s.TestSolrJErrorHandling RESPONSE BODY:{"responseHeader":{"status":400,"QTime":18},"error":{"metadata":["error-class","org.apache.solr.common.SolrException","root-error-class","org.apache.solr.common.SolrException"],"msg":"ERROR: [doc=0] unknown field 'unknown_field_0'","code":400}}
   [junit4]   2>
   [junit4]   2> 320642 INFO  (TEST-TestSolrJErrorHandling.testHttpURLConnection-seed#[4B436208B3C7DB39]) [    ] o.a.s.SolrTestCaseJ4 ###Ending testHttpURLConnection
   [junit4]   2> 320642 INFO  (SUITE-TestSolrJErrorHandling-seed#[4B436208B3C7DB39]-worker) [    ] o.e.j.s.AbstractConnector Stopped ServerConnector@7a3f70e9{HTTP/1.1,[http/1.1]}{127.0.0.1:0}
   [junit4]   2> 320643 INFO  (SUITE-TestSolrJErrorHandling-seed#[4B436208B3C7DB39]-worker) [    ] o.a.s.c.CoreContainer Shutting down CoreContainer instance=750002644
   [junit4]   2> 320643 INFO  (SUITE-TestSolrJErrorHandling-seed#[4B436208B3C7DB39]-worker) [    ] o.a.s.m.SolrMetricManager Closing metric reporters for registry=solr.node, tag=null
   [junit4]   2> 320644 INFO  (SUITE-TestSolrJErrorHandling-seed#[4B436208B3C7DB39]-worker) [    ] o.a.s.m.SolrMetricManager Closing metric reporters for registry=solr.jvm, tag=null
   [junit4]   2> 320645 INFO  (SUITE-TestSolrJErrorHandling-seed#[4B436208B3C7DB39]-worker) [    ] o.a.s.m.SolrMetricManager Closing metric reporters for registry=solr.jetty, tag=null
   [junit4]   2> 320645 INFO  (SUITE-TestSolrJErrorHandling-seed#[4B436208B3C7DB39]-worker) [    ] o.a.s.c.TransientSolrCoreCacheDefault Allocating transient cache for 2147483647 transient cores
   [junit4]   2> 320645 INFO  (coreCloseExecutor-770-thread-1) [    x:collection1] o.a.s.c.SolrCore [collection1]  CLOSING SolrCore org.apache.solr.core.SolrCore@778eac7b
   [junit4]   2> 320645 INFO  (coreCloseExecutor-770-thread-1) [    x:collection1] o.a.s.u.LoggingInfoStream [IW][coreCloseExecutor-770-thread-1]: now flush at close
   [junit4]   2> 320645 INFO  (coreCloseExecutor-770-thread-1) [    x:collection1] o.a.s.u.LoggingInfoStream [IW][coreCloseExecutor-770-thread-1]:   start flush: applyAllDeletes=true
   [junit4]   2> 320646 INFO  (coreCloseExecutor-770-thread-1) [    x:collection1] o.a.s.u.LoggingInfoStream [IW][coreCloseExecutor-770-thread-1]:   index before flush _4(7.1.0):C344/343:delGen=1
   [junit4]   2> 320646 INFO  (coreCloseExecutor-770-thread-1) [    x:collection1] o.a.s.u.LoggingInfoStream [DW][coreCloseExecutor-770-thread-1]: startFullFlush
   [junit4]   2> 320646 INFO  (coreCloseExecutor-770-thread-1) [    x:collection1] o.a.s.u.LoggingInfoStream [DW][coreCloseExecutor-770-thread-1]: coreCloseExecutor-770-thread-1 finishFullFlush success=true
   [junit4]   2> 320646 INFO  (coreCloseExecutor-770-thread-1) [    x:collection1] o.a.s.u.LoggingInfoStream [IW][coreCloseExecutor-770-thread-1]: now apply all deletes for all segments buffered updates bytesUsed=0 reader pool bytesUsed=0
   [junit4]   2> 320646 INFO  (coreCloseExecutor-770-thread-1) [    x:collection1] o.a.s.u.LoggingInfoStream [BD][coreCloseExecutor-770-thread-1]: waitApply: no deletes to apply
   [junit4]   2> 320646 INFO  (coreCloseExecutor-770-thread-1) [    x:collection1] o.a.s.u.LoggingInfoStream [MS][coreCloseExecutor-770-thread-1]: updateMergeThreads ioThrottle=true targetMBPerSec=10240.0 MB/sec
   [junit4]   2> 320646 INFO  (coreCloseExecutor-770-thread-1) [    x:collection1] o.a.s.u.LoggingInfoStream [MS][coreCloseExecutor-770-thread-1]: now merge
   [junit4]   2> 320646 INFO  (coreCloseExecutor-770-thread-1) [    x:collection1] o.a.s.u.LoggingInfoStream [MS][coreCloseExecutor-770-thread-1]:   index: _4(7.1.0):C344/343:delGen=1
   [junit4]   2> 320646 INFO  (coreCloseExecutor-770-thread-1) [    x:collection1] o.a.s.u.LoggingInfoStream [MS][coreCloseExecutor-770-thread-1]:   no more merges pending; now return
   [junit4]   2> 320646 INFO  (coreCloseExecutor-770-thread-1) [    x:collection1] o.a.s.u.LoggingInfoStream [IW][coreCloseExecutor-770-thread-1]: waitForMerges
   [junit4]   2> 320646 INFO  (coreCloseExecutor-770-thread-1) [    x:collection1] o.a.s.u.LoggingInfoStream [IW][coreCloseExecutor-770-thread-1]: waitForMerges done
   [junit4]   2> 320646 INFO  (coreCloseExecutor-770-thread-1) [    x:collection1] o.a.s.u.LoggingInfoStream [IW][coreCloseExecutor-770-thread-1]: commit: start
   [junit4]   2> 320646 INFO  (coreCloseExecutor-770-thread-1) [    x:collection1] o.a.s.u.LoggingInfoStream [IW][coreCloseExecutor-770-thread-1]: commit: enter lock
   [junit4]   2> 320646 INFO  (coreCloseExecutor-770-thread-1) [    x:collection1] o.a.s.u.LoggingInfoStream [IW][coreCloseExecutor-770-thread-1]: commit: now prepare
   [junit4]   2> 320646 INFO  (coreCloseExecutor-770-thread-1) [    x:collection1] o.a.s.u.LoggingInfoStream [IW][coreCloseExecutor-770-thread-1]: prepareCommit: flush
   [junit4]   2> 320646 INFO  (coreCloseExecutor-770-thread-1) [    x:collection1] o.a.s.u.LoggingInfoStream [IW][coreCloseExecutor-770-thread-1]:   index before flush _4(7.1.0):C344/343:delGen=1
   [junit4]   2> 320646 INFO  (coreCloseExecutor-770-thread-1) [    x:collection1] o.a.s.u.LoggingInfoStream [DW][coreCloseExecutor-770-thread-1]: startFullFlush
   [junit4]   2> 320646 INFO  (coreCloseExecutor-770-thread-1) [    x:collection1] o.a.s.u.LoggingInfoStream [IW][coreCloseExecutor-770-thread-1]: now apply all deletes for all segments buffered updates bytesUsed=0 reader pool bytesUsed=0
   [junit4]   2> 320646 INFO  (coreCloseExecutor-770-thread-1) [    x:collection1] o.a.s.u.LoggingInfoStream [BD][coreCloseExecutor-770-thread-1]: waitApply: no deletes to apply
   [junit4]   2> 320646 INFO  (coreCloseExecutor-770-thread-1) [    x:collection1] o.a.s.u.LoggingInfoStream [DW][coreCloseExecutor-770-thread-1]: coreCloseExecutor-770-thread-1 finishFullFlush success=true
   [junit4]   2> 320646 INFO  (coreCloseExecutor-770-thread-1) [    x:collection1] o.a.s.u.LoggingInfoStream [IW][coreCloseExecutor-770-thread-1]: startCommit(): start
   [junit4]   2> 320646 INFO  (coreCloseExecutor-770-thread-1) [    x:collection1] o.a.s.u.LoggingInfoStream [IW][coreCloseExecutor-770-thread-1]:   skip startCommit(): no changes pending
   [junit4]   2> 320646 INFO  (coreCloseExecutor-770-thread-1) [    x:collection1] o.a.s.u.LoggingInfoStream [IW][coreCloseExecutor-770-thread-1]: commit: pendingCommit == null; skip
   [junit4]   2> 320646 INFO  (coreCloseExecutor-770-thread-1) [    x:collection1] o.a.s.u.LoggingInfoStream [IW][coreCloseExecutor-770-thread-1]: commit: took 0.2 msec
   [junit4]   2> 320646 INFO  (coreCloseExecutor-770-thread-1) [    x:collection1] o.a.s.u.LoggingInfoStream [IW][coreCloseExecutor-770-thread-1]: commit: done
   [junit4]   2> 320646 INFO  (coreCloseExecutor-770-thread-1) [    x:collection1] o.a.s.u.LoggingInfoStream [IW][coreCloseExecutor-770-thread-1]: rollback
   [junit4]   2> 320646 INFO  (coreCloseExecutor-770-thread-1) [    x:collection1] o.a.s.u.LoggingInfoStream [IW][coreCloseExecutor-770-thread-1]: all running merges have aborted
   [junit4]   2> 320646 INFO  (coreCloseExecutor-770-thread-1) [    x:collection1] o.a.s.u.LoggingInfoStream [IW][coreCloseExecutor-770-thread-1]: rollback: done finish merges
   [junit4]   2> 320646 INFO  (coreCloseExecutor-770-thread-1) [    x:collection1] o.a.s.u.LoggingInfoStream [DW][coreCloseExecutor-770-thread-1]: abort
   [junit4]   2> 320646 INFO  (coreCloseExecutor-770-thread-1) [    x:collection1] o.a.s.u.LoggingInfoStream [DW][coreCloseExecutor-770-thread-1]: done abort success=true
   [junit4]   2> 320646 INFO  (coreCloseExecutor-770-thread-1) [    x:collection1] o.a.s.u.LoggingInfoStream [IW][coreCloseExecutor-770-thread-1]: rollback: infos=_4(7.1.0):C344/343:delGen=1
   [junit4]   2> 320646 INFO  (coreCloseExecutor-770-thread-1) [    x:collection1] o.a.s.u.LoggingInfoStream [IFD][coreCloseExecutor-770-thread-1]: now checkpoint "_4(7.1.0):C344/343:delGen=1" [1 segments ; isCommit = false]
   [junit4]   2> 320646 INFO  (coreCloseExecutor-770-thread-1) [    x:collection1] o.a.s.u.LoggingInfoStream [IFD][coreCloseExecutor-770-thread-1]: 0 msec to checkpoint
   [junit4]   2> 320647 INFO  (coreCloseExecutor-770-thread-1) [    x:collection1] o.a.s.m.SolrMetricManager Closing metric reporters for registry=solr.core.collection1, tag=2005838971
   [junit4]   2> 320656 INFO  (SUITE-TestSolrJErrorHandling-seed#[4B436208B3C7DB39]-worker) [    ] o.e.j.s.h.ContextHandler Stopped o.e.j.s.ServletContextHandler@13ad69e3{/solr,null,UNAVAILABLE}
   [junit4]   2> NOTE: leaving temporary files on disk at: /home/jenkins/jenkins-slave/workspace/Lucene-Solr-Tests-7.x/solr/build/solr-solrj/test/J1/temp/solr.client.solrj.TestSolrJErrorHandling_4B436208B3C7DB39-001
   [junit4]   2> NOTE: test params are: codec=Asserting(Lucene70): {}, docValues:{}, maxPointsInLeafNode=1064, maxMBSortInHeap=7.86518561436087, sim=RandomSimilarity(queryNorm=false): {}, locale=en-IN, timezone=America/Indiana/Knox
   [junit4]   2> NOTE: Linux 4.4.0-83-generic amd64/Oracle Corporation 1.8.0_131 (64-bit)/cpus=4,threads=1,free=52695760,total=383778816
   [junit4]   2> NOTE: All tests run in this JVM: [TestCloudSolrClientConnections, AddEvaluatorTest, PowerEvaluatorTest, SolrDocumentTest, TestZkConfigManager, TestV1toV2ApiMapper, CloudSolrClientTest, TestClusteringResponse, TestFastInputStream, GetByIdTest, DivideEvaluatorTest, StreamExpressionParserTest, ClientUtilsTest, HttpSolrClientBuilderTest, ArcSineEvaluatorTest, LBHttpSolrClientBuilderTest, SchemaTest, SolrExampleEmbeddedTest, FacetFieldTest, QueryResponseTest, MergeIndexesEmbeddedTest, SolrExampleStreamingTest, LargeVolumeBinaryJettyTest, JettyWebappTest, LargeVolumeJettyTest, SolrParamTest, TestEmbeddedSolrServer, TestNamedListCodec, TestDocumentObjectBinder, SolrQueryTest, ContentStreamTest, ModifiableSolrParamsTest, TestXMLEscaping, DocumentAnalysisResponseTest, TestUpdateRequestCodec, TestSolrJErrorHandling]
   [junit4] Completed [90/135 (1!)] on J1 in 50.47s, 4 tests, 1 failure <<< FAILURES!

[...truncated 42632 lines...]


---------------------------------------------------------------------
To unsubscribe, e-mail: [hidden email]
For additional commands, e-mail: [hidden email]
Loading...