[JENKINS] Lucene-Solr-Tests-8.x - Build # 1 - Unstable

classic Classic list List threaded Threaded
1 message Options
Reply | Threaded
Open this post in threaded view
|

[JENKINS] Lucene-Solr-Tests-8.x - Build # 1 - Unstable

Apache Jenkins Server-2
Build: https://builds.apache.org/job/Lucene-Solr-Tests-8.x/1/

3 tests failed.
FAILED:  org.apache.solr.cloud.autoscaling.sim.TestSimExtremeIndexing.testScaleUp

Error Message:
{numFound=988800000,start=0,docs=[]} expected:<1000000000> but was:<988800000>

Stack Trace:
java.lang.AssertionError: {numFound=988800000,start=0,docs=[]} expected:<1000000000> but was:<988800000>
        at __randomizedtesting.SeedInfo.seed([C7158A17B77797DB:E64BCCB5BB59497A]:0)
        at org.junit.Assert.fail(Assert.java:88)
        at org.junit.Assert.failNotEquals(Assert.java:834)
        at org.junit.Assert.assertEquals(Assert.java:645)
        at org.apache.solr.cloud.autoscaling.sim.TestSimExtremeIndexing.testScaleUp(TestSimExtremeIndexing.java:133)
        at sun.reflect.NativeMethodAccessorImpl.invoke0(Native Method)
        at sun.reflect.NativeMethodAccessorImpl.invoke(NativeMethodAccessorImpl.java:62)
        at sun.reflect.DelegatingMethodAccessorImpl.invoke(DelegatingMethodAccessorImpl.java:43)
        at java.lang.reflect.Method.invoke(Method.java:498)
        at com.carrotsearch.randomizedtesting.RandomizedRunner.invoke(RandomizedRunner.java:1750)
        at com.carrotsearch.randomizedtesting.RandomizedRunner$8.evaluate(RandomizedRunner.java:938)
        at com.carrotsearch.randomizedtesting.RandomizedRunner$9.evaluate(RandomizedRunner.java:974)
        at com.carrotsearch.randomizedtesting.RandomizedRunner$10.evaluate(RandomizedRunner.java:988)
        at com.carrotsearch.randomizedtesting.rules.SystemPropertiesRestoreRule$1.evaluate(SystemPropertiesRestoreRule.java:57)
        at org.apache.lucene.util.TestRuleSetupTeardownChained$1.evaluate(TestRuleSetupTeardownChained.java:49)
        at org.apache.lucene.util.AbstractBeforeAfterRule$1.evaluate(AbstractBeforeAfterRule.java:45)
        at org.apache.lucene.util.TestRuleThreadAndTestName$1.evaluate(TestRuleThreadAndTestName.java:48)
        at org.apache.lucene.util.TestRuleIgnoreAfterMaxFailures$1.evaluate(TestRuleIgnoreAfterMaxFailures.java:64)
        at org.apache.lucene.util.TestRuleMarkFailure$1.evaluate(TestRuleMarkFailure.java:47)
        at com.carrotsearch.randomizedtesting.rules.StatementAdapter.evaluate(StatementAdapter.java:36)
        at com.carrotsearch.randomizedtesting.ThreadLeakControl$StatementRunner.run(ThreadLeakControl.java:368)
        at com.carrotsearch.randomizedtesting.ThreadLeakControl.forkTimeoutingTask(ThreadLeakControl.java:817)
        at com.carrotsearch.randomizedtesting.ThreadLeakControl$3.evaluate(ThreadLeakControl.java:468)
        at com.carrotsearch.randomizedtesting.RandomizedRunner.runSingleTest(RandomizedRunner.java:947)
        at com.carrotsearch.randomizedtesting.RandomizedRunner$5.evaluate(RandomizedRunner.java:832)
        at com.carrotsearch.randomizedtesting.RandomizedRunner$6.evaluate(RandomizedRunner.java:883)
        at com.carrotsearch.randomizedtesting.RandomizedRunner$7.evaluate(RandomizedRunner.java:894)
        at com.carrotsearch.randomizedtesting.rules.StatementAdapter.evaluate(StatementAdapter.java:36)
        at com.carrotsearch.randomizedtesting.rules.SystemPropertiesRestoreRule$1.evaluate(SystemPropertiesRestoreRule.java:57)
        at org.apache.lucene.util.AbstractBeforeAfterRule$1.evaluate(AbstractBeforeAfterRule.java:45)
        at com.carrotsearch.randomizedtesting.rules.StatementAdapter.evaluate(StatementAdapter.java:36)
        at org.apache.lucene.util.TestRuleStoreClassName$1.evaluate(TestRuleStoreClassName.java:41)
        at com.carrotsearch.randomizedtesting.rules.NoShadowingOrOverridesOnMethodsRule$1.evaluate(NoShadowingOrOverridesOnMethodsRule.java:40)
        at com.carrotsearch.randomizedtesting.rules.NoShadowingOrOverridesOnMethodsRule$1.evaluate(NoShadowingOrOverridesOnMethodsRule.java:40)
        at com.carrotsearch.randomizedtesting.rules.StatementAdapter.evaluate(StatementAdapter.java:36)
        at com.carrotsearch.randomizedtesting.rules.StatementAdapter.evaluate(StatementAdapter.java:36)
        at com.carrotsearch.randomizedtesting.rules.StatementAdapter.evaluate(StatementAdapter.java:36)
        at org.apache.lucene.util.TestRuleAssertionsRequired$1.evaluate(TestRuleAssertionsRequired.java:53)
        at org.apache.lucene.util.TestRuleMarkFailure$1.evaluate(TestRuleMarkFailure.java:47)
        at org.apache.lucene.util.TestRuleIgnoreAfterMaxFailures$1.evaluate(TestRuleIgnoreAfterMaxFailures.java:64)
        at org.apache.lucene.util.TestRuleIgnoreTestSuites$1.evaluate(TestRuleIgnoreTestSuites.java:54)
        at com.carrotsearch.randomizedtesting.rules.StatementAdapter.evaluate(StatementAdapter.java:36)
        at com.carrotsearch.randomizedtesting.ThreadLeakControl$StatementRunner.run(ThreadLeakControl.java:368)
        at java.lang.Thread.run(Thread.java:748)


FAILED:  org.apache.solr.client.solrj.TestLBHttp2SolrClient.testTwoServers

Error Message:
Timeout occured while waiting response from server at: http://127.0.0.1:33168/solr/collection1/select?q=*%3A*&wt=javabin&version=2

Stack Trace:
org.apache.solr.client.solrj.SolrServerException: Timeout occured while waiting response from server at: http://127.0.0.1:33168/solr/collection1/select?q=*%3A*&wt=javabin&version=2
        at __randomizedtesting.SeedInfo.seed([134D3B25BF581EB2:B3A795A864133092]:0)
        at org.apache.solr.client.solrj.impl.Http2SolrClient.request(Http2SolrClient.java:400)
        at org.apache.solr.client.solrj.impl.Http2SolrClient.request(Http2SolrClient.java:732)
        at org.apache.solr.client.solrj.impl.LBSolrClient.request(LBSolrClient.java:605)
        at org.apache.solr.client.solrj.impl.LBSolrClient.request(LBSolrClient.java:581)
        at org.apache.solr.client.solrj.SolrRequest.process(SolrRequest.java:207)
        at org.apache.solr.client.solrj.SolrClient.query(SolrClient.java:983)
        at org.apache.solr.client.solrj.SolrClient.query(SolrClient.java:998)
        at org.apache.solr.client.solrj.TestLBHttp2SolrClient.testTwoServers(TestLBHttp2SolrClient.java:186)
        at sun.reflect.NativeMethodAccessorImpl.invoke0(Native Method)
        at sun.reflect.NativeMethodAccessorImpl.invoke(NativeMethodAccessorImpl.java:62)
        at sun.reflect.DelegatingMethodAccessorImpl.invoke(DelegatingMethodAccessorImpl.java:43)
        at java.lang.reflect.Method.invoke(Method.java:498)
        at com.carrotsearch.randomizedtesting.RandomizedRunner.invoke(RandomizedRunner.java:1750)
        at com.carrotsearch.randomizedtesting.RandomizedRunner$8.evaluate(RandomizedRunner.java:938)
        at com.carrotsearch.randomizedtesting.RandomizedRunner$9.evaluate(RandomizedRunner.java:974)
        at com.carrotsearch.randomizedtesting.RandomizedRunner$10.evaluate(RandomizedRunner.java:988)
        at com.carrotsearch.randomizedtesting.rules.SystemPropertiesRestoreRule$1.evaluate(SystemPropertiesRestoreRule.java:57)
        at org.apache.lucene.util.TestRuleSetupTeardownChained$1.evaluate(TestRuleSetupTeardownChained.java:49)
        at org.apache.lucene.util.AbstractBeforeAfterRule$1.evaluate(AbstractBeforeAfterRule.java:45)
        at org.apache.lucene.util.TestRuleThreadAndTestName$1.evaluate(TestRuleThreadAndTestName.java:48)
        at org.apache.lucene.util.TestRuleIgnoreAfterMaxFailures$1.evaluate(TestRuleIgnoreAfterMaxFailures.java:64)
        at org.apache.lucene.util.TestRuleMarkFailure$1.evaluate(TestRuleMarkFailure.java:47)
        at com.carrotsearch.randomizedtesting.rules.StatementAdapter.evaluate(StatementAdapter.java:36)
        at com.carrotsearch.randomizedtesting.ThreadLeakControl$StatementRunner.run(ThreadLeakControl.java:368)
        at com.carrotsearch.randomizedtesting.ThreadLeakControl.forkTimeoutingTask(ThreadLeakControl.java:817)
        at com.carrotsearch.randomizedtesting.ThreadLeakControl$3.evaluate(ThreadLeakControl.java:468)
        at com.carrotsearch.randomizedtesting.RandomizedRunner.runSingleTest(RandomizedRunner.java:947)
        at com.carrotsearch.randomizedtesting.RandomizedRunner$5.evaluate(RandomizedRunner.java:832)
        at com.carrotsearch.randomizedtesting.RandomizedRunner$6.evaluate(RandomizedRunner.java:883)
        at com.carrotsearch.randomizedtesting.RandomizedRunner$7.evaluate(RandomizedRunner.java:894)
        at com.carrotsearch.randomizedtesting.rules.StatementAdapter.evaluate(StatementAdapter.java:36)
        at com.carrotsearch.randomizedtesting.rules.SystemPropertiesRestoreRule$1.evaluate(SystemPropertiesRestoreRule.java:57)
        at org.apache.lucene.util.AbstractBeforeAfterRule$1.evaluate(AbstractBeforeAfterRule.java:45)
        at com.carrotsearch.randomizedtesting.rules.StatementAdapter.evaluate(StatementAdapter.java:36)
        at org.apache.lucene.util.TestRuleStoreClassName$1.evaluate(TestRuleStoreClassName.java:41)
        at com.carrotsearch.randomizedtesting.rules.NoShadowingOrOverridesOnMethodsRule$1.evaluate(NoShadowingOrOverridesOnMethodsRule.java:40)
        at com.carrotsearch.randomizedtesting.rules.NoShadowingOrOverridesOnMethodsRule$1.evaluate(NoShadowingOrOverridesOnMethodsRule.java:40)
        at com.carrotsearch.randomizedtesting.rules.StatementAdapter.evaluate(StatementAdapter.java:36)
        at com.carrotsearch.randomizedtesting.rules.StatementAdapter.evaluate(StatementAdapter.java:36)
        at com.carrotsearch.randomizedtesting.rules.StatementAdapter.evaluate(StatementAdapter.java:36)
        at org.apache.lucene.util.TestRuleAssertionsRequired$1.evaluate(TestRuleAssertionsRequired.java:53)
        at org.apache.lucene.util.TestRuleMarkFailure$1.evaluate(TestRuleMarkFailure.java:47)
        at org.apache.lucene.util.TestRuleIgnoreAfterMaxFailures$1.evaluate(TestRuleIgnoreAfterMaxFailures.java:64)
        at org.apache.lucene.util.TestRuleIgnoreTestSuites$1.evaluate(TestRuleIgnoreTestSuites.java:54)
        at com.carrotsearch.randomizedtesting.rules.StatementAdapter.evaluate(StatementAdapter.java:36)
        at com.carrotsearch.randomizedtesting.ThreadLeakControl$StatementRunner.run(ThreadLeakControl.java:368)
        at java.lang.Thread.run(Thread.java:748)
Caused by: java.util.concurrent.TimeoutException
        at org.eclipse.jetty.client.util.InputStreamResponseListener.get(InputStreamResponseListener.java:216)
        at org.apache.solr.client.solrj.impl.Http2SolrClient.request(Http2SolrClient.java:391)
        ... 46 more


FAILED:  org.apache.solr.common.cloud.TestCollectionStateWatchers.testWaitForStateWatcherIsRetainedOnPredicateFailure

Error Message:
Did not see a fully active cluster after 30 seconds

Stack Trace:
java.lang.AssertionError: Did not see a fully active cluster after 30 seconds
        at __randomizedtesting.SeedInfo.seed([134D3B25BF581EB2:9B7B997667F7F6A0]:0)
        at org.junit.Assert.fail(Assert.java:88)
        at org.junit.Assert.assertTrue(Assert.java:41)
        at org.apache.solr.common.cloud.TestCollectionStateWatchers.testWaitForStateWatcherIsRetainedOnPredicateFailure(TestCollectionStateWatchers.java:261)
        at sun.reflect.NativeMethodAccessorImpl.invoke0(Native Method)
        at sun.reflect.NativeMethodAccessorImpl.invoke(NativeMethodAccessorImpl.java:62)
        at sun.reflect.DelegatingMethodAccessorImpl.invoke(DelegatingMethodAccessorImpl.java:43)
        at java.lang.reflect.Method.invoke(Method.java:498)
        at com.carrotsearch.randomizedtesting.RandomizedRunner.invoke(RandomizedRunner.java:1750)
        at com.carrotsearch.randomizedtesting.RandomizedRunner$8.evaluate(RandomizedRunner.java:938)
        at com.carrotsearch.randomizedtesting.RandomizedRunner$9.evaluate(RandomizedRunner.java:974)
        at com.carrotsearch.randomizedtesting.RandomizedRunner$10.evaluate(RandomizedRunner.java:988)
        at com.carrotsearch.randomizedtesting.rules.SystemPropertiesRestoreRule$1.evaluate(SystemPropertiesRestoreRule.java:57)
        at org.apache.lucene.util.TestRuleSetupTeardownChained$1.evaluate(TestRuleSetupTeardownChained.java:49)
        at org.apache.lucene.util.AbstractBeforeAfterRule$1.evaluate(AbstractBeforeAfterRule.java:45)
        at org.apache.lucene.util.TestRuleThreadAndTestName$1.evaluate(TestRuleThreadAndTestName.java:48)
        at org.apache.lucene.util.TestRuleIgnoreAfterMaxFailures$1.evaluate(TestRuleIgnoreAfterMaxFailures.java:64)
        at org.apache.lucene.util.TestRuleMarkFailure$1.evaluate(TestRuleMarkFailure.java:47)
        at com.carrotsearch.randomizedtesting.rules.StatementAdapter.evaluate(StatementAdapter.java:36)
        at com.carrotsearch.randomizedtesting.ThreadLeakControl$StatementRunner.run(ThreadLeakControl.java:368)
        at com.carrotsearch.randomizedtesting.ThreadLeakControl.forkTimeoutingTask(ThreadLeakControl.java:817)
        at com.carrotsearch.randomizedtesting.ThreadLeakControl$3.evaluate(ThreadLeakControl.java:468)
        at com.carrotsearch.randomizedtesting.RandomizedRunner.runSingleTest(RandomizedRunner.java:947)
        at com.carrotsearch.randomizedtesting.RandomizedRunner$5.evaluate(RandomizedRunner.java:832)
        at com.carrotsearch.randomizedtesting.RandomizedRunner$6.evaluate(RandomizedRunner.java:883)
        at com.carrotsearch.randomizedtesting.RandomizedRunner$7.evaluate(RandomizedRunner.java:894)
        at com.carrotsearch.randomizedtesting.rules.StatementAdapter.evaluate(StatementAdapter.java:36)
        at com.carrotsearch.randomizedtesting.rules.SystemPropertiesRestoreRule$1.evaluate(SystemPropertiesRestoreRule.java:57)
        at org.apache.lucene.util.AbstractBeforeAfterRule$1.evaluate(AbstractBeforeAfterRule.java:45)
        at com.carrotsearch.randomizedtesting.rules.StatementAdapter.evaluate(StatementAdapter.java:36)
        at org.apache.lucene.util.TestRuleStoreClassName$1.evaluate(TestRuleStoreClassName.java:41)
        at com.carrotsearch.randomizedtesting.rules.NoShadowingOrOverridesOnMethodsRule$1.evaluate(NoShadowingOrOverridesOnMethodsRule.java:40)
        at com.carrotsearch.randomizedtesting.rules.NoShadowingOrOverridesOnMethodsRule$1.evaluate(NoShadowingOrOverridesOnMethodsRule.java:40)
        at com.carrotsearch.randomizedtesting.rules.StatementAdapter.evaluate(StatementAdapter.java:36)
        at com.carrotsearch.randomizedtesting.rules.StatementAdapter.evaluate(StatementAdapter.java:36)
        at com.carrotsearch.randomizedtesting.rules.StatementAdapter.evaluate(StatementAdapter.java:36)
        at org.apache.lucene.util.TestRuleAssertionsRequired$1.evaluate(TestRuleAssertionsRequired.java:53)
        at org.apache.lucene.util.TestRuleMarkFailure$1.evaluate(TestRuleMarkFailure.java:47)
        at org.apache.lucene.util.TestRuleIgnoreAfterMaxFailures$1.evaluate(TestRuleIgnoreAfterMaxFailures.java:64)
        at org.apache.lucene.util.TestRuleIgnoreTestSuites$1.evaluate(TestRuleIgnoreTestSuites.java:54)
        at com.carrotsearch.randomizedtesting.rules.StatementAdapter.evaluate(StatementAdapter.java:36)
        at com.carrotsearch.randomizedtesting.ThreadLeakControl$StatementRunner.run(ThreadLeakControl.java:368)
        at java.lang.Thread.run(Thread.java:748)




Build Log:
[...truncated 14527 lines...]
   [junit4] Suite: org.apache.solr.cloud.autoscaling.sim.TestSimExtremeIndexing
   [junit4]   2> Creating dataDir: /home/jenkins/jenkins-slave/workspace/Lucene-Solr-Tests-8.x/solr/build/solr-core/test/J1/temp/solr.cloud.autoscaling.sim.TestSimExtremeIndexing_C7158A17B77797DB-001/init-core-data-001
   [junit4]   2> 3566277 INFO  (SUITE-TestSimExtremeIndexing-seed#[C7158A17B77797DB]-worker) [    ] o.a.s.SolrTestCaseJ4 Using PointFields (NUMERIC_POINTS_SYSPROP=true) w/NUMERIC_DOCVALUES_SYSPROP=false
   [junit4]   2> 3566277 INFO  (SUITE-TestSimExtremeIndexing-seed#[C7158A17B77797DB]-worker) [    ] o.a.s.SolrTestCaseJ4 Randomized ssl (true) and clientAuth (false) via: @org.apache.solr.util.RandomizeSSL(reason=, ssl=NaN, value=NaN, clientAuth=NaN)
   [junit4]   2> 3566278 INFO  (SUITE-TestSimExtremeIndexing-seed#[C7158A17B77797DB]-worker) [    ] o.a.s.SolrTestCaseJ4 SecureRandom sanity checks: test.solr.allowed.securerandom=null & java.security.egd=file:/dev/./urandom
   [junit4]   2> 3566280 INFO  (TEST-TestSimExtremeIndexing.testScaleUp-seed#[C7158A17B77797DB]) [    ] o.a.s.SolrTestCaseJ4 ###Starting testScaleUp
   [junit4]   2> 3566301 DEBUG (TEST-TestSimExtremeIndexing.testScaleUp-seed#[C7158A17B77797DB]) [    ] o.a.s.c.a.s.SimClusterStateProvider --- new Overseer leader: 127.0.0.1:10006_solr
   [junit4]   2> 3566301 DEBUG (Simulated OverseerAutoScalingTriggerThread) [    ] o.a.s.c.a.OverseerTriggerThread Adding .auto_add_replicas and .scheduled_maintenance triggers
   [junit4]   2> 3566301 DEBUG (Simulated OverseerAutoScalingTriggerThread) [    ] o.a.s.c.a.OverseerTriggerThread Refreshing /autoscaling.json with znode version 1
   [junit4]   2> 3566302 DEBUG (Simulated OverseerAutoScalingTriggerThread) [    ] o.a.s.c.a.OverseerTriggerThread Current znodeVersion 1, lastZnodeVersion 0
   [junit4]   2> 3566302 DEBUG (Simulated OverseerAutoScalingTriggerThread) [    ] o.a.s.c.a.OverseerTriggerThread Processed trigger updates upto znodeVersion 1
   [junit4]   2> 3566302 DEBUG (TEST-TestSimExtremeIndexing.testScaleUp-seed#[C7158A17B77797DB]) [    ] o.a.s.c.a.s.SimClusterStateProvider ** creating new collection states, currentVersion=0
   [junit4]   2> 3566302 DEBUG (TEST-TestSimExtremeIndexing.testScaleUp-seed#[C7158A17B77797DB]) [    ] o.a.s.c.a.s.SimClusterStateProvider ** saved cluster state version 0
   [junit4]   2> 3566302 INFO  (TEST-TestSimExtremeIndexing.testScaleUp-seed#[C7158A17B77797DB]) [    ] o.a.s.h.a.MetricsHistoryHandler No .system collection, keeping metrics history in memory.
   [junit4]   2> 3566317 DEBUG (Simulated OverseerAutoScalingTriggerThread) [    ] o.a.s.c.a.OverseerTriggerThread -- cleaning old nodeLost / nodeAdded markers
   [junit4]   2> 3566317 DEBUG (Simulated OverseerAutoScalingTriggerThread) [    ] o.a.s.c.a.OverseerTriggerThread Current znodeVersion 1, lastZnodeVersion 1
   [junit4]   2> 3566467 DEBUG (simCloudManagerPool-8625-thread-1) [    ] o.a.s.c.a.s.SimClusterStateProvider -- simCreateCollection testScaleUp_collection, currentVersion=1
   [junit4]   2> 3566467 DEBUG (simCloudManagerPool-8625-thread-1) [    ] o.a.s.c.a.s.SimClusterStateProvider ** creating new collection states, currentVersion=1
   [junit4]   2> 3566467 DEBUG (simCloudManagerPool-8625-thread-1) [    ] o.a.s.c.a.s.SimClusterStateProvider ** saved cluster state version 1
   [junit4]   2> 3566487 DEBUG (simCloudManagerPool-8625-thread-1) [    ] o.a.s.c.a.s.SimClusterStateProvider ** creating new collection states, currentVersion=2
   [junit4]   2> 3566487 DEBUG (simCloudManagerPool-8625-thread-1) [    ] o.a.s.c.a.s.SimClusterStateProvider ** saved cluster state version 2
   [junit4]   2> 3567354 DEBUG (simCloudManagerPool-8625-thread-2) [    ] o.a.s.c.a.s.SimClusterStateProvider ** creating new collection states, currentVersion=3
   [junit4]   2> 3567354 DEBUG (simCloudManagerPool-8625-thread-2) [    ] o.a.s.c.a.s.SimClusterStateProvider ** saved cluster state version 3
   [junit4]   2> 3567392 DEBUG (simCloudManagerPool-8625-thread-6) [    ] o.a.s.c.a.s.SimClusterStateProvider -- elected new leader for testScaleUp_collection / shard1 (currentVersion=4): {"core_node1":{
   [junit4]   2>     "core":"testScaleUp_collection_shard1_replica_n1",
   [junit4]   2>     "shard":"shard1",
   [junit4]   2>     "collection":"testScaleUp_collection",
   [junit4]   2>     "node_name":"127.0.0.1:10072_solr",
   [junit4]   2>     "type":"NRT",
   [junit4]   2>     "leader":"true",
   [junit4]   2>     "SEARCHER.searcher.maxDoc":0,
   [junit4]   2>     "SEARCHER.searcher.deletedDocs":0,
   [junit4]   2>     "INDEX.sizeInBytes":10240,
   [junit4]   2>     "state":"active",
   [junit4]   2>     "INDEX.sizeInGB":9.5367431640625E-6,
   [junit4]   2>     "SEARCHER.searcher.numDocs":0}}
   [junit4]   2> 3567423 DEBUG (simCloudManagerPool-8625-thread-3) [    ] o.a.s.c.a.s.SimClusterStateProvider ** creating new collection states, currentVersion=4
   [junit4]   2> 3567423 DEBUG (simCloudManagerPool-8625-thread-3) [    ] o.a.s.c.a.s.SimClusterStateProvider ** saved cluster state version 4
   [junit4]   2> 3567439 DEBUG (simCloudManagerPool-8625-thread-4) [    ] o.a.s.c.a.s.SimClusterStateProvider ** creating new collection states, currentVersion=5
   [junit4]   2> 3567440 DEBUG (simCloudManagerPool-8625-thread-4) [    ] o.a.s.c.a.s.SimClusterStateProvider ** saved cluster state version 5
   [junit4]   2> 3567442 DEBUG (simCloudManagerPool-8625-thread-1) [    ] o.a.s.c.a.s.SimClusterStateProvider -- finished createCollection testScaleUp_collection, currentVersion=6
   [junit4]   2> 3567459 DEBUG (simCloudManagerPool-8625-thread-5) [    ] o.a.s.c.a.s.SimClusterStateProvider ** creating new collection states, currentVersion=6
   [junit4]   2> 3567460 DEBUG (simCloudManagerPool-8625-thread-5) [    ] o.a.s.c.a.s.SimClusterStateProvider ** saved cluster state version 6
   [junit4]   2> 3567461 DEBUG (simCloudManagerPool-8625-thread-7) [    ] o.a.s.c.a.s.SimClusterStateProvider -- elected new leader for testScaleUp_collection / shard2 (currentVersion=7): {"core_node3":{
   [junit4]   2>     "core":"testScaleUp_collection_shard2_replica_n3",
   [junit4]   2>     "shard":"shard2",
   [junit4]   2>     "collection":"testScaleUp_collection",
   [junit4]   2>     "node_name":"127.0.0.1:10059_solr",
   [junit4]   2>     "type":"NRT",
   [junit4]   2>     "leader":"true",
   [junit4]   2>     "SEARCHER.searcher.maxDoc":0,
   [junit4]   2>     "SEARCHER.searcher.deletedDocs":0,
   [junit4]   2>     "INDEX.sizeInBytes":10240,
   [junit4]   2>     "state":"active",
   [junit4]   2>     "INDEX.sizeInGB":9.5367431640625E-6,
   [junit4]   2>     "SEARCHER.searcher.numDocs":0}}
   [junit4]   2> 3567461 DEBUG (TEST-TestSimExtremeIndexing.testScaleUp-seed#[C7158A17B77797DB]) [    ] o.a.s.c.a.s.SimClusterStateProvider ** creating new collection states, currentVersion=7
   [junit4]   2> 3567461 DEBUG (TEST-TestSimExtremeIndexing.testScaleUp-seed#[C7158A17B77797DB]) [    ] o.a.s.c.a.s.SimClusterStateProvider ** saved cluster state version 7
   [junit4]   2> 3567476 DEBUG (simCloudManagerPool-8625-thread-9) [    ] o.a.s.c.a.s.SimClusterStateProvider ** creating new collection states, currentVersion=8
   [junit4]   2> 3567477 DEBUG (simCloudManagerPool-8625-thread-9) [    ] o.a.s.c.a.s.SimClusterStateProvider ** saved cluster state version 8
   [junit4]   2> 3567481 DEBUG (simCloudManagerPool-8625-thread-9) [    ] o.a.s.c.a.AutoScalingHandler Verified autoscaling configuration
   [junit4]   2> 3567481 DEBUG (simCloudManagerPool-8625-thread-9) [    ] o.a.s.c.a.OverseerTriggerThread Refreshing /autoscaling.json with znode version 2
   [junit4]   2> 3567502 DEBUG (Simulated OverseerAutoScalingTriggerThread) [    ] o.a.s.c.a.OverseerTriggerThread Processed trigger updates upto znodeVersion 2
   [junit4]   2> 3567502 DEBUG (Simulated OverseerAutoScalingTriggerThread) [    ] o.a.s.c.a.OverseerTriggerThread -- cleaning old nodeLost / nodeAdded markers
   [junit4]   2> 3567502 DEBUG (Simulated OverseerAutoScalingTriggerThread) [    ] o.a.s.c.a.OverseerTriggerThread Current znodeVersion 2, lastZnodeVersion 2
   [junit4]   2> 3567656 INFO  (TEST-TestSimExtremeIndexing.testScaleUp-seed#[C7158A17B77797DB]) [    ] o.a.s.c.a.s.TestSimExtremeIndexing #### Total docs so far: 200,000
   [junit4]   2> 3567737 INFO  (TEST-TestSimExtremeIndexing.testScaleUp-seed#[C7158A17B77797DB]) [    ] o.a.s.c.a.s.TestSimExtremeIndexing #### Total docs so far: 400,000
   [junit4]   2> 3567788 INFO  (TEST-TestSimExtremeIndexing.testScaleUp-seed#[C7158A17B77797DB]) [    ] o.a.s.c.a.s.TestSimExtremeIndexing #### Total docs so far: 600,000
   [junit4]   2> 3567840 INFO  (TEST-TestSimExtremeIndexing.testScaleUp-seed#[C7158A17B77797DB]) [    ] o.a.s.c.a.s.TestSimExtremeIndexing #### Total docs so far: 800,000
   [junit4]   2> 3567881 INFO  (TEST-TestSimExtremeIndexing.testScaleUp-seed#[C7158A17B77797DB]) [    ] o.a.s.c.a.s.TestSimExtremeIndexing #### Total docs so far: 1,000,000
   [junit4]   2> 3568007 INFO  (TEST-TestSimExtremeIndexing.testScaleUp-seed#[C7158A17B77797DB]) [    ] o.a.s.c.a.s.TestSimExtremeIndexing #### Total docs so far: 1,200,000
   [junit4]   2> 3568125 INFO  (TEST-TestSimExtremeIndexing.testScaleUp-seed#[C7158A17B77797DB]) [    ] o.a.s.c.a.s.TestSimExtremeIndexing #### Total docs so far: 1,400,000
   [junit4]   2> 3568213 INFO  (TEST-TestSimExtremeIndexing.testScaleUp-seed#[C7158A17B77797DB]) [    ] o.a.s.c.a.s.TestSimExtremeIndexing #### Total docs so far: 1,600,000
   [junit4]   2> 3568355 INFO  (TEST-TestSimExtremeIndexing.testScaleUp-seed#[C7158A17B77797DB]) [    ] o.a.s.c.a.s.TestSimExtremeIndexing #### Total docs so far: 1,800,000
   [junit4]   2> 3568444 INFO  (TEST-TestSimExtremeIndexing.testScaleUp-seed#[C7158A17B77797DB]) [    ] o.a.s.c.a.s.TestSimExtremeIndexing #### Total docs so far: 2,000,000
   [junit4]   2> 3568445 INFO  (TEST-TestSimExtremeIndexing.testScaleUp-seed#[C7158A17B77797DB]) [    ] o.a.s.c.a.s.TestSimExtremeIndexing #### Total docs so far: 2,200,000
   [junit4]   2> 3568445 INFO  (TEST-TestSimExtremeIndexing.testScaleUp-seed#[C7158A17B77797DB]) [    ] o.a.s.c.a.s.TestSimExtremeIndexing #### Total docs so far: 2,400,000
   [junit4]   2> 3568446 INFO  (TEST-TestSimExtremeIndexing.testScaleUp-seed#[C7158A17B77797DB]) [    ] o.a.s.c.a.s.TestSimExtremeIndexing #### Total docs so far: 2,600,000
   [junit4]   2> 3568446 INFO  (TEST-TestSimExtremeIndexing.testScaleUp-seed#[C7158A17B77797DB]) [    ] o.a.s.c.a.s.TestSimExtremeIndexing #### Total docs so far: 2,800,000
   [junit4]   2> 3568447 INFO  (TEST-TestSimExtremeIndexing.testScaleUp-seed#[C7158A17B77797DB]) [    ] o.a.s.c.a.s.TestSimExtremeIndexing #### Total docs so far: 3,000,000
   [junit4]   2> 3568448 INFO  (TEST-TestSimExtremeIndexing.testScaleUp-seed#[C7158A17B77797DB]) [    ] o.a.s.c.a.s.TestSimExtremeIndexing #### Total docs so far: 3,200,000
   [junit4]   2> 3568448 INFO  (TEST-TestSimExtremeIndexing.testScaleUp-seed#[C7158A17B77797DB]) [    ] o.a.s.c.a.s.TestSimExtremeIndexing #### Total docs so far: 3,400,000
   [junit4]   2> 3568469 INFO  (TEST-TestSimExtremeIndexing.testScaleUp-seed#[C7158A17B77797DB]) [    ] o.a.s.c.a.s.TestSimExtremeIndexing #### Total docs so far: 3,600,000
   [junit4]   2> 3568470 INFO  (TEST-TestSimExtremeIndexing.testScaleUp-seed#[C7158A17B77797DB]) [    ] o.a.s.c.a.s.TestSimExtremeIndexing #### Total docs so far: 3,800,000
   [junit4]   2> 3568470 INFO  (TEST-TestSimExtremeIndexing.testScaleUp-seed#[C7158A17B77797DB]) [    ] o.a.s.c.a.s.TestSimExtremeIndexing #### Total docs so far: 4,000,000
   [junit4]   2> 3568471 INFO  (TEST-TestSimExtremeIndexing.testScaleUp-seed#[C7158A17B77797DB]) [    ] o.a.s.c.a.s.TestSimExtremeIndexing #### Total docs so far: 4,200,000
   [junit4]   2> 3568471 INFO  (TEST-TestSimExtremeIndexing.testScaleUp-seed#[C7158A17B77797DB]) [    ] o.a.s.c.a.s.TestSimExtremeIndexing #### Total docs so far: 4,400,000
   [junit4]   2> 3568472 INFO  (TEST-TestSimExtremeIndexing.testScaleUp-seed#[C7158A17B77797DB]) [    ] o.a.s.c.a.s.TestSimExtremeIndexing #### Total docs so far: 4,600,000
   [junit4]   2> 3568472 INFO  (TEST-TestSimExtremeIndexing.testScaleUp-seed#[C7158A17B77797DB]) [    ] o.a.s.c.a.s.TestSimExtremeIndexing #### Total docs so far: 4,800,000
   [junit4]   2> 3568473 INFO  (TEST-TestSimExtremeIndexing.testScaleUp-seed#[C7158A17B77797DB]) [    ] o.a.s.c.a.s.TestSimExtremeIndexing #### Total docs so far: 5,000,000
   [junit4]   2> 3568473 INFO  (TEST-TestSimExtremeIndexing.testScaleUp-seed#[C7158A17B77797DB]) [    ] o.a.s.c.a.s.TestSimExtremeIndexing #### Total docs so far: 5,200,000
   [junit4]   2> 3568474 INFO  (TEST-TestSimExtremeIndexing.testScaleUp-seed#[C7158A17B77797DB]) [    ] o.a.s.c.a.s.TestSimExtremeIndexing #### Total docs so far: 5,400,000
   [junit4]   2> 3568474 INFO  (TEST-TestSimExtremeIndexing.testScaleUp-seed#[C7158A17B77797DB]) [    ] o.a.s.c.a.s.TestSimExtremeIndexing #### Total docs so far: 5,600,000
   [junit4]   2> 3568474 INFO  (TEST-TestSimExtremeIndexing.testScaleUp-seed#[C7158A17B77797DB]) [    ] o.a.s.c.a.s.TestSimExtremeIndexing #### Total docs so far: 5,800,000
   [junit4]   2> 3568475 INFO  (TEST-TestSimExtremeIndexing.testScaleUp-seed#[C7158A17B77797DB]) [    ] o.a.s.c.a.s.TestSimExtremeIndexing #### Total docs so far: 6,000,000
   [junit4]   2> 3568475 INFO  (TEST-TestSimExtremeIndexing.testScaleUp-seed#[C7158A17B77797DB]) [    ] o.a.s.c.a.s.TestSimExtremeIndexing #### Total docs so far: 6,200,000
   [junit4]   2> 3568476 INFO  (TEST-TestSimExtremeIndexing.testScaleUp-seed#[C7158A17B77797DB]) [    ] o.a.s.c.a.s.TestSimExtremeIndexing #### Total docs so far: 6,400,000
   [junit4]   2> 3568476 INFO  (TEST-TestSimExtremeIndexing.testScaleUp-seed#[C7158A17B77797DB]) [    ] o.a.s.c.a.s.TestSimExtremeIndexing #### Total docs so far: 6,600,000
   [junit4]   2> 3568502 INFO  (TEST-TestSimExtremeIndexing.testScaleUp-seed#[C7158A17B77797DB]) [    ] o.a.s.c.a.s.TestSimExtremeIndexing #### Total docs so far: 6,800,000
   [junit4]   2> 3568502 INFO  (TEST-TestSimExtremeIndexing.testScaleUp-seed#[C7158A17B77797DB]) [    ] o.a.s.c.a.s.TestSimExtremeIndexing #### Total docs so far: 7,000,000
   [junit4]   2> 3568505 INFO  (TEST-TestSimExtremeIndexing.testScaleUp-seed#[C7158A17B77797DB]) [    ] o.a.s.c.a.s.TestSimExtremeIndexing #### Total docs so far: 7,200,000
   [junit4]   2> 3568521 INFO  (TEST-TestSimExtremeIndexing.testScaleUp-seed#[C7158A17B77797DB]) [    ] o.a.s.c.a.s.TestSimExtremeIndexing #### Total docs so far: 7,400,000
   [junit4]   2> 3568542 INFO  (TEST-TestSimExtremeIndexing.testScaleUp-seed#[C7158A17B77797DB]) [    ] o.a.s.c.a.s.TestSimExtremeIndexing #### Total docs so far: 7,600,000
   [junit4]   2> 3568542 INFO  (TEST-TestSimExtremeIndexing.testScaleUp-seed#[C7158A17B77797DB]) [    ] o.a.s.c.a.s.TestSimExtremeIndexing #### Total docs so far: 7,800,000
   [junit4]   2> 3568543 INFO  (TEST-TestSimExtremeIndexing.testScaleUp-seed#[C7158A17B77797DB]) [    ] o.a.s.c.a.s.TestSimExtremeIndexing #### Total docs so far: 8,000,000
   [junit4]   2> 3568543 INFO  (TEST-TestSimExtremeIndexing.testScaleUp-seed#[C7158A17B77797DB]) [    ] o.a.s.c.a.s.TestSimExtremeIndexing #### Total docs so far: 8,200,000
   [junit4]   2> 3568543 INFO  (TEST-TestSimExtremeIndexing.testScaleUp-seed#[C7158A17B77797DB]) [    ] o.a.s.c.a.s.TestSimExtremeIndexing #### Total docs so far: 8,400,000
   [junit4]   2> 3568544 INFO  (TEST-TestSimExtremeIndexing.testScaleUp-seed#[C7158A17B77797DB]) [    ] o.a.s.c.a.s.TestSimExtremeIndexing #### Total docs so far: 8,600,000
   [junit4]   2> 3568544 INFO  (TEST-TestSimExtremeIndexing.testScaleUp-seed#[C7158A17B77797DB]) [    ] o.a.s.c.a.s.TestSimExtremeIndexing #### Total docs so far: 8,800,000
   [junit4]   2> 3568545 INFO  (TEST-TestSimExtremeIndexing.testScaleUp-seed#[C7158A17B77797DB]) [    ] o.a.s.c.a.s.TestSimExtremeIndexing #### Total docs so far: 9,000,000
   [junit4]   2> 3568557 INFO  (TEST-TestSimExtremeIndexing.testScaleUp-seed#[C7158A17B77797DB]) [    ] o.a.s.c.a.s.TestSimExtremeIndexing #### Total docs so far: 9,200,000
   [junit4]   2> 3568558 INFO  (TEST-TestSimExtremeIndexing.testScaleUp-seed#[C7158A17B77797DB]) [    ] o.a.s.c.a.s.TestSimExtremeIndexing #### Total docs so far: 9,400,000
   [junit4]   2> 3568558 INFO  (TEST-TestSimExtremeIndexing.testScaleUp-seed#[C7158A17B77797DB]) [    ] o.a.s.c.a.s.TestSimExtremeIndexing #### Total docs so far: 9,600,000
   [junit4]   2> 3568559 INFO  (TEST-TestSimExtremeIndexing.testScaleUp-seed#[C7158A17B77797DB]) [    ] o.a.s.c.a.s.TestSimExtremeIndexing #### Total docs so far: 9,800,000
   [junit4]   2> 3568559 INFO  (TEST-TestSimExtremeIndexing.testScaleUp-seed#[C7158A17B77797DB]) [    ] o.a.s.c.a.s.TestSimExtremeIndexing #### Total docs so far: 10,000,000
   [junit4]   2> 3568560 INFO  (TEST-TestSimExtremeIndexing.testScaleUp-seed#[C7158A17B77797DB]) [    ] o.a.s.c.a.s.TestSimExtremeIndexing #### Total docs so far: 10,200,000
   [junit4]   2> 3568560 INFO  (TEST-TestSimExtremeIndexing.testScaleUp-seed#[C7158A17B77797DB]) [    ] o.a.s.c.a.s.TestSimExtremeIndexing #### Total docs so far: 10,400,000
   [junit4]   2> 3568578 INFO  (TEST-TestSimExtremeIndexing.testScaleUp-seed#[C7158A17B77797DB]) [    ] o.a.s.c.a.s.TestSimExtremeIndexing #### Total docs so far: 10,600,000
   [junit4]   2> 3568657 INFO  (TEST-TestSimExtremeIndexing.testScaleUp-seed#[C7158A17B77797DB]) [    ] o.a.s.c.a.s.TestSimExtremeIndexing #### Total docs so far: 10,800,000
   [junit4]   2> 3568657 INFO  (TEST-TestSimExtremeIndexing.testScaleUp-seed#[C7158A17B77797DB]) [    ] o.a.s.c.a.s.TestSimExtremeIndexing #### Total docs so far: 11,000,000
   [junit4]   2> 3568658 INFO  (TEST-TestSimExtremeIndexing.testScaleUp-seed#[C7158A17B77797DB]) [    ] o.a.s.c.a.s.TestSimExtremeIndexing #### Total docs so far: 11,200,000
   [junit4]   2> 3568658 INFO  (TEST-TestSimExtremeIndexing.testScaleUp-seed#[C7158A17B77797DB]) [    ] o.a.s.c.a.s.TestSimExtremeIndexing #### Total docs so far: 11,400,000
   [junit4]   2> 3568672 INFO  (TEST-TestSimExtremeIndexing.testScaleUp-seed#[C7158A17B77797DB]) [    ] o.a.s.c.a.s.TestSimExtremeIndexing #### Total docs so far: 11,600,000
   [junit4]   2> 3568672 INFO  (TEST-TestSimExtremeIndexing.testScaleUp-seed#[C7158A17B77797DB]) [    ] o.a.s.c.a.s.TestSimExtremeIndexing #### Total docs so far: 11,800,000
   [junit4]   2> 3568673 INFO  (TEST-TestSimExtremeIndexing.testScaleUp-seed#[C7158A17B77797DB]) [    ] o.a.s.c.a.s.TestSimExtremeIndexing #### Total docs so far: 12,000,000
   [junit4]   2> 3568673 INFO  (TEST-TestSimExtremeIndexing.testScaleUp-seed#[C7158A17B77797DB]) [    ] o.a.s.c.a.s.TestSimExtremeIndexing #### Total docs so far: 12,200,000
   [junit4]   2> 3568674 INFO  (TEST-TestSimExtremeIndexing.testScaleUp-seed#[C7158A17B77797DB]) [    ] o.a.s.c.a.s.TestSimExtremeIndexing #### Total docs so far: 12,400,000
   [junit4]   2> 3568687 INFO  (TEST-TestSimExtremeIndexing.testScaleUp-seed#[C7158A17B77797DB]) [    ] o.a.s.c.a.s.TestSimExtremeIndexing #### Total docs so far: 12,600,000
   [junit4]   2> 3568690 INFO  (TEST-TestSimExtremeIndexing.testScaleUp-seed#[C7158A17B77797DB]) [    ] o.a.s.c.a.s.TestSimExtremeIndexing #### Total docs so far: 12,800,000
   [junit4]   2> 3568700 INFO  (TEST-TestSimExtremeIndexing.testScaleUp-seed#[C7158A17B77797DB]) [    ] o.a.s.c.a.s.TestSimExtremeIndexing #### Total docs so far: 13,000,000
   [junit4]   2> 3568701 INFO  (TEST-TestSimExtremeIndexing.testScaleUp-seed#[C7158A17B77797DB]) [    ] o.a.s.c.a.s.TestSimExtremeIndexing #### Total docs so far: 13,200,000
   [junit4]   2> 3568701 INFO  (TEST-TestSimExtremeIndexing.testScaleUp-seed#[C7158A17B77797DB]) [    ] o.a.s.c.a.s.TestSimExtremeIndexing #### Total docs so far: 13,400,000
   [junit4]   2> 3568701 INFO  (TEST-TestSimExtremeIndexing.testScaleUp-seed#[C7158A17B77797DB]) [    ] o.a.s.c.a.s.TestSimExtremeIndexing #### Total docs so far: 13,600,000
   [junit4]   2> 3568702 INFO  (TEST-TestSimExtremeIndexing.testScaleUp-seed#[C7158A17B77797DB]) [    ] o.a.s.c.a.s.TestSimExtremeIndexing #### Total docs so far: 13,800,000
   [junit4]   2> 3568702 INFO  (TEST-TestSimExtremeIndexing.testScaleUp-seed#[C7158A17B77797DB]) [    ] o.a.s.c.a.s.TestSimExtremeIndexing #### Total docs so far: 14,000,000
   [junit4]   2> 3568703 INFO  (TEST-TestSimExtremeIndexing.testScaleUp-seed#[C7158A17B77797DB]) [    ] o.a.s.c.a.s.TestSimExtremeIndexing #### Total docs so far: 14,200,000
   [junit4]   2> 3568703 INFO  (TEST-TestSimExtremeIndexing.testScaleUp-seed#[C7158A17B77797DB]) [    ] o.a.s.c.a.s.TestSimExtremeIndexing #### Total docs so far: 14,400,000
   [junit4]   2> 3568716 INFO  (TEST-TestSimExtremeIndexing.testScaleUp-seed#[C7158A17B77797DB]) [    ] o.a.s.c.a.s.TestSimExtremeIndexing #### Total docs so far: 14,600,000
   [junit4]   2> 3568716 INFO  (TEST-TestSimExtremeIndexing.testScaleUp-seed#[C7158A17B77797DB]) [    ] o.a.s.c.a.s.TestSimExtremeIndexing #### Total docs so far: 14,800,000
   [junit4]   2> 3568717 INFO  (TEST-TestSimExtremeIndexing.testScaleUp-seed#[C7158A17B77797DB]) [    ] o.a.s.c.a.s.TestSimExtremeIndexing #### Total docs so far: 15,000,000
   [junit4]   2> 3568717 INFO  (TEST-TestSimExtremeIndexing.testScaleUp-seed#[C7158A17B77797DB]) [    ] o.a.s.c.a.s.TestSimExtremeIndexing #### Total docs so far: 15,200,000
   [junit4]   2> 3568718 INFO  (TEST-TestSimExtremeIndexing.testScaleUp-seed#[C7158A17B77797DB]) [    ] o.a.s.c.a.s.TestSimExtremeIndexing #### Total docs so far: 15,400,000
   [junit4]   2> 3568718 INFO  (TEST-TestSimExtremeIndexing.testScaleUp-seed#[C7158A17B77797DB]) [    ] o.a.s.c.a.s.TestSimExtremeIndexing #### Total docs so far: 15,600,000
   [junit4]   2> 3568718 INFO  (TEST-TestSimExtremeIndexing.testScaleUp-seed#[C7158A17B77797DB]) [    ] o.a.s.c.a.s.TestSimExtremeIndexing #### Total docs so far: 15,800,000
   [junit4]   2> 3568719 INFO  (TEST-TestSimExtremeIndexing.testScaleUp-seed#[C7158A17B77797DB]) [    ] o.a.s.c.a.s.TestSimExtremeIndexing #### Total docs so far: 16,000,000
   [junit4]   2> 3568719 INFO  (TEST-TestSimExtremeIndexing.testScaleUp-seed#[C7158A17B77797DB]) [    ] o.a.s.c.a.s.TestSimExtremeIndexing #### Total docs so far: 16,200,000
   [junit4]   2> 3568728 INFO  (TEST-TestSimExtremeIndexing.testScaleUp-seed#[C7158A17B77797DB]) [    ] o.a.s.c.a.s.TestSimExtremeIndexing #### Total docs so far: 16,400,000
   [junit4]   2> 3568729 INFO  (TEST-TestSimExtremeIndexing.testScaleUp-seed#[C7158A17B77797DB]) [    ] o.a.s.c.a.s.TestSimExtremeIndexing #### Total docs so far: 16,600,000
   [junit4]   2> 3568729 INFO  (TEST-TestSimExtremeIndexing.testScaleUp-seed#[C7158A17B77797DB]) [    ] o.a.s.c.a.s.TestSimExtremeIndexing #### Total docs so far: 16,800,000
   [junit4]   2> 3568730 INFO  (TEST-TestSimExtremeIndexing.testScaleUp-seed#[C7158A17B77797DB]) [    ] o.a.s.c.a.s.TestSimExtremeIndexing #### Total docs so far: 17,000,000
   [junit4]   2> 3568730 INFO  (TEST-TestSimExtremeIndexing.testScaleUp-seed#[C7158A17B77797DB]) [    ] o.a.s.c.a.s.TestSimExtremeIndexing #### Total docs so far: 17,200,000
   [junit4]   2> 3568730 INFO  (TEST-TestSimExtremeIndexing.testScaleUp-seed#[C7158A17B77797DB]) [    ] o.a.s.c.a.s.TestSimExtremeIndexing #### Total docs so far: 17,400,000
   [junit4]   2> 3568731 INFO  (TEST-TestSimExtremeIndexing.testScaleUp-seed#[C7158A17B77797DB]) [    ] o.a.s.c.a.s.TestSimExtremeIndexing #### Total docs so far: 17,600,000
   [junit4]   2> 3568733 INFO  (TEST-TestSimExtremeIndexing.testScaleUp-seed#[C7158A17B77797DB]) [    ] o.a.s.c.a.s.TestSimExtremeIndexing #### Total docs so far: 17,800,000
   [junit4]   2> 3568740 INFO  (TEST-TestSimExtremeIndexing.testScaleUp-seed#[C7158A17B77797DB]) [    ] o.a.s.c.a.s.TestSimExtremeIndexing #### Total docs so far: 18,000,000
   [junit4]   2> 3568741 INFO  (TEST-TestSimExtremeIndexing.testScaleUp-seed#[C7158A17B77797DB]) [    ] o.a.s.c.a.s.TestSimExtremeIndexing #### Total docs so far: 18,200,000
   [junit4]   2> 3568847 INFO  (TEST-TestSimExtremeIndexing.testScaleUp-seed#[C7158A17B77797DB]) [    ] o.a.s.c.a.s.TestSimExtremeIndexing #### Total docs so far: 18,400,000
   [junit4]   2> 3568850 INFO  (TEST-TestSimExtremeIndexing.testScaleUp-seed#[C7158A17B77797DB]) [    ] o.a.s.c.a.s.TestSimExtremeIndexing #### Total docs so far: 18,600,000
   [junit4]   2> 3568850 INFO  (TEST-TestSimExtremeIndexing.testScaleUp-seed#[C7158A17B77797DB]) [    ] o.a.s.c.a.s.TestSimExtremeIndexing #### Total docs so far: 18,800,000
   [junit4]   2> 3568851 INFO  (TEST-TestSimExtremeIndexing.testScaleUp-seed#[C7158A17B77797DB]) [    ] o.a.s.c.a.s.TestSimExtremeIndexing #### Total docs so far: 19,000,000
   [junit4]   2> 3568851 INFO  (TEST-TestSimExtremeIndexing.testScaleUp-seed#[C7158A17B77797DB]) [    ] o.a.s.c.a.s.TestSimExtremeIndexing #### Total docs so far: 19,200,000
   [junit4]   2> 3568851 INFO  (TEST-TestSimExtremeIndexing.testScaleUp-seed#[C7158A17B77797DB]) [    ] o.a.s.c.a.s.TestSimExtremeIndexing #### Total docs so far: 19,400,000
   [junit4]   2> 3568852 INFO  (TEST-TestSimExtremeIndexing.testScaleUp-seed#[C7158A17B77797DB]) [    ] o.a.s.c.a.s.TestSimExtremeIndexing #### Total docs so far: 19,600,000
   [junit4]   2> 3568852 INFO  (TEST-TestSimExtremeIndexing.testScaleUp-seed#[C7158A17B77797DB]) [    ] o.a.s.c.a.s.TestSimExtremeIndexing #### Total docs so far: 19,800,000
   [junit4]   2> 3568853 INFO  (TEST-TestSimExtremeIndexing.testScaleUp-seed#[C7158A17B77797DB]) [    ] o.a.s.c.a.s.TestSimExtremeIndexing #### Total docs so far: 20,000,000
   [junit4]   2> 3568853 INFO  (TEST-TestSimExtremeIndexing.testScaleUp-seed#[C7158A17B77797DB]) [    ] o.a.s.c.a.s.TestSimExtremeIndexing #### Total docs so far: 20,200,000
   [junit4]   2> 3568870 INFO  (TEST-TestSimExtremeIndexing.testScaleUp-seed#[C7158A17B77797DB]) [    ] o.a.s.c.a.s.TestSimExtremeIndexing #### Total docs so far: 20,400,000
   [junit4]   2> 3568871 INFO  (TEST-TestSimExtremeIndexing.testScaleUp-seed#[C7158A17B77797DB]) [    ] o.a.s.c.a.s.TestSimExtremeIndexing #### Total docs so far: 20,600,000
   [junit4]   2> 3568871 INFO  (TEST-TestSimExtremeIndexing.testScaleUp-seed#[C7158A17B77797DB]) [    ] o.a.s.c.a.s.TestSimExtremeIndexing #### Total docs so far: 20,800,000
   [junit4]   2> 3568871 INFO  (TEST-TestSimExtremeIndexing.testScaleUp-seed#[C7158A17B77797DB]) [    ] o.a.s.c.a.s.TestSimExtremeIndexing #### Total docs so far: 21,000,000
   [junit4]   2> 3568872 INFO  (TEST-TestSimExtremeIndexing.testScaleUp-seed#[C7158A17B77797DB]) [    ] o.a.s.c.a.s.TestSimExtremeIndexing #### Total docs so far: 21,200,000
   [junit4]   2> 3568872 INFO  (TEST-TestSimExtremeIndexing.testScaleUp-seed#[C7158A17B77797DB]) [    ] o.a.s.c.a.s.TestSimExtremeIndexing #### Total docs so far: 21,400,000
   [junit4]   2> 3568873 INFO  (TEST-TestSimExtremeIndexing.testScaleUp-seed#[C7158A17B77797DB]) [    ] o.a.s.c.a.s.TestSimExtremeIndexing #### Total docs so far: 21,600,000
   [junit4]   2> 3568873 INFO  (TEST-TestSimExtremeIndexing.testScaleUp-seed#[C7158A17B77797DB]) [    ] o.a.s.c.a.s.TestSimExtremeIndexing #### Total docs so far: 21,800,000
   [junit4]   2> 3568873 INFO  (TEST-TestSimExtremeIndexing.testScaleUp-seed#[C7158A17B77797DB]) [    ] o.a.s.c.a.s.TestSimExtremeIndexing #### Total docs so far: 22,000,000
   [junit4]   2> 3568894 INFO  (TEST-TestSimExtremeIndexing.testScaleUp-seed#[C7158A17B77797DB]) [    ] o.a.s.c.a.s.TestSimExtremeIndexing #### Total docs so far: 22,200,000
   [junit4]   2> 3568894 INFO  (TEST-TestSimExtremeIndexing.testScaleUp-seed#[C7158A17B77797DB]) [    ] o.a.s.c.a.s.TestSimExtremeIndexing #### Total docs so far: 22,400,000
   [junit4]   2> 3568895 INFO  (TEST-TestSimExtremeIndexing.testScaleUp-seed#[C7158A17B77797DB]) [    ] o.a.s.c.a.s.TestSimExtremeIndexing #### Total docs so far: 22,600,000
   [junit4]   2> 3568895 INFO  (TEST-TestSimExtremeIndexing.testScaleUp-seed#[C7158A17B77797DB]) [    ] o.a.s.c.a.s.TestSimExtremeIndexing #### Total docs so far: 22,800,000
   [junit4]   2> 3568896 INFO  (TEST-TestSimExtremeIndexing.testScaleUp-seed#[C7158A17B77797DB]) [    ] o.a.s.c.a.s.TestSimExtremeIndexing #### Total docs so far: 23,000,000
   [junit4]   2> 3568896 INFO  (TEST-TestSimExtremeIndexing.testScaleUp-seed#[C7158A17B77797DB]) [    ] o.a.s.c.a.s.TestSimExtremeIndexing #### Total docs so far: 23,200,000
   [junit4]   2> 3568897 INFO  (TEST-TestSimExtremeIndexing.testScaleUp-seed#[C7158A17B77797DB]) [    ] o.a.s.c.a.s.TestSimExtremeIndexing #### Total docs so far: 23,400,000
   [junit4]   2> 3568897 INFO  (TEST-TestSimExtremeIndexing.testScaleUp-seed#[C7158A17B77797DB]) [    ] o.a.s.c.a.s.TestSimExtremeIndexing #### Total docs so far: 23,600,000
   [junit4]   2> 3568897 INFO  (TEST-TestSimExtremeIndexing.testScaleUp-seed#[C7158A17B77797DB]) [    ] o.a.s.c.a.s.TestSimExtremeIndexing #### Total docs so far: 23,800,000
   [junit4]   2> 3568910 INFO  (TEST-TestSimExtremeIndexing.testScaleUp-seed#[C7158A17B77797DB]) [    ] o.a.s.c.a.s.TestSimExtremeIndexing #### Total docs so far: 24,000,000
   [junit4]   2> 3568911 INFO  (TEST-TestSimExtremeIndexing.testScaleUp-seed#[C7158A17B77797DB]) [    ] o.a.s.c.a.s.TestSimExtremeIndexing #### Total docs so far: 24,200,000
   [junit4]   2> 3568911 INFO  (TEST-TestSimExtremeIndexing.testScaleUp-seed#[C7158A17B77797DB]) [    ] o.a.s.c.a.s.TestSimExtremeIndexing #### Total docs so far: 24,400,000
   [junit4]   2> 3568912 INFO  (TEST-TestSimExtremeIndexing.testScaleUp-seed#[C7158A17B77797DB]) [    ] o.a.s.c.a.s.TestSimExtremeIndexing #### Total docs so far: 24,600,000
   [junit4]   2> 3568912 INFO  (TEST-TestSimExtremeIndexing.testScaleUp-seed#[C7158A17B77797DB]) [    ] o.a.s.c.a.s.TestSimExtremeIndexing #### Total docs so far: 24,800,000
   [junit4]   2> 3568913 INFO  (TEST-TestSimExtremeIndexing.testScaleUp-seed#[C7158A17B77797DB]) [    ] o.a.s.c.a.s.TestSimExtremeIndexing #### Total docs so far: 25,000,000
   [junit4]   2> 3568913 INFO  (TEST-TestSimExtremeIndexing.testScaleUp-seed#[C7158A17B77797DB]) [    ] o.a.s.c.a.s.TestSimExtremeIndexing #### Total docs so far: 25,200,000
   [junit4]   2> 3568913 INFO  (TEST-TestSimExtremeIndexing.testScaleUp-seed#[C7158A17B77797DB]) [    ] o.a.s.c.a.s.TestSimExtremeIndexing #### Total docs so far: 25,400,000
   [junit4]   2> 3568914 INFO  (TEST-TestSimExtremeIndexing.testScaleUp-seed#[C7158A17B77797DB]) [    ] o.a.s.c.a.s.TestSimExtremeIndexing #### Total docs so far: 25,600,000
   [junit4]   2> 3568914 INFO  (TEST-TestSimExtremeIndexing.testScaleUp-seed#[C7158A17B77797DB]) [    ] o.a.s.c.a.s.TestSimExtremeIndexing #### Total docs so far: 25,800,000
   [junit4]   2> 3568915 INFO  (TEST-TestSimExtremeIndexing.testScaleUp-seed#[C7158A17B77797DB]) [    ] o.a.s.c.a.s.TestSimExtremeIndexing #### Total docs so far: 26,000,000
   [junit4]   2> 3568915 INFO  (TEST-TestSimExtremeIndexing.testScaleUp-seed#[C7158A17B77797DB]) [    ] o.a.s.c.a.s.TestSimExtremeIndexing #### Total docs so far: 26,200,000
   [junit4]   2> 3568915 INFO  (TEST-TestSimExtremeIndexing.testScaleUp-seed#[C7158A17B77797DB]) [    ] o.a.s.c.a.s.TestSimExtremeIndexing #### Total docs so far: 26,400,000
   [junit4]   2> 3568916 INFO  (TEST-TestSimExtremeIndexing.testScaleUp-seed#[C7158A17B77797DB]) [    ] o.a.s.c.a.s.TestSimExtremeIndexing #### Total docs so far: 26,600,000
   [junit4]   2> 3568916 INFO  (TEST-TestSimExtremeIndexing.testScaleUp-seed#[C7158A17B77797DB]) [    ] o.a.s.c.a.s.TestSimExtremeIndexing #### Total docs so far: 26,800,000
   [junit4]   2> 3568916 INFO  (TEST-TestSimExtremeIndexing.testScaleUp-seed#[C7158A17B77797DB]) [    ] o.a.s.c.a.s.TestSimExtremeIndexing #### Total docs so far: 27,000,000
   [junit4]   2> 3568917 INFO  (TEST-TestSimExtremeIndexing.testScaleUp-seed#[C7158A17B77797DB]) [    ] o.a.s.c.a.s.TestSimExtremeIndexing #### Total docs so far: 27,200,000
   [junit4]   2> 3568917 INFO  (TEST-TestSimExtremeIndexing.testScaleUp-seed#[C7158A17B77797DB]) [    ] o.a.s.c.a.s.TestSimExtremeIndexing #### Total docs so far: 27,400,000
   [junit4]   2> 3568918 INFO  (TEST-TestSimExtremeIndexing.testScaleUp-seed#[C7158A17B77797DB]) [    ] o.a.s.c.a.s.TestSimExtremeIndexing #### Total docs so far: 27,600,000
   [junit4]   2> 3568926 INFO  (TEST-TestSimExtremeIndexing.testScaleUp-seed#[C7158A17B77797DB]) [    ] o.a.s.c.a.s.TestSimExtremeIndexing #### Total docs so far: 27,800,000
   [junit4]   2> 3568927 INFO  (TEST-TestSimExtremeIndexing.testScaleUp-seed#[C7158A17B77797DB]) [    ] o.a.s.c.a.s.TestSimExtremeIndexing #### Total docs so far: 28,000,000
   [junit4]   2> 3568927 INFO  (TEST-TestSimExtremeIndexing.testScaleUp-seed#[C7158A17B77797DB]) [    ] o.a.s.c.a.s.TestSimExtremeIndexing #### Total docs so far: 28,200,000
   [junit4]   2> 3568927 INFO  (TEST-TestSimExtremeIndexing.testScaleUp-seed#[C7158A17B77797DB]) [    ] o.a.s.c.a.s.TestSimExtremeIndexing #### Total docs so far: 28,400,000
   [junit4]   2> 3568928 INFO  (TEST-TestSimExtremeIndexing.testScaleUp-seed#[C7158A17B77797DB]) [    ] o.a.s.c.a.s.TestSimExtremeIndexing #### Total docs so far: 28,600,000
   [junit4]   2> 3568928 INFO  (TEST-TestSimExtremeIndexing.testScaleUp-seed#[C7158A17B77797DB]) [    ] o.a.s.c.a.s.TestSimExtremeIndexing #### Total docs so far: 28,800,000
   [junit4]   2> 3568929 INFO  (TEST-TestSimExtremeIndexing.testScaleUp-seed#[C7158A17B77797DB]) [    ] o.a.s.c.a.s.TestSimExtremeIndexing #### Total docs so far: 29,000,000
   [junit4]   2> 3568929 INFO  (TEST-TestSimExtremeIndexing.testScaleUp-seed#[C7158A17B77797DB]) [    ] o.a.s.c.a.s.TestSimExtremeIndexing #### Total docs so far: 29,200,000
   [junit4]   2> 3568929 INFO  (TEST-TestSimExtremeIndexing.testScaleUp-seed#[C7158A17B77797DB]) [    ] o.a.s.c.a.s.TestSimExtremeIndexing #### Total docs so far: 29,400,000
   [junit4]   2> 3568930 INFO  (TEST-TestSimExtremeIndexing.testScaleUp-seed#[C7158A17B77797DB]) [    ] o.a.s.c.a.s.TestSimExtremeIndexing #### Total docs so far: 29,600,000
   [junit4]   2> 3568943 INFO  (TEST-TestSimExtremeIndexing.testScaleUp-seed#[C7158A17B77797DB]) [    ] o.a.s.c.a.s.TestSimExtremeIndexing #### Total docs so far: 29,800,000
   [junit4]   2> 3568943 INFO  (TEST-TestSimExtremeIndexing.testScaleUp-seed#[C7158A17B77797DB]) [    ] o.a.s.c.a.s.TestSimExtremeIndexing #### Total docs so far: 30,000,000
   [junit4]   2> 3568943 INFO  (TEST-TestSimExtremeIndexing.testScaleUp-seed#[C7158A17B77797DB]) [    ] o.a.s.c.a.s.TestSimExtremeIndexing #### Total docs so far: 30,200,000
   [junit4]   2> 3568944 INFO  (TEST-TestSimExtremeIndexing.testScaleUp-seed#[C7158A17B77797DB]) [    ] o.a.s.c.a.s.TestSimExtremeIndexing #### Total docs so far: 30,400,000
   [junit4]   2> 3568944 INFO  (TEST-TestSimExtremeIndexing.testScaleUp-seed#[C7158A17B77797DB]) [    ] o.a.s.c.a.s.TestSimExtremeIndexing #### Total docs so far: 30,600,000
   [junit4]   2> 3568945 INFO  (TEST-TestSimExtremeIndexing.testScaleUp-seed#[C7158A17B77797DB]) [    ] o.a.s.c.a.s.TestSimExtremeIndexing #### Total docs so far: 30,800,000
   [junit4]   2> 3568945 INFO  (TEST-TestSimExtremeIndexing.testScaleUp-seed#[C7158A17B77797DB]) [    ] o.a.s.c.a.s.TestSimExtremeIndexing #### Total docs so far: 31,000,000
   [junit4]   2> 3568946 INFO  (TEST-TestSimExtremeIndexing.testScaleUp-seed#[C7158A17B77797DB]) [    ] o.a.s.c.a.s.TestSimExtremeIndexing #### Total docs so far: 31,200,000
   [junit4]   2> 3568946 INFO  (TEST-TestSimExtremeIndexing.testScaleUp-seed#[C7158A17B77797DB]) [    ] o.a.s.c.a.s.TestSimExtremeIndexing #### Total docs so far: 31,400,000
   [junit4]   2> 3568946 INFO  (TEST-TestSimExtremeIndexing.testScaleUp-seed#[C7158A17B77797DB]) [    ] o.a.s.c.a.s.TestSimExtremeIndexing #### Total docs so far: 31,600,000
   [junit4]   2> 3568950 INFO  (TEST-TestSimExtremeIndexing.testScaleUp-seed#[C7158A17B77797DB]) [    ] o.a.s.c.a.s.TestSimExtremeIndexing #### Total docs so far: 31,800,000
   [junit4]   2> 3568950 INFO  (TEST-TestSimExtremeIndexing.testScaleUp-seed#[C7158A17B77797DB]) [    ] o.a.s.c.a.s.TestSimExtremeIndexing #### Total docs so far: 32,000,000
   [junit4]   2> 3568951 INFO  (TEST-TestSimExtremeIndexing.testScaleUp-seed#[C7158A17B77797DB]) [    ] o.a.s.c.a.s.TestSimExtremeIndexing #### Total docs so far: 32,200,000
   [junit4]   2> 3568951 INFO  (TEST-TestSimExtremeIndexing.testScaleUp-seed#[C7158A17B77797DB]) [    ] o.a.s.c.a.s.TestSimExtremeIndexing #### Total docs so far: 32,400,000
   [junit4]   2> 3568952 INFO  (TEST-TestSimExtremeIndexing.testScaleUp-seed#[C7158A17B77797DB]) [    ] o.a.s.c.a.s.TestSimExtremeIndexing #### Total docs so far: 32,600,000
   [junit4]   2> 3568952 INFO  (TEST-TestSimExtremeIndexing.testScaleUp-seed#[C7158A17B77797DB]) [    ] o.a.s.c.a.s.TestSimExtremeIndexing #### Total docs so far: 32,800,000
   [junit4]   2> 3568953 INFO  (TEST-TestSimExtremeIndexing.testScaleUp-seed#[C7158A17B77797DB]) [    ] o.a.s.c.a.s.TestSimExtremeIndexing #### Total docs so far: 33,000,000
   [junit4]   2> 3568953 INFO  (TEST-TestSimExtremeIndexing.testScaleUp-seed#[C7158A17B77797DB]) [    ] o.a.s.c.a.s.TestSimExtremeIndexing #### Total docs so far: 33,200,000
   [junit4]   2> 3568954 INFO  (TEST-TestSimExtremeIndexing.testScaleUp-seed#[C7158A17B77797DB]) [    ] o.a.s.c.a.s.TestSimExtremeIndexing #### Total docs so far: 33,400,000
   [junit4]   2> 3568954 INFO  (TEST-TestSimExtremeIndexing.testScaleUp-seed#[C7158A17B77797DB]) [    ] o.a.s.c.a.s.TestSimExtremeIndexing #### Total docs so far: 33,600,000
   [junit4]   2> 3568963 INFO  (TEST-TestSimExtremeIndexing.testScaleUp-seed#[C7158A17B77797DB]) [    ] o.a.s.c.a.s.TestSimExtremeIndexing #### Total docs so far: 33,800,000
   [junit4]   2> 3568963 INFO  (TEST-TestSimExtremeIndexing.testScaleUp-seed#[C7158A17B77797DB]) [    ] o.a.s.c.a.s.TestSimExtremeIndexing #### Total docs so far: 34,000,000
   [junit4]   2> 3568964 INFO  (TEST-TestSimExtremeIndexing.testScaleUp-seed#[C7158A17B77797DB]) [    ] o.a.s.c.a.s.TestSimExtremeIndexing #### Total docs so far: 34,200,000
   [junit4]   2> 3568964 INFO  (TEST-TestSimExtremeIndexing.testScaleUp-seed#[C7158A17B77797DB]) [    ] o.a.s.c.a.s.TestSimExtremeIndexing #### Total docs so far: 34,400,000
   [junit4]   2> 3568965 INFO  (TEST-TestSimExtremeIndexing.testScaleUp-seed#[C7158A17B77797DB]) [    ] o.a.s.c.a.s.TestSimExtremeIndexing #### Total docs so far: 34,600,000
   [junit4]   2> 3568965 INFO  (TEST-TestSimExtremeIndexing.testScaleUp-seed#[C7158A17B77797DB]) [    ] o.a.s.c.a.s.TestSimExtremeIndexing #### Total docs so far: 34,800,000
   [junit4]   2> 3568965 INFO  (TEST-TestSimExtremeIndexing.testScaleUp-seed#[C7158A17B77797DB]) [    ] o.a.s.c.a.s.TestSimExtremeIndexing #### Total docs so far: 35,000,000
   [junit4]   2> 3568966 INFO  (TEST-TestSimExtremeIndexing.testScaleUp-seed#[C7158A17B77797DB]) [    ] o.a.s.c.a.s.TestSimExtremeIndexing #### Total docs so far: 35,200,000
   [junit4]   2> 3568966 INFO  (TEST-TestSimExtremeIndexing.testScaleUp-seed#[C7158A17B77797DB]) [    ] o.a.s.c.a.s.TestSimExtremeIndexing #### Total docs so far: 35,400,000
   [junit4]   2> 3568975 INFO  (TEST-TestSimExtremeIndexing.testScaleUp-seed#[C7158A17B77797DB]) [    ] o.a.s.c.a.s.TestSimExtremeIndexing #### Total docs so far: 35,600,000
   [junit4]   2> 3568976 INFO  (TEST-TestSimExtremeIndexing.testScaleUp-seed#[C7158A17B77797DB]) [    ] o.a.s.c.a.s.TestSimExtremeIndexing #### Total docs so far: 35,800,000
   [junit4]   2> 3568977 INFO  (TEST-TestSimExtremeIndexing.testScaleUp-seed#[C7158A17B77797DB]) [    ] o.a.s.c.a.s.TestSimExtremeIndexing #### Total docs so far: 36,000,000
   [junit4]   2> 3568977 INFO  (TEST-TestSimExtremeIndexing.testScaleUp-seed#[C7158A17B77797DB]) [    ] o.a.s.c.a.s.TestSimExtremeIndexing #### Total docs so far: 36,200,000
   [junit4]   2> 3568977 INFO  (TEST-TestSimExtremeIndexing.testScaleUp-seed#[C7158A17B77797DB]) [    ] o.a.s.c.a.s.TestSimExtremeIndexing #### Total docs so far: 36,400,000
   [junit4]   2> 3568978 INFO  (TEST-TestSimExtremeIndexing.testScaleUp-seed#[C7158A17B77797DB]) [    ] o.a.s.c.a.s.TestSimExtremeIndexing #### Total docs so far: 36,600,000
   [junit4]   2> 3568978 INFO  (TEST-TestSimExtremeIndexing.testScaleUp-seed#[C7158A17B77797DB]) [    ] o.a.s.c.a.s.TestSimExtremeIndexing #### Total docs so far: 36,800,000
   [junit4]   2> 3568979 INFO  (TEST-TestSimExtremeIndexing.testScaleUp-seed#[C7158A17B77797DB]) [    ] o.a.s.c.a.s.TestSimExtremeIndexing #### Total docs so far: 37,000,000
   [junit4]   2> 3568979 INFO  (TEST-TestSimExtremeIndexing.testScaleUp-seed#[C7158A17B77797DB]) [    ] o.a.s.c.a.s.TestSimExtremeIndexing #### Total docs so far: 37,200,000
   [junit4]   2> 3568979 INFO  (TEST-TestSimExtremeIndexing.testScaleUp-seed#[C7158A17B77797DB]) [    ] o.a.s.c.a.s.TestSimExtremeIndexing #### Total docs so far: 37,400,000
   [junit4]   2> 3568980 INFO  (TEST-TestSimExtremeIndexing.testScaleUp-seed#[C7158A17B77797DB]) [    ] o.a.s.c.a.s.TestSimExtremeIndexing #### Total docs so far: 37,600,000
   [junit4]   2> 3568980 INFO  (TEST-TestSimExtremeIndexing.testScaleUp-seed#[C7158A17B77797DB]) [    ] o.a.s.c.a.s.TestSimExtremeIndexing #### Total docs so far: 37,800,000
   [junit4]   2> 3568980 INFO  (TEST-TestSimExtremeIndexing.testScaleUp-seed#[C7158A17B77797DB]) [    ] o.a.s.c.a.s.TestSimExtremeIndexing #### Total docs so far: 38,000,000
   [junit4]   2> 3568981 INFO  (TEST-TestSimExtremeIndexing.testScaleUp-seed#[C7158A17B77797DB]) [    ] o.a.s.c.a.s.TestSimExtremeIndexing #### Total docs so far: 38,200,000
   [junit4]   2> 3568982 INFO  (TEST-TestSimExtremeIndexing.testScaleUp-seed#[C7158A17B77797DB]) [    ] o.a.s.c.a.s.TestSimExtremeIndexing #### Total docs so far: 38,400,000
   [junit4]   2> 3568982 INFO  (TEST-TestSimExtremeIndexing.testScaleUp-seed#[C7158A17B77797DB]) [    ] o.a.s.c.a.s.TestSimExtremeIndexing #### Total docs so far: 38,600,000
   [junit4]   2> 3568983 INFO  (TEST-TestSimExtremeIndexing.testScaleUp-seed#[C7158A17B77797DB]) [    ] o.a.s.c.a.s.TestSimExtremeIndexing #### Total docs so far: 38,800,000
   [junit4]   2> 3568983 INFO  (TEST-TestSimExtremeIndexing.testScaleUp-seed#[C7158A17B77797DB]) [    ] o.a.s.c.a.s.TestSimExtremeIndexing #### Total docs so far: 39,000,000
   [junit4]   2> 3568999 INFO  (TEST-TestSimExtremeIndexing.testScaleUp-seed#[C7158A17B77797DB]) [    ] o.a.s.c.a.s.TestSimExtremeIndexing #### Total docs so far: 39,200,000
   [junit4]   2> 3569000 INFO  (TEST-TestSimExtremeIndexing.testScaleUp-seed#[C7158A17B77797DB]) [    ] o.a.s.c.a.s.TestSimExtremeIndexing #### Total docs so far: 39,400,000
   [junit4]   2> 3569000 INFO  (TEST-TestSimExtremeIndexing.testScaleUp-seed#[C7158A17B77797DB]) [    ] o.a.s.c.a.s.TestSimExtremeIndexing #### Total docs so far: 39,600,000
   [junit4]   2> 3569000 INFO  (TEST-TestSimExtremeIndexing.testScaleUp-seed#[C7158A17B77797DB]) [    ] o.a.s.c.a.s.TestSimExtremeIndexing #### Total docs so far: 39,800,000
   [junit4]   2> 3569000 INFO  (TEST-TestSimExtremeIndexing.testScaleUp-seed#[C7158A17B77797DB]) [    ] o.a.s.c.a.s.TestSimExtremeIndexing #### Total docs so far: 40,000,000
   [junit4]   2> 3569001 INFO  (TEST-TestSimExtremeIndexing.testScaleUp-seed#[C7158A17B77797DB]) [    ] o.a.s.c.a.s.TestSimExtremeIndexing #### Total docs so far: 40,200,000
   [junit4]   2> 3569001 INFO  (TEST-TestSimExtremeIndexing.testScaleUp-seed#[C7158A17B77797DB]) [    ] o.a.s.c.a.s.TestSimExtremeIndexing #### Total docs so far: 40,400,000
   [junit4]   2> 3569001 INFO  (TEST-TestSimExtremeIndexing.testScaleUp-seed#[C7158A17B77797DB]) [    ] o.a.s.c.a.s.TestSimExtremeIndexing #### Total docs so far: 40,600,000
   [junit4]   2> 3569001 INFO  (TEST-TestSimExtremeIndexing.testScaleUp-seed#[C7158A17B77797DB]) [    ] o.a.s.c.a.s.TestSimExtremeIndexing #### Total docs so far: 40,800,000
   [junit4]   2> 3569002 INFO  (TEST-TestSimExtremeIndexing.testScaleUp-seed#[C7158A17B77797DB]) [    ] o.a.s.c.a.s.TestSimExtremeIndexing #### Total docs so far: 41,000,000
   [junit4]   2> 3569002 INFO  (TEST-TestSimExtremeIndexing.testScaleUp-seed#[C7158A17B77797DB]) [    ] o.a.s.c.a.s.TestSimExtremeIndexing #### Total docs so far: 41,200,000
   [junit4]   2> 3569002 INFO  (TEST-TestSimExtremeIndexing.testScaleUp-seed#[C7158A17B77797DB]) [    ] o.a.s.c.a.s.TestSimExtremeIndexing #### Total docs so far: 41,400,000
   [junit4]   2> 3569002 INFO  (TEST-TestSimExtremeIndexing.testScaleUp-seed#[C7158A17B77797DB]) [    ] o.a.s.c.a.s.TestSimExtremeIndexing #### Total docs so far: 41,600,000
   [junit4]   2> 3569003 INFO  (TEST-TestSimExtremeIndexing.testScaleUp-seed#[C7158A17B77797DB]) [    ] o.a.s.c.a.s.TestSimExtremeIndexing #### Total docs so far: 41,800,000
   [junit4]   2> 3569003 INFO  (TEST-TestSimExtremeIndexing.testScaleUp-seed#[C7158A17B77797DB]) [    ] o.a.s.c.a.s.TestSimExtremeIndexing #### Total docs so far: 42,000,000
   [junit4]   2> 3569003 INFO  (TEST-TestSimExtremeIndexing.testScaleUp-seed#[C7158A17B77797DB]) [    ] o.a.s.c.a.s.TestSimExtremeIndexing #### Total docs so far: 42,200,000
   [junit4]   2> 3569016 INFO  (TEST-TestSimExtremeIndexing.testScaleUp-seed#[C7158A17B77797DB]) [    ] o.a.s.c.a.s.TestSimExtremeIndexing #### Total docs so far: 42,400,000
   [junit4]   2> 3569017 INFO  (TEST-TestSimExtremeIndexing.testScaleUp-seed#[C7158A17B77797DB]) [    ] o.a.s.c.a.s.TestSimExtremeIndexing #### Total docs so far: 42,600,000
   [junit4]   2> 3569017 INFO  (TEST-TestSimExtremeIndexing.testScaleUp-seed#[C7158A17B77797DB]) [    ] o.a.s.c.a.s.TestSimExtremeIndexing #### Total docs so far: 42,800,000
   [junit4]   2> 3569017 INFO  (TEST-TestSimExtremeIndexing.testScaleUp-seed#[C7158A17B77797DB]) [    ] o.a.s.c.a.s.TestSimExtremeIndexing #### Total docs so far: 43,000,000
   [junit4]   2> 3569017 INFO  (TEST-TestSimExtremeIndexing.testScaleUp-seed#[C7158A17B77797DB]) [    ] o.a.s.c.a.s.TestSimExtremeIndexing #### Total docs so far: 43,200,000
   [junit4]   2> 3569018 INFO  (TEST-TestSimExtremeIndexing.testScaleUp-seed#[C7158A17B77797DB]) [    ] o.a.s.c.a.s.TestSimExtremeIndexing #### Total docs so far: 43,400,000
   [junit4]   2> 3569018 INFO  (TEST-TestSimExtremeIndexing.testScaleUp-seed#[C7158A17B77797DB]) [    ] o.a.s.c.a.s.TestSimExtremeIndexing #### Total docs so far: 43,600,000
   [junit4]   2> 3569018 INFO  (TEST-TestSimExtremeIndexing.testScaleUp-seed#[C7158A17B77797DB]) [    ] o.a.s.c.a.s.TestSimExtremeIndexing #### Total docs so far: 43,800,000
   [junit4]   2> 3569018 INFO  (TEST-TestSimExtremeIndexing.testScaleUp-seed#[C7158A17B77797DB]) [    ] o.a.s.c.a.s.TestSimExtremeIndexing #### Total docs so far: 44,000,000
   [junit4]   2> 3569019 INFO  (TEST-TestSimExtremeIndexing.testScaleUp-seed#[C7158A17B77797DB]) [    ] o.a.s.c.a.s.TestSimExtremeIndexing #### Total docs so far: 44,200,000
   [junit4]   2> 3569019 INFO  (TEST-TestSimExtremeIndexing.testScaleUp-seed#[C7158A17B77797DB]) [    ] o.a.s.c.a.s.TestSimExtremeIndexing #### Total docs so far: 44,400,000
   [junit4]   2> 3569019 INFO  (TEST-TestSimExtremeIndexing.testScaleUp-seed#[C7158A17B77797DB]) [    ] o.a.s.c.a.s.TestSimExtremeIndexing #### Total docs so far: 44,600,000
   [junit4]   2> 3569032 DEBUG (ScheduledTrigger-8626-thread-4) [    ] o.a.s.c.a.ScheduledTriggers ++++++++ Cooldown inactive - processing event: {
   [junit4]   2>   "id":"691f0bf0353732T6r32vxad8fr076dc95b5frzf0",
   [junit4]   2>   "source":"scaleUpTrigger",
   [junit4]   2>   "eventTime":29589008689739570,
   [junit4]   2>   "eventType":"INDEXSIZE",
   [junit4]   2>   "properties":{
   [junit4]   2>     "aboveSize":{
   [junit4]   2>       "testScaleUp_collection_shard1_replica_n1":"docs=22400000, bytes=11200010240",
   [junit4]   2>       "testScaleUp_collection_shard2_replica_n3":"docs=22400000, bytes=11200010240"},
   [junit4]   2>     "belowSize":{},
   [junit4]   2>     "requestedOps":[
   [junit4]   2>       {
   [junit4]   2>         "action":"SPLITSHARD",
   [junit4]   2>         "hints":{
   [junit4]   2>           "COLL_SHARD":[{
   [junit4]   2>               "first":"testScaleUp_collection",
   [junit4]   2>               "second":"shard1"}],
   [junit4]   2>           "PARAMS":{"splitMethod":"link"}}},
   [junit4]   2>       {
   [junit4]   2>         "action":"SPLITSHARD",
   [junit4]   2>         "hints":{
   [junit4]   2>           "COLL_SHARD":[{
   [junit4]   2>               "first":"testScaleUp_collection",
   [junit4]   2>               "second":"shard2"}],
   [junit4]   2>           "PARAMS":{"splitMethod":"link"}}}]}}
   [junit4]   2> 3569033 DEBUG (ScheduledTrigger-8626-thread-4) [    ] o.a.s.c.a.ScheduledTriggers Pausing all triggers: [.auto_add_replicas, scaleUpTrigger, .scheduled_maintenance]
   [junit4]   2> 3569034 DEBUG (ScheduledTrigger-8626-thread-4) [    ] o.a.s.c.a.SystemLogListener Collection .system missing, skip sending event {
   [junit4]   2>   "id":"691f0bf0353732T6r32vxad8fr076dc95b5frzf0",
   [junit4]   2>   "source":"scaleUpTrigger",
   [junit4]   2>   "eventTime":29589008689739570,
   [junit4]   2>   "eventType":"INDEXSIZE",
   [junit4]   2>   "properties":{
   [junit4]   2>     "aboveSize":{
   [junit4]   2>       "testScaleUp_collection_shard1_replica_n1":"docs=22400000, bytes=11200010240",
   [junit4]   2>       "testScaleUp_collection_shard2_replica_n3":"docs=22400000, bytes=11200010240"},
   [junit4]   2>     "belowSize":{},
   [junit4]   2>     "_enqueue_time_":29589010465963670,
   [junit4]   2>     "requestedOps":[
   [junit4]   2>       {
   [junit4]   2>         "action":"SPLITSHARD",
   [junit4]   2>         "hints":{
   [junit4]   2>           "COLL_SHARD":[{
   [junit4]   2>               "first":"testScaleUp_collection",
   [junit4]   2>               "second":"shard1"}],
   [junit4]   2>           "PARAMS":{"splitMethod":"link"}}},
   [junit4]   2>       {
   [junit4]   2>         "action":"SPLITSHARD",
   [junit4]   2>         "hints":{
   [junit4]   2>           "COLL_SHARD":[{
   [junit4]   2>               "first":"testScaleUp_collection",
   [junit4]   2>               "second":"shard2"}],
   [junit4]   2>           "PARAMS":{"splitMethod":"link"}}}]}}
   [junit4]   2> 3569034 INFO  (TEST-TestSimExtremeIndexing.testScaleUp-seed#[C7158A17B77797DB]) [    ] o.a.s.c.a.s.TestSimExtremeIndexing #### Total docs so far: 44,800,000
   [junit4]   2> 3569034 INFO  (TEST-TestSimExtremeIndexing.testScaleUp-seed#[C7158A17B77797DB]) [    ] o.a.s.c.a.s.TestSimExtremeIndexing #### Total docs so far: 45,000,000
   [junit4]   2> 3569035 INFO  (TEST-TestSimExtremeIndexing.testScaleUp-seed#[C7158A17B77797DB]) [    ] o.a.s.c.a.s.TestSimExtremeIndexing #### Total docs so far: 45,200,000
   [junit4]   2> 3569035 INFO  (TEST-TestSimExtremeIndexing.testScaleUp-seed#[C7158A17B77797DB]) [    ] o.a.s.c.a.s.TestSimExtremeIndexing #### Total docs so far: 45,400,000
   [junit4]   2> 3569035 INFO  (TEST-TestSimExtremeIndexing.testScaleUp-seed#[C7158A17B77797DB]) [    ] o.a.s.c.a.s.TestSimExtremeIndexing #### Total docs so far: 45,600,000
   [junit4]   2> 3569036 INFO  (TEST-TestSimExtremeIndexing.testScaleUp-seed#[C7158A17B77797DB]) [    ] o.a.s.c.a.s.TestSimExtremeIndexing #### Total docs so far: 45,800,000
   [junit4]   2> 3569036 INFO  (TEST-TestSimExtremeIndexing.testScaleUp-seed#[C7158A17B77797DB]) [    ] o.a.s.c.a.s.TestSimExtremeIndexing #### Total docs so far: 46,000,000
   [junit4]   2> 3569036 INFO  (TEST-TestSimExtremeIndexing.testScaleUp-seed#[C7158A17B77797DB]) [    ] o.a.s.c.a.s.TestSimExtremeIndexing #### Total docs so far: 46,200,000
   [junit4]   2> 3569036 INFO  (TEST-TestSimExtremeIndexing.testScaleUp-seed#[C7158A17B77797DB]) [    ] o.a.s.c.a.s.TestSimExtremeIndexing #### Total docs so far: 46,400,000
   [junit4]   2> 3569037 INFO  (TEST-TestSimExtremeIndexing.testScaleUp-seed#[C7158A17B77797DB]) [    ] o.a.s.c.a.s.TestSimExtremeIndexing #### Total docs so far: 46,600,000
   [junit4]   2> 3569037 INFO  (TEST-TestSimExtremeIndexing.testScaleUp-seed#[C7158A17B77797DB]) [    ] o.a.s.c.a.s.TestSimExtremeIndexing #### Total docs so far: 46,800,000
   [junit4]   2> 3569037 INFO  (TEST-TestSimExtremeIndexing.testScaleUp-seed#[C7158A17B77797DB]) [    ] o.a.s.c.a.s.TestSimExtremeIndexing #### Total docs so far: 47,000,000
   [junit4]   2> 3569037 INFO  (TEST-TestSimExtremeIndexing.testScaleUp-seed#[C7158A17B77797DB]) [    ] o.a.s.c.a.s.TestSimExtremeIndexing #### Total docs so far: 47,200,000
   [junit4]   2> 3569037 DEBUG (AutoscalingActionExecutor-8627-thread-1) [    ] o.a.s.c.a.ScheduledTriggers -- processing actions for {
   [junit4]   2>   "id":"691f0bf0353732T6r32vxad8fr076dc95b5frzf0",
   [junit4]   2>   "source":"scaleUpTrigger",
   [junit4]   2>   "eventTime":29589008689739570,
   [junit4]   2>   "eventType":"INDEXSIZE",
   [junit4]   2>   "properties":{
   [junit4]   2>     "aboveSize":{
   [junit4]   2>       "testScaleUp_collection_shard1_replica_n1":"docs=22400000, bytes=11200010240",
   [junit4]   2>       "testScaleUp_collection_shard2_replica_n3":"docs=22400000, bytes=11200010240"},
   [junit4]   2>     "belowSize":{},
   [junit4]   2>     "_enqueue_time_":29589010465963670,
   [junit4]   2>     "requestedOps":[
   [junit4]   2>       {
   [junit4]   2>         "action":"SPLITSHARD",
   [junit4]   2>         "hints":{
   [junit4]   2>           "COLL_SHARD":[{
   [junit4]   2>               "first":"testScaleUp_collection",
   [junit4]   2>               "second":"shard1"}],
   [junit4]   2>           "PARAMS":{"splitMethod":"link"}}},
   [junit4]   2>       {
   [junit4]   2>         "action":"SPLITSHARD",
   [junit4]   2>         "hints":{
   [junit4]   2>           "COLL_SHARD":[{
   [junit4]   2>               "first":"testScaleUp_collection",
   [junit4]   2>               "second":"shard2"}],
   [junit4]   2>           "PARAMS":{"splitMethod":"link"}}}]}}
   [junit4]   2> 3569038 INFO  (TEST-TestSimExtremeIndexing.testScaleUp-seed#[C7158A17B77797DB]) [    ] o.a.s.c.a.s.TestSimExtremeIndexing #### Total docs so far: 47,400,000
   [junit4]   2> 3569038 INFO  (TEST-TestSimExtremeIndexing.testScaleUp-seed#[C7158A17B77797DB]) [    ] o.a.s.c.a.s.TestSimExtremeIndexing #### Total docs so far: 47,600,000
   [junit4]   2> 3569038 INFO  (TEST-TestSimExtremeIndexing.testScaleUp-seed#[C7158A17B77797DB]) [    ] o.a.s.c.a.s.TestSimExtremeIndexing #### Total docs so far: 47,800,000
   [junit4]   2> 3569038 INFO  (TEST-TestSimExtremeIndexing.testScaleUp-seed#[C7158A17B77797DB]) [    ] o.a.s.c.a.s.TestSimExtremeIndexing #### Total docs so far: 48,000,000
   [junit4]   2> 3569039 INFO  (TEST-TestSimExtremeIndexing.testScaleUp-seed#[C7158A17B77797DB]) [    ] o.a.s.c.a.s.TestSimExtremeIndexing #### Total docs so far: 48,200,000
   [junit4]   2> 3569039 INFO  (TEST-TestSimExtremeIndexing.testScaleUp-seed#[C7158A17B77797DB]) [    ] o.a.s.c.a.s.TestSimExtremeIndexing #### Total docs so far: 48,400,000
   [junit4]   2> 3569039 INFO  (TEST-TestSimExtremeIndexing.testScaleUp-seed#[C7158A17B77797DB]) [    ] o.a.s.c.a.s.TestSimExtremeIndexing #### Total docs so far: 48,600,000
   [junit4]   2> 3569039 INFO  (TEST-TestSimExtremeIndexing.testScaleUp-seed#[C7158A17B77797DB]) [    ] o.a.s.c.a.s.TestSimExtremeIndexing #### Total docs so far: 48,800,000
   [junit4]   2> 3569076 INFO  (TEST-TestSimExtremeIndexing.testScaleUp-seed#[C7158A17B77797DB]) [    ] o.a.s.c.a.s.TestSimExtremeIndexing #### Total docs so far: 49,000,000
   [junit4]   2> 3569077 INFO  (TEST-TestSimExtremeIndexing.testScaleUp-seed#[C7158A17B77797DB]) [    ] o.a.s.c.a.s.TestSimExtremeIndexing #### Total docs so far: 49,200,000
   [junit4]   2> 3569077 INFO  (TEST-TestSimExtremeIndexing.testScaleUp-seed#[C7158A17B77797DB]) [    ] o.a.s.c.a.s.TestSimExtremeIndexing #### Total docs so far: 49,400,000
   [junit4]   2> 3569077 INFO  (TEST-TestSimExtremeIndexing.testScaleUp-seed#[C7158A17B77797DB]) [    ] o.a.s.c.a.s.TestSimExtremeIndexing #### Total docs so far: 49,600,000
   [junit4]   2> 3569077 INFO  (TEST-TestSimExtremeIndexing.testScaleUp-seed#[C7158A17B77797DB]) [    ] o.a.s.c.a.s.TestSimExtremeIndexing #### Total docs so far: 49,800,000
   [junit4]   2> 3569078 INFO  (TEST-TestSimExtremeIndexing.testScaleUp-seed#[C7158A17B77797DB]) [    ] o.a.s.c.a.s.TestSimExtremeIndexing #### Total docs so far: 50,000,000
   [junit4]   2> 3569078 INFO  (TEST-TestSimExtremeIndexing.testScaleUp-seed#[C7158A17B77797DB]) [    ] o.a.s.c.a.s.TestSimExtremeIndexing #### Total docs so far: 50,200,000
   [junit4]   2> 3569078 INFO  (TEST-TestSimExtremeIndexing.testScaleUp-seed#[C7158A17B77797DB]) [    ] o.a.s.c.a.s.TestSimExtremeIndexing #### Total docs so far: 50,400,000
   [junit4]   2> 3569098 INFO  (TEST-TestSimExtremeIndexing.testScaleUp-seed#[C7158A17B77797DB]) [    ] o.a.s.c.a.s.TestSimExtremeIndexing #### Total docs so far: 50,600,000
   [junit4]   2> 3569098 INFO  (TEST-TestSimExtremeIndexing.testScaleUp-seed#[C7158A17B77797DB]) [    ] o.a.s.c.a.s.TestSimExtremeIndexing #### Total docs so far: 50,800,000
   [junit4]   2> 3569099 INFO  (TEST-TestSimExtremeIndexing.testScaleUp-seed#[C7158A17B77797DB]) [    ] o.a.s.c.a.s.TestSimExtremeIndexing #### Total docs so far: 51,000,000
   [junit4]   2> 3569113 INFO  (TEST-TestSimExtremeIndexing.testScaleUp-seed#[C7158A17B77797DB]) [    ] o.a.s.c.a.s.TestSimExtremeIndexing #### Total docs so far: 51,200,000
   [junit4]   2> 3569113 INFO  (TEST-TestSimExtremeIndexing.testScaleUp-seed#[C7158A17B77797DB]) [    ] o.a.s.c.a.s.TestSimExtremeIndexing #### Total docs so far: 51,400,000
   [junit4]   2> 3569098 DEBUG (AutoscalingActionExecutor-8627-thread-1) [    ] o.a.s.c.a.ExecutePlanAction -- processing event: {
   [junit4]   2>   "id":"691f0bf0353732T6r32vxad8fr076dc95b5frzf0",
   [junit4]   2>   "source":"scaleUpTrigger",
   [junit4]   2>   "eventTime":29589008689739570,
   [junit4]   2>   "eventType":"INDEXSIZE",
   [junit4]   2>   "properties":{
   [junit4]   2>     "__start__":2,
   [junit4]   2>     "aboveSize":{
   [junit4]   2>       "testScaleUp_collection_shard1_replica_n1":"docs=22400000, bytes=11200010240",
   [junit4]   2>       "testScaleUp_collection_shard2_replica_n3":"docs=22400000, bytes=11200010240"},
   [junit4]   2>     "belowSize":{},
   [junit4]   2>     "_enqueue_time_":29589010465963670,
   [junit4]   2>     "requestedOps":[
   [junit4]   2>       {
   [junit4]   2>         "action":"SPLITSHARD",
   [junit4]   2>         "hints":{
   [junit4]   2>           "COLL_SHARD":[{
   [junit4]   2>               "first":"testScaleUp_collection",
   [junit4]   2>               "second":"shard1"}],
   [junit4]   2>           "PARAMS":{"splitMethod":"link"}}},
   [junit4]   2>       {
   [junit4]   2>         "action":"SPLITSHARD",
   [junit4]   2>         "hints":{
   [junit4]   2>           "COLL_SHARD":[{
   [junit4]   2>               "first":"testScaleUp_collection",
   [junit4]   2>               "second":"shard2"}],
   [junit4]   2>           "PARAMS":{"splitMethod":"link"}}}]}} with context properties: {operations=[{
   [junit4]   2>   "class":"org.apache.solr.client.solrj.request.CollectionAdminRequest$SplitShard",
   [junit4]   2>   "method":"GET",
   [junit4]   2>   "params.action":"SPLITSHARD",
   [junit4]   2>   "params.collection":"testScaleUp_collection",
   [junit4]   2>   "params.shard":"shard1",
   [junit4]   2>   "params.splitMethod":"link"}, {
   [junit4]   2>   "class":"org.apache.solr.client.solrj.request.CollectionAdminRequest$SplitShard",
   [junit4]   2>   "method":"GET",
   [junit4]   2>   "params.action":"SPLITSHARD",
   [junit4]   2>   "params.collection":"testScaleUp_collection",
   [junit4]   2>   "params.shard":"shard2",
   [junit4]   2>   "params.splitMethod":"link"}], AFTER_ACTION=[compute_plan], BEFORE_ACTION=[compute_plan, execute_plan]}
   [junit4]   2> 3569113 DEBUG (AutoscalingActionExecutor-8627-thread-1) [    ] o.a.s.c.a.ExecutePlanAction Executing operation: action=SPLITSHARD&collection=testScaleUp_collection&shard=shard1&splitMethod=link
   [junit4]   2> 3569113 INFO  (TEST-TestSimExtremeIndexing.testScaleUp-seed#[C7158A17B77797DB]) [    ] o.a.s.c.a.s.TestSimExtremeIndexing #### Total docs so far: 51,600,000
   [junit4]   2> 3569114 INFO  (TEST-TestSimExtremeIndexing.testScaleUp-seed#[C7158A17B77797DB]) [    ] o.a.s.c.a.s.TestSimExtremeIndexing #### Total docs so far: 51,800,000
   [junit4]   2> 3569114 INFO  (TEST-TestSimExtremeIndexing.testScaleUp-seed#[C7158A17B77797DB]) [    ] o.a.s.c.a.s.TestSimExtremeIndexing #### Total docs so far: 52,000,000
   [junit4]   2> 3569115 INFO  (TEST-TestSimExtremeIndexing.testScaleUp-seed#[C7158A17B77797DB]) [    ] o.a.s.c.a.s.TestSimExtremeIndexing #### Total docs so far: 52,200,000
   [junit4]   2> 3569115 INFO  (TEST-TestSimExtremeIndexing.testScaleUp-seed#[C7158A17B77797DB]) [    ] o.a.s.c.a.s.TestSimExtremeIndexing #### Total docs so far: 52,400,000
   [junit4]   2> 3569133 INFO  (TEST-TestSimExtremeIndexing.testScaleUp-seed#[C7158A17B77797DB]) [    ] o.a.s.c.a.s.TestSimExtremeIndexing #### Total docs so far: 52,600,000
   [junit4]   2> 3569149 INFO  (TEST-TestSimExtremeIndexing.testScaleUp-seed#[C7158A17B77797DB]) [    ] o.a.s.c.a.s.TestSimExtremeIndexing #### Total docs so far: 52,800,000
   [junit4]   2> 3569150 INFO  (TEST-TestSimExtremeIndexing.testScaleUp-seed#[C7158A17B77797DB]) [    ] o.a.s.c.a.s.TestSimExtremeIndexing #### Total docs so far: 53,000,000
   [junit4]   2> 3569169 INFO  (TEST-TestSimExtremeIndexing.testScaleUp-seed#[C7158A17B77797DB]) [    ] o.a.s.c.a.s.TestSimExtremeIndexing #### Total docs so far: 53,200,000
   [junit4]   2> 3569169 INFO  (simCloudManagerPool-8625-thread-69) [    ] o.a.s.c.a.c.SplitShardCmd numSubShards set at: 2
   [junit4]   2> 3569206 INFO  (TEST-TestSimExtremeIndexing.testScaleUp-seed#[C7158A17B77797DB]) [    ] o.a.s.c.a.s.TestSimExtremeIndexing #### Total docs so far: 53,400,000
   [junit4]   2> 3569206 INFO  (TEST-TestSimExtremeIndexing.testScaleUp-seed#[C7158A17B77797DB]) [    ] o.a.s.c.a.s.TestSimExtremeIndexing #### Total docs so far: 53,600,000
   [junit4]   2> 3569206 INFO  (TEST-TestSimExtremeIndexing.testScaleUp-seed#[C7158A17B77797DB]) [    ] o.a.s.c.a.s.TestSimExtremeIndexing #### Total docs so far: 53,800,000
   [junit4]   2> 3569207 INFO  (TEST-TestSimExtremeIndexing.testScaleUp-seed#[C7158A17B77797DB]) [    ] o.a.s.c.a.s.TestSimExtremeIndexing #### Total docs so far: 54,000,000
   [junit4]   2> 3569207 INFO  (TEST-TestSimExtremeIndexing.testScaleUp-seed#[C7158A17B77797DB]) [    ] o.a.s.c.a.s.TestSimExtremeIndexing #### Total docs so far: 54,200,000
   [junit4]   2> 3569207 INFO  (TEST-TestSimExtremeIndexing.testScaleUp-seed#[C7158A17B77797DB]) [    ] o.a.s.c.a.s.TestSimExtremeIndexing #### Total docs so far: 54,400,000
   [junit4]   2> 3569207 INFO  (TEST-TestSimExtremeIndexing.testScaleUp-seed#[C7158A17B77797DB]) [    ] o.a.s.c.a.s.TestSimExtremeIndexing #### Total docs so far: 54,600,000
   [junit4]   2> 3569208 INFO  (TEST-TestSimExtremeIndexing.testScaleUp-seed#[C7158A17B77797DB]) [    ] o.a.s.c.a.s.TestSimExtremeIndexing #### Total docs so far: 54,800,000
   [junit4]   2> 3569208 INFO  (TEST-TestSimExtremeIndexing.testScaleUp-seed#[C7158A17B77797DB]) [    ] o.a.s.c.a.s.TestSimExtremeIndexing #### Total docs so far: 55,000,000
   [junit4]   2> 3569208 INFO  (TEST-TestSimExtremeIndexing.testScaleUp-seed#[C7158A17B77797DB]) [    ] o.a.s.c.a.s.TestSimExtremeIndexing #### Total docs so far: 55,200,000
   [junit4]   2> 3569208 INFO  (TEST-TestSimExtremeIndexing.testScaleUp-seed#[C7158A17B77797DB]) [    ] o.a.s.c.a.s.TestSimExtremeIndexing #### Total docs so far: 55,400,000
   [junit4]   2> 3569209 INFO  (TEST-TestSimExtremeIndexing.testScaleUp-seed#[C7158A17B77797DB]) [    ] o.a.s.c.a.s.TestSimExtremeIndexing #### Total docs so far: 55,600,000
   [junit4]   2> 3569209 INFO  (TEST-TestSimExtremeIndexing.testScaleUp-seed#[C7158A17B77797DB]) [    ] o.a.s.c.a.s.TestSimExtremeIndexing #### Total docs so far: 55,800,000
   [junit4]   2> 3569209 INFO  (TEST-TestSimExtremeIndexing.testScaleUp-seed#[C7158A17B77797DB]) [    ] o.a.s.c.a.s.TestSimExtremeIndexing #### Total docs so far: 56,000,000
   [junit4]   2> 3569209 INFO  (TEST-TestSimExtremeIndexing.testScaleUp-seed#[C7158A17B77797DB]) [    ] o.a.s.c.a.s.TestSimExtremeIndexing #### Total docs so far: 56,200,000
   [junit4]   2> 3569209 INFO  (TEST-TestSimExtremeIndexing.testScaleUp-seed#[C7158A17B77797DB]) [    ] o.a.s.c.a.s.TestSimExtremeIndexing #### Total docs so far: 56,400,000
   [junit4]   2> 3569210 INFO  (TEST-TestSimExtremeIndexing.testScaleUp-seed#[C7158A17B77797DB]) [    ] o.a.s.c.a.s.TestSimExtremeIndexing #### Total docs so far: 56,600,000
   [junit4]   2> 3569238 INFO  (TEST-TestSimExtremeIndexing.testScaleUp-seed#[C7158A17B77797DB]) [    ] o.a.s.c.a.s.TestSimExtremeIndexing #### Total docs so far: 56,800,000
   [junit4]   2> 3569239 INFO  (TEST-TestSimExtremeIndexing.testScaleUp-seed#[C7158A17B77797DB]) [    ] o.a.s.c.a.s.TestSimExtremeIndexing #### Total docs so far: 57,000,000
   [junit4]   2> 3569239 INFO  (TEST-TestSimExtremeIndexing.testScaleUp-seed#[C7158A17B77797DB]) [    ] o.a.s.c.a.s.TestSimExtremeIndexing #### Total docs so far: 57,200,000
   [junit4]   2> 3569239 INFO  (TEST-TestSimExtremeIndexing.testScaleUp-seed#[C7158A17B77797DB]) [    ] o.a.s.c.a.s.TestSimExtremeIndexing #### Total docs so far: 57,400,000
   [junit4]   2> 3569240 INFO  (TEST-TestSimExtremeIndexing.testScaleUp-seed#[C7158A17B77797DB]) [    ] o.a.s.c.a.s.TestSimExtremeIndexing #### Total docs so far: 57,600,000
   [junit4]   2> 3569240 INFO  (TEST-TestSimExtremeIndexing.testScaleUp-seed#[C7158A17B77797DB]) [    ] o.a.s.c.a.s.TestSimExtremeIndexing #### Total docs so far: 57,800,000
   [junit4]   2> 3569240 INFO  (TEST-TestSimExtremeIndexing.testScaleUp-seed#[C7158A17B77797DB]) [    ] o.a.s.c.a.s.TestSimExtremeIndexing #### Total docs so far: 58,000,000
   [junit4]   2> 3569254 INFO  (TEST-TestSimExtremeIndexing.testScaleUp-seed#[C7158A17B77797DB]) [    ] o.a.s.c.a.s.TestSimExtremeIndexing #### Total docs so far: 58,200,000
   [junit4]   2> 3569275 INFO  (TEST-TestSimExtremeIndexing.testScaleUp-seed#[C7158A17B77797DB]) [    ] o.a.s.c.a.s.TestSimExtremeIndexing #### Total docs so far: 58,400,000
   [junit4]   2> 3569275 INFO  (TEST-TestSimExtremeIndexing.testScaleUp-seed#[C7158A17B77797DB]) [    ] o.a.s.c.a.s.TestSimExtremeIndexing #### Total docs so far: 58,600,000
   [junit4]   2> 3569275 INFO  (TEST-TestSimExtremeIndexing.testScaleUp-seed#[C7158A17B77797DB]) [    ] o.a.s.c.a.s.TestSimExtremeIndexing #### Total docs so far: 58,800,000
   [junit4]   2> 3569276 INFO  (TEST-TestSimExtremeIndexing.testScaleUp-seed#[C7158A17B77797DB]) [    ] o.a.s.c.a.s.TestSimExtremeIndexing #### Total docs so far: 59,000,000
   [junit4]   2> 3569276 INFO  (TEST-TestSimExtremeIndexing.testScaleUp-seed#[C7158A17B77797DB]) [    ] o.a.s.c.a.s.TestSimExtremeIndexing #### Total docs so far: 59,200,000
   [junit4]   2> 3569276 INFO  (TEST-TestSimExtremeIndexing.testScaleUp-seed#[C7158A17B77797DB]) [    ] o.a.s.c.a.s.TestSimExtremeIndexing #### Total docs so far: 59,400,000
   [junit4]   2> 3569276 INFO  (TEST-TestSimExtremeIndexing.testScaleUp-seed#[C7158A17B77797DB]) [    ] o.a.s.c.a.s.TestSimExtremeIndexing #### Total docs so far: 59,600,000
   [junit4]   2> 3569277 INFO  (TEST-TestSimExtremeIndexing.testScaleUp-seed#[C7158A17B77797DB]) [    ] o.a.s.c.a.s.TestSimExtremeIndexing #### Total docs so far: 59,800,000
   [junit4]   2> 3569277 INFO  (TEST-TestSimExtremeIndexing.testScaleUp-seed#[C7158A17B77797DB]) [    ] o.a.s.c.a.s.TestSimExtremeIndexing #### Total docs so far: 60,000,000
   [junit4]   2> 3569291 INFO  (TEST-TestSimExtremeIndexing.testScaleUp-seed#[C7158A17B77797DB]) [    ] o.a.s.c.a.s.TestSimExtremeIndexing #### Total docs so far: 60,200,000
   [junit4]   2> 3569291 INFO  (TEST-TestSimExtremeIndexing.testScaleUp-seed#[C7158A17B77797DB]) [    ] o.a.s.c.a.s.TestSimExtremeIndexing #### Total docs so far: 60,400,000
   [junit4]   2> 3569291 INFO  (TEST-TestSimExtremeIndexing.testScaleUp-seed#[C7158A17B77797DB]) [    ] o.a.s.c.a.s.TestSimExtremeIndexing #### Total docs so far: 60,600,000
   [junit4]   2> 3569292 INFO  (TEST-TestSimExtremeIndexing.testScaleUp-seed#[C7158A17B77797DB]) [    ] o.a.s.c.a.s.TestSimExtremeIndexing #### Total docs so far: 60,800,000
   [junit4]   2> 3569292 INFO  (TEST-TestSimExtremeIndexing.testScaleUp-seed#[C7158A17B77797DB]) [    ] o.a.s.c.a.s.TestSimExtremeIndexing #### Total docs so far: 61,000,000
   [junit4]   2> 3569292 INFO  (TEST-TestSimExtremeIndexing.testScaleUp-seed#[C7158A17B77797DB]) [    ] o.a.s.c.a.s.TestSimExtremeIndexing #### Total docs so far: 61,200,000
   [junit4]   2> 3569292 INFO  (TEST-TestSimExtremeIndexing.testScaleUp-seed#[C7158A17B77797DB]) [    ] o.a.s.c.a.s.TestSimExtremeIndexing #### Total docs so far: 61,400,000
   [junit4]   2> 3569293 INFO  (TEST-TestSimExtremeIndexing.testScaleUp-seed#[C7158A17B77797DB]) [    ] o.a.s.c.a.s.TestSimExtremeIndexing #### Total docs so far: 61,600,000
   [junit4]   2> 3569293 INFO  (TEST-TestSimExtremeIndexing.testScaleUp-seed#[C7158A17B77797DB]) [    ] o.a.s.c.a.s.TestSimExtremeIndexing #### Total docs so far: 61,800,000
   [junit4]   2> 3569311 INFO  (TEST-TestSimExtremeIndexing.testScaleUp-seed#[C7158A17B77797DB]) [    ] o.a.s.c.a.s.TestSimExtremeIndexing #### Total docs so far: 62,000,000
   [junit4]   2> 3569327 INFO  (TEST-TestSimExtremeIndexing.testScaleUp-seed#[C7158A17B77797DB]) [    ] o.a.s.c.a.s.TestSimExtremeIndexing #### Total docs so far: 62,200,000
   [junit4]   2> 3569348 INFO  (TEST-TestSimExtremeIndexing.testScaleUp-seed#[C7158A17B77797DB]) [    ] o.a.s.c.a.s.TestSimExtremeIndexing #### Total docs so far: 62,400,000
   [junit4]   2> 3569364 INFO  (TEST-TestSimExtremeIndexing.testScaleUp-seed#[C7158A17B77797DB]) [    ] o.a.s.c.a.s.TestSimExtremeIndexing #### Total docs so far: 62,600,000
   [junit4]   2> 3569384 INFO  (TEST-TestSimExtremeIndexing.testScaleUp-seed#[C7158A17B77797DB]) [    ] o.a.s.c.a.s.TestSimExtremeIndexing #### Total docs so far: 62,800,000
   [junit4]   2> 3569400 INFO  (TEST-TestSimExtremeIndexing.testScaleUp-seed#[C7158A17B77797DB]) [    ] o.a.s.c.a.s.TestSimExtremeIndexing #### Total docs so far: 63,000,000
   [junit4]   2> 3569413 INFO  (TEST-TestSimExtremeIndexing.testScaleUp-seed#[C7158A17B77797DB]) [    ] o.a.s.c.a.s.TestSimExtremeIndexing #### Total docs so far: 63,200,000
   [junit4]   2> 3569413 INFO  (TEST-TestSimExtremeIndexing.testScaleUp-seed#[C7158A17B77797DB]) [    ] o.a.s.c.a.s.TestSimExtremeIndexing #### Total docs so far: 63,400,000
   [junit4]   2> 3569413 INFO  (TEST-TestSimExtremeIndexing.testScaleUp-seed#[C7158A17B77797DB]) [    ] o.a.s.c.a.s.TestSimExtremeIndexing #### Total docs so far: 63,600,000
   [junit4]   2> 3569413 INFO  (TEST-TestSimExtremeIndexing.testScaleUp-seed#[C7158A17B77797DB]) [    ] o.a.s.c.a.s.TestSimExtremeIndexing #### Total docs so far: 63,800,000
   [junit4]   2> 3569429 INFO  (TEST-TestSimExtremeIndexing.testScaleUp-seed#[C7158A17B77797DB]) [    ] o.a.s.c.a.s.TestSimExtremeIndexing #### Total docs so far: 64,000,000
   [junit4]   2> 3569429 INFO  (TEST-TestSimExtremeIndexing.testScaleUp-seed#[C7158A17B77797DB]) [    ] o.a.s.c.a.s.TestSimExtremeIndexing #### Total docs so far: 64,200,000
   [junit4]   2> 3569430 INFO  (TEST-TestSimExtremeIndexing.testScaleUp-seed#[C7158A17B77797DB]) [    ] o.a.s.c.a.s.TestSimExtremeIndexing #### Total docs so far: 64,400,000
   [junit4]   2> 3569430 INFO  (TEST-TestSimExtremeIndexing.testScaleUp-seed#[C7158A17B77797DB]) [    ] o.a.s.c.a.s.TestSimExtremeIndexing #### Total docs so far: 64,600,000
   [junit4]   2> 3569430 INFO  (TEST-TestSimExtremeIndexing.testScaleUp-seed#[C7158A17B77797DB]) [    ] o.a.s.c.a.s.TestSimExtremeIndexing #### Total docs so far: 64,800,000
   [junit4]   2> 3569430 INFO  (TEST-TestSimExtremeIndexing.testScaleUp-seed#[C7158A17B77797DB]) [    ] o.a.s.c.a.s.TestSimExtremeIndexing #### Total docs so far: 65,000,000
   [junit4]   2> 3569431 INFO  (TEST-TestSimExtremeIndexing.testScaleUp-seed#[C7158A17B77797DB]) [    ] o.a.s.c.a.s.TestSimExtremeIndexing #### Total docs so far: 65,200,000
   [junit4]   2> 3569431 INFO  (TEST-TestSimExtremeIndexing.testScaleUp-seed#[C7158A17B77797DB]) [    ] o.a.s.c.a.s.TestSimExtremeIndexing #### Total docs so far: 65,400,000
   [junit4]   2> 3569431 INFO  (TEST-TestSimExtremeIndexing.testScaleUp-seed#[C7158A17B77797DB]) [    ] o.a.s.c.a.s.TestSimExtremeIndexing #### Total docs so far: 65,600,000
   [junit4]   2> 3569431 INFO  (TEST-TestSimExtremeIndexing.testScaleUp-seed#[C7158A17B77797DB]) [    ] o.a.s.c.a.s.TestSimExtremeIndexing #### Total docs so far: 65,800,000
   [junit4]   2> 3569432 INFO  (TEST-TestSimExtremeIndexing.testScaleUp-seed#[C7158A17B77797DB]) [    ] o.a.s.c.a.s.TestSimExtremeIndexing #### Total docs so far: 66,000,000
   [junit4]   2> 3569432 INFO  (TEST-TestSimExtremeIndexing.testScaleUp-seed#[C7158A17B77797DB]) [    ] o.a.s.c.a.s.TestSimExtremeIndexing #### Total docs so far: 66,200,000
   [junit4]   2> 3569432 INFO  (TEST-TestSimExtremeIndexing.testScaleUp-seed#[C7158A17B77797DB]) [    ] o.a.s.c.a.s.TestSimExtremeIndexing #### Total docs so far: 66,400,000
   [junit4]   2> 3569465 INFO  (TEST-TestSimExtremeIndexing.testScaleUp-seed#[C7158A17B77797DB]) [    ] o.a.s.c.a.s.TestSimExtremeIndexing #### Total docs so far: 66,600,000
   [junit4]   2> 3569465 INFO  (TEST-TestSimExtremeIndexing.testScaleUp-seed#[C7158A17B77797DB]) [    ] o.a.s.c.a.s.TestSimExtremeIndexing #### Total docs so far: 66,800,000
   [junit4]   2> 3569466 INFO  (TEST-TestSimExtremeIndexing.testScaleUp-seed#[C7158A17B77797DB]) [    ] o.a.s.c.a.s.TestSimExtremeIndexing #### Total docs so far: 67,000,000
   [junit4]   2> 3569466 INFO  (TEST-TestSimExtremeIndexing.testScaleUp-seed#[C7158A17B77797DB]) [    ] o.a.s.c.a.s.TestSimExtremeIndexing #### Total docs so far: 67,200,000
   [junit4]   2> 3569466 INFO  (TEST-TestSimExtremeIndexing.testScaleUp-seed#[C7158A17B77797DB]) [    ] o.a.s.c.a.s.TestSimExtremeIndexing #### Total docs so far: 67,400,000
   [junit4]   2> 3569466 INFO  (TEST-TestSimExtremeIndexing.testScaleUp-seed#[C7158A17B77797DB]) [    ] o.a.s.c.a.s.TestSimExtremeIndexing #### Total docs so far: 67,600,000
   [junit4]   2> 3569485 INFO  (TEST-TestSimExtremeIndexing.testScaleUp-seed#[C7158A17B77797DB]) [    ] o.a.s.c.a.s.TestSimExtremeIndexing #### Total docs so far: 67,800,000
   [junit4]   2> 3569502 INFO  (TEST-TestSimExtremeIndexing.testScaleUp-seed#[C7158A17B77797DB]) [    ] o.a.s.c.a.s.TestSimExtremeIndexing #### Total docs so far: 68,000,000
   [junit4]   2> 3569522 INFO  (TEST-TestSimExtremeIndexing.testScaleUp-seed#[C7158A17B77797DB]) [    ] o.a.s.c.a.s.TestSimExtremeIndexing #### Total docs so far: 68,200,000
   [junit4]   2> 3569538 INFO  (TEST-TestSimExtremeIndexing.testScaleUp-seed#[C7158A17B77797DB]) [    ] o.a.s.c.a.s.TestSimExtremeIndexing #### Total docs so far: 68,400,000
   [junit4]   2> 3569558 INFO  (TEST-TestSimExtremeIndexing.testScaleUp-seed#[C7158A17B77797DB]) [    ] o.a.s.c.a.s.TestSimExtremeIndexing #### Total docs so far: 68,600,000
   [junit4]   2> 3569579 INFO  (TEST-TestSimExtremeIndexing.testScaleUp-seed#[C7158A17B77797DB]) [    ] o.a.s.c.a.s.TestSimExtremeIndexing #### Total docs so far: 68,800,000
   [junit4]   2> 3569595 INFO  (TEST-TestSimExtremeIndexing.testScaleUp-seed#[C7158A17B77797DB]) [    ] o.a.s.c.a.s.TestSimExtremeIndexing #### Total docs so far: 69,000,000
   [junit4]   2> 3569604 INFO  (TEST-TestSimExtremeIndexing.testScaleUp-seed#[C7158A17B77797DB]) [    ] o.a.s.c.a.s.TestSimExtremeIndexing #### Total docs so far: 69,200,000
   [junit4]   2> 3569623 DEBUG (simCloudManagerPool-8625-thread-157) [    ] o.a.s.c.a.s.SimClusterStateProvider ** creating new collection states, currentVersion=9
   [junit4]   2> 3569624 DEBUG (simCloudManagerPool-8625-thread-157) [    ] o.a.s.c.a.s.SimClusterStateProvider ** saved cluster state version 9
   [junit4]   2> 3569624 INFO  (TEST-TestSimExtremeIndexing.testScaleUp-seed#[C7158A17B77797DB]) [    ] o.a.s.c.a.s.TestSimExtremeIndexing #### Total docs so far: 69,400,000
   [junit4]   2> 3569624 INFO  (TEST-TestSimExtremeIndexing.testScaleUp-seed#[C7158A17B77797DB]) [    ] o.a.s.c.a.s.TestSimExtremeIndexing #### Total docs so far: 69,600,000
   [junit4]   2> 3569661 DEBUG (simCloudManagerPool-8625-thread-69) [    ] o

[...truncated too long message...]

ivy-fail-disallowed-ivy-version:

ivy-fail:

ivy-fail:

ivy-configure:
[ivy:configure] :: loading settings :: file = /home/jenkins/jenkins-slave/workspace/Lucene-Solr-Tests-8.x/lucene/top-level-ivy-settings.xml

resolve:

ivy-availability-check:
[loadresource] Do not set property disallowed.ivy.jars.list as its length is 0.

-ivy-fail-disallowed-ivy-version:

ivy-fail:

ivy-configure:
[ivy:configure] :: loading settings :: file = /home/jenkins/jenkins-slave/workspace/Lucene-Solr-Tests-8.x/lucene/top-level-ivy-settings.xml

resolve:

ivy-availability-check:
[loadresource] Do not set property disallowed.ivy.jars.list as its length is 0.

-ivy-fail-disallowed-ivy-version:

ivy-fail:

ivy-fail:

ivy-configure:
[ivy:configure] :: loading settings :: file = /home/jenkins/jenkins-slave/workspace/Lucene-Solr-Tests-8.x/lucene/top-level-ivy-settings.xml

resolve:

ivy-availability-check:
[loadresource] Do not set property disallowed.ivy.jars.list as its length is 0.

-ivy-fail-disallowed-ivy-version:

ivy-fail:

ivy-configure:
[ivy:configure] :: loading settings :: file = /home/jenkins/jenkins-slave/workspace/Lucene-Solr-Tests-8.x/lucene/top-level-ivy-settings.xml

resolve:

ivy-availability-check:
[loadresource] Do not set property disallowed.ivy.jars.list as its length is 0.

-ivy-fail-disallowed-ivy-version:

ivy-fail:

ivy-fail:

ivy-configure:
[ivy:configure] :: loading settings :: file = /home/jenkins/jenkins-slave/workspace/Lucene-Solr-Tests-8.x/lucene/top-level-ivy-settings.xml

resolve:

ivy-availability-check:
[loadresource] Do not set property disallowed.ivy.jars.list as its length is 0.

-ivy-fail-disallowed-ivy-version:

ivy-fail:

ivy-fail:

ivy-configure:
[ivy:configure] :: loading settings :: file = /home/jenkins/jenkins-slave/workspace/Lucene-Solr-Tests-8.x/lucene/top-level-ivy-settings.xml

resolve:

ivy-availability-check:
[loadresource] Do not set property disallowed.ivy.jars.list as its length is 0.

-ivy-fail-disallowed-ivy-version:

ivy-fail:

ivy-fail:

ivy-configure:
[ivy:configure] :: loading settings :: file = /home/jenkins/jenkins-slave/workspace/Lucene-Solr-Tests-8.x/lucene/top-level-ivy-settings.xml

resolve:

ivy-availability-check:
[loadresource] Do not set property disallowed.ivy.jars.list as its length is 0.

-ivy-fail-disallowed-ivy-version:

ivy-fail:

ivy-fail:

ivy-configure:
[ivy:configure] :: loading settings :: file = /home/jenkins/jenkins-slave/workspace/Lucene-Solr-Tests-8.x/lucene/top-level-ivy-settings.xml

resolve:

ivy-availability-check:
[loadresource] Do not set property disallowed.ivy.jars.list as its length is 0.

-ivy-fail-disallowed-ivy-version:

ivy-fail:

ivy-fail:

ivy-configure:
[ivy:configure] :: loading settings :: file = /home/jenkins/jenkins-slave/workspace/Lucene-Solr-Tests-8.x/lucene/top-level-ivy-settings.xml

resolve:

ivy-availability-check:
[loadresource] Do not set property disallowed.ivy.jars.list as its length is 0.

-ivy-fail-disallowed-ivy-version:

ivy-fail:

ivy-fail:

ivy-configure:
[ivy:configure] :: loading settings :: file = /home/jenkins/jenkins-slave/workspace/Lucene-Solr-Tests-8.x/lucene/top-level-ivy-settings.xml

resolve:

ivy-availability-check:
[loadresource] Do not set property disallowed.ivy.jars.list as its length is 0.

-ivy-fail-disallowed-ivy-version:

ivy-fail:

ivy-fail:

ivy-configure:
[ivy:configure] :: loading settings :: file = /home/jenkins/jenkins-slave/workspace/Lucene-Solr-Tests-8.x/lucene/top-level-ivy-settings.xml

resolve:

ivy-availability-check:
[loadresource] Do not set property disallowed.ivy.jars.list as its length is 0.

-ivy-fail-disallowed-ivy-version:

ivy-fail:

ivy-fail:

ivy-configure:
[ivy:configure] :: loading settings :: file = /home/jenkins/jenkins-slave/workspace/Lucene-Solr-Tests-8.x/lucene/top-level-ivy-settings.xml

resolve:

ivy-availability-check:
[loadresource] Do not set property disallowed.ivy.jars.list as its length is 0.

-ivy-fail-disallowed-ivy-version:

ivy-fail:

ivy-fail:

ivy-configure:
[ivy:configure] :: loading settings :: file = /home/jenkins/jenkins-slave/workspace/Lucene-Solr-Tests-8.x/lucene/top-level-ivy-settings.xml

resolve:

ivy-availability-check:
[loadresource] Do not set property disallowed.ivy.jars.list as its length is 0.

-ivy-fail-disallowed-ivy-version:

ivy-fail:

ivy-fail:

ivy-configure:
[ivy:configure] :: loading settings :: file = /home/jenkins/jenkins-slave/workspace/Lucene-Solr-Tests-8.x/lucene/top-level-ivy-settings.xml

resolve:

jar-checksums:
    [mkdir] Created dir: /home/jenkins/jenkins-slave/workspace/Lucene-Solr-Tests-8.x/solr/null1413799144
     [copy] Copying 256 files to /home/jenkins/jenkins-slave/workspace/Lucene-Solr-Tests-8.x/solr/null1413799144
   [delete] Deleting directory /home/jenkins/jenkins-slave/workspace/Lucene-Solr-Tests-8.x/solr/null1413799144

check-working-copy:
[ivy:cachepath] :: resolving dependencies :: org.eclipse.jgit#org.eclipse.jgit-caller;working
[ivy:cachepath] confs: [default]
[ivy:cachepath] found org.eclipse.jgit#org.eclipse.jgit;4.6.0.201612231935-r in public
[ivy:cachepath] found com.jcraft#jsch;0.1.53 in public
[ivy:cachepath] found com.googlecode.javaewah#JavaEWAH;1.1.6 in public
[ivy:cachepath] found org.apache.httpcomponents#httpclient;4.3.6 in public
[ivy:cachepath] found org.apache.httpcomponents#httpcore;4.3.3 in public
[ivy:cachepath] found commons-logging#commons-logging;1.1.3 in public
[ivy:cachepath] found commons-codec#commons-codec;1.6 in public
[ivy:cachepath] found org.slf4j#slf4j-api;1.7.2 in public
[ivy:cachepath] :: resolution report :: resolve 66ms :: artifacts dl 4ms
        ---------------------------------------------------------------------
        |                  |            modules            ||   artifacts   |
        |       conf       | number| search|dwnlded|evicted|| number|dwnlded|
        ---------------------------------------------------------------------
        |      default     |   8   |   0   |   0   |   0   ||   8   |   0   |
        ---------------------------------------------------------------------
[wc-checker] Initializing working copy...
[wc-checker] SLF4J: Failed to load class "org.slf4j.impl.StaticLoggerBinder".
[wc-checker] SLF4J: Defaulting to no-operation (NOP) logger implementation
[wc-checker] SLF4J: See http://www.slf4j.org/codes.html#StaticLoggerBinder for further details.
[wc-checker] Checking working copy status...

-jenkins-base:

BUILD SUCCESSFUL
Total time: 211 minutes 33 seconds
Archiving artifacts
java.lang.InterruptedException: no matches found within 10000
        at hudson.FilePath$ValidateAntFileMask.hasMatch(FilePath.java:2847)
        at hudson.FilePath$ValidateAntFileMask.invoke(FilePath.java:2726)
        at hudson.FilePath$ValidateAntFileMask.invoke(FilePath.java:2707)
        at hudson.FilePath$FileCallableWrapper.call(FilePath.java:3086)
Also:   hudson.remoting.Channel$CallSiteStackTrace: Remote call to lucene2
                at hudson.remoting.Channel.attachCallSiteStackTrace(Channel.java:1741)
                at hudson.remoting.UserRequest$ExceptionResponse.retrieve(UserRequest.java:357)
                at hudson.remoting.Channel.call(Channel.java:955)
                at hudson.FilePath.act(FilePath.java:1072)
                at hudson.FilePath.act(FilePath.java:1061)
                at hudson.FilePath.validateAntFileMask(FilePath.java:2705)
                at hudson.tasks.ArtifactArchiver.perform(ArtifactArchiver.java:243)
                at hudson.tasks.BuildStepCompatibilityLayer.perform(BuildStepCompatibilityLayer.java:81)
                at hudson.tasks.BuildStepMonitor$1.perform(BuildStepMonitor.java:20)
                at hudson.model.AbstractBuild$AbstractBuildExecution.perform(AbstractBuild.java:744)
                at hudson.model.AbstractBuild$AbstractBuildExecution.performAllBuildSteps(AbstractBuild.java:690)
                at hudson.model.Build$BuildExecution.post2(Build.java:186)
                at hudson.model.AbstractBuild$AbstractBuildExecution.post(AbstractBuild.java:635)
                at hudson.model.Run.execute(Run.java:1835)
                at hudson.model.FreeStyleBuild.run(FreeStyleBuild.java:43)
                at hudson.model.ResourceController.execute(ResourceController.java:97)
                at hudson.model.Executor.run(Executor.java:429)
Caused: hudson.FilePath$TunneledInterruptedException
        at hudson.FilePath$FileCallableWrapper.call(FilePath.java:3088)
        at hudson.remoting.UserRequest.perform(UserRequest.java:212)
        at hudson.remoting.UserRequest.perform(UserRequest.java:54)
        at hudson.remoting.Request$2.run(Request.java:369)
        at hudson.remoting.InterceptingExecutorService$1.call(InterceptingExecutorService.java:72)
        at java.util.concurrent.FutureTask.run(FutureTask.java:266)
        at java.util.concurrent.ThreadPoolExecutor.runWorker(ThreadPoolExecutor.java:1142)
        at java.util.concurrent.ThreadPoolExecutor$Worker.run(ThreadPoolExecutor.java:617)
        at java.lang.Thread.run(Thread.java:748)
Caused: java.lang.InterruptedException: java.lang.InterruptedException: no matches found within 10000
        at hudson.FilePath.act(FilePath.java:1074)
        at hudson.FilePath.act(FilePath.java:1061)
        at hudson.FilePath.validateAntFileMask(FilePath.java:2705)
        at hudson.tasks.ArtifactArchiver.perform(ArtifactArchiver.java:243)
        at hudson.tasks.BuildStepCompatibilityLayer.perform(BuildStepCompatibilityLayer.java:81)
        at hudson.tasks.BuildStepMonitor$1.perform(BuildStepMonitor.java:20)
        at hudson.model.AbstractBuild$AbstractBuildExecution.perform(AbstractBuild.java:744)
        at hudson.model.AbstractBuild$AbstractBuildExecution.performAllBuildSteps(AbstractBuild.java:690)
        at hudson.model.Build$BuildExecution.post2(Build.java:186)
        at hudson.model.AbstractBuild$AbstractBuildExecution.post(AbstractBuild.java:635)
        at hudson.model.Run.execute(Run.java:1835)
        at hudson.model.FreeStyleBuild.run(FreeStyleBuild.java:43)
        at hudson.model.ResourceController.execute(ResourceController.java:97)
        at hudson.model.Executor.run(Executor.java:429)
No artifacts found that match the file pattern "**/*.events,heapdumps/**,**/hs_err_pid*". Configuration error?
Recording test results
Build step 'Publish JUnit test result report' changed build result to UNSTABLE
Email was triggered for: Unstable (Test Failures)
Sending email for trigger: Unstable (Test Failures)


---------------------------------------------------------------------
To unsubscribe, e-mail: [hidden email]
For additional commands, e-mail: [hidden email]