[JENKINS] Lucene-Solr-Tests-8.x - Build # 144 - Unstable

classic Classic list List threaded Threaded
3 messages Options
Reply | Threaded
Open this post in threaded view
|

[JENKINS] Lucene-Solr-Tests-8.x - Build # 144 - Unstable

Apache Jenkins Server-2
Build: https://builds.apache.org/job/Lucene-Solr-Tests-8.x/144/

1 tests failed.
FAILED:  org.apache.lucene.luke.models.documents.DocumentsImplTest.testGetDocumentFields

Error Message:


Stack Trace:
java.lang.AssertionError
        at __randomizedtesting.SeedInfo.seed([47ED63C9DDA8D789:D8E085BA14A90B69]:0)
        at org.junit.Assert.fail(Assert.java:86)
        at org.junit.Assert.assertTrue(Assert.java:41)
        at org.junit.Assert.assertFalse(Assert.java:64)
        at org.junit.Assert.assertFalse(Assert.java:74)
        at org.apache.lucene.luke.models.documents.DocumentsImplTest.testGetDocumentFields(DocumentsImplTest.java:59)
        at sun.reflect.NativeMethodAccessorImpl.invoke0(Native Method)
        at sun.reflect.NativeMethodAccessorImpl.invoke(NativeMethodAccessorImpl.java:62)
        at sun.reflect.DelegatingMethodAccessorImpl.invoke(DelegatingMethodAccessorImpl.java:43)
        at java.lang.reflect.Method.invoke(Method.java:498)
        at com.carrotsearch.randomizedtesting.RandomizedRunner.invoke(RandomizedRunner.java:1750)
        at com.carrotsearch.randomizedtesting.RandomizedRunner$8.evaluate(RandomizedRunner.java:938)
        at com.carrotsearch.randomizedtesting.RandomizedRunner$9.evaluate(RandomizedRunner.java:974)
        at com.carrotsearch.randomizedtesting.RandomizedRunner$10.evaluate(RandomizedRunner.java:988)
        at org.apache.lucene.util.TestRuleSetupTeardownChained$1.evaluate(TestRuleSetupTeardownChained.java:49)
        at org.apache.lucene.util.AbstractBeforeAfterRule$1.evaluate(AbstractBeforeAfterRule.java:45)
        at org.apache.lucene.util.TestRuleThreadAndTestName$1.evaluate(TestRuleThreadAndTestName.java:48)
        at org.apache.lucene.util.TestRuleIgnoreAfterMaxFailures$1.evaluate(TestRuleIgnoreAfterMaxFailures.java:64)
        at org.apache.lucene.util.TestRuleMarkFailure$1.evaluate(TestRuleMarkFailure.java:47)
        at com.carrotsearch.randomizedtesting.rules.StatementAdapter.evaluate(StatementAdapter.java:36)
        at com.carrotsearch.randomizedtesting.ThreadLeakControl$StatementRunner.run(ThreadLeakControl.java:368)
        at com.carrotsearch.randomizedtesting.ThreadLeakControl.forkTimeoutingTask(ThreadLeakControl.java:817)
        at com.carrotsearch.randomizedtesting.ThreadLeakControl$3.evaluate(ThreadLeakControl.java:468)
        at com.carrotsearch.randomizedtesting.RandomizedRunner.runSingleTest(RandomizedRunner.java:947)
        at com.carrotsearch.randomizedtesting.RandomizedRunner$5.evaluate(RandomizedRunner.java:832)
        at com.carrotsearch.randomizedtesting.RandomizedRunner$6.evaluate(RandomizedRunner.java:883)
        at com.carrotsearch.randomizedtesting.RandomizedRunner$7.evaluate(RandomizedRunner.java:894)
        at org.apache.lucene.util.AbstractBeforeAfterRule$1.evaluate(AbstractBeforeAfterRule.java:45)
        at com.carrotsearch.randomizedtesting.rules.StatementAdapter.evaluate(StatementAdapter.java:36)
        at org.apache.lucene.util.TestRuleStoreClassName$1.evaluate(TestRuleStoreClassName.java:41)
        at com.carrotsearch.randomizedtesting.rules.NoShadowingOrOverridesOnMethodsRule$1.evaluate(NoShadowingOrOverridesOnMethodsRule.java:40)
        at com.carrotsearch.randomizedtesting.rules.NoShadowingOrOverridesOnMethodsRule$1.evaluate(NoShadowingOrOverridesOnMethodsRule.java:40)
        at com.carrotsearch.randomizedtesting.rules.StatementAdapter.evaluate(StatementAdapter.java:36)
        at com.carrotsearch.randomizedtesting.rules.StatementAdapter.evaluate(StatementAdapter.java:36)
        at com.carrotsearch.randomizedtesting.rules.StatementAdapter.evaluate(StatementAdapter.java:36)
        at org.apache.lucene.util.TestRuleAssertionsRequired$1.evaluate(TestRuleAssertionsRequired.java:53)
        at org.apache.lucene.util.TestRuleMarkFailure$1.evaluate(TestRuleMarkFailure.java:47)
        at org.apache.lucene.util.TestRuleIgnoreAfterMaxFailures$1.evaluate(TestRuleIgnoreAfterMaxFailures.java:64)
        at org.apache.lucene.util.TestRuleIgnoreTestSuites$1.evaluate(TestRuleIgnoreTestSuites.java:54)
        at com.carrotsearch.randomizedtesting.rules.StatementAdapter.evaluate(StatementAdapter.java:36)
        at com.carrotsearch.randomizedtesting.ThreadLeakControl$StatementRunner.run(ThreadLeakControl.java:368)
        at java.lang.Thread.run(Thread.java:748)




Build Log:
[...truncated 8915 lines...]
   [junit4] Suite: org.apache.lucene.luke.models.documents.DocumentsImplTest
   [junit4]   2> NOTE: reproduce with: ant test  -Dtestcase=DocumentsImplTest -Dtests.method=testGetDocumentFields -Dtests.seed=47ED63C9DDA8D789 -Dtests.multiplier=2 -Dtests.slow=true -Dtests.locale=hu-HU -Dtests.timezone=Australia/Melbourne -Dtests.asserts=true -Dtests.file.encoding=UTF-8
   [junit4] FAILURE 0.08s J1 | DocumentsImplTest.testGetDocumentFields <<<
   [junit4]    > Throwable #1: java.lang.AssertionError
   [junit4]    > at __randomizedtesting.SeedInfo.seed([47ED63C9DDA8D789:D8E085BA14A90B69]:0)
   [junit4]    > at org.apache.lucene.luke.models.documents.DocumentsImplTest.testGetDocumentFields(DocumentsImplTest.java:59)
   [junit4]    > at java.lang.Thread.run(Thread.java:748)
   [junit4]   2> NOTE: leaving temporary files on disk at: /x1/jenkins/jenkins-slave/workspace/Lucene-Solr-Tests-8.x/lucene/build/luke/test/J1/temp/lucene.luke.models.documents.DocumentsImplTest_47ED63C9DDA8D789-001
   [junit4]   2> NOTE: test params are: codec=CheapBastard, sim=Asserting(org.apache.lucene.search.similarities.AssertingSimilarity@6d0480a6), locale=hu-HU, timezone=Australia/Melbourne
   [junit4]   2> NOTE: Linux 4.4.0-137-generic amd64/Oracle Corporation 1.8.0_191 (64-bit)/cpus=4,threads=1,free=205143384,total=233832448
   [junit4]   2> NOTE: All tests run in this JVM: [AnalysisImplTest, TermCountsTest, SimpleIniFileTest, DocumentsImplTest]
   [junit4] Completed [9/10 (1!)] on J1 in 1.78s, 17 tests, 1 failure <<< FAILURES!

[...truncated 56754 lines...]
[asciidoctor:convert] asciidoctor: ERROR: about-this-guide.adoc: line 1: invalid part, must have at least one section (e.g., chapter, appendix, etc.)
[asciidoctor:convert] asciidoctor: ERROR: solr-glossary.adoc: line 1: invalid part, must have at least one section (e.g., chapter, appendix, etc.)
     [java] Processed 2526 links (2067 relative) to 3355 anchors in 253 files
     [echo] Validated Links & Anchors via: /x1/jenkins/jenkins-slave/workspace/Lucene-Solr-Tests-8.x/solr/build/solr-ref-guide/bare-bones-html/

-documentation-lint:
    [jtidy] Checking for broken html (such as invalid tags)...
   [delete] Deleting directory /x1/jenkins/jenkins-slave/workspace/Lucene-Solr-Tests-8.x/lucene/build/jtidy_tmp
     [echo] Checking for broken links...
     [exec]
     [exec] Crawl/parse...
     [exec]
     [exec] Verify...
     [echo] Checking for malformed docs...

jar-checksums:

resolve:

ivy-availability-check:
[loadresource] Do not set property disallowed.ivy.jars.list as its length is 0.

-ivy-fail-disallowed-ivy-version:

ivy-fail:

ivy-configure:
[ivy:configure] :: loading settings :: file = /x1/jenkins/jenkins-slave/workspace/Lucene-Solr-Tests-8.x/lucene/top-level-ivy-settings.xml

resolve:

ivy-availability-check:
[loadresource] Do not set property disallowed.ivy.jars.list as its length is 0.

-ivy-fail-disallowed-ivy-version:

ivy-fail:

ivy-configure:
[ivy:configure] :: loading settings :: file = /x1/jenkins/jenkins-slave/workspace/Lucene-Solr-Tests-8.x/lucene/top-level-ivy-settings.xml

resolve:

resolve:

ivy-availability-check:
[loadresource] Do not set property disallowed.ivy.jars.list as its length is 0.

-ivy-fail-disallowed-ivy-version:

ivy-fail:

ivy-configure:
[ivy:configure] :: loading settings :: file = /x1/jenkins/jenkins-slave/workspace/Lucene-Solr-Tests-8.x/lucene/top-level-ivy-settings.xml

resolve:

ivy-availability-check:
[loadresource] Do not set property disallowed.ivy.jars.list as its length is 0.

-ivy-fail-disallowed-ivy-version:

ivy-fail:

ivy-configure:
[ivy:configure] :: loading settings :: file = /x1/jenkins/jenkins-slave/workspace/Lucene-Solr-Tests-8.x/lucene/top-level-ivy-settings.xml

resolve:

ivy-availability-check:
[loadresource] Do not set property disallowed.ivy.jars.list as its length is 0.

-ivy-fail-disallowed-ivy-version:

ivy-fail:

ivy-configure:
[ivy:configure] :: loading settings :: file = /x1/jenkins/jenkins-slave/workspace/Lucene-Solr-Tests-8.x/lucene/top-level-ivy-settings.xml

resolve:

ivy-availability-check:
[loadresource] Do not set property disallowed.ivy.jars.list as its length is 0.

-ivy-fail-disallowed-ivy-version:

ivy-fail:

ivy-configure:
[ivy:configure] :: loading settings :: file = /x1/jenkins/jenkins-slave/workspace/Lucene-Solr-Tests-8.x/lucene/top-level-ivy-settings.xml

resolve:

ivy-availability-check:
[loadresource] Do not set property disallowed.ivy.jars.list as its length is 0.

-ivy-fail-disallowed-ivy-version:

ivy-fail:

ivy-configure:
[ivy:configure] :: loading settings :: file = /x1/jenkins/jenkins-slave/workspace/Lucene-Solr-Tests-8.x/lucene/top-level-ivy-settings.xml

resolve:

ivy-availability-check:
[loadresource] Do not set property disallowed.ivy.jars.list as its length is 0.

-ivy-fail-disallowed-ivy-version:

ivy-fail:

ivy-configure:
[ivy:configure] :: loading settings :: file = /x1/jenkins/jenkins-slave/workspace/Lucene-Solr-Tests-8.x/lucene/top-level-ivy-settings.xml

resolve:

ivy-availability-check:
[loadresource] Do not set property disallowed.ivy.jars.list as its length is 0.

-ivy-fail-disallowed-ivy-version:

ivy-fail:

ivy-configure:
[ivy:configure] :: loading settings :: file = /x1/jenkins/jenkins-slave/workspace/Lucene-Solr-Tests-8.x/lucene/top-level-ivy-settings.xml

resolve:

ivy-availability-check:
[loadresource] Do not set property disallowed.ivy.jars.list as its length is 0.

-ivy-fail-disallowed-ivy-version:

ivy-fail:

ivy-configure:
[ivy:configure] :: loading settings :: file = /x1/jenkins/jenkins-slave/workspace/Lucene-Solr-Tests-8.x/lucene/top-level-ivy-settings.xml

resolve:

ivy-availability-check:
[loadresource] Do not set property disallowed.ivy.jars.list as its length is 0.

-ivy-fail-disallowed-ivy-version:

ivy-fail:

ivy-configure:
[ivy:configure] :: loading settings :: file = /x1/jenkins/jenkins-slave/workspace/Lucene-Solr-Tests-8.x/lucene/top-level-ivy-settings.xml

resolve:

ivy-availability-check:
[loadresource] Do not set property disallowed.ivy.jars.list as its length is 0.

-ivy-fail-disallowed-ivy-version:

ivy-fail:

ivy-configure:
[ivy:configure] :: loading settings :: file = /x1/jenkins/jenkins-slave/workspace/Lucene-Solr-Tests-8.x/lucene/top-level-ivy-settings.xml

resolve:

ivy-availability-check:
[loadresource] Do not set property disallowed.ivy.jars.list as its length is 0.

-ivy-fail-disallowed-ivy-version:

ivy-fail:

ivy-configure:
[ivy:configure] :: loading settings :: file = /x1/jenkins/jenkins-slave/workspace/Lucene-Solr-Tests-8.x/lucene/top-level-ivy-settings.xml

resolve:

ivy-availability-check:
[loadresource] Do not set property disallowed.ivy.jars.list as its length is 0.

-ivy-fail-disallowed-ivy-version:

ivy-fail:

ivy-configure:
[ivy:configure] :: loading settings :: file = /x1/jenkins/jenkins-slave/workspace/Lucene-Solr-Tests-8.x/lucene/top-level-ivy-settings.xml

resolve:

ivy-availability-check:
[loadresource] Do not set property disallowed.ivy.jars.list as its length is 0.

-ivy-fail-disallowed-ivy-version:

ivy-fail:

ivy-configure:
[ivy:configure] :: loading settings :: file = /x1/jenkins/jenkins-slave/workspace/Lucene-Solr-Tests-8.x/lucene/top-level-ivy-settings.xml

resolve:

ivy-availability-check:
[loadresource] Do not set property disallowed.ivy.jars.list as its length is 0.

-ivy-fail-disallowed-ivy-version:

ivy-fail:

ivy-configure:
[ivy:configure] :: loading settings :: file = /x1/jenkins/jenkins-slave/workspace/Lucene-Solr-Tests-8.x/lucene/top-level-ivy-settings.xml

resolve:

ivy-availability-check:
[loadresource] Do not set property disallowed.ivy.jars.list as its length is 0.

-ivy-fail-disallowed-ivy-version:

ivy-fail:

ivy-configure:
[ivy:configure] :: loading settings :: file = /x1/jenkins/jenkins-slave/workspace/Lucene-Solr-Tests-8.x/lucene/top-level-ivy-settings.xml

resolve:

ivy-availability-check:
[loadresource] Do not set property disallowed.ivy.jars.list as its length is 0.

-ivy-fail-disallowed-ivy-version:

ivy-fail:

ivy-configure:
[ivy:configure] :: loading settings :: file = /x1/jenkins/jenkins-slave/workspace/Lucene-Solr-Tests-8.x/lucene/top-level-ivy-settings.xml

resolve:

ivy-availability-check:
[loadresource] Do not set property disallowed.ivy.jars.list as its length is 0.

-ivy-fail-disallowed-ivy-version:

ivy-fail:

ivy-configure:
[ivy:configure] :: loading settings :: file = /x1/jenkins/jenkins-slave/workspace/Lucene-Solr-Tests-8.x/lucene/top-level-ivy-settings.xml

resolve:

ivy-availability-check:
[loadresource] Do not set property disallowed.ivy.jars.list as its length is 0.

-ivy-fail-disallowed-ivy-version:

ivy-fail:

ivy-configure:
[ivy:configure] :: loading settings :: file = /x1/jenkins/jenkins-slave/workspace/Lucene-Solr-Tests-8.x/lucene/top-level-ivy-settings.xml

resolve:

ivy-availability-check:
[loadresource] Do not set property disallowed.ivy.jars.list as its length is 0.

-ivy-fail-disallowed-ivy-version:

ivy-fail:

ivy-configure:
[ivy:configure] :: loading settings :: file = /x1/jenkins/jenkins-slave/workspace/Lucene-Solr-Tests-8.x/lucene/top-level-ivy-settings.xml

resolve:

ivy-availability-check:
[loadresource] Do not set property disallowed.ivy.jars.list as its length is 0.

-ivy-fail-disallowed-ivy-version:

ivy-fail:

ivy-configure:
[ivy:configure] :: loading settings :: file = /x1/jenkins/jenkins-slave/workspace/Lucene-Solr-Tests-8.x/lucene/top-level-ivy-settings.xml

resolve:

ivy-availability-check:
[loadresource] Do not set property disallowed.ivy.jars.list as its length is 0.

-ivy-fail-disallowed-ivy-version:

ivy-fail:

ivy-configure:
[ivy:configure] :: loading settings :: file = /x1/jenkins/jenkins-slave/workspace/Lucene-Solr-Tests-8.x/lucene/top-level-ivy-settings.xml

resolve:

ivy-availability-check:
[loadresource] Do not set property disallowed.ivy.jars.list as its length is 0.

-ivy-fail-disallowed-ivy-version:

ivy-fail:

ivy-configure:
[ivy:configure] :: loading settings :: file = /x1/jenkins/jenkins-slave/workspace/Lucene-Solr-Tests-8.x/lucene/top-level-ivy-settings.xml

resolve:

ivy-availability-check:
[loadresource] Do not set property disallowed.ivy.jars.list as its length is 0.

-ivy-fail-disallowed-ivy-version:

ivy-fail:

ivy-configure:
[ivy:configure] :: loading settings :: file = /x1/jenkins/jenkins-slave/workspace/Lucene-Solr-Tests-8.x/lucene/top-level-ivy-settings.xml

resolve:

ivy-availability-check:
[loadresource] Do not set property disallowed.ivy.jars.list as its length is 0.

-ivy-fail-disallowed-ivy-version:

ivy-fail:

ivy-configure:
[ivy:configure] :: loading settings :: file = /x1/jenkins/jenkins-slave/workspace/Lucene-Solr-Tests-8.x/lucene/top-level-ivy-settings.xml

resolve:

ivy-availability-check:
[loadresource] Do not set property disallowed.ivy.jars.list as its length is 0.

-ivy-fail-disallowed-ivy-version:

ivy-fail:

ivy-configure:
[ivy:configure] :: loading settings :: file = /x1/jenkins/jenkins-slave/workspace/Lucene-Solr-Tests-8.x/lucene/top-level-ivy-settings.xml

common.resolve:

resolve:

ivy-availability-check:
[loadresource] Do not set property disallowed.ivy.jars.list as its length is 0.

-ivy-fail-disallowed-ivy-version:

ivy-fail:

ivy-configure:
[ivy:configure] :: loading settings :: file = /x1/jenkins/jenkins-slave/workspace/Lucene-Solr-Tests-8.x/lucene/top-level-ivy-settings.xml

resolve:

ivy-availability-check:
[loadresource] Do not set property disallowed.ivy.jars.list as its length is 0.

-ivy-fail-disallowed-ivy-version:

ivy-fail:

ivy-configure:
[ivy:configure] :: loading settings :: file = /x1/jenkins/jenkins-slave/workspace/Lucene-Solr-Tests-8.x/lucene/top-level-ivy-settings.xml

resolve:

ivy-availability-check:
[loadresource] Do not set property disallowed.ivy.jars.list as its length is 0.

-ivy-fail-disallowed-ivy-version:

ivy-fail:

ivy-configure:
[ivy:configure] :: loading settings :: file = /x1/jenkins/jenkins-slave/workspace/Lucene-Solr-Tests-8.x/lucene/top-level-ivy-settings.xml

resolve:

ivy-availability-check:
[loadresource] Do not set property disallowed.ivy.jars.list as its length is 0.

-ivy-fail-disallowed-ivy-version:

ivy-fail:

ivy-configure:
[ivy:configure] :: loading settings :: file = /x1/jenkins/jenkins-slave/workspace/Lucene-Solr-Tests-8.x/lucene/top-level-ivy-settings.xml

resolve:

ivy-availability-check:
[loadresource] Do not set property disallowed.ivy.jars.list as its length is 0.

-ivy-fail-disallowed-ivy-version:

ivy-fail:

ivy-configure:
[ivy:configure] :: loading settings :: file = /x1/jenkins/jenkins-slave/workspace/Lucene-Solr-Tests-8.x/lucene/top-level-ivy-settings.xml

resolve:

jar-checksums:
    [mkdir] Created dir: /x1/jenkins/jenkins-slave/workspace/Lucene-Solr-Tests-8.x/lucene/null1959618697
     [copy] Copying 38 files to /x1/jenkins/jenkins-slave/workspace/Lucene-Solr-Tests-8.x/lucene/null1959618697
   [delete] Deleting directory /x1/jenkins/jenkins-slave/workspace/Lucene-Solr-Tests-8.x/lucene/null1959618697

resolve-example:

ivy-availability-check:
[loadresource] Do not set property disallowed.ivy.jars.list as its length is 0.

-ivy-fail-disallowed-ivy-version:

ivy-fail:

ivy-configure:
[ivy:configure] :: loading settings :: file = /x1/jenkins/jenkins-slave/workspace/Lucene-Solr-Tests-8.x/lucene/top-level-ivy-settings.xml

resolve:

resolve-server:

ivy-availability-check:
[loadresource] Do not set property disallowed.ivy.jars.list as its length is 0.

-ivy-fail-disallowed-ivy-version:

ivy-fail:

ivy-fail:

ivy-configure:
[ivy:configure] :: loading settings :: file = /x1/jenkins/jenkins-slave/workspace/Lucene-Solr-Tests-8.x/lucene/top-level-ivy-settings.xml

resolve:

resolve:

ivy-availability-check:
[loadresource] Do not set property disallowed.ivy.jars.list as its length is 0.

-ivy-fail-disallowed-ivy-version:

ivy-fail:

ivy-fail:

ivy-configure:
[ivy:configure] :: loading settings :: file = /x1/jenkins/jenkins-slave/workspace/Lucene-Solr-Tests-8.x/lucene/top-level-ivy-settings.xml

resolve:

ivy-availability-check:
[loadresource] Do not set property disallowed.ivy.jars.list as its length is 0.

-ivy-fail-disallowed-ivy-version:

ivy-fail:

ivy-fail:

ivy-configure:
[ivy:configure] :: loading settings :: file = /x1/jenkins/jenkins-slave/workspace/Lucene-Solr-Tests-8.x/lucene/top-level-ivy-settings.xml

resolve:

ivy-availability-check:
[loadresource] Do not set property disallowed.ivy.jars.list as its length is 0.

-ivy-fail-disallowed-ivy-version:

ivy-fail:

ivy-configure:
[ivy:configure] :: loading settings :: file = /x1/jenkins/jenkins-slave/workspace/Lucene-Solr-Tests-8.x/lucene/top-level-ivy-settings.xml

resolve:

ivy-availability-check:
[loadresource] Do not set property disallowed.ivy.jars.list as its length is 0.

-ivy-fail-disallowed-ivy-version:

ivy-fail:

ivy-fail:

ivy-configure:
[ivy:configure] :: loading settings :: file = /x1/jenkins/jenkins-slave/workspace/Lucene-Solr-Tests-8.x/lucene/top-level-ivy-settings.xml

resolve:

ivy-availability-check:
[loadresource] Do not set property disallowed.ivy.jars.list as its length is 0.

-ivy-fail-disallowed-ivy-version:

ivy-fail:

ivy-configure:
[ivy:configure] :: loading settings :: file = /x1/jenkins/jenkins-slave/workspace/Lucene-Solr-Tests-8.x/lucene/top-level-ivy-settings.xml

resolve:

ivy-availability-check:
[loadresource] Do not set property disallowed.ivy.jars.list as its length is 0.

-ivy-fail-disallowed-ivy-version:

ivy-fail:

ivy-fail:

ivy-configure:
[ivy:configure] :: loading settings :: file = /x1/jenkins/jenkins-slave/workspace/Lucene-Solr-Tests-8.x/lucene/top-level-ivy-settings.xml

resolve:

ivy-availability-check:
[loadresource] Do not set property disallowed.ivy.jars.list as its length is 0.

-ivy-fail-disallowed-ivy-version:

ivy-fail:

ivy-fail:

ivy-configure:
[ivy:configure] :: loading settings :: file = /x1/jenkins/jenkins-slave/workspace/Lucene-Solr-Tests-8.x/lucene/top-level-ivy-settings.xml

resolve:

ivy-availability-check:
[loadresource] Do not set property disallowed.ivy.jars.list as its length is 0.

-ivy-fail-disallowed-ivy-version:

ivy-fail:

ivy-fail:

ivy-configure:
[ivy:configure] :: loading settings :: file = /x1/jenkins/jenkins-slave/workspace/Lucene-Solr-Tests-8.x/lucene/top-level-ivy-settings.xml

resolve:

ivy-availability-check:
[loadresource] Do not set property disallowed.ivy.jars.list as its length is 0.

-ivy-fail-disallowed-ivy-version:

ivy-fail:

ivy-fail:

ivy-configure:
[ivy:configure] :: loading settings :: file = /x1/jenkins/jenkins-slave/workspace/Lucene-Solr-Tests-8.x/lucene/top-level-ivy-settings.xml

resolve:

ivy-availability-check:
[loadresource] Do not set property disallowed.ivy.jars.list as its length is 0.

-ivy-fail-disallowed-ivy-version:

ivy-fail:

ivy-fail:

ivy-configure:
[ivy:configure] :: loading settings :: file = /x1/jenkins/jenkins-slave/workspace/Lucene-Solr-Tests-8.x/lucene/top-level-ivy-settings.xml

resolve:

ivy-availability-check:
[loadresource] Do not set property disallowed.ivy.jars.list as its length is 0.

-ivy-fail-disallowed-ivy-version:

ivy-fail:

ivy-fail:

ivy-configure:
[ivy:configure] :: loading settings :: file = /x1/jenkins/jenkins-slave/workspace/Lucene-Solr-Tests-8.x/lucene/top-level-ivy-settings.xml

resolve:

ivy-availability-check:
[loadresource] Do not set property disallowed.ivy.jars.list as its length is 0.

-ivy-fail-disallowed-ivy-version:

ivy-fail:

ivy-fail:

ivy-configure:
[ivy:configure] :: loading settings :: file = /x1/jenkins/jenkins-slave/workspace/Lucene-Solr-Tests-8.x/lucene/top-level-ivy-settings.xml

resolve:

ivy-availability-check:
[loadresource] Do not set property disallowed.ivy.jars.list as its length is 0.

-ivy-fail-disallowed-ivy-version:

ivy-fail:

ivy-fail:

ivy-configure:
[ivy:configure] :: loading settings :: file = /x1/jenkins/jenkins-slave/workspace/Lucene-Solr-Tests-8.x/lucene/top-level-ivy-settings.xml

resolve:

ivy-availability-check:
[loadresource] Do not set property disallowed.ivy.jars.list as its length is 0.

-ivy-fail-disallowed-ivy-version:

ivy-fail:

ivy-fail:

ivy-configure:
[ivy:configure] :: loading settings :: file = /x1/jenkins/jenkins-slave/workspace/Lucene-Solr-Tests-8.x/lucene/top-level-ivy-settings.xml

resolve:

ivy-availability-check:
[loadresource] Do not set property disallowed.ivy.jars.list as its length is 0.

-ivy-fail-disallowed-ivy-version:

ivy-fail:

ivy-fail:

ivy-configure:
[ivy:configure] :: loading settings :: file = /x1/jenkins/jenkins-slave/workspace/Lucene-Solr-Tests-8.x/lucene/top-level-ivy-settings.xml

resolve:

jar-checksums:
    [mkdir] Created dir: /x1/jenkins/jenkins-slave/workspace/Lucene-Solr-Tests-8.x/solr/null2129471223
     [copy] Copying 240 files to /x1/jenkins/jenkins-slave/workspace/Lucene-Solr-Tests-8.x/solr/null2129471223
   [delete] Deleting directory /x1/jenkins/jenkins-slave/workspace/Lucene-Solr-Tests-8.x/solr/null2129471223

check-working-copy:
[ivy:cachepath] :: resolving dependencies :: org.eclipse.jgit#org.eclipse.jgit-caller;working
[ivy:cachepath] confs: [default]
[ivy:cachepath] found org.eclipse.jgit#org.eclipse.jgit;4.6.0.201612231935-r in public
[ivy:cachepath] found com.jcraft#jsch;0.1.53 in public
[ivy:cachepath] found com.googlecode.javaewah#JavaEWAH;1.1.6 in public
[ivy:cachepath] found org.apache.httpcomponents#httpclient;4.3.6 in public
[ivy:cachepath] found org.apache.httpcomponents#httpcore;4.3.3 in public
[ivy:cachepath] found commons-logging#commons-logging;1.1.3 in public
[ivy:cachepath] found commons-codec#commons-codec;1.6 in public
[ivy:cachepath] found org.slf4j#slf4j-api;1.7.2 in public
[ivy:cachepath] :: resolution report :: resolve 28ms :: artifacts dl 2ms
        ---------------------------------------------------------------------
        |                  |            modules            ||   artifacts   |
        |       conf       | number| search|dwnlded|evicted|| number|dwnlded|
        ---------------------------------------------------------------------
        |      default     |   8   |   0   |   0   |   0   ||   8   |   0   |
        ---------------------------------------------------------------------
[wc-checker] Initializing working copy...
[wc-checker] SLF4J: Failed to load class "org.slf4j.impl.StaticLoggerBinder".
[wc-checker] SLF4J: Defaulting to no-operation (NOP) logger implementation
[wc-checker] SLF4J: See http://www.slf4j.org/codes.html#StaticLoggerBinder for further details.
[wc-checker] Checking working copy status...

-jenkins-base:

BUILD SUCCESSFUL
Total time: 116 minutes 52 seconds
Archiving artifacts
java.lang.InterruptedException: no matches found within 10000
        at hudson.FilePath$ValidateAntFileMask.hasMatch(FilePath.java:2847)
        at hudson.FilePath$ValidateAntFileMask.invoke(FilePath.java:2726)
        at hudson.FilePath$ValidateAntFileMask.invoke(FilePath.java:2707)
        at hudson.FilePath$FileCallableWrapper.call(FilePath.java:3086)
Also:   hudson.remoting.Channel$CallSiteStackTrace: Remote call to lucene
                at hudson.remoting.Channel.attachCallSiteStackTrace(Channel.java:1741)
                at hudson.remoting.UserRequest$ExceptionResponse.retrieve(UserRequest.java:357)
                at hudson.remoting.Channel.call(Channel.java:955)
                at hudson.FilePath.act(FilePath.java:1072)
                at hudson.FilePath.act(FilePath.java:1061)
                at hudson.FilePath.validateAntFileMask(FilePath.java:2705)
                at hudson.tasks.ArtifactArchiver.perform(ArtifactArchiver.java:243)
                at hudson.tasks.BuildStepCompatibilityLayer.perform(BuildStepCompatibilityLayer.java:81)
                at hudson.tasks.BuildStepMonitor$1.perform(BuildStepMonitor.java:20)
                at hudson.model.AbstractBuild$AbstractBuildExecution.perform(AbstractBuild.java:744)
                at hudson.model.AbstractBuild$AbstractBuildExecution.performAllBuildSteps(AbstractBuild.java:690)
                at hudson.model.Build$BuildExecution.post2(Build.java:186)
                at hudson.model.AbstractBuild$AbstractBuildExecution.post(AbstractBuild.java:635)
                at hudson.model.Run.execute(Run.java:1835)
                at hudson.model.FreeStyleBuild.run(FreeStyleBuild.java:43)
                at hudson.model.ResourceController.execute(ResourceController.java:97)
                at hudson.model.Executor.run(Executor.java:429)
Caused: hudson.FilePath$TunneledInterruptedException
        at hudson.FilePath$FileCallableWrapper.call(FilePath.java:3088)
        at hudson.remoting.UserRequest.perform(UserRequest.java:212)
        at hudson.remoting.UserRequest.perform(UserRequest.java:54)
        at hudson.remoting.Request$2.run(Request.java:369)
        at hudson.remoting.InterceptingExecutorService$1.call(InterceptingExecutorService.java:72)
        at java.util.concurrent.FutureTask.run(FutureTask.java:266)
        at java.util.concurrent.ThreadPoolExecutor.runWorker(ThreadPoolExecutor.java:1142)
        at java.util.concurrent.ThreadPoolExecutor$Worker.run(ThreadPoolExecutor.java:617)
        at java.lang.Thread.run(Thread.java:748)
Caused: java.lang.InterruptedException: java.lang.InterruptedException: no matches found within 10000
        at hudson.FilePath.act(FilePath.java:1074)
        at hudson.FilePath.act(FilePath.java:1061)
        at hudson.FilePath.validateAntFileMask(FilePath.java:2705)
        at hudson.tasks.ArtifactArchiver.perform(ArtifactArchiver.java:243)
        at hudson.tasks.BuildStepCompatibilityLayer.perform(BuildStepCompatibilityLayer.java:81)
        at hudson.tasks.BuildStepMonitor$1.perform(BuildStepMonitor.java:20)
        at hudson.model.AbstractBuild$AbstractBuildExecution.perform(AbstractBuild.java:744)
        at hudson.model.AbstractBuild$AbstractBuildExecution.performAllBuildSteps(AbstractBuild.java:690)
        at hudson.model.Build$BuildExecution.post2(Build.java:186)
        at hudson.model.AbstractBuild$AbstractBuildExecution.post(AbstractBuild.java:635)
        at hudson.model.Run.execute(Run.java:1835)
        at hudson.model.FreeStyleBuild.run(FreeStyleBuild.java:43)
        at hudson.model.ResourceController.execute(ResourceController.java:97)
        at hudson.model.Executor.run(Executor.java:429)
No artifacts found that match the file pattern "**/*.events,heapdumps/**,**/hs_err_pid*". Configuration error?
Recording test results
Build step 'Publish JUnit test result report' changed build result to UNSTABLE
Email was triggered for: Unstable (Test Failures)
Sending email for trigger: Unstable (Test Failures)


---------------------------------------------------------------------
To unsubscribe, e-mail: [hidden email]
For additional commands, e-mail: [hidden email]
Reply | Threaded
Open this post in threaded view
|

Re: [JENKINS] Lucene-Solr-Tests-8.x - Build # 144 - Unstable

Adrien Grand
I pushed a fix. We were randomly adding term vectors while the test
later asserted that term vectors were disabled.

On Wed, Apr 17, 2019 at 3:34 AM Apache Jenkins Server
<[hidden email]> wrote:

>
> Build: https://builds.apache.org/job/Lucene-Solr-Tests-8.x/144/
>
> 1 tests failed.
> FAILED:  org.apache.lucene.luke.models.documents.DocumentsImplTest.testGetDocumentFields
>
> Error Message:
>
>
> Stack Trace:
> java.lang.AssertionError
>         at __randomizedtesting.SeedInfo.seed([47ED63C9DDA8D789:D8E085BA14A90B69]:0)
>         at org.junit.Assert.fail(Assert.java:86)
>         at org.junit.Assert.assertTrue(Assert.java:41)
>         at org.junit.Assert.assertFalse(Assert.java:64)
>         at org.junit.Assert.assertFalse(Assert.java:74)
>         at org.apache.lucene.luke.models.documents.DocumentsImplTest.testGetDocumentFields(DocumentsImplTest.java:59)
>         at sun.reflect.NativeMethodAccessorImpl.invoke0(Native Method)
>         at sun.reflect.NativeMethodAccessorImpl.invoke(NativeMethodAccessorImpl.java:62)
>         at sun.reflect.DelegatingMethodAccessorImpl.invoke(DelegatingMethodAccessorImpl.java:43)
>         at java.lang.reflect.Method.invoke(Method.java:498)
>         at com.carrotsearch.randomizedtesting.RandomizedRunner.invoke(RandomizedRunner.java:1750)
>         at com.carrotsearch.randomizedtesting.RandomizedRunner$8.evaluate(RandomizedRunner.java:938)
>         at com.carrotsearch.randomizedtesting.RandomizedRunner$9.evaluate(RandomizedRunner.java:974)
>         at com.carrotsearch.randomizedtesting.RandomizedRunner$10.evaluate(RandomizedRunner.java:988)
>         at org.apache.lucene.util.TestRuleSetupTeardownChained$1.evaluate(TestRuleSetupTeardownChained.java:49)
>         at org.apache.lucene.util.AbstractBeforeAfterRule$1.evaluate(AbstractBeforeAfterRule.java:45)
>         at org.apache.lucene.util.TestRuleThreadAndTestName$1.evaluate(TestRuleThreadAndTestName.java:48)
>         at org.apache.lucene.util.TestRuleIgnoreAfterMaxFailures$1.evaluate(TestRuleIgnoreAfterMaxFailures.java:64)
>         at org.apache.lucene.util.TestRuleMarkFailure$1.evaluate(TestRuleMarkFailure.java:47)
>         at com.carrotsearch.randomizedtesting.rules.StatementAdapter.evaluate(StatementAdapter.java:36)
>         at com.carrotsearch.randomizedtesting.ThreadLeakControl$StatementRunner.run(ThreadLeakControl.java:368)
>         at com.carrotsearch.randomizedtesting.ThreadLeakControl.forkTimeoutingTask(ThreadLeakControl.java:817)
>         at com.carrotsearch.randomizedtesting.ThreadLeakControl$3.evaluate(ThreadLeakControl.java:468)
>         at com.carrotsearch.randomizedtesting.RandomizedRunner.runSingleTest(RandomizedRunner.java:947)
>         at com.carrotsearch.randomizedtesting.RandomizedRunner$5.evaluate(RandomizedRunner.java:832)
>         at com.carrotsearch.randomizedtesting.RandomizedRunner$6.evaluate(RandomizedRunner.java:883)
>         at com.carrotsearch.randomizedtesting.RandomizedRunner$7.evaluate(RandomizedRunner.java:894)
>         at org.apache.lucene.util.AbstractBeforeAfterRule$1.evaluate(AbstractBeforeAfterRule.java:45)
>         at com.carrotsearch.randomizedtesting.rules.StatementAdapter.evaluate(StatementAdapter.java:36)
>         at org.apache.lucene.util.TestRuleStoreClassName$1.evaluate(TestRuleStoreClassName.java:41)
>         at com.carrotsearch.randomizedtesting.rules.NoShadowingOrOverridesOnMethodsRule$1.evaluate(NoShadowingOrOverridesOnMethodsRule.java:40)
>         at com.carrotsearch.randomizedtesting.rules.NoShadowingOrOverridesOnMethodsRule$1.evaluate(NoShadowingOrOverridesOnMethodsRule.java:40)
>         at com.carrotsearch.randomizedtesting.rules.StatementAdapter.evaluate(StatementAdapter.java:36)
>         at com.carrotsearch.randomizedtesting.rules.StatementAdapter.evaluate(StatementAdapter.java:36)
>         at com.carrotsearch.randomizedtesting.rules.StatementAdapter.evaluate(StatementAdapter.java:36)
>         at org.apache.lucene.util.TestRuleAssertionsRequired$1.evaluate(TestRuleAssertionsRequired.java:53)
>         at org.apache.lucene.util.TestRuleMarkFailure$1.evaluate(TestRuleMarkFailure.java:47)
>         at org.apache.lucene.util.TestRuleIgnoreAfterMaxFailures$1.evaluate(TestRuleIgnoreAfterMaxFailures.java:64)
>         at org.apache.lucene.util.TestRuleIgnoreTestSuites$1.evaluate(TestRuleIgnoreTestSuites.java:54)
>         at com.carrotsearch.randomizedtesting.rules.StatementAdapter.evaluate(StatementAdapter.java:36)
>         at com.carrotsearch.randomizedtesting.ThreadLeakControl$StatementRunner.run(ThreadLeakControl.java:368)
>         at java.lang.Thread.run(Thread.java:748)
>
>
>
>
> Build Log:
> [...truncated 8915 lines...]
>    [junit4] Suite: org.apache.lucene.luke.models.documents.DocumentsImplTest
>    [junit4]   2> NOTE: reproduce with: ant test  -Dtestcase=DocumentsImplTest -Dtests.method=testGetDocumentFields -Dtests.seed=47ED63C9DDA8D789 -Dtests.multiplier=2 -Dtests.slow=true -Dtests.locale=hu-HU -Dtests.timezone=Australia/Melbourne -Dtests.asserts=true -Dtests.file.encoding=UTF-8
>    [junit4] FAILURE 0.08s J1 | DocumentsImplTest.testGetDocumentFields <<<
>    [junit4]    > Throwable #1: java.lang.AssertionError
>    [junit4]    >        at __randomizedtesting.SeedInfo.seed([47ED63C9DDA8D789:D8E085BA14A90B69]:0)
>    [junit4]    >        at org.apache.lucene.luke.models.documents.DocumentsImplTest.testGetDocumentFields(DocumentsImplTest.java:59)
>    [junit4]    >        at java.lang.Thread.run(Thread.java:748)
>    [junit4]   2> NOTE: leaving temporary files on disk at: /x1/jenkins/jenkins-slave/workspace/Lucene-Solr-Tests-8.x/lucene/build/luke/test/J1/temp/lucene.luke.models.documents.DocumentsImplTest_47ED63C9DDA8D789-001
>    [junit4]   2> NOTE: test params are: codec=CheapBastard, sim=Asserting(org.apache.lucene.search.similarities.AssertingSimilarity@6d0480a6), locale=hu-HU, timezone=Australia/Melbourne
>    [junit4]   2> NOTE: Linux 4.4.0-137-generic amd64/Oracle Corporation 1.8.0_191 (64-bit)/cpus=4,threads=1,free=205143384,total=233832448
>    [junit4]   2> NOTE: All tests run in this JVM: [AnalysisImplTest, TermCountsTest, SimpleIniFileTest, DocumentsImplTest]
>    [junit4] Completed [9/10 (1!)] on J1 in 1.78s, 17 tests, 1 failure <<< FAILURES!
>
> [...truncated 56754 lines...]
> [asciidoctor:convert] asciidoctor: ERROR: about-this-guide.adoc: line 1: invalid part, must have at least one section (e.g., chapter, appendix, etc.)
> [asciidoctor:convert] asciidoctor: ERROR: solr-glossary.adoc: line 1: invalid part, must have at least one section (e.g., chapter, appendix, etc.)
>      [java] Processed 2526 links (2067 relative) to 3355 anchors in 253 files
>      [echo] Validated Links & Anchors via: /x1/jenkins/jenkins-slave/workspace/Lucene-Solr-Tests-8.x/solr/build/solr-ref-guide/bare-bones-html/
>
> -documentation-lint:
>     [jtidy] Checking for broken html (such as invalid tags)...
>    [delete] Deleting directory /x1/jenkins/jenkins-slave/workspace/Lucene-Solr-Tests-8.x/lucene/build/jtidy_tmp
>      [echo] Checking for broken links...
>      [exec]
>      [exec] Crawl/parse...
>      [exec]
>      [exec] Verify...
>      [echo] Checking for malformed docs...
>
> jar-checksums:
>
> resolve:
>
> ivy-availability-check:
> [loadresource] Do not set property disallowed.ivy.jars.list as its length is 0.
>
> -ivy-fail-disallowed-ivy-version:
>
> ivy-fail:
>
> ivy-configure:
> [ivy:configure] :: loading settings :: file = /x1/jenkins/jenkins-slave/workspace/Lucene-Solr-Tests-8.x/lucene/top-level-ivy-settings.xml
>
> resolve:
>
> ivy-availability-check:
> [loadresource] Do not set property disallowed.ivy.jars.list as its length is 0.
>
> -ivy-fail-disallowed-ivy-version:
>
> ivy-fail:
>
> ivy-configure:
> [ivy:configure] :: loading settings :: file = /x1/jenkins/jenkins-slave/workspace/Lucene-Solr-Tests-8.x/lucene/top-level-ivy-settings.xml
>
> resolve:
>
> resolve:
>
> ivy-availability-check:
> [loadresource] Do not set property disallowed.ivy.jars.list as its length is 0.
>
> -ivy-fail-disallowed-ivy-version:
>
> ivy-fail:
>
> ivy-configure:
> [ivy:configure] :: loading settings :: file = /x1/jenkins/jenkins-slave/workspace/Lucene-Solr-Tests-8.x/lucene/top-level-ivy-settings.xml
>
> resolve:
>
> ivy-availability-check:
> [loadresource] Do not set property disallowed.ivy.jars.list as its length is 0.
>
> -ivy-fail-disallowed-ivy-version:
>
> ivy-fail:
>
> ivy-configure:
> [ivy:configure] :: loading settings :: file = /x1/jenkins/jenkins-slave/workspace/Lucene-Solr-Tests-8.x/lucene/top-level-ivy-settings.xml
>
> resolve:
>
> ivy-availability-check:
> [loadresource] Do not set property disallowed.ivy.jars.list as its length is 0.
>
> -ivy-fail-disallowed-ivy-version:
>
> ivy-fail:
>
> ivy-configure:
> [ivy:configure] :: loading settings :: file = /x1/jenkins/jenkins-slave/workspace/Lucene-Solr-Tests-8.x/lucene/top-level-ivy-settings.xml
>
> resolve:
>
> ivy-availability-check:
> [loadresource] Do not set property disallowed.ivy.jars.list as its length is 0.
>
> -ivy-fail-disallowed-ivy-version:
>
> ivy-fail:
>
> ivy-configure:
> [ivy:configure] :: loading settings :: file = /x1/jenkins/jenkins-slave/workspace/Lucene-Solr-Tests-8.x/lucene/top-level-ivy-settings.xml
>
> resolve:
>
> ivy-availability-check:
> [loadresource] Do not set property disallowed.ivy.jars.list as its length is 0.
>
> -ivy-fail-disallowed-ivy-version:
>
> ivy-fail:
>
> ivy-configure:
> [ivy:configure] :: loading settings :: file = /x1/jenkins/jenkins-slave/workspace/Lucene-Solr-Tests-8.x/lucene/top-level-ivy-settings.xml
>
> resolve:
>
> ivy-availability-check:
> [loadresource] Do not set property disallowed.ivy.jars.list as its length is 0.
>
> -ivy-fail-disallowed-ivy-version:
>
> ivy-fail:
>
> ivy-configure:
> [ivy:configure] :: loading settings :: file = /x1/jenkins/jenkins-slave/workspace/Lucene-Solr-Tests-8.x/lucene/top-level-ivy-settings.xml
>
> resolve:
>
> ivy-availability-check:
> [loadresource] Do not set property disallowed.ivy.jars.list as its length is 0.
>
> -ivy-fail-disallowed-ivy-version:
>
> ivy-fail:
>
> ivy-configure:
> [ivy:configure] :: loading settings :: file = /x1/jenkins/jenkins-slave/workspace/Lucene-Solr-Tests-8.x/lucene/top-level-ivy-settings.xml
>
> resolve:
>
> ivy-availability-check:
> [loadresource] Do not set property disallowed.ivy.jars.list as its length is 0.
>
> -ivy-fail-disallowed-ivy-version:
>
> ivy-fail:
>
> ivy-configure:
> [ivy:configure] :: loading settings :: file = /x1/jenkins/jenkins-slave/workspace/Lucene-Solr-Tests-8.x/lucene/top-level-ivy-settings.xml
>
> resolve:
>
> ivy-availability-check:
> [loadresource] Do not set property disallowed.ivy.jars.list as its length is 0.
>
> -ivy-fail-disallowed-ivy-version:
>
> ivy-fail:
>
> ivy-configure:
> [ivy:configure] :: loading settings :: file = /x1/jenkins/jenkins-slave/workspace/Lucene-Solr-Tests-8.x/lucene/top-level-ivy-settings.xml
>
> resolve:
>
> ivy-availability-check:
> [loadresource] Do not set property disallowed.ivy.jars.list as its length is 0.
>
> -ivy-fail-disallowed-ivy-version:
>
> ivy-fail:
>
> ivy-configure:
> [ivy:configure] :: loading settings :: file = /x1/jenkins/jenkins-slave/workspace/Lucene-Solr-Tests-8.x/lucene/top-level-ivy-settings.xml
>
> resolve:
>
> ivy-availability-check:
> [loadresource] Do not set property disallowed.ivy.jars.list as its length is 0.
>
> -ivy-fail-disallowed-ivy-version:
>
> ivy-fail:
>
> ivy-configure:
> [ivy:configure] :: loading settings :: file = /x1/jenkins/jenkins-slave/workspace/Lucene-Solr-Tests-8.x/lucene/top-level-ivy-settings.xml
>
> resolve:
>
> ivy-availability-check:
> [loadresource] Do not set property disallowed.ivy.jars.list as its length is 0.
>
> -ivy-fail-disallowed-ivy-version:
>
> ivy-fail:
>
> ivy-configure:
> [ivy:configure] :: loading settings :: file = /x1/jenkins/jenkins-slave/workspace/Lucene-Solr-Tests-8.x/lucene/top-level-ivy-settings.xml
>
> resolve:
>
> ivy-availability-check:
> [loadresource] Do not set property disallowed.ivy.jars.list as its length is 0.
>
> -ivy-fail-disallowed-ivy-version:
>
> ivy-fail:
>
> ivy-configure:
> [ivy:configure] :: loading settings :: file = /x1/jenkins/jenkins-slave/workspace/Lucene-Solr-Tests-8.x/lucene/top-level-ivy-settings.xml
>
> resolve:
>
> ivy-availability-check:
> [loadresource] Do not set property disallowed.ivy.jars.list as its length is 0.
>
> -ivy-fail-disallowed-ivy-version:
>
> ivy-fail:
>
> ivy-configure:
> [ivy:configure] :: loading settings :: file = /x1/jenkins/jenkins-slave/workspace/Lucene-Solr-Tests-8.x/lucene/top-level-ivy-settings.xml
>
> resolve:
>
> ivy-availability-check:
> [loadresource] Do not set property disallowed.ivy.jars.list as its length is 0.
>
> -ivy-fail-disallowed-ivy-version:
>
> ivy-fail:
>
> ivy-configure:
> [ivy:configure] :: loading settings :: file = /x1/jenkins/jenkins-slave/workspace/Lucene-Solr-Tests-8.x/lucene/top-level-ivy-settings.xml
>
> resolve:
>
> ivy-availability-check:
> [loadresource] Do not set property disallowed.ivy.jars.list as its length is 0.
>
> -ivy-fail-disallowed-ivy-version:
>
> ivy-fail:
>
> ivy-configure:
> [ivy:configure] :: loading settings :: file = /x1/jenkins/jenkins-slave/workspace/Lucene-Solr-Tests-8.x/lucene/top-level-ivy-settings.xml
>
> resolve:
>
> ivy-availability-check:
> [loadresource] Do not set property disallowed.ivy.jars.list as its length is 0.
>
> -ivy-fail-disallowed-ivy-version:
>
> ivy-fail:
>
> ivy-configure:
> [ivy:configure] :: loading settings :: file = /x1/jenkins/jenkins-slave/workspace/Lucene-Solr-Tests-8.x/lucene/top-level-ivy-settings.xml
>
> resolve:
>
> ivy-availability-check:
> [loadresource] Do not set property disallowed.ivy.jars.list as its length is 0.
>
> -ivy-fail-disallowed-ivy-version:
>
> ivy-fail:
>
> ivy-configure:
> [ivy:configure] :: loading settings :: file = /x1/jenkins/jenkins-slave/workspace/Lucene-Solr-Tests-8.x/lucene/top-level-ivy-settings.xml
>
> resolve:
>
> ivy-availability-check:
> [loadresource] Do not set property disallowed.ivy.jars.list as its length is 0.
>
> -ivy-fail-disallowed-ivy-version:
>
> ivy-fail:
>
> ivy-configure:
> [ivy:configure] :: loading settings :: file = /x1/jenkins/jenkins-slave/workspace/Lucene-Solr-Tests-8.x/lucene/top-level-ivy-settings.xml
>
> resolve:
>
> ivy-availability-check:
> [loadresource] Do not set property disallowed.ivy.jars.list as its length is 0.
>
> -ivy-fail-disallowed-ivy-version:
>
> ivy-fail:
>
> ivy-configure:
> [ivy:configure] :: loading settings :: file = /x1/jenkins/jenkins-slave/workspace/Lucene-Solr-Tests-8.x/lucene/top-level-ivy-settings.xml
>
> resolve:
>
> ivy-availability-check:
> [loadresource] Do not set property disallowed.ivy.jars.list as its length is 0.
>
> -ivy-fail-disallowed-ivy-version:
>
> ivy-fail:
>
> ivy-configure:
> [ivy:configure] :: loading settings :: file = /x1/jenkins/jenkins-slave/workspace/Lucene-Solr-Tests-8.x/lucene/top-level-ivy-settings.xml
>
> resolve:
>
> ivy-availability-check:
> [loadresource] Do not set property disallowed.ivy.jars.list as its length is 0.
>
> -ivy-fail-disallowed-ivy-version:
>
> ivy-fail:
>
> ivy-configure:
> [ivy:configure] :: loading settings :: file = /x1/jenkins/jenkins-slave/workspace/Lucene-Solr-Tests-8.x/lucene/top-level-ivy-settings.xml
>
> resolve:
>
> ivy-availability-check:
> [loadresource] Do not set property disallowed.ivy.jars.list as its length is 0.
>
> -ivy-fail-disallowed-ivy-version:
>
> ivy-fail:
>
> ivy-configure:
> [ivy:configure] :: loading settings :: file = /x1/jenkins/jenkins-slave/workspace/Lucene-Solr-Tests-8.x/lucene/top-level-ivy-settings.xml
>
> resolve:
>
> ivy-availability-check:
> [loadresource] Do not set property disallowed.ivy.jars.list as its length is 0.
>
> -ivy-fail-disallowed-ivy-version:
>
> ivy-fail:
>
> ivy-configure:
> [ivy:configure] :: loading settings :: file = /x1/jenkins/jenkins-slave/workspace/Lucene-Solr-Tests-8.x/lucene/top-level-ivy-settings.xml
>
> resolve:
>
> ivy-availability-check:
> [loadresource] Do not set property disallowed.ivy.jars.list as its length is 0.
>
> -ivy-fail-disallowed-ivy-version:
>
> ivy-fail:
>
> ivy-configure:
> [ivy:configure] :: loading settings :: file = /x1/jenkins/jenkins-slave/workspace/Lucene-Solr-Tests-8.x/lucene/top-level-ivy-settings.xml
>
> common.resolve:
>
> resolve:
>
> ivy-availability-check:
> [loadresource] Do not set property disallowed.ivy.jars.list as its length is 0.
>
> -ivy-fail-disallowed-ivy-version:
>
> ivy-fail:
>
> ivy-configure:
> [ivy:configure] :: loading settings :: file = /x1/jenkins/jenkins-slave/workspace/Lucene-Solr-Tests-8.x/lucene/top-level-ivy-settings.xml
>
> resolve:
>
> ivy-availability-check:
> [loadresource] Do not set property disallowed.ivy.jars.list as its length is 0.
>
> -ivy-fail-disallowed-ivy-version:
>
> ivy-fail:
>
> ivy-configure:
> [ivy:configure] :: loading settings :: file = /x1/jenkins/jenkins-slave/workspace/Lucene-Solr-Tests-8.x/lucene/top-level-ivy-settings.xml
>
> resolve:
>
> ivy-availability-check:
> [loadresource] Do not set property disallowed.ivy.jars.list as its length is 0.
>
> -ivy-fail-disallowed-ivy-version:
>
> ivy-fail:
>
> ivy-configure:
> [ivy:configure] :: loading settings :: file = /x1/jenkins/jenkins-slave/workspace/Lucene-Solr-Tests-8.x/lucene/top-level-ivy-settings.xml
>
> resolve:
>
> ivy-availability-check:
> [loadresource] Do not set property disallowed.ivy.jars.list as its length is 0.
>
> -ivy-fail-disallowed-ivy-version:
>
> ivy-fail:
>
> ivy-configure:
> [ivy:configure] :: loading settings :: file = /x1/jenkins/jenkins-slave/workspace/Lucene-Solr-Tests-8.x/lucene/top-level-ivy-settings.xml
>
> resolve:
>
> ivy-availability-check:
> [loadresource] Do not set property disallowed.ivy.jars.list as its length is 0.
>
> -ivy-fail-disallowed-ivy-version:
>
> ivy-fail:
>
> ivy-configure:
> [ivy:configure] :: loading settings :: file = /x1/jenkins/jenkins-slave/workspace/Lucene-Solr-Tests-8.x/lucene/top-level-ivy-settings.xml
>
> resolve:
>
> jar-checksums:
>     [mkdir] Created dir: /x1/jenkins/jenkins-slave/workspace/Lucene-Solr-Tests-8.x/lucene/null1959618697
>      [copy] Copying 38 files to /x1/jenkins/jenkins-slave/workspace/Lucene-Solr-Tests-8.x/lucene/null1959618697
>    [delete] Deleting directory /x1/jenkins/jenkins-slave/workspace/Lucene-Solr-Tests-8.x/lucene/null1959618697
>
> resolve-example:
>
> ivy-availability-check:
> [loadresource] Do not set property disallowed.ivy.jars.list as its length is 0.
>
> -ivy-fail-disallowed-ivy-version:
>
> ivy-fail:
>
> ivy-configure:
> [ivy:configure] :: loading settings :: file = /x1/jenkins/jenkins-slave/workspace/Lucene-Solr-Tests-8.x/lucene/top-level-ivy-settings.xml
>
> resolve:
>
> resolve-server:
>
> ivy-availability-check:
> [loadresource] Do not set property disallowed.ivy.jars.list as its length is 0.
>
> -ivy-fail-disallowed-ivy-version:
>
> ivy-fail:
>
> ivy-fail:
>
> ivy-configure:
> [ivy:configure] :: loading settings :: file = /x1/jenkins/jenkins-slave/workspace/Lucene-Solr-Tests-8.x/lucene/top-level-ivy-settings.xml
>
> resolve:
>
> resolve:
>
> ivy-availability-check:
> [loadresource] Do not set property disallowed.ivy.jars.list as its length is 0.
>
> -ivy-fail-disallowed-ivy-version:
>
> ivy-fail:
>
> ivy-fail:
>
> ivy-configure:
> [ivy:configure] :: loading settings :: file = /x1/jenkins/jenkins-slave/workspace/Lucene-Solr-Tests-8.x/lucene/top-level-ivy-settings.xml
>
> resolve:
>
> ivy-availability-check:
> [loadresource] Do not set property disallowed.ivy.jars.list as its length is 0.
>
> -ivy-fail-disallowed-ivy-version:
>
> ivy-fail:
>
> ivy-fail:
>
> ivy-configure:
> [ivy:configure] :: loading settings :: file = /x1/jenkins/jenkins-slave/workspace/Lucene-Solr-Tests-8.x/lucene/top-level-ivy-settings.xml
>
> resolve:
>
> ivy-availability-check:
> [loadresource] Do not set property disallowed.ivy.jars.list as its length is 0.
>
> -ivy-fail-disallowed-ivy-version:
>
> ivy-fail:
>
> ivy-configure:
> [ivy:configure] :: loading settings :: file = /x1/jenkins/jenkins-slave/workspace/Lucene-Solr-Tests-8.x/lucene/top-level-ivy-settings.xml
>
> resolve:
>
> ivy-availability-check:
> [loadresource] Do not set property disallowed.ivy.jars.list as its length is 0.
>
> -ivy-fail-disallowed-ivy-version:
>
> ivy-fail:
>
> ivy-fail:
>
> ivy-configure:
> [ivy:configure] :: loading settings :: file = /x1/jenkins/jenkins-slave/workspace/Lucene-Solr-Tests-8.x/lucene/top-level-ivy-settings.xml
>
> resolve:
>
> ivy-availability-check:
> [loadresource] Do not set property disallowed.ivy.jars.list as its length is 0.
>
> -ivy-fail-disallowed-ivy-version:
>
> ivy-fail:
>
> ivy-configure:
> [ivy:configure] :: loading settings :: file = /x1/jenkins/jenkins-slave/workspace/Lucene-Solr-Tests-8.x/lucene/top-level-ivy-settings.xml
>
> resolve:
>
> ivy-availability-check:
> [loadresource] Do not set property disallowed.ivy.jars.list as its length is 0.
>
> -ivy-fail-disallowed-ivy-version:
>
> ivy-fail:
>
> ivy-fail:
>
> ivy-configure:
> [ivy:configure] :: loading settings :: file = /x1/jenkins/jenkins-slave/workspace/Lucene-Solr-Tests-8.x/lucene/top-level-ivy-settings.xml
>
> resolve:
>
> ivy-availability-check:
> [loadresource] Do not set property disallowed.ivy.jars.list as its length is 0.
>
> -ivy-fail-disallowed-ivy-version:
>
> ivy-fail:
>
> ivy-fail:
>
> ivy-configure:
> [ivy:configure] :: loading settings :: file = /x1/jenkins/jenkins-slave/workspace/Lucene-Solr-Tests-8.x/lucene/top-level-ivy-settings.xml
>
> resolve:
>
> ivy-availability-check:
> [loadresource] Do not set property disallowed.ivy.jars.list as its length is 0.
>
> -ivy-fail-disallowed-ivy-version:
>
> ivy-fail:
>
> ivy-fail:
>
> ivy-configure:
> [ivy:configure] :: loading settings :: file = /x1/jenkins/jenkins-slave/workspace/Lucene-Solr-Tests-8.x/lucene/top-level-ivy-settings.xml
>
> resolve:
>
> ivy-availability-check:
> [loadresource] Do not set property disallowed.ivy.jars.list as its length is 0.
>
> -ivy-fail-disallowed-ivy-version:
>
> ivy-fail:
>
> ivy-fail:
>
> ivy-configure:
> [ivy:configure] :: loading settings :: file = /x1/jenkins/jenkins-slave/workspace/Lucene-Solr-Tests-8.x/lucene/top-level-ivy-settings.xml
>
> resolve:
>
> ivy-availability-check:
> [loadresource] Do not set property disallowed.ivy.jars.list as its length is 0.
>
> -ivy-fail-disallowed-ivy-version:
>
> ivy-fail:
>
> ivy-fail:
>
> ivy-configure:
> [ivy:configure] :: loading settings :: file = /x1/jenkins/jenkins-slave/workspace/Lucene-Solr-Tests-8.x/lucene/top-level-ivy-settings.xml
>
> resolve:
>
> ivy-availability-check:
> [loadresource] Do not set property disallowed.ivy.jars.list as its length is 0.
>
> -ivy-fail-disallowed-ivy-version:
>
> ivy-fail:
>
> ivy-fail:
>
> ivy-configure:
> [ivy:configure] :: loading settings :: file = /x1/jenkins/jenkins-slave/workspace/Lucene-Solr-Tests-8.x/lucene/top-level-ivy-settings.xml
>
> resolve:
>
> ivy-availability-check:
> [loadresource] Do not set property disallowed.ivy.jars.list as its length is 0.
>
> -ivy-fail-disallowed-ivy-version:
>
> ivy-fail:
>
> ivy-fail:
>
> ivy-configure:
> [ivy:configure] :: loading settings :: file = /x1/jenkins/jenkins-slave/workspace/Lucene-Solr-Tests-8.x/lucene/top-level-ivy-settings.xml
>
> resolve:
>
> ivy-availability-check:
> [loadresource] Do not set property disallowed.ivy.jars.list as its length is 0.
>
> -ivy-fail-disallowed-ivy-version:
>
> ivy-fail:
>
> ivy-fail:
>
> ivy-configure:
> [ivy:configure] :: loading settings :: file = /x1/jenkins/jenkins-slave/workspace/Lucene-Solr-Tests-8.x/lucene/top-level-ivy-settings.xml
>
> resolve:
>
> ivy-availability-check:
> [loadresource] Do not set property disallowed.ivy.jars.list as its length is 0.
>
> -ivy-fail-disallowed-ivy-version:
>
> ivy-fail:
>
> ivy-fail:
>
> ivy-configure:
> [ivy:configure] :: loading settings :: file = /x1/jenkins/jenkins-slave/workspace/Lucene-Solr-Tests-8.x/lucene/top-level-ivy-settings.xml
>
> resolve:
>
> ivy-availability-check:
> [loadresource] Do not set property disallowed.ivy.jars.list as its length is 0.
>
> -ivy-fail-disallowed-ivy-version:
>
> ivy-fail:
>
> ivy-fail:
>
> ivy-configure:
> [ivy:configure] :: loading settings :: file = /x1/jenkins/jenkins-slave/workspace/Lucene-Solr-Tests-8.x/lucene/top-level-ivy-settings.xml
>
> resolve:
>
> jar-checksums:
>     [mkdir] Created dir: /x1/jenkins/jenkins-slave/workspace/Lucene-Solr-Tests-8.x/solr/null2129471223
>      [copy] Copying 240 files to /x1/jenkins/jenkins-slave/workspace/Lucene-Solr-Tests-8.x/solr/null2129471223
>    [delete] Deleting directory /x1/jenkins/jenkins-slave/workspace/Lucene-Solr-Tests-8.x/solr/null2129471223
>
> check-working-copy:
> [ivy:cachepath] :: resolving dependencies :: org.eclipse.jgit#org.eclipse.jgit-caller;working
> [ivy:cachepath]         confs: [default]
> [ivy:cachepath]         found org.eclipse.jgit#org.eclipse.jgit;4.6.0.201612231935-r in public
> [ivy:cachepath]         found com.jcraft#jsch;0.1.53 in public
> [ivy:cachepath]         found com.googlecode.javaewah#JavaEWAH;1.1.6 in public
> [ivy:cachepath]         found org.apache.httpcomponents#httpclient;4.3.6 in public
> [ivy:cachepath]         found org.apache.httpcomponents#httpcore;4.3.3 in public
> [ivy:cachepath]         found commons-logging#commons-logging;1.1.3 in public
> [ivy:cachepath]         found commons-codec#commons-codec;1.6 in public
> [ivy:cachepath]         found org.slf4j#slf4j-api;1.7.2 in public
> [ivy:cachepath] :: resolution report :: resolve 28ms :: artifacts dl 2ms
>         ---------------------------------------------------------------------
>         |                  |            modules            ||   artifacts   |
>         |       conf       | number| search|dwnlded|evicted|| number|dwnlded|
>         ---------------------------------------------------------------------
>         |      default     |   8   |   0   |   0   |   0   ||   8   |   0   |
>         ---------------------------------------------------------------------
> [wc-checker] Initializing working copy...
> [wc-checker] SLF4J: Failed to load class "org.slf4j.impl.StaticLoggerBinder".
> [wc-checker] SLF4J: Defaulting to no-operation (NOP) logger implementation
> [wc-checker] SLF4J: See http://www.slf4j.org/codes.html#StaticLoggerBinder for further details.
> [wc-checker] Checking working copy status...
>
> -jenkins-base:
>
> BUILD SUCCESSFUL
> Total time: 116 minutes 52 seconds
> Archiving artifacts
> java.lang.InterruptedException: no matches found within 10000
>         at hudson.FilePath$ValidateAntFileMask.hasMatch(FilePath.java:2847)
>         at hudson.FilePath$ValidateAntFileMask.invoke(FilePath.java:2726)
>         at hudson.FilePath$ValidateAntFileMask.invoke(FilePath.java:2707)
>         at hudson.FilePath$FileCallableWrapper.call(FilePath.java:3086)
> Also:   hudson.remoting.Channel$CallSiteStackTrace: Remote call to lucene
>                 at hudson.remoting.Channel.attachCallSiteStackTrace(Channel.java:1741)
>                 at hudson.remoting.UserRequest$ExceptionResponse.retrieve(UserRequest.java:357)
>                 at hudson.remoting.Channel.call(Channel.java:955)
>                 at hudson.FilePath.act(FilePath.java:1072)
>                 at hudson.FilePath.act(FilePath.java:1061)
>                 at hudson.FilePath.validateAntFileMask(FilePath.java:2705)
>                 at hudson.tasks.ArtifactArchiver.perform(ArtifactArchiver.java:243)
>                 at hudson.tasks.BuildStepCompatibilityLayer.perform(BuildStepCompatibilityLayer.java:81)
>                 at hudson.tasks.BuildStepMonitor$1.perform(BuildStepMonitor.java:20)
>                 at hudson.model.AbstractBuild$AbstractBuildExecution.perform(AbstractBuild.java:744)
>                 at hudson.model.AbstractBuild$AbstractBuildExecution.performAllBuildSteps(AbstractBuild.java:690)
>                 at hudson.model.Build$BuildExecution.post2(Build.java:186)
>                 at hudson.model.AbstractBuild$AbstractBuildExecution.post(AbstractBuild.java:635)
>                 at hudson.model.Run.execute(Run.java:1835)
>                 at hudson.model.FreeStyleBuild.run(FreeStyleBuild.java:43)
>                 at hudson.model.ResourceController.execute(ResourceController.java:97)
>                 at hudson.model.Executor.run(Executor.java:429)
> Caused: hudson.FilePath$TunneledInterruptedException
>         at hudson.FilePath$FileCallableWrapper.call(FilePath.java:3088)
>         at hudson.remoting.UserRequest.perform(UserRequest.java:212)
>         at hudson.remoting.UserRequest.perform(UserRequest.java:54)
>         at hudson.remoting.Request$2.run(Request.java:369)
>         at hudson.remoting.InterceptingExecutorService$1.call(InterceptingExecutorService.java:72)
>         at java.util.concurrent.FutureTask.run(FutureTask.java:266)
>         at java.util.concurrent.ThreadPoolExecutor.runWorker(ThreadPoolExecutor.java:1142)
>         at java.util.concurrent.ThreadPoolExecutor$Worker.run(ThreadPoolExecutor.java:617)
>         at java.lang.Thread.run(Thread.java:748)
> Caused: java.lang.InterruptedException: java.lang.InterruptedException: no matches found within 10000
>         at hudson.FilePath.act(FilePath.java:1074)
>         at hudson.FilePath.act(FilePath.java:1061)
>         at hudson.FilePath.validateAntFileMask(FilePath.java:2705)
>         at hudson.tasks.ArtifactArchiver.perform(ArtifactArchiver.java:243)
>         at hudson.tasks.BuildStepCompatibilityLayer.perform(BuildStepCompatibilityLayer.java:81)
>         at hudson.tasks.BuildStepMonitor$1.perform(BuildStepMonitor.java:20)
>         at hudson.model.AbstractBuild$AbstractBuildExecution.perform(AbstractBuild.java:744)
>         at hudson.model.AbstractBuild$AbstractBuildExecution.performAllBuildSteps(AbstractBuild.java:690)
>         at hudson.model.Build$BuildExecution.post2(Build.java:186)
>         at hudson.model.AbstractBuild$AbstractBuildExecution.post(AbstractBuild.java:635)
>         at hudson.model.Run.execute(Run.java:1835)
>         at hudson.model.FreeStyleBuild.run(FreeStyleBuild.java:43)
>         at hudson.model.ResourceController.execute(ResourceController.java:97)
>         at hudson.model.Executor.run(Executor.java:429)
> No artifacts found that match the file pattern "**/*.events,heapdumps/**,**/hs_err_pid*". Configuration error?
> Recording test results
> Build step 'Publish JUnit test result report' changed build result to UNSTABLE
> Email was triggered for: Unstable (Test Failures)
> Sending email for trigger: Unstable (Test Failures)
>
> ---------------------------------------------------------------------
> To unsubscribe, e-mail: [hidden email]
> For additional commands, e-mail: [hidden email]



--
Adrien

---------------------------------------------------------------------
To unsubscribe, e-mail: [hidden email]
For additional commands, e-mail: [hidden email]

Reply | Threaded
Open this post in threaded view
|

Re: [JENKINS] Lucene-Solr-Tests-8.x - Build # 144 - Unstable

Tomoko Uchida
Thanks, Adrien!

Tomoko

2019年4月18日(木) 16:58 Adrien Grand <[hidden email]>:
I pushed a fix. We were randomly adding term vectors while the test
later asserted that term vectors were disabled.

On Wed, Apr 17, 2019 at 3:34 AM Apache Jenkins Server
<[hidden email]> wrote:
>
> Build: https://builds.apache.org/job/Lucene-Solr-Tests-8.x/144/
>
> 1 tests failed.
> FAILED:  org.apache.lucene.luke.models.documents.DocumentsImplTest.testGetDocumentFields
>
> Error Message:
>
>
> Stack Trace:
> java.lang.AssertionError
>         at __randomizedtesting.SeedInfo.seed([47ED63C9DDA8D789:D8E085BA14A90B69]:0)
>         at org.junit.Assert.fail(Assert.java:86)
>         at org.junit.Assert.assertTrue(Assert.java:41)
>         at org.junit.Assert.assertFalse(Assert.java:64)
>         at org.junit.Assert.assertFalse(Assert.java:74)
>         at org.apache.lucene.luke.models.documents.DocumentsImplTest.testGetDocumentFields(DocumentsImplTest.java:59)
>         at sun.reflect.NativeMethodAccessorImpl.invoke0(Native Method)
>         at sun.reflect.NativeMethodAccessorImpl.invoke(NativeMethodAccessorImpl.java:62)
>         at sun.reflect.DelegatingMethodAccessorImpl.invoke(DelegatingMethodAccessorImpl.java:43)
>         at java.lang.reflect.Method.invoke(Method.java:498)
>         at com.carrotsearch.randomizedtesting.RandomizedRunner.invoke(RandomizedRunner.java:1750)
>         at com.carrotsearch.randomizedtesting.RandomizedRunner$8.evaluate(RandomizedRunner.java:938)
>         at com.carrotsearch.randomizedtesting.RandomizedRunner$9.evaluate(RandomizedRunner.java:974)
>         at com.carrotsearch.randomizedtesting.RandomizedRunner$10.evaluate(RandomizedRunner.java:988)
>         at org.apache.lucene.util.TestRuleSetupTeardownChained$1.evaluate(TestRuleSetupTeardownChained.java:49)
>         at org.apache.lucene.util.AbstractBeforeAfterRule$1.evaluate(AbstractBeforeAfterRule.java:45)
>         at org.apache.lucene.util.TestRuleThreadAndTestName$1.evaluate(TestRuleThreadAndTestName.java:48)
>         at org.apache.lucene.util.TestRuleIgnoreAfterMaxFailures$1.evaluate(TestRuleIgnoreAfterMaxFailures.java:64)
>         at org.apache.lucene.util.TestRuleMarkFailure$1.evaluate(TestRuleMarkFailure.java:47)
>         at com.carrotsearch.randomizedtesting.rules.StatementAdapter.evaluate(StatementAdapter.java:36)
>         at com.carrotsearch.randomizedtesting.ThreadLeakControl$StatementRunner.run(ThreadLeakControl.java:368)
>         at com.carrotsearch.randomizedtesting.ThreadLeakControl.forkTimeoutingTask(ThreadLeakControl.java:817)
>         at com.carrotsearch.randomizedtesting.ThreadLeakControl$3.evaluate(ThreadLeakControl.java:468)
>         at com.carrotsearch.randomizedtesting.RandomizedRunner.runSingleTest(RandomizedRunner.java:947)
>         at com.carrotsearch.randomizedtesting.RandomizedRunner$5.evaluate(RandomizedRunner.java:832)
>         at com.carrotsearch.randomizedtesting.RandomizedRunner$6.evaluate(RandomizedRunner.java:883)
>         at com.carrotsearch.randomizedtesting.RandomizedRunner$7.evaluate(RandomizedRunner.java:894)
>         at org.apache.lucene.util.AbstractBeforeAfterRule$1.evaluate(AbstractBeforeAfterRule.java:45)
>         at com.carrotsearch.randomizedtesting.rules.StatementAdapter.evaluate(StatementAdapter.java:36)
>         at org.apache.lucene.util.TestRuleStoreClassName$1.evaluate(TestRuleStoreClassName.java:41)
>         at com.carrotsearch.randomizedtesting.rules.NoShadowingOrOverridesOnMethodsRule$1.evaluate(NoShadowingOrOverridesOnMethodsRule.java:40)
>         at com.carrotsearch.randomizedtesting.rules.NoShadowingOrOverridesOnMethodsRule$1.evaluate(NoShadowingOrOverridesOnMethodsRule.java:40)
>         at com.carrotsearch.randomizedtesting.rules.StatementAdapter.evaluate(StatementAdapter.java:36)
>         at com.carrotsearch.randomizedtesting.rules.StatementAdapter.evaluate(StatementAdapter.java:36)
>         at com.carrotsearch.randomizedtesting.rules.StatementAdapter.evaluate(StatementAdapter.java:36)
>         at org.apache.lucene.util.TestRuleAssertionsRequired$1.evaluate(TestRuleAssertionsRequired.java:53)
>         at org.apache.lucene.util.TestRuleMarkFailure$1.evaluate(TestRuleMarkFailure.java:47)
>         at org.apache.lucene.util.TestRuleIgnoreAfterMaxFailures$1.evaluate(TestRuleIgnoreAfterMaxFailures.java:64)
>         at org.apache.lucene.util.TestRuleIgnoreTestSuites$1.evaluate(TestRuleIgnoreTestSuites.java:54)
>         at com.carrotsearch.randomizedtesting.rules.StatementAdapter.evaluate(StatementAdapter.java:36)
>         at com.carrotsearch.randomizedtesting.ThreadLeakControl$StatementRunner.run(ThreadLeakControl.java:368)
>         at java.lang.Thread.run(Thread.java:748)
>
>
>
>
> Build Log:
> [...truncated 8915 lines...]
>    [junit4] Suite: org.apache.lucene.luke.models.documents.DocumentsImplTest
>    [junit4]   2> NOTE: reproduce with: ant test  -Dtestcase=DocumentsImplTest -Dtests.method=testGetDocumentFields -Dtests.seed=47ED63C9DDA8D789 -Dtests.multiplier=2 -Dtests.slow=true -Dtests.locale=hu-HU -Dtests.timezone=Australia/Melbourne -Dtests.asserts=true -Dtests.file.encoding=UTF-8
>    [junit4] FAILURE 0.08s J1 | DocumentsImplTest.testGetDocumentFields <<<
>    [junit4]    > Throwable #1: java.lang.AssertionError
>    [junit4]    >        at __randomizedtesting.SeedInfo.seed([47ED63C9DDA8D789:D8E085BA14A90B69]:0)
>    [junit4]    >        at org.apache.lucene.luke.models.documents.DocumentsImplTest.testGetDocumentFields(DocumentsImplTest.java:59)
>    [junit4]    >        at java.lang.Thread.run(Thread.java:748)
>    [junit4]   2> NOTE: leaving temporary files on disk at: /x1/jenkins/jenkins-slave/workspace/Lucene-Solr-Tests-8.x/lucene/build/luke/test/J1/temp/lucene.luke.models.documents.DocumentsImplTest_47ED63C9DDA8D789-001
>    [junit4]   2> NOTE: test params are: codec=CheapBastard, sim=Asserting(org.apache.lucene.search.similarities.AssertingSimilarity@6d0480a6), locale=hu-HU, timezone=Australia/Melbourne
>    [junit4]   2> NOTE: Linux 4.4.0-137-generic amd64/Oracle Corporation 1.8.0_191 (64-bit)/cpus=4,threads=1,free=205143384,total=233832448
>    [junit4]   2> NOTE: All tests run in this JVM: [AnalysisImplTest, TermCountsTest, SimpleIniFileTest, DocumentsImplTest]
>    [junit4] Completed [9/10 (1!)] on J1 in 1.78s, 17 tests, 1 failure <<< FAILURES!
>
> [...truncated 56754 lines...]
> [asciidoctor:convert] asciidoctor: ERROR: about-this-guide.adoc: line 1: invalid part, must have at least one section (e.g., chapter, appendix, etc.)
> [asciidoctor:convert] asciidoctor: ERROR: solr-glossary.adoc: line 1: invalid part, must have at least one section (e.g., chapter, appendix, etc.)
>      [java] Processed 2526 links (2067 relative) to 3355 anchors in 253 files
>      [echo] Validated Links & Anchors via: /x1/jenkins/jenkins-slave/workspace/Lucene-Solr-Tests-8.x/solr/build/solr-ref-guide/bare-bones-html/
>
> -documentation-lint:
>     [jtidy] Checking for broken html (such as invalid tags)...
>    [delete] Deleting directory /x1/jenkins/jenkins-slave/workspace/Lucene-Solr-Tests-8.x/lucene/build/jtidy_tmp
>      [echo] Checking for broken links...
>      [exec]
>      [exec] Crawl/parse...
>      [exec]
>      [exec] Verify...
>      [echo] Checking for malformed docs...
>
> jar-checksums:
>
> resolve:
>
> ivy-availability-check:
> [loadresource] Do not set property disallowed.ivy.jars.list as its length is 0.
>
> -ivy-fail-disallowed-ivy-version:
>
> ivy-fail:
>
> ivy-configure:
> [ivy:configure] :: loading settings :: file = /x1/jenkins/jenkins-slave/workspace/Lucene-Solr-Tests-8.x/lucene/top-level-ivy-settings.xml
>
> resolve:
>
> ivy-availability-check:
> [loadresource] Do not set property disallowed.ivy.jars.list as its length is 0.
>
> -ivy-fail-disallowed-ivy-version:
>
> ivy-fail:
>
> ivy-configure:
> [ivy:configure] :: loading settings :: file = /x1/jenkins/jenkins-slave/workspace/Lucene-Solr-Tests-8.x/lucene/top-level-ivy-settings.xml
>
> resolve:
>
> resolve:
>
> ivy-availability-check:
> [loadresource] Do not set property disallowed.ivy.jars.list as its length is 0.
>
> -ivy-fail-disallowed-ivy-version:
>
> ivy-fail:
>
> ivy-configure:
> [ivy:configure] :: loading settings :: file = /x1/jenkins/jenkins-slave/workspace/Lucene-Solr-Tests-8.x/lucene/top-level-ivy-settings.xml
>
> resolve:
>
> ivy-availability-check:
> [loadresource] Do not set property disallowed.ivy.jars.list as its length is 0.
>
> -ivy-fail-disallowed-ivy-version:
>
> ivy-fail:
>
> ivy-configure:
> [ivy:configure] :: loading settings :: file = /x1/jenkins/jenkins-slave/workspace/Lucene-Solr-Tests-8.x/lucene/top-level-ivy-settings.xml
>
> resolve:
>
> ivy-availability-check:
> [loadresource] Do not set property disallowed.ivy.jars.list as its length is 0.
>
> -ivy-fail-disallowed-ivy-version:
>
> ivy-fail:
>
> ivy-configure:
> [ivy:configure] :: loading settings :: file = /x1/jenkins/jenkins-slave/workspace/Lucene-Solr-Tests-8.x/lucene/top-level-ivy-settings.xml
>
> resolve:
>
> ivy-availability-check:
> [loadresource] Do not set property disallowed.ivy.jars.list as its length is 0.
>
> -ivy-fail-disallowed-ivy-version:
>
> ivy-fail:
>
> ivy-configure:
> [ivy:configure] :: loading settings :: file = /x1/jenkins/jenkins-slave/workspace/Lucene-Solr-Tests-8.x/lucene/top-level-ivy-settings.xml
>
> resolve:
>
> ivy-availability-check:
> [loadresource] Do not set property disallowed.ivy.jars.list as its length is 0.
>
> -ivy-fail-disallowed-ivy-version:
>
> ivy-fail:
>
> ivy-configure:
> [ivy:configure] :: loading settings :: file = /x1/jenkins/jenkins-slave/workspace/Lucene-Solr-Tests-8.x/lucene/top-level-ivy-settings.xml
>
> resolve:
>
> ivy-availability-check:
> [loadresource] Do not set property disallowed.ivy.jars.list as its length is 0.
>
> -ivy-fail-disallowed-ivy-version:
>
> ivy-fail:
>
> ivy-configure:
> [ivy:configure] :: loading settings :: file = /x1/jenkins/jenkins-slave/workspace/Lucene-Solr-Tests-8.x/lucene/top-level-ivy-settings.xml
>
> resolve:
>
> ivy-availability-check:
> [loadresource] Do not set property disallowed.ivy.jars.list as its length is 0.
>
> -ivy-fail-disallowed-ivy-version:
>
> ivy-fail:
>
> ivy-configure:
> [ivy:configure] :: loading settings :: file = /x1/jenkins/jenkins-slave/workspace/Lucene-Solr-Tests-8.x/lucene/top-level-ivy-settings.xml
>
> resolve:
>
> ivy-availability-check:
> [loadresource] Do not set property disallowed.ivy.jars.list as its length is 0.
>
> -ivy-fail-disallowed-ivy-version:
>
> ivy-fail:
>
> ivy-configure:
> [ivy:configure] :: loading settings :: file = /x1/jenkins/jenkins-slave/workspace/Lucene-Solr-Tests-8.x/lucene/top-level-ivy-settings.xml
>
> resolve:
>
> ivy-availability-check:
> [loadresource] Do not set property disallowed.ivy.jars.list as its length is 0.
>
> -ivy-fail-disallowed-ivy-version:
>
> ivy-fail:
>
> ivy-configure:
> [ivy:configure] :: loading settings :: file = /x1/jenkins/jenkins-slave/workspace/Lucene-Solr-Tests-8.x/lucene/top-level-ivy-settings.xml
>
> resolve:
>
> ivy-availability-check:
> [loadresource] Do not set property disallowed.ivy.jars.list as its length is 0.
>
> -ivy-fail-disallowed-ivy-version:
>
> ivy-fail:
>
> ivy-configure:
> [ivy:configure] :: loading settings :: file = /x1/jenkins/jenkins-slave/workspace/Lucene-Solr-Tests-8.x/lucene/top-level-ivy-settings.xml
>
> resolve:
>
> ivy-availability-check:
> [loadresource] Do not set property disallowed.ivy.jars.list as its length is 0.
>
> -ivy-fail-disallowed-ivy-version:
>
> ivy-fail:
>
> ivy-configure:
> [ivy:configure] :: loading settings :: file = /x1/jenkins/jenkins-slave/workspace/Lucene-Solr-Tests-8.x/lucene/top-level-ivy-settings.xml
>
> resolve:
>
> ivy-availability-check:
> [loadresource] Do not set property disallowed.ivy.jars.list as its length is 0.
>
> -ivy-fail-disallowed-ivy-version:
>
> ivy-fail:
>
> ivy-configure:
> [ivy:configure] :: loading settings :: file = /x1/jenkins/jenkins-slave/workspace/Lucene-Solr-Tests-8.x/lucene/top-level-ivy-settings.xml
>
> resolve:
>
> ivy-availability-check:
> [loadresource] Do not set property disallowed.ivy.jars.list as its length is 0.
>
> -ivy-fail-disallowed-ivy-version:
>
> ivy-fail:
>
> ivy-configure:
> [ivy:configure] :: loading settings :: file = /x1/jenkins/jenkins-slave/workspace/Lucene-Solr-Tests-8.x/lucene/top-level-ivy-settings.xml
>
> resolve:
>
> ivy-availability-check:
> [loadresource] Do not set property disallowed.ivy.jars.list as its length is 0.
>
> -ivy-fail-disallowed-ivy-version:
>
> ivy-fail:
>
> ivy-configure:
> [ivy:configure] :: loading settings :: file = /x1/jenkins/jenkins-slave/workspace/Lucene-Solr-Tests-8.x/lucene/top-level-ivy-settings.xml
>
> resolve:
>
> ivy-availability-check:
> [loadresource] Do not set property disallowed.ivy.jars.list as its length is 0.
>
> -ivy-fail-disallowed-ivy-version:
>
> ivy-fail:
>
> ivy-configure:
> [ivy:configure] :: loading settings :: file = /x1/jenkins/jenkins-slave/workspace/Lucene-Solr-Tests-8.x/lucene/top-level-ivy-settings.xml
>
> resolve:
>
> ivy-availability-check:
> [loadresource] Do not set property disallowed.ivy.jars.list as its length is 0.
>
> -ivy-fail-disallowed-ivy-version:
>
> ivy-fail:
>
> ivy-configure:
> [ivy:configure] :: loading settings :: file = /x1/jenkins/jenkins-slave/workspace/Lucene-Solr-Tests-8.x/lucene/top-level-ivy-settings.xml
>
> resolve:
>
> ivy-availability-check:
> [loadresource] Do not set property disallowed.ivy.jars.list as its length is 0.
>
> -ivy-fail-disallowed-ivy-version:
>
> ivy-fail:
>
> ivy-configure:
> [ivy:configure] :: loading settings :: file = /x1/jenkins/jenkins-slave/workspace/Lucene-Solr-Tests-8.x/lucene/top-level-ivy-settings.xml
>
> resolve:
>
> ivy-availability-check:
> [loadresource] Do not set property disallowed.ivy.jars.list as its length is 0.
>
> -ivy-fail-disallowed-ivy-version:
>
> ivy-fail:
>
> ivy-configure:
> [ivy:configure] :: loading settings :: file = /x1/jenkins/jenkins-slave/workspace/Lucene-Solr-Tests-8.x/lucene/top-level-ivy-settings.xml
>
> resolve:
>
> ivy-availability-check:
> [loadresource] Do not set property disallowed.ivy.jars.list as its length is 0.
>
> -ivy-fail-disallowed-ivy-version:
>
> ivy-fail:
>
> ivy-configure:
> [ivy:configure] :: loading settings :: file = /x1/jenkins/jenkins-slave/workspace/Lucene-Solr-Tests-8.x/lucene/top-level-ivy-settings.xml
>
> resolve:
>
> ivy-availability-check:
> [loadresource] Do not set property disallowed.ivy.jars.list as its length is 0.
>
> -ivy-fail-disallowed-ivy-version:
>
> ivy-fail:
>
> ivy-configure:
> [ivy:configure] :: loading settings :: file = /x1/jenkins/jenkins-slave/workspace/Lucene-Solr-Tests-8.x/lucene/top-level-ivy-settings.xml
>
> resolve:
>
> ivy-availability-check:
> [loadresource] Do not set property disallowed.ivy.jars.list as its length is 0.
>
> -ivy-fail-disallowed-ivy-version:
>
> ivy-fail:
>
> ivy-configure:
> [ivy:configure] :: loading settings :: file = /x1/jenkins/jenkins-slave/workspace/Lucene-Solr-Tests-8.x/lucene/top-level-ivy-settings.xml
>
> resolve:
>
> ivy-availability-check:
> [loadresource] Do not set property disallowed.ivy.jars.list as its length is 0.
>
> -ivy-fail-disallowed-ivy-version:
>
> ivy-fail:
>
> ivy-configure:
> [ivy:configure] :: loading settings :: file = /x1/jenkins/jenkins-slave/workspace/Lucene-Solr-Tests-8.x/lucene/top-level-ivy-settings.xml
>
> resolve:
>
> ivy-availability-check:
> [loadresource] Do not set property disallowed.ivy.jars.list as its length is 0.
>
> -ivy-fail-disallowed-ivy-version:
>
> ivy-fail:
>
> ivy-configure:
> [ivy:configure] :: loading settings :: file = /x1/jenkins/jenkins-slave/workspace/Lucene-Solr-Tests-8.x/lucene/top-level-ivy-settings.xml
>
> resolve:
>
> ivy-availability-check:
> [loadresource] Do not set property disallowed.ivy.jars.list as its length is 0.
>
> -ivy-fail-disallowed-ivy-version:
>
> ivy-fail:
>
> ivy-configure:
> [ivy:configure] :: loading settings :: file = /x1/jenkins/jenkins-slave/workspace/Lucene-Solr-Tests-8.x/lucene/top-level-ivy-settings.xml
>
> resolve:
>
> ivy-availability-check:
> [loadresource] Do not set property disallowed.ivy.jars.list as its length is 0.
>
> -ivy-fail-disallowed-ivy-version:
>
> ivy-fail:
>
> ivy-configure:
> [ivy:configure] :: loading settings :: file = /x1/jenkins/jenkins-slave/workspace/Lucene-Solr-Tests-8.x/lucene/top-level-ivy-settings.xml
>
> common.resolve:
>
> resolve:
>
> ivy-availability-check:
> [loadresource] Do not set property disallowed.ivy.jars.list as its length is 0.
>
> -ivy-fail-disallowed-ivy-version:
>
> ivy-fail:
>
> ivy-configure:
> [ivy:configure] :: loading settings :: file = /x1/jenkins/jenkins-slave/workspace/Lucene-Solr-Tests-8.x/lucene/top-level-ivy-settings.xml
>
> resolve:
>
> ivy-availability-check:
> [loadresource] Do not set property disallowed.ivy.jars.list as its length is 0.
>
> -ivy-fail-disallowed-ivy-version:
>
> ivy-fail:
>
> ivy-configure:
> [ivy:configure] :: loading settings :: file = /x1/jenkins/jenkins-slave/workspace/Lucene-Solr-Tests-8.x/lucene/top-level-ivy-settings.xml
>
> resolve:
>
> ivy-availability-check:
> [loadresource] Do not set property disallowed.ivy.jars.list as its length is 0.
>
> -ivy-fail-disallowed-ivy-version:
>
> ivy-fail:
>
> ivy-configure:
> [ivy:configure] :: loading settings :: file = /x1/jenkins/jenkins-slave/workspace/Lucene-Solr-Tests-8.x/lucene/top-level-ivy-settings.xml
>
> resolve:
>
> ivy-availability-check:
> [loadresource] Do not set property disallowed.ivy.jars.list as its length is 0.
>
> -ivy-fail-disallowed-ivy-version:
>
> ivy-fail:
>
> ivy-configure:
> [ivy:configure] :: loading settings :: file = /x1/jenkins/jenkins-slave/workspace/Lucene-Solr-Tests-8.x/lucene/top-level-ivy-settings.xml
>
> resolve:
>
> ivy-availability-check:
> [loadresource] Do not set property disallowed.ivy.jars.list as its length is 0.
>
> -ivy-fail-disallowed-ivy-version:
>
> ivy-fail:
>
> ivy-configure:
> [ivy:configure] :: loading settings :: file = /x1/jenkins/jenkins-slave/workspace/Lucene-Solr-Tests-8.x/lucene/top-level-ivy-settings.xml
>
> resolve:
>
> jar-checksums:
>     [mkdir] Created dir: /x1/jenkins/jenkins-slave/workspace/Lucene-Solr-Tests-8.x/lucene/null1959618697
>      [copy] Copying 38 files to /x1/jenkins/jenkins-slave/workspace/Lucene-Solr-Tests-8.x/lucene/null1959618697
>    [delete] Deleting directory /x1/jenkins/jenkins-slave/workspace/Lucene-Solr-Tests-8.x/lucene/null1959618697
>
> resolve-example:
>
> ivy-availability-check:
> [loadresource] Do not set property disallowed.ivy.jars.list as its length is 0.
>
> -ivy-fail-disallowed-ivy-version:
>
> ivy-fail:
>
> ivy-configure:
> [ivy:configure] :: loading settings :: file = /x1/jenkins/jenkins-slave/workspace/Lucene-Solr-Tests-8.x/lucene/top-level-ivy-settings.xml
>
> resolve:
>
> resolve-server:
>
> ivy-availability-check:
> [loadresource] Do not set property disallowed.ivy.jars.list as its length is 0.
>
> -ivy-fail-disallowed-ivy-version:
>
> ivy-fail:
>
> ivy-fail:
>
> ivy-configure:
> [ivy:configure] :: loading settings :: file = /x1/jenkins/jenkins-slave/workspace/Lucene-Solr-Tests-8.x/lucene/top-level-ivy-settings.xml
>
> resolve:
>
> resolve:
>
> ivy-availability-check:
> [loadresource] Do not set property disallowed.ivy.jars.list as its length is 0.
>
> -ivy-fail-disallowed-ivy-version:
>
> ivy-fail:
>
> ivy-fail:
>
> ivy-configure:
> [ivy:configure] :: loading settings :: file = /x1/jenkins/jenkins-slave/workspace/Lucene-Solr-Tests-8.x/lucene/top-level-ivy-settings.xml
>
> resolve:
>
> ivy-availability-check:
> [loadresource] Do not set property disallowed.ivy.jars.list as its length is 0.
>
> -ivy-fail-disallowed-ivy-version:
>
> ivy-fail:
>
> ivy-fail:
>
> ivy-configure:
> [ivy:configure] :: loading settings :: file = /x1/jenkins/jenkins-slave/workspace/Lucene-Solr-Tests-8.x/lucene/top-level-ivy-settings.xml
>
> resolve:
>
> ivy-availability-check:
> [loadresource] Do not set property disallowed.ivy.jars.list as its length is 0.
>
> -ivy-fail-disallowed-ivy-version:
>
> ivy-fail:
>
> ivy-configure:
> [ivy:configure] :: loading settings :: file = /x1/jenkins/jenkins-slave/workspace/Lucene-Solr-Tests-8.x/lucene/top-level-ivy-settings.xml
>
> resolve:
>
> ivy-availability-check:
> [loadresource] Do not set property disallowed.ivy.jars.list as its length is 0.
>
> -ivy-fail-disallowed-ivy-version:
>
> ivy-fail:
>
> ivy-fail:
>
> ivy-configure:
> [ivy:configure] :: loading settings :: file = /x1/jenkins/jenkins-slave/workspace/Lucene-Solr-Tests-8.x/lucene/top-level-ivy-settings.xml
>
> resolve:
>
> ivy-availability-check:
> [loadresource] Do not set property disallowed.ivy.jars.list as its length is 0.
>
> -ivy-fail-disallowed-ivy-version:
>
> ivy-fail:
>
> ivy-configure:
> [ivy:configure] :: loading settings :: file = /x1/jenkins/jenkins-slave/workspace/Lucene-Solr-Tests-8.x/lucene/top-level-ivy-settings.xml
>
> resolve:
>
> ivy-availability-check:
> [loadresource] Do not set property disallowed.ivy.jars.list as its length is 0.
>
> -ivy-fail-disallowed-ivy-version:
>
> ivy-fail:
>
> ivy-fail:
>
> ivy-configure:
> [ivy:configure] :: loading settings :: file = /x1/jenkins/jenkins-slave/workspace/Lucene-Solr-Tests-8.x/lucene/top-level-ivy-settings.xml
>
> resolve:
>
> ivy-availability-check:
> [loadresource] Do not set property disallowed.ivy.jars.list as its length is 0.
>
> -ivy-fail-disallowed-ivy-version:
>
> ivy-fail:
>
> ivy-fail:
>
> ivy-configure:
> [ivy:configure] :: loading settings :: file = /x1/jenkins/jenkins-slave/workspace/Lucene-Solr-Tests-8.x/lucene/top-level-ivy-settings.xml
>
> resolve:
>
> ivy-availability-check:
> [loadresource] Do not set property disallowed.ivy.jars.list as its length is 0.
>
> -ivy-fail-disallowed-ivy-version:
>
> ivy-fail:
>
> ivy-fail:
>
> ivy-configure:
> [ivy:configure] :: loading settings :: file = /x1/jenkins/jenkins-slave/workspace/Lucene-Solr-Tests-8.x/lucene/top-level-ivy-settings.xml
>
> resolve:
>
> ivy-availability-check:
> [loadresource] Do not set property disallowed.ivy.jars.list as its length is 0.
>
> -ivy-fail-disallowed-ivy-version:
>
> ivy-fail:
>
> ivy-fail:
>
> ivy-configure:
> [ivy:configure] :: loading settings :: file = /x1/jenkins/jenkins-slave/workspace/Lucene-Solr-Tests-8.x/lucene/top-level-ivy-settings.xml
>
> resolve:
>
> ivy-availability-check:
> [loadresource] Do not set property disallowed.ivy.jars.list as its length is 0.
>
> -ivy-fail-disallowed-ivy-version:
>
> ivy-fail:
>
> ivy-fail:
>
> ivy-configure:
> [ivy:configure] :: loading settings :: file = /x1/jenkins/jenkins-slave/workspace/Lucene-Solr-Tests-8.x/lucene/top-level-ivy-settings.xml
>
> resolve:
>
> ivy-availability-check:
> [loadresource] Do not set property disallowed.ivy.jars.list as its length is 0.
>
> -ivy-fail-disallowed-ivy-version:
>
> ivy-fail:
>
> ivy-fail:
>
> ivy-configure:
> [ivy:configure] :: loading settings :: file = /x1/jenkins/jenkins-slave/workspace/Lucene-Solr-Tests-8.x/lucene/top-level-ivy-settings.xml
>
> resolve:
>
> ivy-availability-check:
> [loadresource] Do not set property disallowed.ivy.jars.list as its length is 0.
>
> -ivy-fail-disallowed-ivy-version:
>
> ivy-fail:
>
> ivy-fail:
>
> ivy-configure:
> [ivy:configure] :: loading settings :: file = /x1/jenkins/jenkins-slave/workspace/Lucene-Solr-Tests-8.x/lucene/top-level-ivy-settings.xml
>
> resolve:
>
> ivy-availability-check:
> [loadresource] Do not set property disallowed.ivy.jars.list as its length is 0.
>
> -ivy-fail-disallowed-ivy-version:
>
> ivy-fail:
>
> ivy-fail:
>
> ivy-configure:
> [ivy:configure] :: loading settings :: file = /x1/jenkins/jenkins-slave/workspace/Lucene-Solr-Tests-8.x/lucene/top-level-ivy-settings.xml
>
> resolve:
>
> ivy-availability-check:
> [loadresource] Do not set property disallowed.ivy.jars.list as its length is 0.
>
> -ivy-fail-disallowed-ivy-version:
>
> ivy-fail:
>
> ivy-fail:
>
> ivy-configure:
> [ivy:configure] :: loading settings :: file = /x1/jenkins/jenkins-slave/workspace/Lucene-Solr-Tests-8.x/lucene/top-level-ivy-settings.xml
>
> resolve:
>
> ivy-availability-check:
> [loadresource] Do not set property disallowed.ivy.jars.list as its length is 0.
>
> -ivy-fail-disallowed-ivy-version:
>
> ivy-fail:
>
> ivy-fail:
>
> ivy-configure:
> [ivy:configure] :: loading settings :: file = /x1/jenkins/jenkins-slave/workspace/Lucene-Solr-Tests-8.x/lucene/top-level-ivy-settings.xml
>
> resolve:
>
> jar-checksums:
>     [mkdir] Created dir: /x1/jenkins/jenkins-slave/workspace/Lucene-Solr-Tests-8.x/solr/null2129471223
>      [copy] Copying 240 files to /x1/jenkins/jenkins-slave/workspace/Lucene-Solr-Tests-8.x/solr/null2129471223
>    [delete] Deleting directory /x1/jenkins/jenkins-slave/workspace/Lucene-Solr-Tests-8.x/solr/null2129471223
>
> check-working-copy:
> [ivy:cachepath] :: resolving dependencies :: org.eclipse.jgit#org.eclipse.jgit-caller;working
> [ivy:cachepath]         confs: [default]
> [ivy:cachepath]         found org.eclipse.jgit#org.eclipse.jgit;4.6.0.201612231935-r in public
> [ivy:cachepath]         found com.jcraft#jsch;0.1.53 in public
> [ivy:cachepath]         found com.googlecode.javaewah#JavaEWAH;1.1.6 in public
> [ivy:cachepath]         found org.apache.httpcomponents#httpclient;4.3.6 in public
> [ivy:cachepath]         found org.apache.httpcomponents#httpcore;4.3.3 in public
> [ivy:cachepath]         found commons-logging#commons-logging;1.1.3 in public
> [ivy:cachepath]         found commons-codec#commons-codec;1.6 in public
> [ivy:cachepath]         found org.slf4j#slf4j-api;1.7.2 in public
> [ivy:cachepath] :: resolution report :: resolve 28ms :: artifacts dl 2ms
>         ---------------------------------------------------------------------
>         |                  |            modules            ||   artifacts   |
>         |       conf       | number| search|dwnlded|evicted|| number|dwnlded|
>         ---------------------------------------------------------------------
>         |      default     |   8   |   0   |   0   |   0   ||   8   |   0   |
>         ---------------------------------------------------------------------
> [wc-checker] Initializing working copy...
> [wc-checker] SLF4J: Failed to load class "org.slf4j.impl.StaticLoggerBinder".
> [wc-checker] SLF4J: Defaulting to no-operation (NOP) logger implementation
> [wc-checker] SLF4J: See http://www.slf4j.org/codes.html#StaticLoggerBinder for further details.
> [wc-checker] Checking working copy status...
>
> -jenkins-base:
>
> BUILD SUCCESSFUL
> Total time: 116 minutes 52 seconds
> Archiving artifacts
> java.lang.InterruptedException: no matches found within 10000
>         at hudson.FilePath$ValidateAntFileMask.hasMatch(FilePath.java:2847)
>         at hudson.FilePath$ValidateAntFileMask.invoke(FilePath.java:2726)
>         at hudson.FilePath$ValidateAntFileMask.invoke(FilePath.java:2707)
>         at hudson.FilePath$FileCallableWrapper.call(FilePath.java:3086)
> Also:   hudson.remoting.Channel$CallSiteStackTrace: Remote call to lucene
>                 at hudson.remoting.Channel.attachCallSiteStackTrace(Channel.java:1741)
>                 at hudson.remoting.UserRequest$ExceptionResponse.retrieve(UserRequest.java:357)
>                 at hudson.remoting.Channel.call(Channel.java:955)
>                 at hudson.FilePath.act(FilePath.java:1072)
>                 at hudson.FilePath.act(FilePath.java:1061)
>                 at hudson.FilePath.validateAntFileMask(FilePath.java:2705)
>                 at hudson.tasks.ArtifactArchiver.perform(ArtifactArchiver.java:243)
>                 at hudson.tasks.BuildStepCompatibilityLayer.perform(BuildStepCompatibilityLayer.java:81)
>                 at hudson.tasks.BuildStepMonitor$1.perform(BuildStepMonitor.java:20)
>                 at hudson.model.AbstractBuild$AbstractBuildExecution.perform(AbstractBuild.java:744)
>                 at hudson.model.AbstractBuild$AbstractBuildExecution.performAllBuildSteps(AbstractBuild.java:690)
>                 at hudson.model.Build$BuildExecution.post2(Build.java:186)
>                 at hudson.model.AbstractBuild$AbstractBuildExecution.post(AbstractBuild.java:635)
>                 at hudson.model.Run.execute(Run.java:1835)
>                 at hudson.model.FreeStyleBuild.run(FreeStyleBuild.java:43)
>                 at hudson.model.ResourceController.execute(ResourceController.java:97)
>                 at hudson.model.Executor.run(Executor.java:429)
> Caused: hudson.FilePath$TunneledInterruptedException
>         at hudson.FilePath$FileCallableWrapper.call(FilePath.java:3088)
>         at hudson.remoting.UserRequest.perform(UserRequest.java:212)
>         at hudson.remoting.UserRequest.perform(UserRequest.java:54)
>         at hudson.remoting.Request$2.run(Request.java:369)
>         at hudson.remoting.InterceptingExecutorService$1.call(InterceptingExecutorService.java:72)
>         at java.util.concurrent.FutureTask.run(FutureTask.java:266)
>         at java.util.concurrent.ThreadPoolExecutor.runWorker(ThreadPoolExecutor.java:1142)
>         at java.util.concurrent.ThreadPoolExecutor$Worker.run(ThreadPoolExecutor.java:617)
>         at java.lang.Thread.run(Thread.java:748)
> Caused: java.lang.InterruptedException: java.lang.InterruptedException: no matches found within 10000
>         at hudson.FilePath.act(FilePath.java:1074)
>         at hudson.FilePath.act(FilePath.java:1061)
>         at hudson.FilePath.validateAntFileMask(FilePath.java:2705)
>         at hudson.tasks.ArtifactArchiver.perform(ArtifactArchiver.java:243)
>         at hudson.tasks.BuildStepCompatibilityLayer.perform(BuildStepCompatibilityLayer.java:81)
>         at hudson.tasks.BuildStepMonitor$1.perform(BuildStepMonitor.java:20)
>         at hudson.model.AbstractBuild$AbstractBuildExecution.perform(AbstractBuild.java:744)
>         at hudson.model.AbstractBuild$AbstractBuildExecution.performAllBuildSteps(AbstractBuild.java:690)
>         at hudson.model.Build$BuildExecution.post2(Build.java:186)
>         at hudson.model.AbstractBuild$AbstractBuildExecution.post(AbstractBuild.java:635)
>         at hudson.model.Run.execute(Run.java:1835)
>         at hudson.model.FreeStyleBuild.run(FreeStyleBuild.java:43)
>         at hudson.model.ResourceController.execute(ResourceController.java:97)
>         at hudson.model.Executor.run(Executor.java:429)
> No artifacts found that match the file pattern "**/*.events,heapdumps/**,**/hs_err_pid*". Configuration error?
> Recording test results
> Build step 'Publish JUnit test result report' changed build result to UNSTABLE
> Email was triggered for: Unstable (Test Failures)
> Sending email for trigger: Unstable (Test Failures)
>
> ---------------------------------------------------------------------
> To unsubscribe, e-mail: [hidden email]
> For additional commands, e-mail: [hidden email]



--
Adrien

---------------------------------------------------------------------
To unsubscribe, e-mail: [hidden email]
For additional commands, e-mail: [hidden email]