[JENKINS] Lucene-Solr-Tests-8.x - Build # 32 - Unstable

classic Classic list List threaded Threaded
1 message Options
Reply | Threaded
Open this post in threaded view
|

[JENKINS] Lucene-Solr-Tests-8.x - Build # 32 - Unstable

Apache Jenkins Server-2
Build: https://builds.apache.org/job/Lucene-Solr-Tests-8.x/32/

1 tests failed.
FAILED:  org.apache.solr.cloud.TestSolrCloudWithSecureImpersonation.testForwarding

Error Message:
Error from server at https://127.0.0.1:42064/solr/forwardingCollection: Expected mime type application/octet-stream but got text/html. <html> <head> <meta http-equiv="Content-Type" content="text/html;charset=utf-8"/> <title>Error 401 Authentication required</title> </head> <body><h2>HTTP ERROR 401</h2> <p>Problem accessing /solr/forwardingCollection/select. Reason: <pre>    Authentication required</pre></p><hr><a href="http://eclipse.org/jetty">Powered by Jetty:// 9.4.14.v20181114</a><hr/>  </body> </html>

Stack Trace:
org.apache.solr.client.solrj.impl.HttpSolrClient$RemoteSolrException: Error from server at https://127.0.0.1:42064/solr/forwardingCollection: Expected mime type application/octet-stream but got text/html. <html>
<head>
<meta http-equiv="Content-Type" content="text/html;charset=utf-8"/>
<title>Error 401 Authentication required</title>
</head>
<body><h2>HTTP ERROR 401</h2>
<p>Problem accessing /solr/forwardingCollection/select. Reason:
<pre>    Authentication required</pre></p><hr><a href="http://eclipse.org/jetty">Powered by Jetty:// 9.4.14.v20181114</a><hr/>

</body>
</html>

        at __randomizedtesting.SeedInfo.seed([7F312D21643EC4A9:9EB744DF79082240]:0)
        at org.apache.solr.client.solrj.impl.HttpSolrClient.executeMethod(HttpSolrClient.java:614)
        at org.apache.solr.client.solrj.impl.HttpSolrClient.request(HttpSolrClient.java:256)
        at org.apache.solr.client.solrj.impl.HttpSolrClient.request(HttpSolrClient.java:245)
        at org.apache.solr.client.solrj.SolrRequest.process(SolrRequest.java:207)
        at org.apache.solr.client.solrj.SolrClient.query(SolrClient.java:987)
        at org.apache.solr.client.solrj.SolrClient.query(SolrClient.java:1002)
        at org.apache.solr.cloud.TestSolrCloudWithSecureImpersonation.testForwarding(TestSolrCloudWithSecureImpersonation.java:328)
        at sun.reflect.NativeMethodAccessorImpl.invoke0(Native Method)
        at sun.reflect.NativeMethodAccessorImpl.invoke(NativeMethodAccessorImpl.java:62)
        at sun.reflect.DelegatingMethodAccessorImpl.invoke(DelegatingMethodAccessorImpl.java:43)
        at java.lang.reflect.Method.invoke(Method.java:498)
        at com.carrotsearch.randomizedtesting.RandomizedRunner.invoke(RandomizedRunner.java:1750)
        at com.carrotsearch.randomizedtesting.RandomizedRunner$8.evaluate(RandomizedRunner.java:938)
        at com.carrotsearch.randomizedtesting.RandomizedRunner$9.evaluate(RandomizedRunner.java:974)
        at com.carrotsearch.randomizedtesting.RandomizedRunner$10.evaluate(RandomizedRunner.java:988)
        at com.carrotsearch.randomizedtesting.rules.SystemPropertiesRestoreRule$1.evaluate(SystemPropertiesRestoreRule.java:57)
        at org.apache.lucene.util.TestRuleSetupTeardownChained$1.evaluate(TestRuleSetupTeardownChained.java:49)
        at org.apache.lucene.util.AbstractBeforeAfterRule$1.evaluate(AbstractBeforeAfterRule.java:45)
        at org.apache.lucene.util.TestRuleThreadAndTestName$1.evaluate(TestRuleThreadAndTestName.java:48)
        at org.apache.lucene.util.TestRuleIgnoreAfterMaxFailures$1.evaluate(TestRuleIgnoreAfterMaxFailures.java:64)
        at org.apache.lucene.util.TestRuleMarkFailure$1.evaluate(TestRuleMarkFailure.java:47)
        at com.carrotsearch.randomizedtesting.rules.StatementAdapter.evaluate(StatementAdapter.java:36)
        at com.carrotsearch.randomizedtesting.ThreadLeakControl$StatementRunner.run(ThreadLeakControl.java:368)
        at com.carrotsearch.randomizedtesting.ThreadLeakControl.forkTimeoutingTask(ThreadLeakControl.java:817)
        at com.carrotsearch.randomizedtesting.ThreadLeakControl$3.evaluate(ThreadLeakControl.java:468)
        at com.carrotsearch.randomizedtesting.RandomizedRunner.runSingleTest(RandomizedRunner.java:947)
        at com.carrotsearch.randomizedtesting.RandomizedRunner$5.evaluate(RandomizedRunner.java:832)
        at com.carrotsearch.randomizedtesting.RandomizedRunner$6.evaluate(RandomizedRunner.java:883)
        at com.carrotsearch.randomizedtesting.RandomizedRunner$7.evaluate(RandomizedRunner.java:894)
        at com.carrotsearch.randomizedtesting.rules.StatementAdapter.evaluate(StatementAdapter.java:36)
        at com.carrotsearch.randomizedtesting.rules.SystemPropertiesRestoreRule$1.evaluate(SystemPropertiesRestoreRule.java:57)
        at org.apache.lucene.util.AbstractBeforeAfterRule$1.evaluate(AbstractBeforeAfterRule.java:45)
        at com.carrotsearch.randomizedtesting.rules.StatementAdapter.evaluate(StatementAdapter.java:36)
        at org.apache.lucene.util.TestRuleStoreClassName$1.evaluate(TestRuleStoreClassName.java:41)
        at com.carrotsearch.randomizedtesting.rules.NoShadowingOrOverridesOnMethodsRule$1.evaluate(NoShadowingOrOverridesOnMethodsRule.java:40)
        at com.carrotsearch.randomizedtesting.rules.NoShadowingOrOverridesOnMethodsRule$1.evaluate(NoShadowingOrOverridesOnMethodsRule.java:40)
        at com.carrotsearch.randomizedtesting.rules.StatementAdapter.evaluate(StatementAdapter.java:36)
        at com.carrotsearch.randomizedtesting.rules.StatementAdapter.evaluate(StatementAdapter.java:36)
        at com.carrotsearch.randomizedtesting.rules.StatementAdapter.evaluate(StatementAdapter.java:36)
        at org.apache.lucene.util.TestRuleAssertionsRequired$1.evaluate(TestRuleAssertionsRequired.java:53)
        at org.apache.lucene.util.TestRuleMarkFailure$1.evaluate(TestRuleMarkFailure.java:47)
        at org.apache.lucene.util.TestRuleIgnoreAfterMaxFailures$1.evaluate(TestRuleIgnoreAfterMaxFailures.java:64)
        at org.apache.lucene.util.TestRuleIgnoreTestSuites$1.evaluate(TestRuleIgnoreTestSuites.java:54)
        at com.carrotsearch.randomizedtesting.rules.StatementAdapter.evaluate(StatementAdapter.java:36)
        at com.carrotsearch.randomizedtesting.ThreadLeakControl$StatementRunner.run(ThreadLeakControl.java:368)
        at java.lang.Thread.run(Thread.java:748)




Build Log:
[...truncated 14144 lines...]
   [junit4] Suite: org.apache.solr.cloud.TestSolrCloudWithSecureImpersonation
   [junit4]   2> 2592754 INFO  (SUITE-TestSolrCloudWithSecureImpersonation-seed#[7F312D21643EC4A9]-worker) [    ] o.a.s.SolrTestCaseJ4 SecureRandom sanity checks: test.solr.allowed.securerandom=null & java.security.egd=file:/dev/./urandom
   [junit4]   2> Creating dataDir: /home/jenkins/jenkins-slave/workspace/Lucene-Solr-Tests-8.x/solr/build/solr-core/test/J0/temp/solr.cloud.TestSolrCloudWithSecureImpersonation_7F312D21643EC4A9-001/init-core-data-001
   [junit4]   2> 2592787 WARN  (SUITE-TestSolrCloudWithSecureImpersonation-seed#[7F312D21643EC4A9]-worker) [    ] o.a.s.SolrTestCaseJ4 startTrackingSearchers: numOpens=1 numCloses=1
   [junit4]   2> 2592803 INFO  (SUITE-TestSolrCloudWithSecureImpersonation-seed#[7F312D21643EC4A9]-worker) [    ] o.a.s.SolrTestCaseJ4 Using PointFields (NUMERIC_POINTS_SYSPROP=true) w/NUMERIC_DOCVALUES_SYSPROP=false
   [junit4]   2> 2592805 INFO  (SUITE-TestSolrCloudWithSecureImpersonation-seed#[7F312D21643EC4A9]-worker) [    ] o.a.s.SolrTestCaseJ4 Randomized ssl (true) and clientAuth (false) via: @org.apache.solr.util.RandomizeSSL(reason=, ssl=NaN, value=NaN, clientAuth=NaN)
   [junit4]   2> 2593169 INFO  (SUITE-TestSolrCloudWithSecureImpersonation-seed#[7F312D21643EC4A9]-worker) [    ] o.a.s.c.MiniSolrCloudCluster Starting cluster of 2 servers in /home/jenkins/jenkins-slave/workspace/Lucene-Solr-Tests-8.x/solr/build/solr-core/test/J0/temp/solr.cloud.TestSolrCloudWithSecureImpersonation_7F312D21643EC4A9-001/tempDir-001
   [junit4]   2> 2593169 INFO  (SUITE-TestSolrCloudWithSecureImpersonation-seed#[7F312D21643EC4A9]-worker) [    ] o.a.s.c.ZkTestServer STARTING ZK TEST SERVER
   [junit4]   2> 2593170 INFO  (ZkTestServer Run Thread) [    ] o.a.s.c.ZkTestServer client port:0.0.0.0/0.0.0.0:0
   [junit4]   2> 2593170 INFO  (ZkTestServer Run Thread) [    ] o.a.s.c.ZkTestServer Starting server
   [junit4]   2> 2593277 INFO  (SUITE-TestSolrCloudWithSecureImpersonation-seed#[7F312D21643EC4A9]-worker) [    ] o.a.s.c.ZkTestServer start zk server on port:45296
   [junit4]   2> 2593277 INFO  (SUITE-TestSolrCloudWithSecureImpersonation-seed#[7F312D21643EC4A9]-worker) [    ] o.a.s.c.ZkTestServer parse host and port list: 127.0.0.1:45296
   [junit4]   2> 2593277 INFO  (SUITE-TestSolrCloudWithSecureImpersonation-seed#[7F312D21643EC4A9]-worker) [    ] o.a.s.c.ZkTestServer connecting to 127.0.0.1 45296
   [junit4]   2> 2593350 INFO  (zkConnectionManagerCallback-8130-thread-1) [    ] o.a.s.c.c.ConnectionManager zkClient has connected
   [junit4]   2> 2593383 INFO  (zkConnectionManagerCallback-8132-thread-1) [    ] o.a.s.c.c.ConnectionManager zkClient has connected
   [junit4]   2> 2593398 INFO  (zkConnectionManagerCallback-8134-thread-1) [    ] o.a.s.c.c.ConnectionManager zkClient has connected
   [junit4]   2> 2593404 WARN  (jetty-launcher-8135-thread-2) [    ] o.e.j.s.AbstractConnector Ignoring deprecated socket close linger time
   [junit4]   2> 2593404 WARN  (jetty-launcher-8135-thread-1) [    ] o.e.j.s.AbstractConnector Ignoring deprecated socket close linger time
   [junit4]   2> 2593404 INFO  (jetty-launcher-8135-thread-2) [    ] o.a.s.c.s.e.JettySolrRunner Start Jetty (original configured port=0)
   [junit4]   2> 2593404 INFO  (jetty-launcher-8135-thread-1) [    ] o.a.s.c.s.e.JettySolrRunner Start Jetty (original configured port=0)
   [junit4]   2> 2593404 INFO  (jetty-launcher-8135-thread-2) [    ] o.a.s.c.s.e.JettySolrRunner Trying to start Jetty on port 0 try number 1 ...
   [junit4]   2> 2593404 INFO  (jetty-launcher-8135-thread-1) [    ] o.a.s.c.s.e.JettySolrRunner Trying to start Jetty on port 0 try number 1 ...
   [junit4]   2> 2593404 INFO  (jetty-launcher-8135-thread-2) [    ] o.e.j.s.Server jetty-9.4.14.v20181114; built: 2018-11-14T21:20:31.478Z; git: c4550056e785fb5665914545889f21dc136ad9e6; jvm 1.8.0_191-b12
   [junit4]   2> 2593404 INFO  (jetty-launcher-8135-thread-1) [    ] o.e.j.s.Server jetty-9.4.14.v20181114; built: 2018-11-14T21:20:31.478Z; git: c4550056e785fb5665914545889f21dc136ad9e6; jvm 1.8.0_191-b12
   [junit4]   2> 2593407 INFO  (jetty-launcher-8135-thread-2) [    ] o.e.j.s.session DefaultSessionIdManager workerName=node0
   [junit4]   2> 2593407 INFO  (jetty-launcher-8135-thread-2) [    ] o.e.j.s.session No SessionScavenger set, using defaults
   [junit4]   2> 2593407 INFO  (jetty-launcher-8135-thread-2) [    ] o.e.j.s.session node0 Scavenging every 600000ms
   [junit4]   2> 2593407 INFO  (jetty-launcher-8135-thread-2) [    ] o.e.j.s.h.ContextHandler Started o.e.j.s.ServletContextHandler@471a72d4{/solr,null,AVAILABLE}
   [junit4]   2> 2593408 WARN  (jetty-launcher-8135-thread-2) [    ] o.e.j.u.s.S.config No Client EndPointIdentificationAlgorithm configured for SslContextFactory@5b68d09f[provider=null,keyStore=null,trustStore=null]
   [junit4]   2> 2593455 INFO  (jetty-launcher-8135-thread-1) [    ] o.e.j.s.session DefaultSessionIdManager workerName=node0
   [junit4]   2> 2593455 INFO  (jetty-launcher-8135-thread-1) [    ] o.e.j.s.session No SessionScavenger set, using defaults
   [junit4]   2> 2593455 INFO  (jetty-launcher-8135-thread-1) [    ] o.e.j.s.session node0 Scavenging every 600000ms
   [junit4]   2> 2593455 INFO  (jetty-launcher-8135-thread-1) [    ] o.e.j.s.h.ContextHandler Started o.e.j.s.ServletContextHandler@269180ed{/solr,null,AVAILABLE}
   [junit4]   2> 2593456 WARN  (jetty-launcher-8135-thread-1) [    ] o.e.j.u.s.S.config No Client EndPointIdentificationAlgorithm configured for SslContextFactory@7e40c1b9[provider=null,keyStore=null,trustStore=null]
   [junit4]   2> 2593456 INFO  (jetty-launcher-8135-thread-2) [    ] o.e.j.s.AbstractConnector Started ServerConnector@4f578803{SSL,[ssl, http/1.1]}{127.0.0.1:42064}
   [junit4]   2> 2593456 INFO  (jetty-launcher-8135-thread-2) [    ] o.e.j.s.Server Started @2593539ms
   [junit4]   2> 2593456 INFO  (jetty-launcher-8135-thread-2) [    ] o.a.s.c.s.e.JettySolrRunner Jetty properties: {hostContext=/solr, hostPort=42064}
   [junit4]   2> 2593456 ERROR (jetty-launcher-8135-thread-2) [    ] o.a.s.u.StartupLoggingUtils Missing Java Option solr.log.dir. Logging may be missing or incomplete.
   [junit4]   2> 2593456 INFO  (jetty-launcher-8135-thread-2) [    ] o.a.s.s.SolrDispatchFilter Using logger factory org.apache.logging.slf4j.Log4jLoggerFactory
   [junit4]   2> 2593457 INFO  (jetty-launcher-8135-thread-2) [    ] o.a.s.s.SolrDispatchFilter  ___      _       Welcome to Apache Solr? version 8.0.0
   [junit4]   2> 2593457 INFO  (jetty-launcher-8135-thread-2) [    ] o.a.s.s.SolrDispatchFilter / __| ___| |_ _   Starting in cloud mode on port null
   [junit4]   2> 2593457 INFO  (jetty-launcher-8135-thread-2) [    ] o.a.s.s.SolrDispatchFilter \__ \/ _ \ | '_|  Install dir: null
   [junit4]   2> 2593457 INFO  (jetty-launcher-8135-thread-2) [    ] o.a.s.s.SolrDispatchFilter |___/\___/_|_|    Start time: 2019-02-12T00:28:25.565Z
   [junit4]   2> 2593475 INFO  (jetty-launcher-8135-thread-1) [    ] o.e.j.s.AbstractConnector Started ServerConnector@5fa8031b{SSL,[ssl, http/1.1]}{127.0.0.1:40515}
   [junit4]   2> 2593475 INFO  (jetty-launcher-8135-thread-1) [    ] o.e.j.s.Server Started @2593558ms
   [junit4]   2> 2593475 INFO  (jetty-launcher-8135-thread-1) [    ] o.a.s.c.s.e.JettySolrRunner Jetty properties: {hostContext=/solr, hostPort=40515}
   [junit4]   2> 2593476 ERROR (jetty-launcher-8135-thread-1) [    ] o.a.s.u.StartupLoggingUtils Missing Java Option solr.log.dir. Logging may be missing or incomplete.
   [junit4]   2> 2593476 INFO  (jetty-launcher-8135-thread-1) [    ] o.a.s.s.SolrDispatchFilter Using logger factory org.apache.logging.slf4j.Log4jLoggerFactory
   [junit4]   2> 2593476 INFO  (jetty-launcher-8135-thread-1) [    ] o.a.s.s.SolrDispatchFilter  ___      _       Welcome to Apache Solr? version 8.0.0
   [junit4]   2> 2593476 INFO  (jetty-launcher-8135-thread-1) [    ] o.a.s.s.SolrDispatchFilter / __| ___| |_ _   Starting in cloud mode on port null
   [junit4]   2> 2593476 INFO  (jetty-launcher-8135-thread-1) [    ] o.a.s.s.SolrDispatchFilter \__ \/ _ \ | '_|  Install dir: null
   [junit4]   2> 2593476 INFO  (jetty-launcher-8135-thread-1) [    ] o.a.s.s.SolrDispatchFilter |___/\___/_|_|    Start time: 2019-02-12T00:28:25.584Z
   [junit4]   2> 2593477 INFO  (zkConnectionManagerCallback-8137-thread-1) [    ] o.a.s.c.c.ConnectionManager zkClient has connected
   [junit4]   2> 2593488 INFO  (jetty-launcher-8135-thread-2) [    ] o.a.s.s.SolrDispatchFilter solr.xml found in ZooKeeper. Loading...
   [junit4]   2> 2593633 INFO  (zkConnectionManagerCallback-8139-thread-1) [    ] o.a.s.c.c.ConnectionManager zkClient has connected
   [junit4]   2> 2593634 INFO  (jetty-launcher-8135-thread-1) [    ] o.a.s.s.SolrDispatchFilter solr.xml found in ZooKeeper. Loading...
   [junit4]   2> 2594712 INFO  (jetty-launcher-8135-thread-1) [    ] o.a.s.h.c.HttpShardHandlerFactory Host whitelist initialized: WhitelistHostChecker [whitelistHosts=null, whitelistHostCheckingEnabled=true]
   [junit4]   2> 2594712 WARN  (jetty-launcher-8135-thread-1) [    ] o.a.s.c.s.i.Http2SolrClient Create Http2SolrClient with HTTP/1.1 transport since Java 8 or lower versions does not support SSL + HTTP/2
   [junit4]   2> 2594720 WARN  (jetty-launcher-8135-thread-1) [    ] o.e.j.u.s.S.config No Client EndPointIdentificationAlgorithm configured for SslContextFactory@128cc531[provider=null,keyStore=null,trustStore=null]
   [junit4]   2> 2594736 WARN  (jetty-launcher-8135-thread-1) [    ] o.a.s.c.s.i.Http2SolrClient Create Http2SolrClient with HTTP/1.1 transport since Java 8 or lower versions does not support SSL + HTTP/2
   [junit4]   2> 2594756 WARN  (jetty-launcher-8135-thread-1) [    ] o.e.j.u.s.S.config No Client EndPointIdentificationAlgorithm configured for SslContextFactory@786df5de[provider=null,keyStore=null,trustStore=null]
   [junit4]   2> 2594757 INFO  (jetty-launcher-8135-thread-1) [    ] o.a.s.c.ZkContainer Zookeeper client=127.0.0.1:45296/solr
   [junit4]   2> 2594795 INFO  (zkConnectionManagerCallback-8145-thread-1) [    ] o.a.s.c.c.ConnectionManager zkClient has connected
   [junit4]   2> 2594845 INFO  (zkConnectionManagerCallback-8147-thread-1) [    ] o.a.s.c.c.ConnectionManager zkClient has connected
   [junit4]   2> 2595096 INFO  (jetty-launcher-8135-thread-2) [    ] o.a.s.h.c.HttpShardHandlerFactory Host whitelist initialized: WhitelistHostChecker [whitelistHosts=null, whitelistHostCheckingEnabled=true]
   [junit4]   2> 2595096 WARN  (jetty-launcher-8135-thread-2) [    ] o.a.s.c.s.i.Http2SolrClient Create Http2SolrClient with HTTP/1.1 transport since Java 8 or lower versions does not support SSL + HTTP/2
   [junit4]   2> 2595139 INFO  (jetty-launcher-8135-thread-1) [n:127.0.0.1:40515_solr    ] o.a.s.c.OverseerElectionContext I am going to be the leader 127.0.0.1:40515_solr
   [junit4]   2> 2595139 INFO  (jetty-launcher-8135-thread-1) [n:127.0.0.1:40515_solr    ] o.a.s.c.Overseer Overseer (id=74172355968499718-127.0.0.1:40515_solr-n_0000000000) starting
   [junit4]   2> 2595149 WARN  (jetty-launcher-8135-thread-2) [    ] o.e.j.u.s.S.config No Client EndPointIdentificationAlgorithm configured for SslContextFactory@49811e4b[provider=null,keyStore=null,trustStore=null]
   [junit4]   2> 2595186 WARN  (jetty-launcher-8135-thread-2) [    ] o.a.s.c.s.i.Http2SolrClient Create Http2SolrClient with HTTP/1.1 transport since Java 8 or lower versions does not support SSL + HTTP/2
   [junit4]   2> 2595198 WARN  (jetty-launcher-8135-thread-2) [    ] o.e.j.u.s.S.config No Client EndPointIdentificationAlgorithm configured for SslContextFactory@7c54685c[provider=null,keyStore=null,trustStore=null]
   [junit4]   2> 2595199 INFO  (jetty-launcher-8135-thread-2) [    ] o.a.s.c.ZkContainer Zookeeper client=127.0.0.1:45296/solr
   [junit4]   2> 2595222 INFO  (zkConnectionManagerCallback-8155-thread-1) [    ] o.a.s.c.c.ConnectionManager zkClient has connected
   [junit4]   2> 2595270 INFO  (zkConnectionManagerCallback-8157-thread-1) [    ] o.a.s.c.c.ConnectionManager zkClient has connected
   [junit4]   2> 2595275 INFO  (jetty-launcher-8135-thread-2) [n:127.0.0.1:42064_solr    ] o.a.s.c.ZkController Register node as live in ZooKeeper:/live_nodes/127.0.0.1:42064_solr
   [junit4]   2> 2595276 INFO  (jetty-launcher-8135-thread-2) [n:127.0.0.1:42064_solr    ] o.a.s.c.CoreContainer Initializing authentication plugin: org.apache.solr.security.HttpParamDelegationTokenPlugin
   [junit4]   2> 2595295 INFO  (zkCallback-8156-thread-1) [    ] o.a.s.c.c.ZkStateReader Updated live nodes from ZooKeeper... (0) -> (1)
   [junit4]   2> 2595331 INFO  (zkCallback-8146-thread-1) [    ] o.a.s.c.c.ZkStateReader Updated live nodes from ZooKeeper... (0) -> (1)
   [junit4]   2> 2595332 WARN  (jetty-launcher-8135-thread-2) [n:127.0.0.1:42064_solr    ] o.a.s.c.s.i.Krb5HttpClientBuilder org.apache.solr.client.solrj.impl.Krb5HttpClientBuilder is configured without specifying system property 'java.security.auth.login.config'
   [junit4]   2> 2595334 INFO  (jetty-launcher-8135-thread-2) [n:127.0.0.1:42064_solr    ] o.a.s.s.KerberosPlugin Params: {solr.kerberos.impersonator.user.noGroups.hosts=*, solr.kerberos.impersonator.user.bogusGroup.groups=__some_bogus_group, token.valid=30, cookie.domain=127.0.0.1, solr.kerberos.impersonator.user.anyHostAnyUser.groups=*, solr.kerberos.impersonator.user.bogusGroup.hosts=*, solr.kerberos.impersonator.user.anyHostAnyUser.hosts=*, token.validity=36000, solr.kerberos.impersonator.user.noHosts.groups=*, type=kerberos, solr.kerberos.impersonator.user.localHostAnyGroup.groups=*, delegation-token.token-kind=solr-dt, solr.kerberos.impersonator.user.wrongHost.hosts=1.1.1.1.1.1, cookie.path=/, zk-dt-secret-manager.znodeWorkingPath=solr/security/zkdtsm, solr.kerberos.impersonator.user.localHostAnyGroup.hosts=lucene2-us-west.apache.org,localhost,127.0.0.1, signer.secret.provider.zookeeper.path=/token, solr.kerberos.impersonator.user.anyHostUsersGroup.groups=jenkins, zk-dt-secret-manager.enable=true, solr.kerberos.impersonator.user.wrongHost.groups=*, kerberos.name.rules=DEFAULT, signer.secret.provider=zookeeper, solr.kerberos.impersonator.user.anyHostUsersGroup.hosts=*}
   [junit4]   2> 2595356 INFO  (zkConnectionManagerCallback-8162-thread-1) [    ] o.a.s.c.c.ConnectionManager zkClient has connected
   [junit4]   2> 2595359 INFO  (jetty-launcher-8135-thread-1) [n:127.0.0.1:40515_solr    ] o.a.s.c.c.ZkStateReader Updated live nodes from ZooKeeper... (0) -> (1)
   [junit4]   2> 2595372 INFO  (jetty-launcher-8135-thread-2) [n:127.0.0.1:42064_solr    ] o.a.c.f.i.CuratorFrameworkImpl Starting
   [junit4]   2> 2595372 INFO  (jetty-launcher-8135-thread-1) [n:127.0.0.1:40515_solr    ] o.a.s.c.s.i.ZkClientClusterStateProvider Cluster at 127.0.0.1:45296/solr ready
   [junit4]   2> 2595374 INFO  (jetty-launcher-8135-thread-2-EventThread) [    ] o.a.c.f.s.ConnectionStateManager State change: CONNECTED
   [junit4]   2> 2595403 INFO  (OverseerStateUpdate-74172355968499718-127.0.0.1:40515_solr-n_0000000000) [n:127.0.0.1:40515_solr    ] o.a.s.c.Overseer Starting to work on the main queue : 127.0.0.1:40515_solr
   [junit4]   2> 2595411 INFO  (jetty-launcher-8135-thread-1) [n:127.0.0.1:40515_solr    ] o.a.s.c.ZkController Publish node=127.0.0.1:40515_solr as DOWN
   [junit4]   2> 2595412 INFO  (jetty-launcher-8135-thread-1) [n:127.0.0.1:40515_solr    ] o.a.s.c.TransientSolrCoreCacheDefault Allocating transient cache for 2147483647 transient cores
   [junit4]   2> 2595412 INFO  (jetty-launcher-8135-thread-1) [n:127.0.0.1:40515_solr    ] o.a.s.c.ZkController Register node as live in ZooKeeper:/live_nodes/127.0.0.1:40515_solr
   [junit4]   2> 2595413 INFO  (jetty-launcher-8135-thread-1) [n:127.0.0.1:40515_solr    ] o.a.s.c.CoreContainer Initializing authentication plugin: org.apache.solr.security.HttpParamDelegationTokenPlugin
   [junit4]   2> 2595413 WARN  (jetty-launcher-8135-thread-1) [n:127.0.0.1:40515_solr    ] o.a.s.c.s.i.Krb5HttpClientBuilder org.apache.solr.client.solrj.impl.Krb5HttpClientBuilder is configured without specifying system property 'java.security.auth.login.config'
   [junit4]   2> 2595431 INFO  (zkCallback-8156-thread-1) [    ] o.a.s.c.c.ZkStateReader Updated live nodes from ZooKeeper... (1) -> (2)
   [junit4]   2> 2595473 INFO  (zkCallback-8161-thread-1) [    ] o.a.s.c.c.ZkStateReader Updated live nodes from ZooKeeper... (1) -> (2)
   [junit4]   2> 2595473 INFO  (jetty-launcher-8135-thread-1) [n:127.0.0.1:40515_solr    ] o.a.s.s.KerberosPlugin Params: {solr.kerberos.impersonator.user.noGroups.hosts=*, solr.kerberos.impersonator.user.bogusGroup.groups=__some_bogus_group, token.valid=30, cookie.domain=127.0.0.1, solr.kerberos.impersonator.user.anyHostAnyUser.groups=*, solr.kerberos.impersonator.user.bogusGroup.hosts=*, solr.kerberos.impersonator.user.anyHostAnyUser.hosts=*, token.validity=36000, solr.kerberos.impersonator.user.noHosts.groups=*, type=kerberos, solr.kerberos.impersonator.user.localHostAnyGroup.groups=*, delegation-token.token-kind=solr-dt, solr.kerberos.impersonator.user.wrongHost.hosts=1.1.1.1.1.1, cookie.path=/, zk-dt-secret-manager.znodeWorkingPath=solr/security/zkdtsm, solr.kerberos.impersonator.user.localHostAnyGroup.hosts=lucene2-us-west.apache.org,localhost,127.0.0.1, signer.secret.provider.zookeeper.path=/token, solr.kerberos.impersonator.user.anyHostUsersGroup.groups=jenkins, zk-dt-secret-manager.enable=true, solr.kerberos.impersonator.user.wrongHost.groups=*, kerberos.name.rules=DEFAULT, signer.secret.provider=zookeeper, solr.kerberos.impersonator.user.anyHostUsersGroup.hosts=*}
   [junit4]   2> 2595474 INFO  (zkCallback-8146-thread-2) [    ] o.a.s.c.c.ZkStateReader Updated live nodes from ZooKeeper... (1) -> (2)
   [junit4]   2> 2595474 INFO  (jetty-launcher-8135-thread-1) [n:127.0.0.1:40515_solr    ] o.a.c.f.i.CuratorFrameworkImpl Starting
   [junit4]   2> 2595513 INFO  (jetty-launcher-8135-thread-1-EventThread) [    ] o.a.c.f.s.ConnectionStateManager State change: CONNECTED
   [junit4]   2> 2596557 WARN  (jetty-launcher-8135-thread-2) [n:127.0.0.1:42064_solr    ] o.a.s.c.s.i.Krb5HttpClientBuilder org.apache.solr.client.solrj.impl.Krb5HttpClientBuilder is configured without specifying system property 'java.security.auth.login.config'
   [junit4]   2> 2596712 INFO  (zkConnectionManagerCallback-8169-thread-1) [    ] o.a.s.c.c.ConnectionManager zkClient has connected
   [junit4]   2> 2596713 INFO  (jetty-launcher-8135-thread-2) [n:127.0.0.1:42064_solr    ] o.a.s.c.c.ZkStateReader Updated live nodes from ZooKeeper... (0) -> (2)
   [junit4]   2> 2596714 INFO  (jetty-launcher-8135-thread-2) [n:127.0.0.1:42064_solr    ] o.a.s.c.s.i.ZkClientClusterStateProvider Cluster at 127.0.0.1:45296/solr ready
   [junit4]   2> 2596715 INFO  (jetty-launcher-8135-thread-2) [n:127.0.0.1:42064_solr    ] o.a.s.h.a.MetricsHistoryHandler No .system collection, keeping metrics history in memory.
   [junit4]   2> 2596739 WARN  (jetty-launcher-8135-thread-1) [n:127.0.0.1:40515_solr    ] o.a.s.c.s.i.Krb5HttpClientBuilder org.apache.solr.client.solrj.impl.Krb5HttpClientBuilder is configured without specifying system property 'java.security.auth.login.config'
   [junit4]   2> 2596807 INFO  (jetty-launcher-8135-thread-1) [n:127.0.0.1:40515_solr    ] o.a.s.h.a.MetricsHistoryHandler No .system collection, keeping metrics history in memory.
   [junit4]   2> 2597004 INFO  (jetty-launcher-8135-thread-2) [n:127.0.0.1:42064_solr    ] o.a.s.m.r.SolrJmxReporter JMX monitoring for 'solr_42064.solr.node' (registry 'solr.node') enabled at server: com.sun.jmx.mbeanserver.JmxMBeanServer@33387381
   [junit4]   2> 2597086 INFO  (jetty-launcher-8135-thread-2) [n:127.0.0.1:42064_solr    ] o.a.s.m.r.SolrJmxReporter JMX monitoring for 'solr_42064.solr.jvm' (registry 'solr.jvm') enabled at server: com.sun.jmx.mbeanserver.JmxMBeanServer@33387381
   [junit4]   2> 2597086 INFO  (jetty-launcher-8135-thread-2) [n:127.0.0.1:42064_solr    ] o.a.s.m.r.SolrJmxReporter JMX monitoring for 'solr_42064.solr.jetty' (registry 'solr.jetty') enabled at server: com.sun.jmx.mbeanserver.JmxMBeanServer@33387381
   [junit4]   2> 2597087 INFO  (jetty-launcher-8135-thread-2) [n:127.0.0.1:42064_solr    ] o.a.s.c.CorePropertiesLocator Found 0 core definitions underneath /home/jenkins/jenkins-slave/workspace/Lucene-Solr-Tests-8.x/solr/build/solr-core/test/J0/temp/solr.cloud.TestSolrCloudWithSecureImpersonation_7F312D21643EC4A9-001/tempDir-001/node2/.
   [junit4]   2> 2597090 INFO  (jetty-launcher-8135-thread-1) [n:127.0.0.1:40515_solr    ] o.a.s.m.r.SolrJmxReporter JMX monitoring for 'solr_40515.solr.node' (registry 'solr.node') enabled at server: com.sun.jmx.mbeanserver.JmxMBeanServer@33387381
   [junit4]   2> 2597259 INFO  (jetty-launcher-8135-thread-1) [n:127.0.0.1:40515_solr    ] o.a.s.m.r.SolrJmxReporter JMX monitoring for 'solr_40515.solr.jvm' (registry 'solr.jvm') enabled at server: com.sun.jmx.mbeanserver.JmxMBeanServer@33387381
   [junit4]   2> 2597259 INFO  (jetty-launcher-8135-thread-1) [n:127.0.0.1:40515_solr    ] o.a.s.m.r.SolrJmxReporter JMX monitoring for 'solr_40515.solr.jetty' (registry 'solr.jetty') enabled at server: com.sun.jmx.mbeanserver.JmxMBeanServer@33387381
   [junit4]   2> 2597260 INFO  (jetty-launcher-8135-thread-1) [n:127.0.0.1:40515_solr    ] o.a.s.c.CorePropertiesLocator Found 0 core definitions underneath /home/jenkins/jenkins-slave/workspace/Lucene-Solr-Tests-8.x/solr/build/solr-core/test/J0/temp/solr.cloud.TestSolrCloudWithSecureImpersonation_7F312D21643EC4A9-001/tempDir-001/node1/.
   [junit4]   2> 2597414 INFO  (zkConnectionManagerCallback-8176-thread-1) [    ] o.a.s.c.c.ConnectionManager zkClient has connected
   [junit4]   2> 2597415 INFO  (SUITE-TestSolrCloudWithSecureImpersonation-seed#[7F312D21643EC4A9]-worker) [    ] o.a.s.c.c.ZkStateReader Updated live nodes from ZooKeeper... (0) -> (2)
   [junit4]   2> 2597416 INFO  (SUITE-TestSolrCloudWithSecureImpersonation-seed#[7F312D21643EC4A9]-worker) [    ] o.a.s.c.s.i.ZkClientClusterStateProvider Cluster at 127.0.0.1:45296/solr ready
   [junit4]   2> 2597533 INFO  (TEST-TestSolrCloudWithSecureImpersonation.testProxyInvalidProxyUser-seed#[7F312D21643EC4A9]) [    ] o.a.s.SolrTestCaseJ4 ###Starting testProxyInvalidProxyUser
   [junit4]   2> 2598013 WARN  (qtp310550354-24042) [    ] o.a.h.s.t.d.w.DelegationTokenAuthenticationFilter Authentication exception: User: bar is not allowed to impersonate anyHostAnyUser
   [junit4]   2> 2598144 INFO  (TEST-TestSolrCloudWithSecureImpersonation.testProxyInvalidProxyUser-seed#[7F312D21643EC4A9]) [    ] o.a.s.SolrTestCaseJ4 ###Ending testProxyInvalidProxyUser
   [junit4]   2> 2598360 INFO  (TEST-TestSolrCloudWithSecureImpersonation.testProxyValidateAnyHostAnyUser-seed#[7F312D21643EC4A9]) [    ] o.a.s.SolrTestCaseJ4 ###Starting testProxyValidateAnyHostAnyUser
   [junit4]   2> 2598470 WARN  (qtp310550354-24038) [    ] o.a.h.s.a.s.AuthenticationFilter AuthenticationToken ignored: Invalid AuthenticationToken type
   [junit4]   2> 2598503 INFO  (qtp310550354-24038) [n:127.0.0.1:42064_solr    ] o.a.s.h.a.CollectionsHandler Invoked Collection Action :list with params doAs=bar&action=LIST&wt=javabin&version=2 and sendToOCPQueue=true
   [junit4]   2> 2598503 INFO  (qtp310550354-24038) [n:127.0.0.1:42064_solr    ] o.a.s.s.HttpSolrCall [admin] webapp=null path=/admin/collections params={doAs=bar&action=LIST&wt=javabin&version=2} status=0 QTime=12
   [junit4]   2> 2598524 INFO  (TEST-TestSolrCloudWithSecureImpersonation.testProxyValidateAnyHostAnyUser-seed#[7F312D21643EC4A9]) [    ] o.a.s.SolrTestCaseJ4 ###Ending testProxyValidateAnyHostAnyUser
   [junit4]   2> 2598965 INFO  (TEST-TestSolrCloudWithSecureImpersonation.testProxyValidateHost-seed#[7F312D21643EC4A9]) [    ] o.a.s.SolrTestCaseJ4 ###Starting testProxyValidateHost
   [junit4]   2> 2598967 WARN  (qtp310550354-24039) [    ] o.a.h.s.a.s.AuthenticationFilter AuthenticationToken ignored: Invalid AuthenticationToken type
   [junit4]   2> 2598967 INFO  (qtp310550354-24039) [n:127.0.0.1:42064_solr    ] o.a.s.h.a.CollectionsHandler Invoked Collection Action :list with params doAs=bar&action=LIST&wt=javabin&version=2 and sendToOCPQueue=true
   [junit4]   2> 2598967 INFO  (qtp310550354-24039) [n:127.0.0.1:42064_solr    ] o.a.s.s.HttpSolrCall [admin] webapp=null path=/admin/collections params={doAs=bar&action=LIST&wt=javabin&version=2} status=0 QTime=0
   [junit4]   2> 2598984 INFO  (TEST-TestSolrCloudWithSecureImpersonation.testProxyValidateHost-seed#[7F312D21643EC4A9]) [    ] o.a.s.SolrTestCaseJ4 ###Ending testProxyValidateHost
   [junit4]   2> 2599378 INFO  (TEST-TestSolrCloudWithSecureImpersonation.testProxyNoConfigGroups-seed#[7F312D21643EC4A9]) [    ] o.a.s.SolrTestCaseJ4 ###Starting testProxyNoConfigGroups
   [junit4]   2> 2599383 WARN  (qtp310550354-24040) [    ] o.a.h.s.a.s.AuthenticationFilter AuthenticationToken ignored: Invalid AuthenticationToken type
   [junit4]   2> 2599456 WARN  (qtp310550354-24040) [    ] o.a.h.s.t.d.w.DelegationTokenAuthenticationFilter Authentication exception: User: noGroups is not allowed to impersonate bar
   [junit4]   2> 2599468 INFO  (TEST-TestSolrCloudWithSecureImpersonation.testProxyNoConfigGroups-seed#[7F312D21643EC4A9]) [    ] o.a.s.SolrTestCaseJ4 ###Ending testProxyNoConfigGroups
   [junit4]   2> 2599923 INFO  (TEST-TestSolrCloudWithSecureImpersonation.testProxyInvalidGroup-seed#[7F312D21643EC4A9]) [    ] o.a.s.SolrTestCaseJ4 ###Starting testProxyInvalidGroup
   [junit4]   2> 2599925 WARN  (qtp310550354-24041) [    ] o.a.h.s.a.s.AuthenticationFilter AuthenticationToken ignored: Invalid AuthenticationToken type
   [junit4]   2> 2600236 WARN  (qtp310550354-24041) [    ] o.a.h.s.ShellBasedUnixGroupsMapping unable to return groups for user bar
   [junit4]   2> org.apache.hadoop.security.ShellBasedUnixGroupsMapping$PartialGroupNameException: The user name 'bar' is not found. id: ‘bar’: no such user
   [junit4]   2> id: ‘bar’: no such user
   [junit4]   2>
   [junit4]   2> at org.apache.hadoop.security.ShellBasedUnixGroupsMapping.resolvePartialGroupNames(ShellBasedUnixGroupsMapping.java:294) ~[hadoop-common-3.2.0.jar:?]
   [junit4]   2> at org.apache.hadoop.security.ShellBasedUnixGroupsMapping.getUnixGroups(ShellBasedUnixGroupsMapping.java:207) [hadoop-common-3.2.0.jar:?]
   [junit4]   2> at org.apache.hadoop.security.ShellBasedUnixGroupsMapping.getGroups(ShellBasedUnixGroupsMapping.java:97) [hadoop-common-3.2.0.jar:?]
   [junit4]   2> at org.apache.hadoop.security.JniBasedUnixGroupsMappingWithFallback.getGroups(JniBasedUnixGroupsMappingWithFallback.java:51) [hadoop-common-3.2.0.jar:?]
   [junit4]   2> at org.apache.hadoop.security.Groups$GroupCacheLoader.fetchGroupList(Groups.java:387) [hadoop-common-3.2.0.jar:?]
   [junit4]   2> at org.apache.hadoop.security.Groups$GroupCacheLoader.load(Groups.java:321) [hadoop-common-3.2.0.jar:?]
   [junit4]   2> at org.apache.hadoop.security.Groups$GroupCacheLoader.load(Groups.java:270) [hadoop-common-3.2.0.jar:?]
   [junit4]   2> at com.google.common.cache.LocalCache$LoadingValueReference.loadFuture(LocalCache.java:3599) [guava-14.0.1.jar:?]
   [junit4]   2> at com.google.common.cache.LocalCache$Segment.loadSync(LocalCache.java:2379) [guava-14.0.1.jar:?]
   [junit4]   2> at com.google.common.cache.LocalCache$Segment.lockedGetOrLoad(LocalCache.java:2342) [guava-14.0.1.jar:?]
   [junit4]   2> at com.google.common.cache.LocalCache$Segment.get(LocalCache.java:2257) [guava-14.0.1.jar:?]
   [junit4]   2> at com.google.common.cache.LocalCache.get(LocalCache.java:4000) [guava-14.0.1.jar:?]
   [junit4]   2> at com.google.common.cache.LocalCache.getOrLoad(LocalCache.java:4004) [guava-14.0.1.jar:?]
   [junit4]   2> at com.google.common.cache.LocalCache$LocalLoadingCache.get(LocalCache.java:4874) [guava-14.0.1.jar:?]
   [junit4]   2> at org.apache.hadoop.security.Groups.getGroups(Groups.java:228) [hadoop-common-3.2.0.jar:?]
   [junit4]   2> at org.apache.hadoop.security.UserGroupInformation.getGroups(UserGroupInformation.java:1588) [hadoop-common-3.2.0.jar:?]
   [junit4]   2> at org.apache.hadoop.security.authorize.AccessControlList.isUserInList(AccessControlList.java:234) [hadoop-common-3.2.0.jar:?]
   [junit4]   2> at org.apache.hadoop.security.authorize.AccessControlList.isUserAllowed(AccessControlList.java:244) [hadoop-common-3.2.0.jar:?]
   [junit4]   2> at org.apache.hadoop.security.authorize.DefaultImpersonationProvider.authorize(DefaultImpersonationProvider.java:122) [hadoop-common-3.2.0.jar:?]
   [junit4]   2> at org.apache.hadoop.security.authorize.ProxyUsers.authorize(ProxyUsers.java:102) [hadoop-common-3.2.0.jar:?]
   [junit4]   2> at org.apache.hadoop.security.token.delegation.web.DelegationTokenAuthenticationFilter.doFilter(DelegationTokenAuthenticationFilter.java:264) [hadoop-common-3.2.0.jar:?]
   [junit4]   2> at org.apache.solr.security.HttpParamDelegationTokenPlugin$HttpParamToRequestFilter.doFilter(HttpParamDelegationTokenPlugin.java:289) [test/:?]
   [junit4]   2> at org.apache.hadoop.security.authentication.server.AuthenticationFilter.doFilter(AuthenticationFilter.java:592) [hadoop-auth-3.2.0.jar:?]
   [junit4]   2> at org.apache.solr.security.DelegationTokenKerberosFilter.doFilter(DelegationTokenKerberosFilter.java:139) [java/:?]
   [junit4]   2> at org.apache.solr.security.HttpParamDelegationTokenPlugin$HttpParamToRequestFilter.doFilter(HttpParamDelegationTokenPlugin.java:265) [test/:?]
   [junit4]   2> at org.apache.solr.security.KerberosPlugin.doAuthenticate(KerberosPlugin.java:244) [java/:?]
   [junit4]   2> at org.apache.solr.security.AuthenticationPlugin.authenticate(AuthenticationPlugin.java:94) [java/:?]
   [junit4]   2> at org.apache.solr.servlet.SolrDispatchFilter.authenticateRequest(SolrDispatchFilter.java:480) [java/:?]
   [junit4]   2> at org.apache.solr.servlet.SolrDispatchFilter.doFilter(SolrDispatchFilter.java:380) [java/:?]
   [junit4]   2> at org.apache.solr.servlet.SolrDispatchFilter.doFilter(SolrDispatchFilter.java:340) [java/:?]
   [junit4]   2> at org.eclipse.jetty.servlet.ServletHandler$CachedChain.doFilter(ServletHandler.java:1610) [jetty-servlet-9.4.14.v20181114.jar:9.4.14.v20181114]
   [junit4]   2> at org.apache.solr.client.solrj.embedded.JettySolrRunner$DebugFilter.doFilter(JettySolrRunner.java:164) [java/:?]
   [junit4]   2> at org.eclipse.jetty.servlet.ServletHandler$CachedChain.doFilter(ServletHandler.java:1610) [jetty-servlet-9.4.14.v20181114.jar:9.4.14.v20181114]
   [junit4]   2> at org.eclipse.jetty.servlet.ServletHandler.doHandle(ServletHandler.java:540) [jetty-servlet-9.4.14.v20181114.jar:9.4.14.v20181114]
   [junit4]   2> at org.eclipse.jetty.server.handler.ScopedHandler.nextHandle(ScopedHandler.java:255) [jetty-server-9.4.14.v20181114.jar:9.4.14.v20181114]
   [junit4]   2> at org.eclipse.jetty.server.session.SessionHandler.doHandle(SessionHandler.java:1588) [jetty-server-9.4.14.v20181114.jar:9.4.14.v20181114]
   [junit4]   2> at org.eclipse.jetty.server.handler.ScopedHandler.nextHandle(ScopedHandler.java:255) [jetty-server-9.4.14.v20181114.jar:9.4.14.v20181114]
   [junit4]   2> at org.eclipse.jetty.server.handler.ContextHandler.doHandle(ContextHandler.java:1345) [jetty-server-9.4.14.v20181114.jar:9.4.14.v20181114]
   [junit4]   2> at org.eclipse.jetty.server.handler.ScopedHandler.nextScope(ScopedHandler.java:203) [jetty-server-9.4.14.v20181114.jar:9.4.14.v20181114]
   [junit4]   2> at org.eclipse.jetty.servlet.ServletHandler.doScope(ServletHandler.java:480) [jetty-servlet-9.4.14.v20181114.jar:9.4.14.v20181114]
   [junit4]   2> at org.eclipse.jetty.server.session.SessionHandler.doScope(SessionHandler.java:1557) [jetty-server-9.4.14.v20181114.jar:9.4.14.v20181114]
   [junit4]   2> at org.eclipse.jetty.server.handler.ScopedHandler.nextScope(ScopedHandler.java:201) [jetty-server-9.4.14.v20181114.jar:9.4.14.v20181114]
   [junit4]   2> at org.eclipse.jetty.server.handler.ContextHandler.doScope(ContextHandler.java:1247) [jetty-server-9.4.14.v20181114.jar:9.4.14.v20181114]
   [junit4]   2> at org.eclipse.jetty.server.handler.ScopedHandler.handle(ScopedHandler.java:144) [jetty-server-9.4.14.v20181114.jar:9.4.14.v20181114]
   [junit4]   2> at org.eclipse.jetty.server.handler.gzip.GzipHandler.handle(GzipHandler.java:753) [jetty-server-9.4.14.v20181114.jar:9.4.14.v20181114]
   [junit4]   2> at org.eclipse.jetty.server.handler.HandlerWrapper.handle(HandlerWrapper.java:132) [jetty-server-9.4.14.v20181114.jar:9.4.14.v20181114]
   [junit4]   2> at org.eclipse.jetty.server.Server.handle(Server.java:502) [jetty-server-9.4.14.v20181114.jar:9.4.14.v20181114]
   [junit4]   2> at org.eclipse.jetty.server.HttpChannel.handle(HttpChannel.java:364) [jetty-server-9.4.14.v20181114.jar:9.4.14.v20181114]
   [junit4]   2> at org.eclipse.jetty.server.HttpConnection.onFillable(HttpConnection.java:260) [jetty-server-9.4.14.v20181114.jar:9.4.14.v20181114]
   [junit4]   2> at org.eclipse.jetty.io.AbstractConnection$ReadCallback.succeeded(AbstractConnection.java:305) [jetty-io-9.4.14.v20181114.jar:9.4.14.v20181114]
   [junit4]   2> at org.eclipse.jetty.io.FillInterest.fillable(FillInterest.java:103) [jetty-io-9.4.14.v20181114.jar:9.4.14.v20181114]
   [junit4]   2> at org.eclipse.jetty.io.ssl.SslConnection$DecryptedEndPoint.onFillable(SslConnection.java:411) [jetty-io-9.4.14.v20181114.jar:9.4.14.v20181114]
   [junit4]   2> at org.eclipse.jetty.io.ssl.SslConnection.onFillable(SslConnection.java:305) [jetty-io-9.4.14.v20181114.jar:9.4.14.v20181114]
   [junit4]   2> at org.eclipse.jetty.io.ssl.SslConnection$2.succeeded(SslConnection.java:159) [jetty-io-9.4.14.v20181114.jar:9.4.14.v20181114]
   [junit4]   2> at org.eclipse.jetty.io.FillInterest.fillable(FillInterest.java:103) [jetty-io-9.4.14.v20181114.jar:9.4.14.v20181114]
   [junit4]   2> at org.eclipse.jetty.io.ChannelEndPoint$2.run(ChannelEndPoint.java:118) [jetty-io-9.4.14.v20181114.jar:9.4.14.v20181114]
   [junit4]   2> at org.eclipse.jetty.util.thread.QueuedThreadPool.runJob(QueuedThreadPool.java:765) [jetty-util-9.4.14.v20181114.jar:9.4.14.v20181114]
   [junit4]   2> at org.eclipse.jetty.util.thread.QueuedThreadPool$2.run(QueuedThreadPool.java:683) [jetty-util-9.4.14.v20181114.jar:9.4.14.v20181114]
   [junit4]   2> at java.lang.Thread.run(Thread.java:748) [?:1.8.0_191]
   [junit4]   2> 2600266 WARN  (qtp310550354-24041) [    ] o.a.h.s.t.d.w.DelegationTokenAuthenticationFilter Authentication exception: User: bogusGroup is not allowed to impersonate bar
   [junit4]   2> 2600267 INFO  (TEST-TestSolrCloudWithSecureImpersonation.testProxyInvalidGroup-seed#[7F312D21643EC4A9]) [    ] o.a.s.SolrTestCaseJ4 ###Ending testProxyInvalidGroup
   [junit4]   2> 2600378 INFO  (TEST-TestSolrCloudWithSecureImpersonation.testProxyWrongHost-seed#[7F312D21643EC4A9]) [    ] o.a.s.SolrTestCaseJ4 ###Starting testProxyWrongHost
   [junit4]   2> 2600396 WARN  (qtp310550354-24042) [    ] o.a.h.s.a.s.AuthenticationFilter AuthenticationToken ignored: Invalid AuthenticationToken type
   [junit4]   2> 2600469 WARN  (qtp310550354-24042) [    ] o.a.h.s.t.d.w.DelegationTokenAuthenticationFilter Authentication exception: Unauthorized connection for super-user: wrongHost from IP 127.0.0.1
   [junit4]   2> 2600470 INFO  (TEST-TestSolrCloudWithSecureImpersonation.testProxyWrongHost-seed#[7F312D21643EC4A9]) [    ] o.a.s.SolrTestCaseJ4 ###Ending testProxyWrongHost
   [junit4]   2> 2600963 INFO  (TEST-TestSolrCloudWithSecureImpersonation.testForwarding-seed#[7F312D21643EC4A9]) [    ] o.a.s.SolrTestCaseJ4 ###Starting testForwarding
   [junit4]   2> 2600965 INFO  (zkConnectionManagerCallback-8178-thread-1) [    ] o.a.s.c.c.ConnectionManager zkClient has connected
   [junit4]   2> 2603074 INFO  (qtp1933050319-24050) [n:127.0.0.1:40515_solr    ] o.a.s.h.a.CollectionsHandler Invoked Collection Action :create with params pullReplicas=0&collection.configName=conf1&maxShardsPerNode=1&name=forwardingCollection&nrtReplicas=1&action=CREATE&numShards=1&tlogReplicas=0&wt=javabin&version=2 and sendToOCPQueue=true
   [junit4]   2> 2603087 INFO  (OverseerThreadFactory-7745-thread-1-processing-n:127.0.0.1:40515_solr) [n:127.0.0.1:40515_solr    ] o.a.s.c.a.c.CreateCollectionCmd Create collection forwardingCollection
   [junit4]   2> 2603218 INFO  (qtp1933050319-24048) [n:127.0.0.1:40515_solr    ] o.a.s.s.HttpSolrCall [admin] webapp=null path=/admin/metrics params={prefix=CONTAINER.fs.usableSpace,CONTAINER.fs.totalSpace,CORE.coreName&wt=javabin&version=2&group=solr.node,solr.core} status=0 QTime=0
   [junit4]   2> 2603228 WARN  (qtp1933050319-24049) [    ] o.a.h.s.a.s.AuthenticationFilter AuthenticationToken ignored: Invalid AuthenticationToken type
   [junit4]   2> 2603228 INFO  (qtp1933050319-24049) [n:127.0.0.1:40515_solr    ] o.a.s.s.HttpSolrCall [admin] webapp=null path=/admin/metrics params={prefix=CONTAINER.fs.usableSpace,CONTAINER.fs.totalSpace,CORE.coreName&wt=javabin&version=2&group=solr.node,solr.core} status=0 QTime=0
   [junit4]   2> 2603230 WARN  (qtp1933050319-24046) [    ] o.a.h.s.a.s.AuthenticationFilter AuthenticationToken ignored: Invalid AuthenticationToken type
   [junit4]   2> 2603230 INFO  (qtp1933050319-24046) [n:127.0.0.1:40515_solr    ] o.a.s.s.HttpSolrCall [admin] webapp=null path=/admin/metrics params={prefix=CONTAINER.fs.usableSpace,CONTAINER.fs.totalSpace,CORE.coreName&wt=javabin&version=2&group=solr.node,solr.core} status=0 QTime=0
   [junit4]   2> 2603260 WARN  (qtp1933050319-24047) [    ] o.a.h.s.a.s.AuthenticationFilter AuthenticationToken ignored: Invalid AuthenticationToken type
   [junit4]   2> 2603261 INFO  (qtp1933050319-24047) [n:127.0.0.1:40515_solr    ] o.a.s.s.HttpSolrCall [admin] webapp=null path=/admin/metrics params={prefix=CONTAINER.fs.usableSpace,CONTAINER.fs.totalSpace,CORE.coreName&wt=javabin&version=2&group=solr.node,solr.core} status=0 QTime=0
   [junit4]   2> 2603262 WARN  (qtp1933050319-24048) [n:127.0.0.1:40515_solr    ] o.a.h.s.a.s.AuthenticationFilter AuthenticationToken ignored: Invalid AuthenticationToken type
   [junit4]   2> 2603263 INFO  (qtp1933050319-24048) [n:127.0.0.1:40515_solr    ] o.a.s.s.HttpSolrCall [admin] webapp=null path=/admin/metrics params={prefix=CONTAINER.fs.usableSpace,CONTAINER.fs.totalSpace,CORE.coreName&wt=javabin&version=2&group=solr.node,solr.core} status=0 QTime=0
   [junit4]   2> 2603307 WARN  (qtp310550354-24040) [    ] o.a.h.s.a.s.AuthenticationFilter AuthenticationToken ignored: Invalid AuthenticationToken type
   [junit4]   2> 2603308 INFO  (qtp310550354-24040) [n:127.0.0.1:42064_solr    ] o.a.s.s.HttpSolrCall [admin] webapp=null path=/admin/metrics params={prefix=CONTAINER.fs.usableSpace,CONTAINER.fs.totalSpace,CORE.coreName&wt=javabin&version=2&group=solr.node,solr.core} status=0 QTime=0
   [junit4]   2> 2603312 WARN  (qtp310550354-24041) [    ] o.a.h.s.a.s.AuthenticationFilter AuthenticationToken ignored: Invalid AuthenticationToken type
   [junit4]   2> 2603313 INFO  (qtp310550354-24041) [n:127.0.0.1:42064_solr    ] o.a.s.s.HttpSolrCall [admin] webapp=null path=/admin/metrics params={prefix=CONTAINER.fs.usableSpace,CONTAINER.fs.totalSpace,CORE.coreName&wt=javabin&version=2&group=solr.node,solr.core} status=0 QTime=0
   [junit4]   2> 2603314 WARN  (qtp310550354-24042) [    ] o.a.h.s.a.s.AuthenticationFilter AuthenticationToken ignored: Invalid AuthenticationToken type
   [junit4]   2> 2603314 INFO  (qtp310550354-24042) [n:127.0.0.1:42064_solr    ] o.a.s.s.HttpSolrCall [admin] webapp=null path=/admin/metrics params={prefix=CONTAINER.fs.usableSpace,CONTAINER.fs.totalSpace,CORE.coreName&wt=javabin&version=2&group=solr.node,solr.core} status=0 QTime=0
   [junit4]   2> 2603315 WARN  (qtp310550354-24038) [n:127.0.0.1:42064_solr    ] o.a.h.s.a.s.AuthenticationFilter AuthenticationToken ignored: Invalid AuthenticationToken type
   [junit4]   2> 2603316 INFO  (qtp310550354-24038) [n:127.0.0.1:42064_solr    ] o.a.s.s.HttpSolrCall [admin] webapp=null path=/admin/metrics params={prefix=CONTAINER.fs.usableSpace,CONTAINER.fs.totalSpace,CORE.coreName&wt=javabin&version=2&group=solr.node,solr.core} status=0 QTime=0
   [junit4]   2> 2603329 WARN  (qtp310550354-24039) [n:127.0.0.1:42064_solr    ] o.a.h.s.a.s.AuthenticationFilter AuthenticationToken ignored: Invalid AuthenticationToken type
   [junit4]   2> 2603329 INFO  (qtp310550354-24039) [n:127.0.0.1:42064_solr    ] o.a.s.s.HttpSolrCall [admin] webapp=null path=/admin/metrics params={prefix=CONTAINER.fs.usableSpace,CONTAINER.fs.totalSpace,CORE.coreName&wt=javabin&version=2&group=solr.node,solr.core} status=0 QTime=0
   [junit4]   2> 2603335 INFO  (OverseerStateUpdate-74172355968499718-127.0.0.1:40515_solr-n_0000000000) [n:127.0.0.1:40515_solr    ] o.a.s.c.o.SliceMutator createReplica() {
   [junit4]   2>   "operation":"ADDREPLICA",
   [junit4]   2>   "collection":"forwardingCollection",
   [junit4]   2>   "shard":"shard1",
   [junit4]   2>   "core":"forwardingCollection_shard1_replica_n1",
   [junit4]   2>   "state":"down",
   [junit4]   2>   "base_url":"https://127.0.0.1:42064/solr",
   [junit4]   2>   "type":"NRT",
   [junit4]   2>   "waitForFinalState":"false"}
   [junit4]   2> 2603831 WARN  (qtp310550354-24040) [n:127.0.0.1:42064_solr    ] o.a.h.s.a.s.AuthenticationFilter AuthenticationToken ignored: Invalid AuthenticationToken type
   [junit4]   2> 2603832 INFO  (qtp310550354-24040) [n:127.0.0.1:42064_solr    x:forwardingCollection_shard1_replica_n1] o.a.s.h.a.CoreAdminOperation core create command qt=/admin/cores&coreNodeName=core_node2&collection.configName=conf1&newCollection=true&name=forwardingCollection_shard1_replica_n1&action=CREATE&numShards=1&collection=forwardingCollection&shard=shard1&wt=javabin&version=2&replicaType=NRT
   [junit4]   2> 2603832 INFO  (qtp310550354-24040) [n:127.0.0.1:42064_solr    x:forwardingCollection_shard1_replica_n1] o.a.s.c.TransientSolrCoreCacheDefault Allocating transient cache for 2147483647 transient cores
   [junit4]   2> 2605144 INFO  (qtp310550354-24040) [n:127.0.0.1:42064_solr c:forwardingCollection s:shard1 r:core_node2 x:forwardingCollection_shard1_replica_n1] o.a.s.c.SolrConfig Using Lucene MatchVersion: 8.0.0
   [junit4]   2> 2605235 INFO  (qtp310550354-24040) [n:127.0.0.1:42064_solr c:forwardingCollection s:shard1 r:core_node2 x:forwardingCollection_shard1_replica_n1] o.a.s.s.IndexSchema [forwardingCollection_shard1_replica_n1] Schema name=test
   [junit4]   2> 2605751 INFO  (qtp310550354-24040) [n:127.0.0.1:42064_solr c:forwardingCollection s:shard1 r:core_node2 x:forwardingCollection_shard1_replica_n1] o.a.s.s.IndexSchema Loaded schema test/1.0 with uniqueid field id
   [junit4]   2> 2605823 INFO  (qtp310550354-24040) [n:127.0.0.1:42064_solr c:forwardingCollection s:shard1 r:core_node2 x:forwardingCollection_shard1_replica_n1] o.a.s.c.CoreContainer Creating SolrCore 'forwardingCollection_shard1_replica_n1' using configuration from collection forwardingCollection, trusted=true
   [junit4]   2> 2605823 INFO  (qtp310550354-24040) [n:127.0.0.1:42064_solr c:forwardingCollection s:shard1 r:core_node2 x:forwardingCollection_shard1_replica_n1] o.a.s.m.r.SolrJmxReporter JMX monitoring for 'solr_42064.solr.core.forwardingCollection.shard1.replica_n1' (registry 'solr.core.forwardingCollection.shard1.replica_n1') enabled at server: com.sun.jmx.mbeanserver.JmxMBeanServer@33387381
   [junit4]   2> 2605824 INFO  (qtp310550354-24040) [n:127.0.0.1:42064_solr c:forwardingCollection s:shard1 r:core_node2 x:forwardingCollection_shard1_replica_n1] o.a.s.c.SolrCore [[forwardingCollection_shard1_replica_n1] ] Opening new SolrCore at [/home/jenkins/jenkins-slave/workspace/Lucene-Solr-Tests-8.x/solr/build/solr-core/test/J0/temp/solr.cloud.TestSolrCloudWithSecureImpersonation_7F312D21643EC4A9-001/tempDir-001/node2/forwardingCollection_shard1_replica_n1], dataDir=[/home/jenkins/jenkins-slave/workspace/Lucene-Solr-Tests-8.x/solr/build/solr-core/test/J0/temp/solr.cloud.TestSolrCloudWithSecureImpersonation_7F312D21643EC4A9-001/tempDir-001/node2/./forwardingCollection_shard1_replica_n1/data/]
   [junit4]   2> 2605826 INFO  (qtp310550354-24040) [n:127.0.0.1:42064_solr c:forwardingCollection s:shard1 r:core_node2 x:forwardingCollection_shard1_replica_n1] o.a.s.u.RandomMergePolicy RandomMergePolicy wrapping class org.apache.lucene.index.TieredMergePolicy: [TieredMergePolicy: maxMergeAtOnce=3, maxMergeAtOnceExplicit=6, maxMergedSegmentMB=90.0859375, floorSegmentMB=1.166015625, forceMergeDeletesPctAllowed=18.582966476545504, segmentsPerTier=39.0, maxCFSSegmentSizeMB=8.796093022207999E12, noCFSRatio=0.0, deletesPctAllowed=33.130644606212826
   [junit4]   2> 2606051 INFO  (qtp310550354-24040) [n:127.0.0.1:42064_solr c:forwardingCollection s:shard1 r:core_node2 x:forwardingCollection_shard1_replica_n1] o.a.s.u.UpdateHandler Using UpdateLog implementation: org.apache.solr.update.UpdateLog
   [junit4]   2> 2606051 INFO  (qtp310550354-24040) [n:127.0.0.1:42064_solr c:forwardingCollection s:shard1 r:core_node2 x:forwardingCollection_shard1_replica_n1] o.a.s.u.UpdateLog Initializing UpdateLog: dataDir= defaultSyncLevel=FLUSH numRecordsToKeep=100 maxNumLogsToKeep=10 numVersionBuckets=65536
   [junit4]   2> 2606053 INFO  (qtp310550354-24040) [n:127.0.0.1:42064_solr c:forwardingCollection s:shard1 r:core_node2 x:forwardingCollection_shard1_replica_n1] o.a.s.u.CommitTracker Hard AutoCommit: disabled
   [junit4]   2> 2606053 INFO  (qtp310550354-24040) [n:127.0.0.1:42064_solr c:forwardingCollection s:shard1 r:core_node2 x:forwardingCollection_shard1_replica_n1] o.a.s.u.CommitTracker Soft AutoCommit: disabled
   [junit4]   2> 2606054 INFO  (qtp310550354-24040) [n:127.0.0.1:42064_solr c:forwardingCollection s:shard1 r:core_node2 x:forwardingCollection_shard1_replica_n1] o.a.s.u.RandomMergePolicy RandomMergePolicy wrapping class org.apache.lucene.index.LogByteSizeMergePolicy: [LogByteSizeMergePolicy: minMergeSize=1677721, mergeFactor=26, maxMergeSize=2147483648, maxMergeSizeForForcedMerge=9223372036854775807, calibrateSizeByDeletes=true, maxMergeDocs=2147483647, maxCFSSegmentSizeMB=8.796093022207999E12, noCFSRatio=0.0]
   [junit4]   2> 2606071 INFO  (qtp310550354-24040) [n:127.0.0.1:42064_solr c:forwardingCollection s:shard1 r:core_node2 x:forwardingCollection_shard1_replica_n1] o.a.s.s.SolrIndexSearcher Opening [Searcher@78637662[forwardingCollection_shard1_replica_n1] main]
   [junit4]   2> 2606072 INFO  (qtp310550354-24040) [n:127.0.0.1:42064_solr c:forwardingCollection s:shard1 r:core_node2 x:forwardingCollection_shard1_replica_n1] o.a.s.h.c.SpellCheckComponent Initializing spell checkers
   [junit4]   2> 2606090 INFO  (qtp310550354-24040) [n:127.0.0.1:42064_solr c:forwardingCollection s:shard1 r:core_node2 x:forwardingCollection_shard1_replica_n1] o.a.s.s.DirectSolrSpellChecker init: {name=direct,classname=DirectSolrSpellChecker,field=lowerfilt,minQueryLength=3}
   [junit4]   2> 2606209 INFO  (qtp310550354-24040) [n:127.0.0.1:42064_solr c:forwardingCollection s:shard1 r:core_node2 x:forwardingCollection_shard1_replica_n1] o.a.s.h.ReplicationHandler Commits will be reserved for 10000ms.
   [junit4]   2> 2606209 INFO  (qtp310550354-24040) [n:127.0.0.1:42064_solr c:forwardingCollection s:shard1 r:core_node2 x:forwardingCollection_shard1_replica_n1] o.a.s.u.UpdateLog Could not find max version in index or recent updates, using new clock 1625220782035566592
   [junit4]   2> 2606212 INFO  (searcherExecutor-7754-thread-1-processing-n:127.0.0.1:42064_solr x:forwardingCollection_shard1_replica_n1 c:forwardingCollection s:shard1 r:core_node2) [n:127.0.0.1:42064_solr c:forwardingCollection s:shard1 r:core_node2 x:forwardingCollection_shard1_replica_n1] o.a.s.h.c.SpellCheckComponent Loading spell index for spellchecker: default
   [junit4]   2> 2606212 INFO  (searcherExecutor-7754-thread-1-processing-n:127.0.0.1:42064_solr x:forwardingCollection_shard1_replica_n1 c:forwardingCollection s:shard1 r:core_node2) [n:127.0.0.1:42064_solr c:forwardingCollection s:shard1 r:core_node2 x:forwardingCollection_shard1_replica_n1] o.a.s.h.c.SpellCheckComponent Loading spell index for spellchecker: direct
   [junit4]   2> 2606212 INFO  (searcherExecutor-7754-thread-1-processing-n:127.0.0.1:42064_solr x:forwardingCollection_shard1_replica_n1 c:forwardingCollection s:shard1 r:core_node2) [n:127.0.0.1:42064_solr c:forwardingCollection s:shard1 r:core_node2 x:forwardingCollection_shard1_replica_n1] o.a.s.h.c.SpellCheckComponent Loading spell index for spellchecker: wordbreak
   [junit4]   2> 2606212 INFO  (searcherExecutor-7754-thread-1-processing-n:127.0.0.1:42064_solr x:forwardingCollection_shard1_replica_n1 c:forwardingCollection s:shard1 r:core_node2) [n:127.0.0.1:42064_solr c:forwardingCollection s:shard1 r:core_node2 x:forwardingCollection_shard1_replica_n1] o.a.s.h.c.SpellCheckComponent Loading spell index for spellchecker: multipleFields
   [junit4]   2> 2606212 INFO  (searcherExecutor-7754-thread-1-processing-n:127.0.0.1:42064_solr x:forwardingCollection_shard1_replica_n1 c:forwardingCollection s:shard1 r:core_node2) [n:127.0.0.1:42064_solr c:forwardingCollection s:shard1 r:core_node2 x:forwardingCollection_shard1_replica_n1] o.a.s.h.c.SpellCheckComponent Loading spell index for spellchecker: jarowinkler
   [junit4]   2> 2606213 INFO  (searcherExecutor-7754-thread-1-processing-n:127.0.0.1:42064_solr x:forwardingCollection_shard1_replica_n1 c:forwardingCollection s:shard1 r:core_node2) [n:127.0.0.1:42064_solr c:forwardingCollection s:shard1 r:core_node2 x:forwardingCollection_shard1_replica_n1] o.a.s.h.c.SpellCheckComponent Loading spell index for spellchecker: external
   [junit4]   2> 2606213 INFO  (searcherExecutor-7754-thread-1-processing-n:127.0.0.1:42064_solr x:forwardingCollection_shard1_replica_n1 c:forwardingCollection s:shard1 r:core_node2) [n:127.0.0.1:42064_solr c:forwardingCollection s:shard1 r:core_node2 x:forwardingCollection_shard1_replica_n1] o.a.s.h.c.SpellCheckComponent Loading spell index for spellchecker: freq
   [junit4]   2> 2606213 INFO  (searcherExecutor-7754-thread-1-processing-n:127.0.0.1:42064_solr x:forwardingCollection_shard1_replica_n1 c:forwardingCollection s:shard1 r:core_node2) [n:127.0.0.1:42064_solr c:forwardingCollection s:shard1 r:core_node2 x:forwardingCollection_shard1_replica_n1] o.a.s.h.c.SpellCheckComponent Loading spell index for spellchecker: fqcn
   [junit4]   2> 2606213 INFO  (searcherExecutor-7754-thread-1-processing-n:127.0.0.1:42064_solr x:forwardingCollection_shard1_replica_n1 c:forwardingCollection s:shard1 r:core_node2) [n:127.0.0.1:42064_solr c:forwardingCollection s:shard1 r:core_node2 x:forwardingCollection_shard1_replica_n1] o.a.s.h.c.SpellCheckComponent Loading spell index for spellchecker: perDict
   [junit4]   2> 2606214 INFO  (searcherExecutor-7754-thread-1-processing-n:127.0.0.1:42064_solr x:forwardingCollection_shard1_replica_n1 c:forwardingCollection s:shard1 r:core_node2) [n:127.0.0.1:42064_solr c:forwardingCollection s:shard1 r:core_node2 x:forwardingCollection_shard1_replica_n1] o.a.s.c.SolrCore [forwardingCollection_shard1_replica_n1] Registered new searcher Searcher@78637662[forwardingCollection_shard1_replica_n1] main{ExitableDirectoryReader(UninvertingDirectoryReader())}
   [junit4]   2> 2606238 INFO  (qtp310550354-24040) [n:127.0.0.1:42064_solr c:forwardingCollection s:shard1 r:core_node2 x:forwardingCollection_shard1_replica_n1] o.a.s.c.ZkShardTerms Successful update of terms at /collections/forwardingCollection/terms/shard1 to Terms{values={core_node2=0}, version=0}
   [junit4]   2> 2606238 INFO  (qtp310550354-24040) [n:127.0.0.1:42064_solr c:forwardingCollection s:shard1 r:core_node2 x:forwardingCollection_shard1_replica_n1] o.a.s.c.ShardLeaderElectionContextBase make sure parent is created /collections/forwardingCollection/leaders/shard1
   [junit4]   2> 2606240 INFO  (qtp310550354-24040) [n:127.0.0.1:42064_solr c:forwardingCollection s:shard1 r:core_node2 x:forwardingCollection_shard1_replica_n1] o.a.s.c.ShardLeaderElectionContext Enough replicas found to continue.
   [junit4]   2> 2606240 INFO  (qtp310550354-24040) [n:127.0.0.1:42064_solr c:forwardingCollection s:shard1 r:core_node2 x:forwardingCollection_shard1_replica_n1] o.a.s.c.ShardLeaderElectionContext I may be the new leader - try and sync
   [junit4]   2> 2606240 INFO  (qtp310550354-24040) [n:127.0.0.1:42064_solr c:forwardingCollection s:shard1 r:core_node2 x:forwardingCollection_shard1_replica_n1] o.a.s.c.SyncStrategy Sync replicas to https://127.0.0.1:42064/solr/forwardingCollection_shard1_replica_n1/
   [junit4]   2> 2606257 INFO  (qtp310550354-24040) [n:127.0.0.1:42064_solr c:forwardingCollection s:shard1 r:core_node2 x:forwardingCollection_shard1_replica_n1] o.a.s.c.SyncStrategy Sync Success - now sync replicas to me
   [junit4]   2> 2606258 INFO  (qtp310550354-24040) [n:127.0.0.1:42064_solr c:forwardingCollection s:shard1 r:core_node2 x:forwardingCollection_shard1_replica_n1] o.a.s.c.SyncStrategy https://127.0.0.1:42064/solr/forwardingCollection_shard1_replica_n1/ has no replicas
   [junit4]   2> 2606258 INFO  (qtp310550354-24040) [n:127.0.0.1:42064_solr c:forwardingCollection s:shard1 r:core_node2 x:forwardingCollection_shard1_replica_n1] o.a.s.c.ShardLeaderElectionContextBase Creating leader registration node /collections/forwardingCollection/leaders/shard1/leader after winning as /collections/forwardingCollection/leader_elect/shard1/election/74172355968499720-core_node2-n_0000000000
   [junit4]   2> 2606260 INFO  (qtp310550354-24040) [n:127.0.0.1:42064_solr c:forwardingCollection s:shard1 r:core_node2 x:forwardingCollection_shard1_replica_n1] o.a.s.c.ShardLeaderElectionContext I am the new leader: https://127.0.0.1:42064/solr/forwardingCollection_shard1_replica_n1/ shard1
   [junit4]   2> 2606274 INFO  (zkCallback-8156-thread-1) [    ] o.a.s.c.c.ZkStateReader A cluster state change: [WatchedEvent state:SyncConnected type:NodeDataChanged path:/collections/forwardingCollection/state.json] for collection [forwardingCollection] has occurred - updating... (live nodes size: [2])
   [junit4]   2> 2606274 INFO  (zkCallback-8156-thread-2) [    ] o.a.s.c.c.ZkStateReader A cluster state change: [WatchedEvent state:SyncConnected type:NodeDataChanged path:/collections/forwardingCollection/state.json] for collection [forwardingCollection] has occurred - updating... (live nodes size: [2])
   [junit4]   2> 2606274 INFO  (qtp310550354-24040) [n:127.0.0.1:42064_solr c:forwardingCollection s:shard1 r:core_node2 x:forwardingCollection_shard1_replica_n1] o.a.s.c.ZkController I am the leader, no recovery necessary
   [junit4]   2> 2606285 INFO  (qtp310550354-24040) [n:127.0.0.1:42064_solr c:forwardingCollection s:shard1 r:core_node2 x:forwardingCollection_shard1_replica_n1] o.a.s.s.HttpSolrCall [admin] webapp=null path=/admin/cores params={qt=/admin/cores&coreNodeName=core_node2&collection.configName=conf1&newCollection=true&name=forwardingCollection_shard1_replica_n1&action=CREATE&numShards=1&collection=forwardingCollection&shard=shard1&wt=javabin&version=2&replicaType=NRT} status=0 QTime=2453
   [junit4]   2> 2606289 INFO  (qtp1933050319-24050) [n:127.0.0.1:40515_solr    ] o.a.s.h.a.CollectionsHandler Wait for new collection to be active for at most 45 seconds. Check all shard replicas
   [junit4]   2> 2606378 INFO  (zkCallback-8146-thread-2) [    ] o.a.s.c.c.ZkStateReader A cluster state change: [WatchedEvent state:SyncConnected type:NodeDataChanged path:/collections/forwardingCollection/state.json] for collection [forwardingCollection] has occurred - updating... (live nodes size: [2])
   [junit4]   2> 2606379 INFO  (qtp1933050319-24050) [n:127.0.0.1:40515_solr    ] o.a.s.s.HttpSolrCall [admin] webapp=null path=/admin/collections params={pullReplicas=0&collection.configName=conf1&maxShardsPerNode=1&name=forwardingCollection&nrtReplicas=1&action=CREATE&numShards=1&tlogReplicas=0&wt=javabin&version=2} status=0 QTime=3305
   [junit4]   2> 2606391 INFO  (zkCallback-8156-thread-1) [    ] o.a.s.c.c.ZkStateReader A cluster state change: [WatchedEvent state:SyncConnected type:NodeDataChanged path:/collections/forwardingCollection/state.json] for collection [forwardingCollection] has occurred - updating... (live nodes size: [2])
   [junit4]   2> 2606391 INFO  (zkCallback-8156-thread-2) [    ] o.a.s.c.c.ZkStateReader A cluster state change: [WatchedEvent state:SyncConnected type:NodeDataChanged path:/collections/forwardingCollection/state.json] for collection [forwardingCollection] has occurred - updating... (live nodes size: [2])
   [junit4]   2> 2606393 INFO  (zkCallback-8156-thread-3) [    ] o.a.s.c.c.ZkStateReader A cluster state change: [WatchedEvent state:SyncConnected type:NodeDataChanged path:/collections/forwardingCollection/state.json] for collection [forwardingCollection] has occurred - updating... (live nodes size: [2])
   [junit4]   2> 2606425 INFO  (TEST-TestSolrCloudWithSecureImpersonation.testForwarding-seed#[7F312D21643EC4A9]) [    ] o.a.s.SolrTestCaseJ4 ###Ending testForwarding
   [junit4]   2> NOTE: reproduce with: ant test  -Dtestcase=TestSolrCloudWithSecureImpersonation -Dtests.method=testForwarding -Dtests.seed=7F312D21643EC4A9 -Dtests.multiplier=2 -Dtests.slow=true -Dtests.locale=vi -Dtests.timezone=Antarctica/Rothera -Dtests.asserts=true -Dtests.file.encoding=ISO-8859-1
   [junit4] ERROR   5.97s J0 | TestSolrCloudWithSecureImpersonation.testForwarding <<<
   [junit4]    > Throwable #1: org.apache.solr.client.solrj.impl.HttpSolrClient$RemoteSolrException: Error from server at https://127.0.0.1:42064/solr/forwardingCollection: Expected mime type application/octet-stream but got text/html. <html>
   [junit4]    > <head>
   [junit4]    > <meta http-equiv="Content-Type" content="text/html;charset=utf-8"/>
   [junit4]    > <title>Error 401 Authentication required</title>
   [junit4]    > </head>
   [junit4]    > <body><h2>HTTP ERROR 401</h2>
   [junit4]    > <p>Problem accessing /solr/forwardingCollection/select. Reason:
   [junit4]    > <pre>    Authentication required</pre></p><hr><a href="http://eclipse.org/jetty">Powered by Jetty:// 9.4.14.v20181114</a><hr/>
   [junit4]    > </body>
   [junit4]    > </html>
   [junit4]    > at __randomizedtesting.SeedInfo.seed([7F312D21643EC4A9:9EB744DF79082240]:0)
   [junit4]    > at org.apache.solr.client.solrj.impl.HttpSolrClient.executeMethod(HttpSolrClient.java:614)
   [junit4]    > at org.apache.solr.client.solrj.impl.HttpSolrClient.request(HttpSolrClient.java:256)
   [junit4]    > at org.apache.solr.client.solrj.impl.HttpSolrClient.request(HttpSolrClient.java:245)
   [junit4]    > at org.apache.solr.client.solrj.SolrRequest.process(SolrRequest.java:207)
   [junit4]    > at org.apache.solr.client.solrj.SolrClient.query(SolrClient.java:987)
   [junit4]    > at org.apache.solr.client.solrj.SolrClient.query(SolrClient.java:1002)
   [junit4]    > at org.apache.solr.cloud.TestSolrCloudWithSecureImpersonation.testForwarding(TestSolrCloudWithSecureImpersonation.java:328)
   [junit4]    > at java.lang.Thread.run(Thread.java:748)
   [junit4]   2> 2606522 INFO  (TEST-TestSolrCloudWithSecureImpersonation.testProxyInvalidRemote-seed#[7F312D21643EC4A9]) [    ] o.a.s.SolrTestCaseJ4 ###Starting testProxyInvalidRemote
   [junit4]   2> 2606524 WARN  (qtp310550354-24041) [n:127.0.0.1:42064_solr    ] o.a.h.s.a.s.AuthenticationFilter AuthenticationToken ignored: Invalid AuthenticationToken type
   [junit4]   2> 2606785 WARN  (qtp310550354-24041) [n:127.0.0.1:42064_solr    ] o.a.h.s.t.d.w.DelegationTokenAuthenticationFilter Authentication exception: Unauthorized connection for super-user: localHostAnyGroup from IP -127.-128
   [junit4]   2> 2606786 INFO  (TEST-TestSolrCloudWithSecureImpersonation.testProxyInvalidRemote-seed#[7F312D21643EC4A9]) [    ] o.a.s.SolrTestCaseJ4 ###Ending testProxyInvalidRemote
   [junit4]   2> 2606880 INFO  (TEST-TestSolrCloudWithSecureImpersonation.testProxyValidateGroup-seed#[7F312D21643EC4A9]) [    ] o.a.s.SolrTestCaseJ4 ###Starting testProxyValidateGroup
   [junit4]   2> 2606881 WARN  (qtp310550354-24042) [n:127.0.0.1:42064_solr    ] o.a.h.s.a.s.AuthenticationFilter AuthenticationToken ignored: Invalid AuthenticationToken type
   [junit4]   2> 2607082 INFO  (qtp310550354-24042) [n:127.0.0.1:42064_solr    ] o.a.s.h.a.CollectionsHandler Invoked Collection Action :list with params doAs=jenkins&action=LIST&wt=javabin&version=2 and sendToOCPQueue=true
   [junit4]   2> 2607082 INFO  (qtp310550354-24042) [n:127.0.0.1:42064_solr    ] o.a.s.s.HttpSolrCall [admin] webapp=null path=/admin/collections params={doAs=jenkins&action=LIST&wt=javabin&version=2} status=0 QTime=0
   [junit4]   2> 2607083 INFO  (TEST-TestSolrCloudWithSecureImpersonation.testProxyValidateGroup-seed#[7F312D21643EC4A9]) [    ] o.a.s.SolrTestCaseJ4 ###Ending testProxyValidateGroup
   [junit4]   2> 2607139 INFO  (OverseerCollectionConfigSetProcessor-74172355968499718-127.0.0.1:40515_solr-n_0000000000) [n:127.0.0.1:40515_solr    ] o.a.s.c.OverseerTaskQueue Response ZK path: /overseer/collection-queue-work/qnr-0000000000 doesn't exist.  Requestor may have disconnected from ZooKeeper
   [junit4]   2> 2607158 INFO  (TEST-TestSolrCloudWithSecureImpersonation.testProxyUnknownRemote-seed#[7F312D21643EC4A9]) [    ] o.a.s.SolrTestCaseJ4 ###Starting testProxyUnknownRemote
   [junit4]   2> 2607159 WARN  (qtp310550354-24038) [n:127.0.0.1:42064_solr    ] o.a.h.s.a.s.AuthenticationFilter AuthenticationToken ignored: Invalid AuthenticationToken type
   [junit4]   2> 2607160 WARN  (qtp310550354-24038) [n:127.0.0.1:42064_solr    ] o.a.h.s.t.d.w.DelegationTokenAuthenticationFilter Authentication exception: Unauthorized connection for super-user: localHostAnyGroup from IP 255.255.255.255
   [junit4]   2> 2607161 INFO  (TEST-TestSolrCloudWithSecureImpersonation.testProxyUnknownRemote-seed#[7F312D21643EC4A9]) [    ] o.a.s.SolrTestCaseJ4 ###Ending testProxyUnknownRemote
   [junit4]   2> 2607245 INFO  (TEST-TestSolrCloudWithSecureImpersonation.testProxyNoConfigHosts-seed#[7F312D21643EC4A9]) [    ] o.a.s.SolrTestCaseJ4 ###Starting testProxyNoConfigHosts
   [junit4]   2> 2607246 WARN  (qtp310550354-24039) [n:127.0.0.1:42064_solr    ] o.a.h.s.a.s.AuthenticationFilter AuthenticationToken ignored: Invalid AuthenticationToken type
   [junit4]   2> 2607247 WARN  (qtp310550354-24039) [n:127.0.0.1:42064_solr    ] o.a.h.s.t.d.w.DelegationTokenAuthenticationFilter Authentication exception: Unauthorized connection for super-user: noHosts from IP 127.0.0.1
   [junit4]   2> 2607258 INFO  (TEST-TestSolrCloudWithSecureImpersonation.testProxyNoConfigHosts-seed#[7F312D21643EC4A9]) [    ] o.a.s.SolrTestCaseJ4 ###Ending testProxyNoConfigHosts
   [junit4]   2> 2607320 INFO  (TEST-TestSolrCloudWithSecureImpersonation.testProxyNullProxyUser-seed#[7F312D21643EC4A9]) [    ] o.a.s.SolrTestCaseJ4 ###Starting testProxyNullProxyUser
   [junit4]   2> 2607321 WARN  (qtp310550354-24040) [n:127.0.0.1:42064_solr c:forwardingCollection s:shard1 r:core_node2 x:forwardingCollection_shard1_replica_n1] o.a.h.s.a.s.AuthenticationFilter AuthenticationToken ignored: Invalid AuthenticationToken type
   [junit4]   2> 2607321 INFO  (qtp310550354-24040) [n:127.0.0.1:42064_solr c:forwardingCollection s:shard1 r:core_node2 x:forwardingCollection_shard1_replica_n1] o.a.s.s.SolrDispatchFilter Error authenticating
   [junit4]   2> java.lang.IllegalArgumentException: userName is NULL, empty or contains a '&'
   [junit4]   2> at org.apache.hadoop.security.authentication.util.AuthToken.checkForIllegalArgument(AuthToken.java:91) ~[hadoop-auth-3.2.0.jar:?]
   [junit4]   2> at org.apache.hadoop.security.authentication.util.AuthToken.<init>(AuthToken.java:73) ~[hadoop-auth-3.2.0.jar:?]
   [junit4]   2> at org.apache.hadoop.security.authentication.server.AuthenticationToken.<init>(AuthenticationToken.java:59) ~[hadoop-auth-3.2.0.jar:?]
   [junit4]   2> at org.apache.solr.security.HttpParamDelegationTokenPlugin$HttpParamDelegationTokenAuthenticationHandler$HttpParamAuthenticationHandler.authenticate(HttpParamDelegationTokenPlugin.java:233) ~[test/:?]
   [junit4]   2> at org.apache.hadoop.security.token.delegation.web.DelegationTokenAuthenticationHandler.authenticate(DelegationTokenAuthenticationHandler.java:411) ~[hadoop-common-3.2.0.jar:?]
   [junit4]   2> at org.apache.solr.security.RequestContinuesRecorderAuthenticationHandler.authenticate(RequestContinuesRecorderAuthenticationHandler.java:69) ~[java/:?]
   [junit4]   2> at org.apache.hadoop.security.authentication.server.AuthenticationFilter.doFilter(AuthenticationFilter.java:536) ~[hadoop-auth-3.2.0.jar:?]
   [junit4]   2> at org.apache.solr.security.DelegationTokenKerberosFilter.doFilter(DelegationTokenKerberosFilter.java:139) ~[java/:?]
   [junit4]   2> at org.apache.solr.security.HttpParamDelegationTokenPlugin$HttpParamToRequestFilter.doFilter(HttpParamDelegationTokenPlugin.java:265) ~[test/:?]
   [junit4]   2> at org.apache.solr.security.KerberosPlugin.doAuthenticate(KerberosPlugin.java:244) ~[java/:?]
   [junit4]   2> at org.apache.solr.security.AuthenticationPlugin.authenticate(AuthenticationPlugin.java:94) ~[java/:?]
   [junit4]   2> at org.apache.solr.servlet.SolrDispatchFilter.authenticateRequest(SolrDispatchFilter.java:480) [java/:?]
   [junit4]   2> at org.apache.solr.servlet.SolrDispatchFilter.doFilter(SolrDispatchFilter.java:380) [java/:?]
   [junit4]   2> at org.apache.solr.servlet.SolrDispatchFilter.doFilter(SolrDispatchFilter.java:340) [java/:?]
   [junit4]   2> at org.eclipse.jetty.servlet.ServletHandler$CachedChain.doFilter(ServletHandler.java:1610) [jetty-servlet-9.4.14.v20181114.jar:9.4.14.v20181114]
   [junit4]   2> at org.apache.solr.client.solrj.embedded.JettySolrRunner$DebugFilter.doFilter(JettySolrRunner.java:164) [java/:?]
   [junit4]   2> at org.eclipse.jetty.servlet.ServletHandler$CachedChain.doFilter(ServletHandler.java:1610) [jetty-servlet-9.4.14.v20181114.jar:9.4.14.v20181114]
   [junit4]   2> at org.eclipse.jetty.servlet.ServletHandler.doHandle(ServletHandler.java:540) [jetty-servlet-9.4.14.v20181114.jar:9.4.14.v20181114]
   [junit4]   2> at org.eclipse.jetty.server.handler.ScopedHandler.nextHandle(ScopedHandler.java:255) [jetty-server-9.4.14.v20181114.jar:9.4.14.v20181114]
   [junit4]   2> at org.eclipse.jetty.server.session.SessionHandler.doHandle(SessionHandler.java:1588) [jetty-server-9.4.14.v20181114.jar:9.4.14.v20181114]
   [junit4]   2> at org.eclipse.jetty.server.handler.ScopedHandler.nextHandle(ScopedHandler.java:255) [jetty-server-9.4.14.v20181114.jar:9.4.14.v20181114]
   [junit4]   2> at org.eclipse.jetty.server.handler.ContextHandler.doHandle(ContextHandler.java:1345) [jetty-server-9.4.14.v20181114.jar:9.4.14.v20181114]
   [junit4]   2> at org.eclipse.jetty.server.handler.ScopedHandler.nextScope(ScopedHandler.java:203) [jetty-server-9.4.14.v20181114.jar:9.4.14.v20181114]
   [junit4]   2> at org.eclipse.jetty.servlet.ServletHandler.doScope(ServletHandler.java:480) [jetty-servlet-9.4.14.v20181114.jar:9.4.14.v20181114]
   [junit4]   2> at org.eclipse.jetty.server.session.SessionHandler.doScope(SessionHandler.java:1557) [jetty-server-9.4.14.v20181114.jar:9.4.14.v20181114]
   [junit4]   2> at org.eclipse.jetty.server.handler.ScopedHandler.nextScope(ScopedHandler.java:201) [jetty-server-9.4.14.v20181114.jar:9.4.14.v20181114]
   [junit4]   2> at org.eclipse.jetty.server.handler.ContextHandler.doScope(ContextHandler.java:1247) [jetty-server-9.4.14.v20181114.jar:9.4.14.v20181114]
   [junit4]   2> at org.eclipse.jetty.server.handler.ScopedHandler.handle(ScopedHandler.java:144) [jetty-server-9.4.14.v20181114.jar:9.4.14.v20181114]
   [junit4]   2> at org.eclipse.jetty.server.handler.gzip.GzipHandler.handle(GzipHandler.java:753) [jetty-server-9.4.14.v20181114.jar:9.4.14.v20181114]
   [junit4]   2> at org.eclipse.jetty.server.handler.HandlerWrapper.handle(HandlerWrapper.java:132) [jetty-server-9.4.14.v20181114.jar:9.4.14.v20181114]
   [junit4]   2> at org.eclipse.jetty.server.Server.handle(Server.java:502) [jetty-server-9.4.14.v20181114.jar:9.4.14.v20181114]
   [junit4]   2> at org.eclipse.jetty.server.HttpChannel.handle(HttpChannel.java:364) [jetty-server-9.4.14.v20181114.jar:9.4.14.v20181114]
   [junit4]   2> at org.eclipse.jetty.server.HttpConnection.onFillable(HttpConnection.java:260) [jetty-server-9.4.14.v20181114.jar:9.4.14.v20181114]
   [junit4]   2> at org.eclipse.jetty.io.AbstractConnection$ReadCallback.succeeded(AbstractConnection.java:305) [jetty-io-9.4.14.v20181114.jar:9.4.14.v20181114]
   [junit4]   2> at org.eclipse.jetty.io.FillInterest.fillable(FillInterest.java:103) [jetty-io-9.4.14.v20181114.jar:9.4.14.v20181114]
   [junit4]   2> at org.eclipse.jetty.io.ssl.SslConnection$DecryptedEndPoint.onFillable(SslConnection.java:411) [jetty-io-9.4.14.v20181114.jar:9.4.14.v20181114]
   [junit4]   2> at org.eclipse.jetty.io.ssl.SslConnection.onFillable(SslConnection.java:305) [jetty-io-9.4.14.v20181114.jar:9.4.14.v20181114]
   [junit4]   2> at org.eclipse.jetty.io.ssl.SslConnection$2.succeeded(SslConnection.java:159) [jetty-io-9.4.14.v20181114.jar:9.4.14.v20181114]
   [junit4]   2> at org.eclipse.jetty.io.FillInterest.fillable(FillInterest.java:103) [jetty-io-9.4.14.v20181114.jar:9.4.14.v20181114]
   [junit4]   2> at org.eclipse.jetty.io.ChannelEndPoint$2.run(ChannelEndPoint.java:118) [jetty-io-9.4.14.v20181114.jar:9.4.14.v20181114]
   [junit4]   2> at org.eclipse.jetty.util.thread.QueuedThreadPool.runJob(QueuedThreadPool.java:765) [jetty-util-9.4.14.v20181114.jar:9.4.14.v20181114]
   [junit4]   2> at org.eclipse.jetty.util.thread.QueuedThreadPool$2.run(QueuedThreadPool.java:683) [jetty-util-9.4.14.v20181114.jar:9.4.14.v20181114]
   [junit4]   2> at java.lang.Thread.run(Thread.java:748) [?:1.8.0_191]
   [junit4]   2> 2607335 WARN  (qtp310550354-24040) [n:127.0.0.1:42064_solr c:forwardingCollection s:shard1 r:core_node2 x:forwardingCollection_shard1_replica_n1] o.e.j.s.HttpChannel /solr/admin/collections
   [junit4]   2> org.apache.solr.common.SolrException: Error during request authentication,
   [junit4]   2> at org.apache.solr.servlet.SolrDispatchFilter.authenticateRequest(SolrDispatchFilter.java:486) ~[java/:?]
   [junit4]   2> at org.apache.solr.servlet.SolrDispatchFilter.doFilter(SolrDispatchFilter.java:380) ~[java/:?]
   [junit4]   2> at org.apache.solr.servlet.SolrDispatchFilter.doFilter(SolrDispatchFilter.java:340) ~[java/:?]
   [junit4]   2> at org.eclipse.jetty.servlet.ServletHandler$CachedChain.doFilter(ServletHandler.java:1610) ~[jetty-servlet-9.4.14.v20181114.jar:9.4.14.v20181114]
   [junit4]   2> at org.apache.solr.client.solrj.embedded.JettySolrRunner$DebugFilter.doFilter(JettySolrRunner.java:164) ~[java/:?]
   [junit4]   2> at org.eclipse.jetty.servlet.ServletHandler$CachedChain.doFilter(ServletHandler.java:1610) ~[jetty-servlet-9.4.14.v20181114.jar:9.4.14.v20181114]
   [junit4]   2> at org.eclipse.jetty.servlet.ServletHandler.doHandle(ServletHandler.java:540) ~[jetty-servlet-9.4.14.v20181114.jar:9.4.14.v20181114]
   [junit4]   2> at org.eclipse.jetty.server.handler.ScopedHandler.nextHandle(ScopedHandler.java:255) ~[jetty-server-9.4.14.v20181114.jar:9.4.14.v20181114]
   [junit4]   2> at org.eclipse.jetty.server.session.SessionHandler.doHandle(SessionHandler.java:1588) ~[jetty-server-9.4.14.v20181114.jar:9.4.14.v20181114]
   [junit4]   2> at org.eclipse.jetty.server.handler.ScopedHandler.nextHandle(ScopedHandler.java:255) ~[jetty-server-9.4.14.v20181114.jar:9.4.14.v20181114]
   [junit4]   2> at org.eclipse.jetty.server.handler.ContextHandler.doHandle(ContextHandler.java:1345) ~[jetty-server-9.4.14.v20181114.jar:9.4.14.v20181114]
   [junit4]   2> at org.eclipse.jetty.server.handler.ScopedHandler.nextScope(ScopedHandler.java:203) ~[jetty-server-9.4.14.v20181114.jar:9.4.14.v20181114]
   [junit4]   2> at org.eclipse.jetty.servlet.ServletHandler.doScope(ServletHandler.java:480) ~[jetty-servlet-9.4.14.v20181114.jar:9.4.14.v20181114]
   [junit4]   2> at org.eclipse.jetty.server.session.SessionHandler.doScope(SessionHandler.java:1557) ~[jetty-server-9.4.14.v20181114.jar:9.4.14.v20181114]
   [junit4]   2> at org.eclipse.jetty.server.handler.ScopedHandler.nextScope(ScopedHandler.java:201) ~[jetty-server-9.4.14.v20181114.jar:9.4.14.v20181114]
   [junit4]   2> at org.eclipse.jetty.server.handler.ContextHandler.doScope(ContextHandler.java:1247) ~[jetty-server-9.4.14.v20181114.jar:9.4.14.v20181114]
   [junit4]   2> at org.eclipse.jetty.server.handler.ScopedHandler.handle(ScopedHandler.java:144) ~[jetty-server-9.4.14.v20181114.jar:9.4.14.v20181114]
   [junit4]   2> at org.eclipse.jetty.server.handler.gzip.GzipHandler.handle(GzipHandler.java:753) ~[jetty-server-9.4.14.v20181114.jar:9.4.14.v20181114]
   [junit4]   2> at org.eclipse.jetty.server.handler.HandlerWrapper.handle(HandlerWrapper.java:132) ~[jetty-server-9.4.14.v20181114.jar:9.4.14.v20181114]
   [junit4]   2> at org.eclipse.jetty.server.Server.handle(Server.java:502) ~[jetty-server-9.4.14.v20181114.jar:9.4.14.v20181114]
   [junit4]   2> at org.eclipse.jetty.server.HttpChannel.handle(HttpChannel.java:364) [jetty-server-9.4.14.v20181114.jar:9.4.14.v20181114]
   [junit4]   2> at org.eclipse.jetty.server.HttpConnection.onFillable(HttpConnection.java:260) [jetty-server-9.4.14.v20181114.jar:9.4.14.v20181114]
   [junit4]   2> at org.eclipse.jetty.io.AbstractConnection$ReadCallback.succeeded(AbstractConnection.java:305) [jetty-io-9.4.14.v20181114.jar:9.4.14.v20181114]
   [junit4]   2> at org.eclipse.jetty.io.FillInterest.fillable(FillInterest.java:103) [jetty-io-9.4.14.v20181114.jar:9.4.14.v20181114]
   [junit4]   2> at org.eclipse.jetty.io.ssl.SslConnection$DecryptedEndPoint.onFillable(SslConnection.java:411) [jetty-io-9.4.14.v20181114.jar:9.4.14.v20181114]
   [junit4]   2> at org.eclipse.jetty.io.ssl.SslConnection.onFillable(SslConnection.java:305) [jetty-io-9.4.14.v20181114.jar:9.4.14.v20181114]
   [junit4]   2> at org.eclipse.jetty.io.ssl.SslConnection$2.succeeded(SslConnection.java:159) [jetty-io-9.4.14.v20181114.jar:9.4.14.v20181114]
   [junit4]   2> at org.eclipse.jetty.io.FillInterest.fillable(FillInterest.java:103) [jetty-io-9.4.14.v20181114.jar:9.4.14.v20181114]
   [junit4]   2> at org.eclipse.jetty.io.ChannelEndPoint$2.run(ChannelEndPoint.java:118) [jetty-io-9.4.14.v20181114.jar:9.4.14.v20181114]
   [junit4]   2> at org.eclipse.jetty.util.thread.QueuedThreadPool.runJob(QueuedThreadPool.java:765) [jetty-util-9.4.14.v20181114.jar:9.4.14.v20181114]
   [junit4]   2> at org.eclipse.jetty.util.thread.QueuedThreadPool$2.run(QueuedThreadPool.java:683) [jetty-util-9.4.14.v20181114.jar:9.4.14.v20181114]
   [junit4]   2> at java.lang.Thread.run(Thread.java:748) [?:1.8.0_191]
   [junit4]   2> Caused by: java.lang.IllegalArgumentException: userName is NULL, empty or contains a '&'
   [junit4]   2> at org.apache.hadoop.security.authentication.util.AuthToken.checkForIllegalArgument(AuthToken.java:91) ~[hadoop-auth-3.2.0.jar:?]
   [junit4]   2> at org.apache.hadoop.security.authentication.util.AuthToken.<init>(AuthToken.java:73) ~[hadoop-auth-3.2.0.jar:?]
   [junit4]   2> at org.apache.hadoop.security.authentication.server.AuthenticationToken.<init>(AuthenticationToken.java:59) ~[hadoop-auth-3.2.0.jar:?]
   [junit4]   2> at org.apache.solr.security.HttpParamDelegationTokenPlugin$HttpParamDelegationTokenAuthenticationHandler$HttpParamAuthenticationHandler.authenticate(HttpParamDelegationTokenPlugin.java:233) ~[test/:?]
   [junit4]   2> at org.apache.hadoop.security.token.delegation.web.DelegationTokenAuthenticationHandler.authenticate(DelegationTokenAuthenticationHandler.java:411) ~[hadoop-common-3.2.0.jar:?]
   [junit4]   2> at org.apache.solr.security.RequestContinuesRecorderAuthenticationHandler.authenticate(RequestContinuesRecorderAuthenticationHandler.java:69) ~[java/:?]
   [junit4]   2> at org.apache.hadoop.security.authentication.server.AuthenticationFilter.doFilter(AuthenticationFilter.java:536) ~[hadoop-auth-3.2.0.jar:?]
   [junit4]   2> at org.apache.solr.security.DelegationTokenKerberosFilter.doFilter(DelegationTokenKerberosFilter.java:139) ~[java/:?]
   [junit4]   2> at org.apache.solr.security.HttpParamDelegationTokenPlugin$HttpParamToRequestFilter.doFilter(HttpParamDelegationTokenPlugin.java:265) ~[test/:?]
   [junit4]   2> at org.apache.solr.security.KerberosPlugin.doAuthenticate(KerberosPlugin.java:244) ~[java/:?]
   [junit4]   2> at org.apache.solr.security.AuthenticationPlugin.authenticate(AuthenticationPlugin.java:94) ~[java/:?]
   [junit4]   2> at org.apache.solr.servlet.SolrDispatchFilter.authenticateRequest(SolrDispatchFilter.java:480) ~[java/:?]
   [junit4]   2> ... 31 more
   [junit4]   2> 2607337 INFO  (TEST-TestSolrCloudWithSecureImpersonation.testProxyNullProxyUser-seed#[7F312D21643EC4A9]) [    ] o.a.s.SolrTestCaseJ4 ###Ending testProxyNullProxyUser
   [junit4]   2> 2607363 INFO  (jetty-closer-8180-thread-1) [    ] o.a.s.c.CoreContainer Shutting down CoreContainer instance=1935212639
   [junit4]   2> 2607363 INFO  (jetty-closer-8180-thread-1) [    ] o.a.s.c.ZkController Remove node as live in ZooKeeper:/live_nodes/127.0.0.1:42064_solr
   [junit4]   2> 2607363 INFO  (jetty-closer-8180-thread-1) [    ] o.a.s.c.CoreContainer Publish this node as DOWN...
   [junit4]   2> 2607364 INFO  (jetty-closer-8180-thread-1) [    ] o.a.s.c.ZkController Publish node=127.0.0.1:42064_solr as DOWN
   [junit4]   2> 2607443 INFO  (jetty-closer-8180-thread-2) [    ] o.a.s.c.CoreContainer Shutting down CoreContainer instance=1770602184
   [junit4]   2> 2607443 INFO  (jetty-closer-8180-thread-2) [    ] o.a.s.c.ZkController Remove node as live in ZooKeeper:/live_nodes/127.0.0.1:40515_solr
   [junit4]   2> 2607444 INFO  (jetty-closer-8180-thread-2) [    ] o.a.s.c.CoreContainer Publish this node as DOWN...
   [junit4]   2> 2607444 INFO  (jetty-closer-8180-thread-2) [    ] o.a.s.c.ZkController Publish node=127.0.0.1:40515_solr as DOWN
   [junit4]   2> 2607448 INFO  (coreCloseExecutor-7759-thread-1) [n:127.0.0.1:42064_solr c:forwardingCollection s:shard1 r:core_node2 x:forwardingCollection_shard1_replica_n1] o.a.s.c.SolrCore [forwardingCollection_shard1_replica_n1]  CLOSING SolrCore org.apache.solr.core.SolrCore@f2ee51
   [junit4]   2> 2607448 INFO  (coreCloseExecutor-7759-thread-1) [n:127.0.0.1:42064_solr c:forwardingCollection s:shard1 r:core_node2 x:forwardingCollection_shard1_replica_n1] o.a.s.m.SolrMetricManager Closing metric reporters for registry=solr.core.forwardingCollection.shard1.replica_n1, tag=f2ee51
   [junit4]   2> 2607448 INFO  (coreCloseExecutor-7759-thread-1) [n:127.0.0.1:42064_solr c:forwardingCollection s:shard1 r:core_node2 x:forwardingCollection_shard1_replica_n1] o.a.s.m.r.SolrJmxReporter Closing reporter [org.apache.solr.metrics.reporters.SolrJmxReporter@2b6cd2db: rootName = solr_42064, domain = solr.core.forwardingCollection.shard1.replica_n1, service url = null, agent id = null] for registry solr.core.forwardingCollection.shard1.replica_n1 / com.codahale.metrics.MetricRegistry@5cf40df8
   [junit4]   2> 2607473 INFO  (jetty-closer-8180-thread-2) [    ] o.a.s.m.SolrMetricManager Closing metric reporters for registry=solr.node, tag=null
   [junit4]   2> 2607474 INFO  (jetty-closer-8180-thread-2) [    ] o.a.s.m.r.SolrJmxReporter Closing reporter [org.apache.solr.metrics.reporters.SolrJmxReporter@62161c91: rootName = solr_40515, domain = solr.node, service url = null, agent id = null] for registry solr.node / com.codahale.metrics.MetricRegistry@7e7e5504
   [junit4]   2> 2607488 INFO  (coreCloseExecutor-7759-thread-1) [n:127.0.0.1:42064_solr c:forwardingCollection s:shard1 r:core_node2 x:forwardingCollection_shard1_replica_n1] o.a.s.m.SolrMetricManager Closing metric reporters for registry=solr.collection.forwardingCollection.shard1.leader, tag=f2ee51
   [junit4]   2> 2607490 INFO  (jetty-closer-8180-thread-2) [    ] o.a.s.m.SolrMetricManager Closing metric reporters for registry=solr.jvm, tag=null
   [junit4]   2> 2607490 INFO  (jetty-closer-8180-thread-2) [    ] o.a.s.m.r.SolrJmxReporter Closing reporter [org.apache.solr.metrics.reporters.SolrJmxReporter@4a873798: rootName = solr_40515, domain = solr.jvm, service url = null, agent id = null] for registry solr.jvm / com.codahale.metrics.MetricRegistry@7cb56b09
   [junit4]   2> 2607492 INFO  (jetty-closer-8180-thread-2) [    ] o.a.s.m.SolrMetricManager Closing metric reporters for registry=solr.jetty, tag=null
   [junit4]   2> 2607492 INFO  (jetty-closer-8180-thread-2) [    ] o.a.s.m.r.SolrJmxReporter Closing reporter [org.apache.solr.metrics.reporters.SolrJmxReporter@5430ad5: rootName = solr_40515, domain = solr.jetty, service url = null, agent id = null] for registry solr.jetty / com.codahale.metrics.MetricRegistry@14d6471b
   [junit4]   2> 2607492 INFO  (jetty-closer-8180-thread-2) [    ] o.a.s.m.SolrMetricManager Closing metric reporters for registry=solr.cluster, tag=null
   [junit4]   2> 2607512 INFO  (closeThreadPool-8185-thread-1) [    ] o.a.s.c.Overseer Overseer (id=74172355968499718-127.0.0.1:40515_solr-n_0000000000) closing
   [junit4]   2> 2607512 INFO  (OverseerStateUpdate-74172355968499718-127.0.0.1:40515_solr-n_0000000000) [n:127.0.0.1:40515_solr    ] o.a.s.c.Overseer Overseer Loop exiting : 127.0.0.1:40515_solr
   [junit4]   1> Done close org.apache.solr.common.util.ExecutorUtil$MDCAwareThreadPoolExecutor@47cb6612[Terminated, pool size = 0, active threads = 0, queued tasks = 0, completed tasks = 2]
   [junit4]   2> 2607512 INFO  (OverseerAutoScalingTriggerThread-74172355968499718-127.0.0.1:40515_solr-n_0000000000) [    ] o.a.s.c.a.OverseerTriggerThread OverseerTriggerThread woken up but we are closed, exiting.
   [junit4]   1> Done close org.apache.solr.common.util.ExecutorUtil$MDCAwareThreadPoolExecutor@a85c79d[Terminated, pool size = 0, active threads = 0, queued tasks = 0, completed tasks = 2]
   [junit4]   2> 2607525 INFO  (jetty-closer-8180-thread-1) [    ] o.a.s.m.SolrMetricManager Closing metric reporters for registry=solr.node, tag=null
   [junit4]   2> 2607525 INFO  (jetty-closer-8180-thread-1) [    ] o.a.s.m.r.SolrJmxReporter Closing reporter [org.apache.solr.metrics.reporters.SolrJmxReporter@2d1fca34: rootName = solr_42064, domain = solr.node, service url = null, agent id = null] for registry solr.node / com.codahale.metrics.MetricRegistry@498289cc
   [junit4]   2> 2607529 INFO  (jetty-closer-8180-thread-1) [    ] o.a.s.m.SolrMetricManager Closing metric reporters for registry=solr.jvm, tag=null
   [junit4]   2> 2607529 INFO  (jetty-closer-8180-thread-1) [    ] o.a.s.m.r.SolrJmxReporter Closing reporter [org.apache.solr.metrics.reporters.SolrJmxReporter@7dd0c3c2: rootName = solr_42064, domain = solr.jvm, service url = null, agent id = null] for registry solr.jvm / com.codahale.metrics.MetricRegistry@7cb56b09
   [junit4]   2> 2607530 INFO  (jetty-closer-8180-thread-1) [    ] o.a.s.m.SolrMetricManager Closing metric reporters for registry=solr.jetty, tag=null
   [junit4]   2> 2607530 INFO  (jetty-closer-8180-thread-1) [    ] o.a.s.m.r.SolrJmxReporter Closing reporter [org.apache.solr.metrics.reporters.SolrJmxReporter@71daf0e0: rootName = solr_42064, domain = solr.jetty, service url = null, agent id = null] for registry solr.jetty / com.codahale.metrics.MetricRegistry@14d6471b
   [junit4]   2> 2607530 INFO  (jetty-closer-8180-thread-1) [    ] o.a.s.m.SolrMetricManager Closing metric reporters for registry=solr.cluster, tag=null
   [junit4]   1> Done close org.apache.solr.common.util.ExecutorUtil$MDCAwareThreadPoolExecutor@6b129ed8[Terminated, pool size = 0, active threads = 0, queued tasks = 0, completed tasks = 2]
   [junit4]   1> Done close org.apache.solr.common.util.ExecutorUtil$MDCAwareThreadPoolExecutor@5f3ac54[Terminated, pool size = 0, active threads = 0, queued tasks = 0, completed tasks = 2]
   [junit4]   2> 2607558 INFO  (jetty-closer-8180-thread-2) [    ] o.a.s.c.Overseer Overseer (id=74172355968499718-127.0.0.1:40515_solr-n_0000000000) closing
   [junit4]   2> 2607558 INFO  (closeThreadPool-8185-thread-2) [    ] o.a.s.c.Overseer Overseer (id=74172355968499718-127.0.0.1:40515_solr-n_0000000000) closing
   [junit4]   2> 2607558 ERROR (Thread[Thread-4874,5,TGRP-TestSolrCloudWithSecureImpersonation]) [    ] o.a.h.s.t.d.AbstractDelegationTokenSecretManager ExpiredTokenRemover received java.lang.Interru

[...truncated too long message...]

ivy-fail-disallowed-ivy-version:

ivy-fail:

ivy-fail:

ivy-configure:
[ivy:configure] :: loading settings :: file = /home/jenkins/jenkins-slave/workspace/Lucene-Solr-Tests-8.x/lucene/top-level-ivy-settings.xml

resolve:

ivy-availability-check:
[loadresource] Do not set property disallowed.ivy.jars.list as its length is 0.

-ivy-fail-disallowed-ivy-version:

ivy-fail:

ivy-configure:
[ivy:configure] :: loading settings :: file = /home/jenkins/jenkins-slave/workspace/Lucene-Solr-Tests-8.x/lucene/top-level-ivy-settings.xml

resolve:

ivy-availability-check:
[loadresource] Do not set property disallowed.ivy.jars.list as its length is 0.

-ivy-fail-disallowed-ivy-version:

ivy-fail:

ivy-fail:

ivy-configure:
[ivy:configure] :: loading settings :: file = /home/jenkins/jenkins-slave/workspace/Lucene-Solr-Tests-8.x/lucene/top-level-ivy-settings.xml

resolve:

ivy-availability-check:
[loadresource] Do not set property disallowed.ivy.jars.list as its length is 0.

-ivy-fail-disallowed-ivy-version:

ivy-fail:

ivy-configure:
[ivy:configure] :: loading settings :: file = /home/jenkins/jenkins-slave/workspace/Lucene-Solr-Tests-8.x/lucene/top-level-ivy-settings.xml

resolve:

ivy-availability-check:
[loadresource] Do not set property disallowed.ivy.jars.list as its length is 0.

-ivy-fail-disallowed-ivy-version:

ivy-fail:

ivy-fail:

ivy-configure:
[ivy:configure] :: loading settings :: file = /home/jenkins/jenkins-slave/workspace/Lucene-Solr-Tests-8.x/lucene/top-level-ivy-settings.xml

resolve:

ivy-availability-check:
[loadresource] Do not set property disallowed.ivy.jars.list as its length is 0.

-ivy-fail-disallowed-ivy-version:

ivy-fail:

ivy-fail:

ivy-configure:
[ivy:configure] :: loading settings :: file = /home/jenkins/jenkins-slave/workspace/Lucene-Solr-Tests-8.x/lucene/top-level-ivy-settings.xml

resolve:

ivy-availability-check:
[loadresource] Do not set property disallowed.ivy.jars.list as its length is 0.

-ivy-fail-disallowed-ivy-version:

ivy-fail:

ivy-fail:

ivy-configure:
[ivy:configure] :: loading settings :: file = /home/jenkins/jenkins-slave/workspace/Lucene-Solr-Tests-8.x/lucene/top-level-ivy-settings.xml

resolve:

ivy-availability-check:
[loadresource] Do not set property disallowed.ivy.jars.list as its length is 0.

-ivy-fail-disallowed-ivy-version:

ivy-fail:

ivy-fail:

ivy-configure:
[ivy:configure] :: loading settings :: file = /home/jenkins/jenkins-slave/workspace/Lucene-Solr-Tests-8.x/lucene/top-level-ivy-settings.xml

resolve:

ivy-availability-check:
[loadresource] Do not set property disallowed.ivy.jars.list as its length is 0.

-ivy-fail-disallowed-ivy-version:

ivy-fail:

ivy-fail:

ivy-configure:
[ivy:configure] :: loading settings :: file = /home/jenkins/jenkins-slave/workspace/Lucene-Solr-Tests-8.x/lucene/top-level-ivy-settings.xml

resolve:

ivy-availability-check:
[loadresource] Do not set property disallowed.ivy.jars.list as its length is 0.

-ivy-fail-disallowed-ivy-version:

ivy-fail:

ivy-fail:

ivy-configure:
[ivy:configure] :: loading settings :: file = /home/jenkins/jenkins-slave/workspace/Lucene-Solr-Tests-8.x/lucene/top-level-ivy-settings.xml

resolve:

ivy-availability-check:
[loadresource] Do not set property disallowed.ivy.jars.list as its length is 0.

-ivy-fail-disallowed-ivy-version:

ivy-fail:

ivy-fail:

ivy-configure:
[ivy:configure] :: loading settings :: file = /home/jenkins/jenkins-slave/workspace/Lucene-Solr-Tests-8.x/lucene/top-level-ivy-settings.xml

resolve:

ivy-availability-check:
[loadresource] Do not set property disallowed.ivy.jars.list as its length is 0.

-ivy-fail-disallowed-ivy-version:

ivy-fail:

ivy-fail:

ivy-configure:
[ivy:configure] :: loading settings :: file = /home/jenkins/jenkins-slave/workspace/Lucene-Solr-Tests-8.x/lucene/top-level-ivy-settings.xml

resolve:

ivy-availability-check:
[loadresource] Do not set property disallowed.ivy.jars.list as its length is 0.

-ivy-fail-disallowed-ivy-version:

ivy-fail:

ivy-fail:

ivy-configure:
[ivy:configure] :: loading settings :: file = /home/jenkins/jenkins-slave/workspace/Lucene-Solr-Tests-8.x/lucene/top-level-ivy-settings.xml

resolve:

ivy-availability-check:
[loadresource] Do not set property disallowed.ivy.jars.list as its length is 0.

-ivy-fail-disallowed-ivy-version:

ivy-fail:

ivy-fail:

ivy-configure:
[ivy:configure] :: loading settings :: file = /home/jenkins/jenkins-slave/workspace/Lucene-Solr-Tests-8.x/lucene/top-level-ivy-settings.xml

resolve:

jar-checksums:
    [mkdir] Created dir: /home/jenkins/jenkins-slave/workspace/Lucene-Solr-Tests-8.x/solr/null1477273256
     [copy] Copying 237 files to /home/jenkins/jenkins-slave/workspace/Lucene-Solr-Tests-8.x/solr/null1477273256
   [delete] Deleting directory /home/jenkins/jenkins-slave/workspace/Lucene-Solr-Tests-8.x/solr/null1477273256

check-working-copy:
[ivy:cachepath] :: resolving dependencies :: org.eclipse.jgit#org.eclipse.jgit-caller;working
[ivy:cachepath] confs: [default]
[ivy:cachepath] found org.eclipse.jgit#org.eclipse.jgit;4.6.0.201612231935-r in public
[ivy:cachepath] found com.jcraft#jsch;0.1.53 in public
[ivy:cachepath] found com.googlecode.javaewah#JavaEWAH;1.1.6 in public
[ivy:cachepath] found org.apache.httpcomponents#httpclient;4.3.6 in public
[ivy:cachepath] found org.apache.httpcomponents#httpcore;4.3.3 in public
[ivy:cachepath] found commons-logging#commons-logging;1.1.3 in public
[ivy:cachepath] found commons-codec#commons-codec;1.6 in public
[ivy:cachepath] found org.slf4j#slf4j-api;1.7.2 in public
[ivy:cachepath] :: resolution report :: resolve 49ms :: artifacts dl 4ms
        ---------------------------------------------------------------------
        |                  |            modules            ||   artifacts   |
        |       conf       | number| search|dwnlded|evicted|| number|dwnlded|
        ---------------------------------------------------------------------
        |      default     |   8   |   0   |   0   |   0   ||   8   |   0   |
        ---------------------------------------------------------------------
[wc-checker] Initializing working copy...
[wc-checker] SLF4J: Failed to load class "org.slf4j.impl.StaticLoggerBinder".
[wc-checker] SLF4J: Defaulting to no-operation (NOP) logger implementation
[wc-checker] SLF4J: See http://www.slf4j.org/codes.html#StaticLoggerBinder for further details.
[wc-checker] Checking working copy status...

-jenkins-base:

BUILD SUCCESSFUL
Total time: 219 minutes 58 seconds
Archiving artifacts
java.lang.InterruptedException: no matches found within 10000
        at hudson.FilePath$ValidateAntFileMask.hasMatch(FilePath.java:2847)
        at hudson.FilePath$ValidateAntFileMask.invoke(FilePath.java:2726)
        at hudson.FilePath$ValidateAntFileMask.invoke(FilePath.java:2707)
        at hudson.FilePath$FileCallableWrapper.call(FilePath.java:3086)
Also:   hudson.remoting.Channel$CallSiteStackTrace: Remote call to lucene2
                at hudson.remoting.Channel.attachCallSiteStackTrace(Channel.java:1741)
                at hudson.remoting.UserRequest$ExceptionResponse.retrieve(UserRequest.java:357)
                at hudson.remoting.Channel.call(Channel.java:955)
                at hudson.FilePath.act(FilePath.java:1072)
                at hudson.FilePath.act(FilePath.java:1061)
                at hudson.FilePath.validateAntFileMask(FilePath.java:2705)
                at hudson.tasks.ArtifactArchiver.perform(ArtifactArchiver.java:243)
                at hudson.tasks.BuildStepCompatibilityLayer.perform(BuildStepCompatibilityLayer.java:81)
                at hudson.tasks.BuildStepMonitor$1.perform(BuildStepMonitor.java:20)
                at hudson.model.AbstractBuild$AbstractBuildExecution.perform(AbstractBuild.java:744)
                at hudson.model.AbstractBuild$AbstractBuildExecution.performAllBuildSteps(AbstractBuild.java:690)
                at hudson.model.Build$BuildExecution.post2(Build.java:186)
                at hudson.model.AbstractBuild$AbstractBuildExecution.post(AbstractBuild.java:635)
                at hudson.model.Run.execute(Run.java:1835)
                at hudson.model.FreeStyleBuild.run(FreeStyleBuild.java:43)
                at hudson.model.ResourceController.execute(ResourceController.java:97)
                at hudson.model.Executor.run(Executor.java:429)
Caused: hudson.FilePath$TunneledInterruptedException
        at hudson.FilePath$FileCallableWrapper.call(FilePath.java:3088)
        at hudson.remoting.UserRequest.perform(UserRequest.java:212)
        at hudson.remoting.UserRequest.perform(UserRequest.java:54)
        at hudson.remoting.Request$2.run(Request.java:369)
        at hudson.remoting.InterceptingExecutorService$1.call(InterceptingExecutorService.java:72)
        at java.util.concurrent.FutureTask.run(FutureTask.java:266)
        at java.util.concurrent.ThreadPoolExecutor.runWorker(ThreadPoolExecutor.java:1142)
        at java.util.concurrent.ThreadPoolExecutor$Worker.run(ThreadPoolExecutor.java:617)
        at java.lang.Thread.run(Thread.java:748)
Caused: java.lang.InterruptedException: java.lang.InterruptedException: no matches found within 10000
        at hudson.FilePath.act(FilePath.java:1074)
        at hudson.FilePath.act(FilePath.java:1061)
        at hudson.FilePath.validateAntFileMask(FilePath.java:2705)
        at hudson.tasks.ArtifactArchiver.perform(ArtifactArchiver.java:243)
        at hudson.tasks.BuildStepCompatibilityLayer.perform(BuildStepCompatibilityLayer.java:81)
        at hudson.tasks.BuildStepMonitor$1.perform(BuildStepMonitor.java:20)
        at hudson.model.AbstractBuild$AbstractBuildExecution.perform(AbstractBuild.java:744)
        at hudson.model.AbstractBuild$AbstractBuildExecution.performAllBuildSteps(AbstractBuild.java:690)
        at hudson.model.Build$BuildExecution.post2(Build.java:186)
        at hudson.model.AbstractBuild$AbstractBuildExecution.post(AbstractBuild.java:635)
        at hudson.model.Run.execute(Run.java:1835)
        at hudson.model.FreeStyleBuild.run(FreeStyleBuild.java:43)
        at hudson.model.ResourceController.execute(ResourceController.java:97)
        at hudson.model.Executor.run(Executor.java:429)
No artifacts found that match the file pattern "**/*.events,heapdumps/**,**/hs_err_pid*". Configuration error?
Recording test results
Build step 'Publish JUnit test result report' changed build result to UNSTABLE
Email was triggered for: Unstable (Test Failures)
Sending email for trigger: Unstable (Test Failures)


---------------------------------------------------------------------
To unsubscribe, e-mail: [hidden email]
For additional commands, e-mail: [hidden email]