[JENKINS] Lucene-Solr-Tests-master - Build # 2594 - Unstable

classic Classic list List threaded Threaded
1 message Options
Reply | Threaded
Open this post in threaded view
|

[JENKINS] Lucene-Solr-Tests-master - Build # 2594 - Unstable

Apache Jenkins Server-2
Build: https://builds.apache.org/job/Lucene-Solr-Tests-master/2594/

3 tests failed.
FAILED:  org.apache.solr.cloud.LeaderTragicEventTest.testOtherReplicasAreNotActive

Error Message:
Jetty Connector is not open: -2

Stack Trace:
java.lang.IllegalStateException: Jetty Connector is not open: -2
        at __randomizedtesting.SeedInfo.seed([933DC23F75D426F1:1689EE48492B9F69]:0)
        at org.apache.solr.client.solrj.embedded.JettySolrRunner.getBaseUrl(JettySolrRunner.java:499)
        at org.apache.solr.cloud.MiniSolrCloudCluster.getReplicaJetty(MiniSolrCloudCluster.java:539)
        at org.apache.solr.cloud.LeaderTragicEventTest.corruptLeader(LeaderTragicEventTest.java:100)
        at org.apache.solr.cloud.LeaderTragicEventTest.testOtherReplicasAreNotActive(LeaderTragicEventTest.java:150)
        at sun.reflect.NativeMethodAccessorImpl.invoke0(Native Method)
        at sun.reflect.NativeMethodAccessorImpl.invoke(NativeMethodAccessorImpl.java:62)
        at sun.reflect.DelegatingMethodAccessorImpl.invoke(DelegatingMethodAccessorImpl.java:43)
        at java.lang.reflect.Method.invoke(Method.java:498)
        at com.carrotsearch.randomizedtesting.RandomizedRunner.invoke(RandomizedRunner.java:1737)
        at com.carrotsearch.randomizedtesting.RandomizedRunner$8.evaluate(RandomizedRunner.java:934)
        at com.carrotsearch.randomizedtesting.RandomizedRunner$9.evaluate(RandomizedRunner.java:970)
        at com.carrotsearch.randomizedtesting.RandomizedRunner$10.evaluate(RandomizedRunner.java:984)
        at com.carrotsearch.randomizedtesting.rules.SystemPropertiesRestoreRule$1.evaluate(SystemPropertiesRestoreRule.java:57)
        at org.apache.lucene.util.TestRuleSetupTeardownChained$1.evaluate(TestRuleSetupTeardownChained.java:49)
        at org.apache.lucene.util.AbstractBeforeAfterRule$1.evaluate(AbstractBeforeAfterRule.java:45)
        at org.apache.lucene.util.TestRuleThreadAndTestName$1.evaluate(TestRuleThreadAndTestName.java:48)
        at org.apache.lucene.util.TestRuleIgnoreAfterMaxFailures$1.evaluate(TestRuleIgnoreAfterMaxFailures.java:64)
        at org.apache.lucene.util.TestRuleMarkFailure$1.evaluate(TestRuleMarkFailure.java:47)
        at com.carrotsearch.randomizedtesting.rules.StatementAdapter.evaluate(StatementAdapter.java:36)
        at com.carrotsearch.randomizedtesting.ThreadLeakControl$StatementRunner.run(ThreadLeakControl.java:368)
        at com.carrotsearch.randomizedtesting.ThreadLeakControl.forkTimeoutingTask(ThreadLeakControl.java:817)
        at com.carrotsearch.randomizedtesting.ThreadLeakControl$3.evaluate(ThreadLeakControl.java:468)
        at com.carrotsearch.randomizedtesting.RandomizedRunner.runSingleTest(RandomizedRunner.java:943)
        at com.carrotsearch.randomizedtesting.RandomizedRunner$5.evaluate(RandomizedRunner.java:829)
        at com.carrotsearch.randomizedtesting.RandomizedRunner$6.evaluate(RandomizedRunner.java:879)
        at com.carrotsearch.randomizedtesting.RandomizedRunner$7.evaluate(RandomizedRunner.java:890)
        at com.carrotsearch.randomizedtesting.rules.StatementAdapter.evaluate(StatementAdapter.java:36)
        at com.carrotsearch.randomizedtesting.rules.SystemPropertiesRestoreRule$1.evaluate(SystemPropertiesRestoreRule.java:57)
        at org.apache.lucene.util.AbstractBeforeAfterRule$1.evaluate(AbstractBeforeAfterRule.java:45)
        at com.carrotsearch.randomizedtesting.rules.StatementAdapter.evaluate(StatementAdapter.java:36)
        at org.apache.lucene.util.TestRuleStoreClassName$1.evaluate(TestRuleStoreClassName.java:41)
        at com.carrotsearch.randomizedtesting.rules.NoShadowingOrOverridesOnMethodsRule$1.evaluate(NoShadowingOrOverridesOnMethodsRule.java:40)
        at com.carrotsearch.randomizedtesting.rules.NoShadowingOrOverridesOnMethodsRule$1.evaluate(NoShadowingOrOverridesOnMethodsRule.java:40)
        at com.carrotsearch.randomizedtesting.rules.StatementAdapter.evaluate(StatementAdapter.java:36)
        at com.carrotsearch.randomizedtesting.rules.StatementAdapter.evaluate(StatementAdapter.java:36)
        at com.carrotsearch.randomizedtesting.rules.StatementAdapter.evaluate(StatementAdapter.java:36)
        at org.apache.lucene.util.TestRuleAssertionsRequired$1.evaluate(TestRuleAssertionsRequired.java:53)
        at org.apache.lucene.util.TestRuleMarkFailure$1.evaluate(TestRuleMarkFailure.java:47)
        at org.apache.lucene.util.TestRuleIgnoreAfterMaxFailures$1.evaluate(TestRuleIgnoreAfterMaxFailures.java:64)
        at org.apache.lucene.util.TestRuleIgnoreTestSuites$1.evaluate(TestRuleIgnoreTestSuites.java:54)
        at com.carrotsearch.randomizedtesting.rules.StatementAdapter.evaluate(StatementAdapter.java:36)
        at com.carrotsearch.randomizedtesting.ThreadLeakControl$StatementRunner.run(ThreadLeakControl.java:368)
        at java.lang.Thread.run(Thread.java:748)


FAILED:  org.apache.solr.cloud.LeaderTragicEventTest.test

Error Message:
Error from server at http://127.0.0.1:43134/solr: collection already exists: collection1

Stack Trace:
org.apache.solr.client.solrj.impl.HttpSolrClient$RemoteSolrException: Error from server at http://127.0.0.1:43134/solr: collection already exists: collection1
        at __randomizedtesting.SeedInfo.seed([933DC23F75D426F1:1B69FDE5DB284B09]:0)
        at org.apache.solr.client.solrj.impl.HttpSolrClient.executeMethod(HttpSolrClient.java:643)
        at org.apache.solr.client.solrj.impl.HttpSolrClient.request(HttpSolrClient.java:255)
        at org.apache.solr.client.solrj.impl.HttpSolrClient.request(HttpSolrClient.java:244)
        at org.apache.solr.client.solrj.impl.LBHttpSolrClient.doRequest(LBHttpSolrClient.java:483)
        at org.apache.solr.client.solrj.impl.LBHttpSolrClient.request(LBHttpSolrClient.java:413)
        at org.apache.solr.client.solrj.impl.CloudSolrClient.sendRequest(CloudSolrClient.java:1106)
        at org.apache.solr.client.solrj.impl.CloudSolrClient.requestWithRetryOnStaleState(CloudSolrClient.java:886)
        at org.apache.solr.client.solrj.impl.CloudSolrClient.request(CloudSolrClient.java:819)
        at org.apache.solr.client.solrj.SolrRequest.process(SolrRequest.java:194)
        at org.apache.solr.client.solrj.SolrRequest.process(SolrRequest.java:211)
        at org.apache.solr.cloud.LeaderTragicEventTest.test(LeaderTragicEventTest.java:70)
        at sun.reflect.NativeMethodAccessorImpl.invoke0(Native Method)
        at sun.reflect.NativeMethodAccessorImpl.invoke(NativeMethodAccessorImpl.java:62)
        at sun.reflect.DelegatingMethodAccessorImpl.invoke(DelegatingMethodAccessorImpl.java:43)
        at java.lang.reflect.Method.invoke(Method.java:498)
        at com.carrotsearch.randomizedtesting.RandomizedRunner.invoke(RandomizedRunner.java:1737)
        at com.carrotsearch.randomizedtesting.RandomizedRunner$8.evaluate(RandomizedRunner.java:934)
        at com.carrotsearch.randomizedtesting.RandomizedRunner$9.evaluate(RandomizedRunner.java:970)
        at com.carrotsearch.randomizedtesting.RandomizedRunner$10.evaluate(RandomizedRunner.java:984)
        at com.carrotsearch.randomizedtesting.rules.SystemPropertiesRestoreRule$1.evaluate(SystemPropertiesRestoreRule.java:57)
        at org.apache.lucene.util.TestRuleSetupTeardownChained$1.evaluate(TestRuleSetupTeardownChained.java:49)
        at org.apache.lucene.util.AbstractBeforeAfterRule$1.evaluate(AbstractBeforeAfterRule.java:45)
        at org.apache.lucene.util.TestRuleThreadAndTestName$1.evaluate(TestRuleThreadAndTestName.java:48)
        at org.apache.lucene.util.TestRuleIgnoreAfterMaxFailures$1.evaluate(TestRuleIgnoreAfterMaxFailures.java:64)
        at org.apache.lucene.util.TestRuleMarkFailure$1.evaluate(TestRuleMarkFailure.java:47)
        at com.carrotsearch.randomizedtesting.rules.StatementAdapter.evaluate(StatementAdapter.java:36)
        at com.carrotsearch.randomizedtesting.ThreadLeakControl$StatementRunner.run(ThreadLeakControl.java:368)
        at com.carrotsearch.randomizedtesting.ThreadLeakControl.forkTimeoutingTask(ThreadLeakControl.java:817)
        at com.carrotsearch.randomizedtesting.ThreadLeakControl$3.evaluate(ThreadLeakControl.java:468)
        at com.carrotsearch.randomizedtesting.RandomizedRunner.runSingleTest(RandomizedRunner.java:943)
        at com.carrotsearch.randomizedtesting.RandomizedRunner$5.evaluate(RandomizedRunner.java:829)
        at com.carrotsearch.randomizedtesting.RandomizedRunner$6.evaluate(RandomizedRunner.java:879)
        at com.carrotsearch.randomizedtesting.RandomizedRunner$7.evaluate(RandomizedRunner.java:890)
        at com.carrotsearch.randomizedtesting.rules.StatementAdapter.evaluate(StatementAdapter.java:36)
        at com.carrotsearch.randomizedtesting.rules.SystemPropertiesRestoreRule$1.evaluate(SystemPropertiesRestoreRule.java:57)
        at org.apache.lucene.util.AbstractBeforeAfterRule$1.evaluate(AbstractBeforeAfterRule.java:45)
        at com.carrotsearch.randomizedtesting.rules.StatementAdapter.evaluate(StatementAdapter.java:36)
        at org.apache.lucene.util.TestRuleStoreClassName$1.evaluate(TestRuleStoreClassName.java:41)
        at com.carrotsearch.randomizedtesting.rules.NoShadowingOrOverridesOnMethodsRule$1.evaluate(NoShadowingOrOverridesOnMethodsRule.java:40)
        at com.carrotsearch.randomizedtesting.rules.NoShadowingOrOverridesOnMethodsRule$1.evaluate(NoShadowingOrOverridesOnMethodsRule.java:40)
        at com.carrotsearch.randomizedtesting.rules.StatementAdapter.evaluate(StatementAdapter.java:36)
        at com.carrotsearch.randomizedtesting.rules.StatementAdapter.evaluate(StatementAdapter.java:36)
        at com.carrotsearch.randomizedtesting.rules.StatementAdapter.evaluate(StatementAdapter.java:36)
        at org.apache.lucene.util.TestRuleAssertionsRequired$1.evaluate(TestRuleAssertionsRequired.java:53)
        at org.apache.lucene.util.TestRuleMarkFailure$1.evaluate(TestRuleMarkFailure.java:47)
        at org.apache.lucene.util.TestRuleIgnoreAfterMaxFailures$1.evaluate(TestRuleIgnoreAfterMaxFailures.java:64)
        at org.apache.lucene.util.TestRuleIgnoreTestSuites$1.evaluate(TestRuleIgnoreTestSuites.java:54)
        at com.carrotsearch.randomizedtesting.rules.StatementAdapter.evaluate(StatementAdapter.java:36)
        at com.carrotsearch.randomizedtesting.ThreadLeakControl$StatementRunner.run(ThreadLeakControl.java:368)
        at java.lang.Thread.run(Thread.java:748)


FAILED:  org.apache.solr.cloud.autoscaling.ScheduledTriggerIntegrationTest.testScheduledTrigger

Error Message:
ScheduledTrigger did not fire within 20 seconds

Stack Trace:
java.lang.AssertionError: ScheduledTrigger did not fire within 20 seconds
        at __randomizedtesting.SeedInfo.seed([933DC23F75D426F1:268A4D2B297DC5]:0)
        at org.junit.Assert.fail(Assert.java:93)
        at org.junit.Assert.assertTrue(Assert.java:43)
        at org.apache.solr.cloud.autoscaling.ScheduledTriggerIntegrationTest.testScheduledTrigger(ScheduledTriggerIntegrationTest.java:113)
        at sun.reflect.NativeMethodAccessorImpl.invoke0(Native Method)
        at sun.reflect.NativeMethodAccessorImpl.invoke(NativeMethodAccessorImpl.java:62)
        at sun.reflect.DelegatingMethodAccessorImpl.invoke(DelegatingMethodAccessorImpl.java:43)
        at java.lang.reflect.Method.invoke(Method.java:498)
        at com.carrotsearch.randomizedtesting.RandomizedRunner.invoke(RandomizedRunner.java:1737)
        at com.carrotsearch.randomizedtesting.RandomizedRunner$8.evaluate(RandomizedRunner.java:934)
        at com.carrotsearch.randomizedtesting.RandomizedRunner$9.evaluate(RandomizedRunner.java:970)
        at com.carrotsearch.randomizedtesting.RandomizedRunner$10.evaluate(RandomizedRunner.java:984)
        at com.carrotsearch.randomizedtesting.rules.SystemPropertiesRestoreRule$1.evaluate(SystemPropertiesRestoreRule.java:57)
        at org.apache.lucene.util.TestRuleSetupTeardownChained$1.evaluate(TestRuleSetupTeardownChained.java:49)
        at org.apache.lucene.util.AbstractBeforeAfterRule$1.evaluate(AbstractBeforeAfterRule.java:45)
        at org.apache.lucene.util.TestRuleThreadAndTestName$1.evaluate(TestRuleThreadAndTestName.java:48)
        at org.apache.lucene.util.TestRuleIgnoreAfterMaxFailures$1.evaluate(TestRuleIgnoreAfterMaxFailures.java:64)
        at org.apache.lucene.util.TestRuleMarkFailure$1.evaluate(TestRuleMarkFailure.java:47)
        at com.carrotsearch.randomizedtesting.rules.StatementAdapter.evaluate(StatementAdapter.java:36)
        at com.carrotsearch.randomizedtesting.ThreadLeakControl$StatementRunner.run(ThreadLeakControl.java:368)
        at com.carrotsearch.randomizedtesting.ThreadLeakControl.forkTimeoutingTask(ThreadLeakControl.java:817)
        at com.carrotsearch.randomizedtesting.ThreadLeakControl$3.evaluate(ThreadLeakControl.java:468)
        at com.carrotsearch.randomizedtesting.RandomizedRunner.runSingleTest(RandomizedRunner.java:943)
        at com.carrotsearch.randomizedtesting.RandomizedRunner$5.evaluate(RandomizedRunner.java:829)
        at com.carrotsearch.randomizedtesting.RandomizedRunner$6.evaluate(RandomizedRunner.java:879)
        at com.carrotsearch.randomizedtesting.RandomizedRunner$7.evaluate(RandomizedRunner.java:890)
        at com.carrotsearch.randomizedtesting.rules.StatementAdapter.evaluate(StatementAdapter.java:36)
        at com.carrotsearch.randomizedtesting.rules.SystemPropertiesRestoreRule$1.evaluate(SystemPropertiesRestoreRule.java:57)
        at org.apache.lucene.util.AbstractBeforeAfterRule$1.evaluate(AbstractBeforeAfterRule.java:45)
        at com.carrotsearch.randomizedtesting.rules.StatementAdapter.evaluate(StatementAdapter.java:36)
        at org.apache.lucene.util.TestRuleStoreClassName$1.evaluate(TestRuleStoreClassName.java:41)
        at com.carrotsearch.randomizedtesting.rules.NoShadowingOrOverridesOnMethodsRule$1.evaluate(NoShadowingOrOverridesOnMethodsRule.java:40)
        at com.carrotsearch.randomizedtesting.rules.NoShadowingOrOverridesOnMethodsRule$1.evaluate(NoShadowingOrOverridesOnMethodsRule.java:40)
        at com.carrotsearch.randomizedtesting.rules.StatementAdapter.evaluate(StatementAdapter.java:36)
        at com.carrotsearch.randomizedtesting.rules.StatementAdapter.evaluate(StatementAdapter.java:36)
        at com.carrotsearch.randomizedtesting.rules.StatementAdapter.evaluate(StatementAdapter.java:36)
        at org.apache.lucene.util.TestRuleAssertionsRequired$1.evaluate(TestRuleAssertionsRequired.java:53)
        at org.apache.lucene.util.TestRuleMarkFailure$1.evaluate(TestRuleMarkFailure.java:47)
        at org.apache.lucene.util.TestRuleIgnoreAfterMaxFailures$1.evaluate(TestRuleIgnoreAfterMaxFailures.java:64)
        at org.apache.lucene.util.TestRuleIgnoreTestSuites$1.evaluate(TestRuleIgnoreTestSuites.java:54)
        at com.carrotsearch.randomizedtesting.rules.StatementAdapter.evaluate(StatementAdapter.java:36)
        at com.carrotsearch.randomizedtesting.ThreadLeakControl$StatementRunner.run(ThreadLeakControl.java:368)
        at java.lang.Thread.run(Thread.java:748)




Build Log:
[...truncated 12728 lines...]
   [junit4] Suite: org.apache.solr.cloud.autoscaling.ScheduledTriggerIntegrationTest
   [junit4]   2> 1034435 INFO  (SUITE-ScheduledTriggerIntegrationTest-seed#[933DC23F75D426F1]-worker) [    ] o.a.s.SolrTestCaseJ4 SecureRandom sanity checks: test.solr.allowed.securerandom=null & java.security.egd=file:/dev/./urandom
   [junit4]   2> Creating dataDir: /home/jenkins/jenkins-slave/workspace/Lucene-Solr-Tests-master/solr/build/solr-core/test/J2/temp/solr.cloud.autoscaling.ScheduledTriggerIntegrationTest_933DC23F75D426F1-001/init-core-data-001
   [junit4]   2> 1034436 WARN  (SUITE-ScheduledTriggerIntegrationTest-seed#[933DC23F75D426F1]-worker) [    ] o.a.s.SolrTestCaseJ4 startTrackingSearchers: numOpens=2501 numCloses=2501
   [junit4]   2> 1034469 INFO  (SUITE-ScheduledTriggerIntegrationTest-seed#[933DC23F75D426F1]-worker) [    ] o.a.s.SolrTestCaseJ4 Using PointFields (NUMERIC_POINTS_SYSPROP=true) w/NUMERIC_DOCVALUES_SYSPROP=true
   [junit4]   2> 1034471 INFO  (SUITE-ScheduledTriggerIntegrationTest-seed#[933DC23F75D426F1]-worker) [    ] o.a.s.SolrTestCaseJ4 Randomized ssl (true) and clientAuth (true) via: @org.apache.solr.util.RandomizeSSL(reason=, ssl=NaN, value=NaN, clientAuth=NaN)
   [junit4]   2> 1034526 INFO  (SUITE-ScheduledTriggerIntegrationTest-seed#[933DC23F75D426F1]-worker) [    ] o.a.s.c.MiniSolrCloudCluster Starting cluster of 2 servers in /home/jenkins/jenkins-slave/workspace/Lucene-Solr-Tests-master/solr/build/solr-core/test/J2/temp/solr.cloud.autoscaling.ScheduledTriggerIntegrationTest_933DC23F75D426F1-001/tempDir-001
   [junit4]   2> 1034526 INFO  (SUITE-ScheduledTriggerIntegrationTest-seed#[933DC23F75D426F1]-worker) [    ] o.a.s.c.ZkTestServer STARTING ZK TEST SERVER
   [junit4]   2> 1034554 INFO  (Thread-1127) [    ] o.a.s.c.ZkTestServer client port:0.0.0.0/0.0.0.0:0
   [junit4]   2> 1034554 INFO  (Thread-1127) [    ] o.a.s.c.ZkTestServer Starting server
   [junit4]   2> 1034571 ERROR (Thread-1127) [    ] o.a.z.s.ZooKeeperServer ZKShutdownHandler is not registered, so ZooKeeper server won't take any action on ERROR or SHUTDOWN server state changes
   [junit4]   2> 1034652 INFO  (SUITE-ScheduledTriggerIntegrationTest-seed#[933DC23F75D426F1]-worker) [    ] o.a.s.c.ZkTestServer start zk server on port:46215
   [junit4]   2> 1034946 INFO  (zkConnectionManagerCallback-819-thread-1) [    ] o.a.s.c.c.ConnectionManager zkClient has connected
   [junit4]   2> 1035084 INFO  (jetty-launcher-816-thread-2) [    ] o.e.j.s.Server jetty-9.4.11.v20180605; built: 2018-06-05T18:24:03.829Z; git: d5fc0523cfa96bfebfbda19606cad384d772f04c; jvm 1.8.0_172-b11
   [junit4]   2> 1035092 INFO  (jetty-launcher-816-thread-1) [    ] o.e.j.s.Server jetty-9.4.11.v20180605; built: 2018-06-05T18:24:03.829Z; git: d5fc0523cfa96bfebfbda19606cad384d772f04c; jvm 1.8.0_172-b11
   [junit4]   2> 1035140 INFO  (jetty-launcher-816-thread-2) [    ] o.e.j.s.session DefaultSessionIdManager workerName=node0
   [junit4]   2> 1035140 INFO  (jetty-launcher-816-thread-2) [    ] o.e.j.s.session No SessionScavenger set, using defaults
   [junit4]   2> 1035140 INFO  (jetty-launcher-816-thread-2) [    ] o.e.j.s.session node0 Scavenging every 660000ms
   [junit4]   2> 1035144 INFO  (jetty-launcher-816-thread-2) [    ] o.e.j.s.h.ContextHandler Started o.e.j.s.ServletContextHandler@36707939{/solr,null,AVAILABLE}
   [junit4]   2> 1035144 INFO  (jetty-launcher-816-thread-2) [    ] o.e.j.s.AbstractConnector Started ServerConnector@d49cbfe{SSL,[ssl, http/1.1]}{127.0.0.1:40218}
   [junit4]   2> 1035144 INFO  (jetty-launcher-816-thread-2) [    ] o.e.j.s.Server Started @1035194ms
   [junit4]   2> 1035144 INFO  (jetty-launcher-816-thread-2) [    ] o.a.s.c.s.e.JettySolrRunner Jetty properties: {hostContext=/solr, hostPort=40218}
   [junit4]   2> 1035145 ERROR (jetty-launcher-816-thread-2) [    ] o.a.s.u.StartupLoggingUtils Missing Java Option solr.log.dir. Logging may be missing or incomplete.
   [junit4]   2> 1035145 INFO  (jetty-launcher-816-thread-2) [    ] o.a.s.s.SolrDispatchFilter Using logger factory org.apache.logging.slf4j.Log4jLoggerFactory
   [junit4]   2> 1035145 INFO  (jetty-launcher-816-thread-2) [    ] o.a.s.s.SolrDispatchFilter  ___      _       Welcome to Apache Solr™ version 8.0.0
   [junit4]   2> 1035145 INFO  (jetty-launcher-816-thread-2) [    ] o.a.s.s.SolrDispatchFilter / __| ___| |_ _   Starting in cloud mode on port null
   [junit4]   2> 1035145 INFO  (jetty-launcher-816-thread-2) [    ] o.a.s.s.SolrDispatchFilter \__ \/ _ \ | '_|  Install dir: null
   [junit4]   2> 1035145 INFO  (jetty-launcher-816-thread-2) [    ] o.a.s.s.SolrDispatchFilter |___/\___/_|_|    Start time: 2018-07-11T21:32:59.461Z
   [junit4]   2> 1035180 INFO  (jetty-launcher-816-thread-1) [    ] o.e.j.s.session DefaultSessionIdManager workerName=node0
   [junit4]   2> 1035180 INFO  (jetty-launcher-816-thread-1) [    ] o.e.j.s.session No SessionScavenger set, using defaults
   [junit4]   2> 1035180 INFO  (jetty-launcher-816-thread-1) [    ] o.e.j.s.session node0 Scavenging every 660000ms
   [junit4]   2> 1035183 INFO  (jetty-launcher-816-thread-1) [    ] o.e.j.s.h.ContextHandler Started o.e.j.s.ServletContextHandler@46644833{/solr,null,AVAILABLE}
   [junit4]   2> 1035183 INFO  (jetty-launcher-816-thread-1) [    ] o.e.j.s.AbstractConnector Started ServerConnector@6b280e87{SSL,[ssl, http/1.1]}{127.0.0.1:40048}
   [junit4]   2> 1035183 INFO  (jetty-launcher-816-thread-1) [    ] o.e.j.s.Server Started @1035233ms
   [junit4]   2> 1035183 INFO  (jetty-launcher-816-thread-1) [    ] o.a.s.c.s.e.JettySolrRunner Jetty properties: {hostContext=/solr, hostPort=40048}
   [junit4]   2> 1035184 ERROR (jetty-launcher-816-thread-1) [    ] o.a.s.u.StartupLoggingUtils Missing Java Option solr.log.dir. Logging may be missing or incomplete.
   [junit4]   2> 1035184 INFO  (jetty-launcher-816-thread-1) [    ] o.a.s.s.SolrDispatchFilter Using logger factory org.apache.logging.slf4j.Log4jLoggerFactory
   [junit4]   2> 1035184 INFO  (jetty-launcher-816-thread-1) [    ] o.a.s.s.SolrDispatchFilter  ___      _       Welcome to Apache Solr™ version 8.0.0
   [junit4]   2> 1035184 INFO  (jetty-launcher-816-thread-1) [    ] o.a.s.s.SolrDispatchFilter / __| ___| |_ _   Starting in cloud mode on port null
   [junit4]   2> 1035184 INFO  (jetty-launcher-816-thread-1) [    ] o.a.s.s.SolrDispatchFilter \__ \/ _ \ | '_|  Install dir: null
   [junit4]   2> 1035184 INFO  (jetty-launcher-816-thread-1) [    ] o.a.s.s.SolrDispatchFilter |___/\___/_|_|    Start time: 2018-07-11T21:32:59.500Z
   [junit4]   2> 1035229 INFO  (zkConnectionManagerCallback-821-thread-1) [    ] o.a.s.c.c.ConnectionManager zkClient has connected
   [junit4]   2> 1035237 INFO  (jetty-launcher-816-thread-2) [    ] o.a.s.s.SolrDispatchFilter solr.xml found in ZooKeeper. Loading...
   [junit4]   2> 1035266 INFO  (zkConnectionManagerCallback-823-thread-1) [    ] o.a.s.c.c.ConnectionManager zkClient has connected
   [junit4]   2> 1035267 INFO  (jetty-launcher-816-thread-1) [    ] o.a.s.s.SolrDispatchFilter solr.xml found in ZooKeeper. Loading...
   [junit4]   2> 1036879 INFO  (jetty-launcher-816-thread-1) [    ] o.a.s.c.ZkContainer Zookeeper client=127.0.0.1:46215/solr
   [junit4]   2> 1036898 INFO  (zkConnectionManagerCallback-827-thread-1) [    ] o.a.s.c.c.ConnectionManager zkClient has connected
   [junit4]   2> 1037068 INFO  (zkConnectionManagerCallback-829-thread-1) [    ] o.a.s.c.c.ConnectionManager zkClient has connected
   [junit4]   2> 1037579 INFO  (jetty-launcher-816-thread-1) [n:127.0.0.1:40048_solr    ] o.a.s.c.Overseer Overseer (id=null) closing
   [junit4]   2> 1037597 INFO  (jetty-launcher-816-thread-1) [n:127.0.0.1:40048_solr    ] o.a.s.c.OverseerElectionContext I am going to be the leader 127.0.0.1:40048_solr
   [junit4]   2> 1037599 INFO  (jetty-launcher-816-thread-1) [n:127.0.0.1:40048_solr    ] o.a.s.c.Overseer Overseer (id=72954269373825028-127.0.0.1:40048_solr-n_0000000000) starting
   [junit4]   2> 1037649 INFO  (zkConnectionManagerCallback-836-thread-1) [    ] o.a.s.c.c.ConnectionManager zkClient has connected
   [junit4]   2> 1037650 INFO  (jetty-launcher-816-thread-1) [n:127.0.0.1:40048_solr    ] o.a.s.c.s.i.ZkClientClusterStateProvider Cluster at 127.0.0.1:46215/solr ready
   [junit4]   2> 1037671 DEBUG (OverseerAutoScalingTriggerThread-72954269373825028-127.0.0.1:40048_solr-n_0000000000) [    ] o.a.s.c.a.OverseerTriggerThread Adding .auto_add_replicas and .scheduled_maintenance triggers
   [junit4]   2> 1037672 DEBUG (OverseerAutoScalingTriggerThread-72954269373825028-127.0.0.1:40048_solr-n_0000000000) [    ] o.a.s.c.a.OverseerTriggerThread Refreshing /autoscaling.json with znode version 1
   [junit4]   2> 1037795 INFO  (jetty-launcher-816-thread-1) [n:127.0.0.1:40048_solr    ] o.a.s.c.ZkController Register node as live in ZooKeeper:/live_nodes/127.0.0.1:40048_solr
   [junit4]   2> 1037799 DEBUG (OverseerAutoScalingTriggerThread-72954269373825028-127.0.0.1:40048_solr-n_0000000000) [    ] o.a.s.c.a.OverseerTriggerThread Current znodeVersion 1, lastZnodeVersion -1
   [junit4]   2> 1037799 DEBUG (OverseerAutoScalingTriggerThread-72954269373825028-127.0.0.1:40048_solr-n_0000000000) [    ] o.a.s.c.a.OverseerTriggerThread Processed trigger updates upto znodeVersion 1
   [junit4]   2> 1037872 INFO  (OverseerStateUpdate-72954269373825028-127.0.0.1:40048_solr-n_0000000000) [    ] o.a.s.c.c.ZkStateReader Updated live nodes from ZooKeeper... (0) -> (1)
   [junit4]   2> 1037888 INFO  (zkCallback-835-thread-1) [    ] o.a.s.c.c.ZkStateReader Updated live nodes from ZooKeeper... (0) -> (1)
   [junit4]   2> 1037962 DEBUG (OverseerAutoScalingTriggerThread-72954269373825028-127.0.0.1:40048_solr-n_0000000000) [    ] o.a.s.c.a.NodeLostTrigger NodeLostTrigger .auto_add_replicas - Initial livenodes: [127.0.0.1:40048_solr]
   [junit4]   2> 1037963 DEBUG (ScheduledTrigger-1509-thread-1) [    ] o.a.s.c.a.NodeLostTrigger Running NodeLostTrigger: .auto_add_replicas with currently live nodes: 1
   [junit4]   2> 1037998 DEBUG (OverseerAutoScalingTriggerThread-72954269373825028-127.0.0.1:40048_solr-n_0000000000) [    ] o.a.s.c.a.OverseerTriggerThread -- clean old nodeAdded markers
   [junit4]   2> 1037998 DEBUG (OverseerAutoScalingTriggerThread-72954269373825028-127.0.0.1:40048_solr-n_0000000000) [    ] o.a.s.c.a.OverseerTriggerThread Current znodeVersion 1, lastZnodeVersion 1
   [junit4]   2> 1038073 INFO  (jetty-launcher-816-thread-1) [n:127.0.0.1:40048_solr    ] o.a.s.h.a.MetricsHistoryHandler No .system collection, keeping metrics history in memory.
   [junit4]   2> 1038198 INFO  (jetty-launcher-816-thread-1) [n:127.0.0.1:40048_solr    ] o.a.s.m.r.SolrJmxReporter JMX monitoring for 'solr_40048.solr.node' (registry 'solr.node') enabled at server: com.sun.jmx.mbeanserver.JmxMBeanServer@24048d84
   [junit4]   2> 1038234 INFO  (jetty-launcher-816-thread-1) [n:127.0.0.1:40048_solr    ] o.a.s.m.r.SolrJmxReporter JMX monitoring for 'solr_40048.solr.jvm' (registry 'solr.jvm') enabled at server: com.sun.jmx.mbeanserver.JmxMBeanServer@24048d84
   [junit4]   2> 1038234 INFO  (jetty-launcher-816-thread-1) [n:127.0.0.1:40048_solr    ] o.a.s.m.r.SolrJmxReporter JMX monitoring for 'solr_40048.solr.jetty' (registry 'solr.jetty') enabled at server: com.sun.jmx.mbeanserver.JmxMBeanServer@24048d84
   [junit4]   2> 1038235 INFO  (jetty-launcher-816-thread-1) [n:127.0.0.1:40048_solr    ] o.a.s.c.CorePropertiesLocator Found 0 core definitions underneath /home/jenkins/jenkins-slave/workspace/Lucene-Solr-Tests-master/solr/build/solr-core/test/J2/temp/solr.cloud.autoscaling.ScheduledTriggerIntegrationTest_933DC23F75D426F1-001/tempDir-001/node2/.
   [junit4]   2> 1038856 INFO  (jetty-launcher-816-thread-2) [    ] o.a.s.c.ZkContainer Zookeeper client=127.0.0.1:46215/solr
   [junit4]   2> 1038926 INFO  (zkConnectionManagerCallback-841-thread-1) [    ] o.a.s.c.c.ConnectionManager zkClient has connected
   [junit4]   2> 1039087 INFO  (zkConnectionManagerCallback-843-thread-1) [    ] o.a.s.c.c.ConnectionManager zkClient has connected
   [junit4]   2> 1039147 DEBUG (ScheduledTrigger-1509-thread-2) [    ] o.a.s.c.a.NodeLostTrigger Running NodeLostTrigger: .auto_add_replicas with currently live nodes: 1
   [junit4]   2> 1039149 INFO  (jetty-launcher-816-thread-2) [n:127.0.0.1:40218_solr    ] o.a.s.c.c.ZkStateReader Updated live nodes from ZooKeeper... (0) -> (1)
   [junit4]   2> 1039188 INFO  (jetty-launcher-816-thread-2) [n:127.0.0.1:40218_solr    ] o.a.s.c.Overseer Overseer (id=null) closing
   [junit4]   2> 1039190 INFO  (jetty-launcher-816-thread-2) [n:127.0.0.1:40218_solr    ] o.a.s.c.TransientSolrCoreCacheDefault Allocating transient cache for 2147483647 transient cores
   [junit4]   2> 1039191 INFO  (jetty-launcher-816-thread-2) [n:127.0.0.1:40218_solr    ] o.a.s.c.ZkController Register node as live in ZooKeeper:/live_nodes/127.0.0.1:40218_solr
   [junit4]   2> 1039245 INFO  (zkCallback-835-thread-1) [    ] o.a.s.c.c.ZkStateReader Updated live nodes from ZooKeeper... (1) -> (2)
   [junit4]   2> 1039265 INFO  (zkCallback-828-thread-2) [    ] o.a.s.c.c.ZkStateReader Updated live nodes from ZooKeeper... (1) -> (2)
   [junit4]   2> 1039317 INFO  (zkCallback-842-thread-1) [    ] o.a.s.c.c.ZkStateReader Updated live nodes from ZooKeeper... (1) -> (2)
   [junit4]   2> 1039348 INFO  (zkConnectionManagerCallback-850-thread-1) [    ] o.a.s.c.c.ConnectionManager zkClient has connected
   [junit4]   2> 1039348 INFO  (jetty-launcher-816-thread-2) [n:127.0.0.1:40218_solr    ] o.a.s.c.c.ZkStateReader Updated live nodes from ZooKeeper... (0) -> (2)
   [junit4]   2> 1039366 INFO  (jetty-launcher-816-thread-2) [n:127.0.0.1:40218_solr    ] o.a.s.c.s.i.ZkClientClusterStateProvider Cluster at 127.0.0.1:46215/solr ready
   [junit4]   2> 1039375 INFO  (jetty-launcher-816-thread-2) [n:127.0.0.1:40218_solr    ] o.a.s.h.a.MetricsHistoryHandler No .system collection, keeping metrics history in memory.
   [junit4]   2> 1039510 INFO  (jetty-launcher-816-thread-2) [n:127.0.0.1:40218_solr    ] o.a.s.m.r.SolrJmxReporter JMX monitoring for 'solr_40218.solr.node' (registry 'solr.node') enabled at server: com.sun.jmx.mbeanserver.JmxMBeanServer@24048d84
   [junit4]   2> 1039582 INFO  (jetty-launcher-816-thread-2) [n:127.0.0.1:40218_solr    ] o.a.s.m.r.SolrJmxReporter JMX monitoring for 'solr_40218.solr.jvm' (registry 'solr.jvm') enabled at server: com.sun.jmx.mbeanserver.JmxMBeanServer@24048d84
   [junit4]   2> 1039582 INFO  (jetty-launcher-816-thread-2) [n:127.0.0.1:40218_solr    ] o.a.s.m.r.SolrJmxReporter JMX monitoring for 'solr_40218.solr.jetty' (registry 'solr.jetty') enabled at server: com.sun.jmx.mbeanserver.JmxMBeanServer@24048d84
   [junit4]   2> 1039584 INFO  (jetty-launcher-816-thread-2) [n:127.0.0.1:40218_solr    ] o.a.s.c.CorePropertiesLocator Found 0 core definitions underneath /home/jenkins/jenkins-slave/workspace/Lucene-Solr-Tests-master/solr/build/solr-core/test/J2/temp/solr.cloud.autoscaling.ScheduledTriggerIntegrationTest_933DC23F75D426F1-001/tempDir-001/node1/.
   [junit4]   2> 1039939 INFO  (zkConnectionManagerCallback-853-thread-1) [    ] o.a.s.c.c.ConnectionManager zkClient has connected
   [junit4]   2> 1040049 INFO  (zkConnectionManagerCallback-858-thread-1) [    ] o.a.s.c.c.ConnectionManager zkClient has connected
   [junit4]   2> 1040050 INFO  (SUITE-ScheduledTriggerIntegrationTest-seed#[933DC23F75D426F1]-worker) [    ] o.a.s.c.c.ZkStateReader Updated live nodes from ZooKeeper... (0) -> (2)
   [junit4]   2> 1040050 INFO  (SUITE-ScheduledTriggerIntegrationTest-seed#[933DC23F75D426F1]-worker) [    ] o.a.s.c.s.i.ZkClientClusterStateProvider Cluster at 127.0.0.1:46215/solr ready
   [junit4]   2> 1040217 DEBUG (ScheduledTrigger-1509-thread-3) [    ] o.a.s.c.a.NodeLostTrigger Running NodeLostTrigger: .auto_add_replicas with currently live nodes: 2
   [junit4]   2> 1040437 INFO  (qtp1993298941-4487) [n:127.0.0.1:40048_solr    ] o.a.s.s.HttpSolrCall [admin] webapp=null path=/admin/metrics params={prefix=CONTAINER.fs.usableSpace,CORE.coreName&wt=javabin&version=2&group=solr.node,solr.core} status=0 QTime=0
   [junit4]   2> 1040575 INFO  (qtp1623350403-4477) [n:127.0.0.1:40218_solr    ] o.a.s.s.HttpSolrCall [admin] webapp=null path=/admin/metrics params={prefix=CONTAINER.fs.usableSpace,CORE.coreName&wt=javabin&version=2&group=solr.node,solr.core} status=0 QTime=0
   [junit4]   2> 1040575 DEBUG (qtp1993298941-4491) [n:127.0.0.1:40048_solr    ] o.a.s.c.a.AutoScalingHandler Verified autoscaling configuration
   [junit4]   2> 1040589 INFO  (qtp1993298941-4491) [n:127.0.0.1:40048_solr    ] o.a.s.s.HttpSolrCall [admin] webapp=null path=/admin/autoscaling params={wt=javabin&version=2} status=0 QTime=249
   [junit4]   2> 1040641 DEBUG (zkCallback-835-thread-1) [    ] o.a.s.c.a.OverseerTriggerThread Refreshing /autoscaling.json with znode version 2
   [junit4]   2> 1040644 DEBUG (OverseerAutoScalingTriggerThread-72954269373825028-127.0.0.1:40048_solr-n_0000000000) [    ] o.a.s.c.a.OverseerTriggerThread Processed trigger updates upto znodeVersion 2
   [junit4]   2> 1040699 INFO  (TEST-ScheduledTriggerIntegrationTest.testScheduledTrigger-seed#[933DC23F75D426F1]) [    ] o.a.s.SolrTestCaseJ4 ###Starting testScheduledTrigger
   [junit4]   2> 1040700 DEBUG (OverseerAutoScalingTriggerThread-72954269373825028-127.0.0.1:40048_solr-n_0000000000) [    ] o.a.s.c.a.OverseerTriggerThread -- clean old nodeAdded markers
   [junit4]   2> 1040700 DEBUG (OverseerAutoScalingTriggerThread-72954269373825028-127.0.0.1:40048_solr-n_0000000000) [    ] o.a.s.c.a.OverseerTriggerThread Current znodeVersion 2, lastZnodeVersion 2
   [junit4]   2> 1040701 INFO  (qtp1993298941-4493) [n:127.0.0.1:40048_solr    ] o.a.s.h.a.CollectionsHandler Invoked Collection Action :create with params pullReplicas=0&maxShardsPerNode=5&name=testScheduledTrigger&nrtReplicas=3&action=CREATE&numShards=1&tlogReplicas=0&wt=javabin&version=2 and sendToOCPQueue=true
   [junit4]   2> 1040753 INFO  (OverseerThreadFactory-1511-thread-1) [    ] o.a.s.c.a.c.CreateCollectionCmd Create collection testScheduledTrigger
   [junit4]   2> 1040827 INFO  (OverseerThreadFactory-1511-thread-1) [    ] o.a.s.c.c.ZkConfigManager Copying zk node /configs/_default/protwords.txt to /configs/testScheduledTrigger.AUTOCREATED/protwords.txt
   [junit4]   2> 1040897 INFO  (OverseerThreadFactory-1511-thread-1) [    ] o.a.s.c.c.ZkConfigManager Copying zk node /configs/_default/managed-schema to /configs/testScheduledTrigger.AUTOCREATED/managed-schema
   [junit4]   2> 1040899 INFO  (OverseerThreadFactory-1511-thread-1) [    ] o.a.s.c.c.ZkConfigManager Copying zk node /configs/_default/solrconfig.xml to /configs/testScheduledTrigger.AUTOCREATED/solrconfig.xml
   [junit4]   2> 1040901 INFO  (OverseerThreadFactory-1511-thread-1) [    ] o.a.s.c.c.ZkConfigManager Copying zk node /configs/_default/synonyms.txt to /configs/testScheduledTrigger.AUTOCREATED/synonyms.txt
   [junit4]   2> 1040902 INFO  (OverseerThreadFactory-1511-thread-1) [    ] o.a.s.c.c.ZkConfigManager Copying zk node /configs/_default/stopwords.txt to /configs/testScheduledTrigger.AUTOCREATED/stopwords.txt
   [junit4]   2> 1040903 INFO  (OverseerThreadFactory-1511-thread-1) [    ] o.a.s.c.c.ZkConfigManager Copying zk node /configs/_default/params.json to /configs/testScheduledTrigger.AUTOCREATED/params.json
   [junit4]   2> 1040904 INFO  (OverseerThreadFactory-1511-thread-1) [    ] o.a.s.c.c.ZkConfigManager Copying zk node /configs/_default/lang/contractions_it.txt to /configs/testScheduledTrigger.AUTOCREATED/lang/contractions_it.txt
   [junit4]   2> 1040932 INFO  (OverseerThreadFactory-1511-thread-1) [    ] o.a.s.c.c.ZkConfigManager Copying zk node /configs/_default/lang/stopwords_no.txt to /configs/testScheduledTrigger.AUTOCREATED/lang/stopwords_no.txt
   [junit4]   2> 1040951 INFO  (OverseerThreadFactory-1511-thread-1) [    ] o.a.s.c.c.ZkConfigManager Copying zk node /configs/_default/lang/stopwords_hy.txt to /configs/testScheduledTrigger.AUTOCREATED/lang/stopwords_hy.txt
   [junit4]   2> 1040987 INFO  (OverseerThreadFactory-1511-thread-1) [    ] o.a.s.c.c.ZkConfigManager Copying zk node /configs/_default/lang/stemdict_nl.txt to /configs/testScheduledTrigger.AUTOCREATED/lang/stemdict_nl.txt
   [junit4]   2> 1040989 INFO  (OverseerThreadFactory-1511-thread-1) [    ] o.a.s.c.c.ZkConfigManager Copying zk node /configs/_default/lang/contractions_ca.txt to /configs/testScheduledTrigger.AUTOCREATED/lang/contractions_ca.txt
   [junit4]   2> 1041003 INFO  (OverseerThreadFactory-1511-thread-1) [    ] o.a.s.c.c.ZkConfigManager Copying zk node /configs/_default/lang/stopwords_id.txt to /configs/testScheduledTrigger.AUTOCREATED/lang/stopwords_id.txt
   [junit4]   2> 1041004 INFO  (OverseerThreadFactory-1511-thread-1) [    ] o.a.s.c.c.ZkConfigManager Copying zk node /configs/_default/lang/stopwords_ga.txt to /configs/testScheduledTrigger.AUTOCREATED/lang/stopwords_ga.txt
   [junit4]   2> 1041006 INFO  (OverseerThreadFactory-1511-thread-1) [    ] o.a.s.c.c.ZkConfigManager Copying zk node /configs/_default/lang/stopwords_da.txt to /configs/testScheduledTrigger.AUTOCREATED/lang/stopwords_da.txt
   [junit4]   2> 1041041 INFO  (OverseerThreadFactory-1511-thread-1) [    ] o.a.s.c.c.ZkConfigManager Copying zk node /configs/_default/lang/stopwords_hi.txt to /configs/testScheduledTrigger.AUTOCREATED/lang/stopwords_hi.txt
   [junit4]   2> 1041043 INFO  (OverseerThreadFactory-1511-thread-1) [    ] o.a.s.c.c.ZkConfigManager Copying zk node /configs/_default/lang/stopwords_ja.txt to /configs/testScheduledTrigger.AUTOCREATED/lang/stopwords_ja.txt
   [junit4]   2> 1041077 INFO  (OverseerThreadFactory-1511-thread-1) [    ] o.a.s.c.c.ZkConfigManager Copying zk node /configs/_default/lang/stopwords_pt.txt to /configs/testScheduledTrigger.AUTOCREATED/lang/stopwords_pt.txt
   [junit4]   2> 1041079 INFO  (OverseerThreadFactory-1511-thread-1) [    ] o.a.s.c.c.ZkConfigManager Copying zk node /configs/_default/lang/stopwords_hu.txt to /configs/testScheduledTrigger.AUTOCREATED/lang/stopwords_hu.txt
   [junit4]   2> 1041113 INFO  (OverseerThreadFactory-1511-thread-1) [    ] o.a.s.c.c.ZkConfigManager Copying zk node /configs/_default/lang/stopwords_el.txt to /configs/testScheduledTrigger.AUTOCREATED/lang/stopwords_el.txt
   [junit4]   2> 1041115 INFO  (OverseerThreadFactory-1511-thread-1) [    ] o.a.s.c.c.ZkConfigManager Copying zk node /configs/_default/lang/stopwords_ru.txt to /configs/testScheduledTrigger.AUTOCREATED/lang/stopwords_ru.txt
   [junit4]   2> 1041133 INFO  (OverseerThreadFactory-1511-thread-1) [    ] o.a.s.c.c.ZkConfigManager Copying zk node /configs/_default/lang/stopwords_tr.txt to /configs/testScheduledTrigger.AUTOCREATED/lang/stopwords_tr.txt
   [junit4]   2> 1041134 INFO  (OverseerThreadFactory-1511-thread-1) [    ] o.a.s.c.c.ZkConfigManager Copying zk node /configs/_default/lang/stopwords_ar.txt to /configs/testScheduledTrigger.AUTOCREATED/lang/stopwords_ar.txt
   [junit4]   2> 1041210 INFO  (OverseerThreadFactory-1511-thread-1) [    ] o.a.s.c.c.ZkConfigManager Copying zk node /configs/_default/lang/userdict_ja.txt to /configs/testScheduledTrigger.AUTOCREATED/lang/userdict_ja.txt
   [junit4]   2> 1041218 DEBUG (ScheduledTrigger-1509-thread-3) [    ] o.a.s.c.a.NodeLostTrigger Running NodeLostTrigger: .auto_add_replicas with currently live nodes: 2
   [junit4]   2> 1041262 INFO  (OverseerThreadFactory-1511-thread-1) [    ] o.a.s.c.c.ZkConfigManager Copying zk node /configs/_default/lang/stopwords_it.txt to /configs/testScheduledTrigger.AUTOCREATED/lang/stopwords_it.txt
   [junit4]   2> 1041301 INFO  (OverseerThreadFactory-1511-thread-1) [    ] o.a.s.c.c.ZkConfigManager Copying zk node /configs/_default/lang/stopwords_eu.txt to /configs/testScheduledTrigger.AUTOCREATED/lang/stopwords_eu.txt
   [junit4]   2> 1041302 INFO  (OverseerThreadFactory-1511-thread-1) [    ] o.a.s.c.c.ZkConfigManager Copying zk node /configs/_default/lang/stopwords_cz.txt to /configs/testScheduledTrigger.AUTOCREATED/lang/stopwords_cz.txt
   [junit4]   2> 1041304 INFO  (OverseerThreadFactory-1511-thread-1) [    ] o.a.s.c.c.ZkConfigManager Copying zk node /configs/_default/lang/stoptags_ja.txt to /configs/testScheduledTrigger.AUTOCREATED/lang/stoptags_ja.txt
   [junit4]   2> 1041305 INFO  (OverseerThreadFactory-1511-thread-1) [    ] o.a.s.c.c.ZkConfigManager Copying zk node /configs/_default/lang/contractions_fr.txt to /configs/testScheduledTrigger.AUTOCREATED/lang/contractions_fr.txt
   [junit4]   2> 1041306 INFO  (OverseerThreadFactory-1511-thread-1) [    ] o.a.s.c.c.ZkConfigManager Copying zk node /configs/_default/lang/stopwords_fa.txt to /configs/testScheduledTrigger.AUTOCREATED/lang/stopwords_fa.txt
   [junit4]   2> 1041326 INFO  (OverseerThreadFactory-1511-thread-1) [    ] o.a.s.c.c.ZkConfigManager Copying zk node /configs/_default/lang/stopwords_de.txt to /configs/testScheduledTrigger.AUTOCREATED/lang/stopwords_de.txt
   [junit4]   2> 1041327 INFO  (OverseerThreadFactory-1511-thread-1) [    ] o.a.s.c.c.ZkConfigManager Copying zk node /configs/_default/lang/contractions_ga.txt to /configs/testScheduledTrigger.AUTOCREATED/lang/contractions_ga.txt
   [junit4]   2> 1041340 INFO  (OverseerThreadFactory-1511-thread-1) [    ] o.a.s.c.c.ZkConfigManager Copying zk node /configs/_default/lang/stopwords_ca.txt to /configs/testScheduledTrigger.AUTOCREATED/lang/stopwords_ca.txt
   [junit4]   2> 1041342 INFO  (OverseerThreadFactory-1511-thread-1) [    ] o.a.s.c.c.ZkConfigManager Copying zk node /configs/_default/lang/stopwords_nl.txt to /configs/testScheduledTrigger.AUTOCREATED/lang/stopwords_nl.txt
   [junit4]   2> 1041343 INFO  (OverseerThreadFactory-1511-thread-1) [    ] o.a.s.c.c.ZkConfigManager Copying zk node /configs/_default/lang/stopwords_bg.txt to /configs/testScheduledTrigger.AUTOCREATED/lang/stopwords_bg.txt
   [junit4]   2> 1041362 INFO  (OverseerThreadFactory-1511-thread-1) [    ] o.a.s.c.c.ZkConfigManager Copying zk node /configs/_default/lang/stopwords_es.txt to /configs/testScheduledTrigger.AUTOCREATED/lang/stopwords_es.txt
   [junit4]   2> 1041363 INFO  (OverseerThreadFactory-1511-thread-1) [    ] o.a.s.c.c.ZkConfigManager Copying zk node /configs/_default/lang/stopwords_en.txt to /configs/testScheduledTrigger.AUTOCREATED/lang/stopwords_en.txt
   [junit4]   2> 1041376 INFO  (OverseerThreadFactory-1511-thread-1) [    ] o.a.s.c.c.ZkConfigManager Copying zk node /configs/_default/lang/stopwords_lv.txt to /configs/testScheduledTrigger.AUTOCREATED/lang/stopwords_lv.txt
   [junit4]   2> 1041377 INFO  (OverseerThreadFactory-1511-thread-1) [    ] o.a.s.c.c.ZkConfigManager Copying zk node /configs/_default/lang/stopwords_th.txt to /configs/testScheduledTrigger.AUTOCREATED/lang/stopwords_th.txt
   [junit4]   2> 1041379 INFO  (OverseerThreadFactory-1511-thread-1) [    ] o.a.s.c.c.ZkConfigManager Copying zk node /configs/_default/lang/stopwords_ro.txt to /configs/testScheduledTrigger.AUTOCREATED/lang/stopwords_ro.txt
   [junit4]   2> 1041380 INFO  (OverseerThreadFactory-1511-thread-1) [    ] o.a.s.c.c.ZkConfigManager Copying zk node /configs/_default/lang/stopwords_fr.txt to /configs/testScheduledTrigger.AUTOCREATED/lang/stopwords_fr.txt
   [junit4]   2> 1041398 INFO  (OverseerThreadFactory-1511-thread-1) [    ] o.a.s.c.c.ZkConfigManager Copying zk node /configs/_default/lang/stopwords_sv.txt to /configs/testScheduledTrigger.AUTOCREATED/lang/stopwords_sv.txt
   [junit4]   2> 1041400 INFO  (OverseerThreadFactory-1511-thread-1) [    ] o.a.s.c.c.ZkConfigManager Copying zk node /configs/_default/lang/stopwords_fi.txt to /configs/testScheduledTrigger.AUTOCREATED/lang/stopwords_fi.txt
   [junit4]   2> 1041426 INFO  (OverseerThreadFactory-1511-thread-1) [    ] o.a.s.c.c.ZkConfigManager Copying zk node /configs/_default/lang/hyphenations_ga.txt to /configs/testScheduledTrigger.AUTOCREATED/lang/hyphenations_ga.txt
   [junit4]   2> 1041428 INFO  (OverseerThreadFactory-1511-thread-1) [    ] o.a.s.c.c.ZkConfigManager Copying zk node /configs/_default/lang/stopwords_gl.txt to /configs/testScheduledTrigger.AUTOCREATED/lang/stopwords_gl.txt
   [junit4]   2> 1041446 WARN  (OverseerThreadFactory-1511-thread-1) [    ] o.a.s.c.a.c.CreateCollectionCmd Specified number of replicas of 3 on collection testScheduledTrigger is higher than the number of Solr instances currently live or live and part of your createNodeSet(2). It's unusual to run two replica of the same slice on the same Solr-instance.
   [junit4]   2> 1041766 INFO  (OverseerStateUpdate-72954269373825028-127.0.0.1:40048_solr-n_0000000000) [    ] o.a.s.c.o.SliceMutator createReplica() {
   [junit4]   2>   "operation":"ADDREPLICA",
   [junit4]   2>   "collection":"testScheduledTrigger",
   [junit4]   2>   "shard":"shard1",
   [junit4]   2>   "core":"testScheduledTrigger_shard1_replica_n1",
   [junit4]   2>   "state":"down",
   [junit4]   2>   "base_url":"https://127.0.0.1:40048/solr",
   [junit4]   2>   "type":"NRT",
   [junit4]   2>   "waitForFinalState":"false"}
   [junit4]   2> 1041982 INFO  (OverseerStateUpdate-72954269373825028-127.0.0.1:40048_solr-n_0000000000) [    ] o.a.s.c.o.SliceMutator createReplica() {
   [junit4]   2>   "operation":"ADDREPLICA",
   [junit4]   2>   "collection":"testScheduledTrigger",
   [junit4]   2>   "shard":"shard1",
   [junit4]   2>   "core":"testScheduledTrigger_shard1_replica_n2",
   [junit4]   2>   "state":"down",
   [junit4]   2>   "base_url":"https://127.0.0.1:40218/solr",
   [junit4]   2>   "type":"NRT",
   [junit4]   2>   "waitForFinalState":"false"}
   [junit4]   2> 1042128 INFO  (OverseerStateUpdate-72954269373825028-127.0.0.1:40048_solr-n_0000000000) [    ] o.a.s.c.o.SliceMutator createReplica() {
   [junit4]   2>   "operation":"ADDREPLICA",
   [junit4]   2>   "collection":"testScheduledTrigger",
   [junit4]   2>   "shard":"shard1",
   [junit4]   2>   "core":"testScheduledTrigger_shard1_replica_n4",
   [junit4]   2>   "state":"down",
   [junit4]   2>   "base_url":"https://127.0.0.1:40048/solr",
   [junit4]   2>   "type":"NRT",
   [junit4]   2>   "waitForFinalState":"false"}
   [junit4]   2> 1042229 DEBUG (ScheduledTrigger-1509-thread-3) [    ] o.a.s.c.a.NodeLostTrigger Running NodeLostTrigger: .auto_add_replicas with currently live nodes: 2
   [junit4]   2> 1042524 INFO  (qtp1993298941-4491) [n:127.0.0.1:40048_solr    x:testScheduledTrigger_shard1_replica_n1] o.a.s.h.a.CoreAdminOperation core create command qt=/admin/cores&coreNodeName=core_node3&collection.configName=testScheduledTrigger.AUTOCREATED&newCollection=true&name=testScheduledTrigger_shard1_replica_n1&action=CREATE&numShards=1&collection=testScheduledTrigger&shard=shard1&wt=javabin&version=2&replicaType=NRT
   [junit4]   2> 1042524 INFO  (qtp1993298941-4491) [n:127.0.0.1:40048_solr    x:testScheduledTrigger_shard1_replica_n1] o.a.s.c.TransientSolrCoreCacheDefault Allocating transient cache for 2147483647 transient cores
   [junit4]   2> 1042629 INFO  (qtp1993298941-4492) [n:127.0.0.1:40048_solr    x:testScheduledTrigger_shard1_replica_n4] o.a.s.h.a.CoreAdminOperation core create command qt=/admin/cores&coreNodeName=core_node6&collection.configName=testScheduledTrigger.AUTOCREATED&newCollection=true&name=testScheduledTrigger_shard1_replica_n4&action=CREATE&numShards=1&collection=testScheduledTrigger&shard=shard1&wt=javabin&version=2&replicaType=NRT
   [junit4]   2> 1042707 INFO  (qtp1623350403-4482) [n:127.0.0.1:40218_solr    x:testScheduledTrigger_shard1_replica_n2] o.a.s.h.a.CoreAdminOperation core create command qt=/admin/cores&coreNodeName=core_node5&collection.configName=testScheduledTrigger.AUTOCREATED&newCollection=true&name=testScheduledTrigger_shard1_replica_n2&action=CREATE&numShards=1&collection=testScheduledTrigger&shard=shard1&wt=javabin&version=2&replicaType=NRT
   [junit4]   2> 1043237 DEBUG (ScheduledTrigger-1509-thread-3) [    ] o.a.s.c.a.NodeLostTrigger Running NodeLostTrigger: .auto_add_replicas with currently live nodes: 2
   [junit4]   2> 1043784 INFO  (qtp1993298941-4492) [n:127.0.0.1:40048_solr c:testScheduledTrigger s:shard1 r:core_node6 x:testScheduledTrigger_shard1_replica_n4] o.a.s.c.RequestParams conf resource params.json loaded . version : 0
   [junit4]   2> 1043839 INFO  (qtp1993298941-4492) [n:127.0.0.1:40048_solr c:testScheduledTrigger s:shard1 r:core_node6 x:testScheduledTrigger_shard1_replica_n4] o.a.s.c.RequestParams request params refreshed to version 0
   [junit4]   2> 1043841 WARN  (qtp1993298941-4492) [n:127.0.0.1:40048_solr c:testScheduledTrigger s:shard1 r:core_node6 x:testScheduledTrigger_shard1_replica_n4] o.a.s.c.SolrConfig Couldn't add files from /home/jenkins/jenkins-slave/workspace/Lucene-Solr-Tests-master/solr/build/solr-core/test/J2/temp/solr.cloud.autoscaling.ScheduledTriggerIntegrationTest_933DC23F75D426F1-001/tempDir-001/node2/testScheduledTrigger_shard1_replica_n4/../../../../contrib/extraction/lib filtered by .*\.jar to classpath: /home/jenkins/jenkins-slave/workspace/Lucene-Solr-Tests-master/solr/build/solr-core/test/J2/temp/solr.cloud.autoscaling.ScheduledTriggerIntegrationTest_933DC23F75D426F1-001/tempDir-001/node2/testScheduledTrigger_shard1_replica_n4/../../../../contrib/extraction/lib
   [junit4]   2> 1043842 WARN  (qtp1993298941-4492) [n:127.0.0.1:40048_solr c:testScheduledTrigger s:shard1 r:core_node6 x:testScheduledTrigger_shard1_replica_n4] o.a.s.c.SolrConfig Couldn't add files from /home/jenkins/jenkins-slave/workspace/Lucene-Solr-Tests-master/solr/build/solr-core/test/J2/temp/solr.cloud.autoscaling.ScheduledTriggerIntegrationTest_933DC23F75D426F1-001/tempDir-001/node2/testScheduledTrigger_shard1_replica_n4/../../../../dist filtered by solr-cell-\d.*\.jar to classpath: /home/jenkins/jenkins-slave/workspace/Lucene-Solr-Tests-master/solr/build/solr-core/test/J2/temp/solr.cloud.autoscaling.ScheduledTriggerIntegrationTest_933DC23F75D426F1-001/tempDir-001/node2/testScheduledTrigger_shard1_replica_n4/../../../../dist
   [junit4]   2> 1043842 WARN  (qtp1993298941-4492) [n:127.0.0.1:40048_solr c:testScheduledTrigger s:shard1 r:core_node6 x:testScheduledTrigger_shard1_replica_n4] o.a.s.c.SolrConfig Couldn't add files from /home/jenkins/jenkins-slave/workspace/Lucene-Solr-Tests-master/solr/build/solr-core/test/J2/temp/solr.cloud.autoscaling.ScheduledTriggerIntegrationTest_933DC23F75D426F1-001/tempDir-001/node2/testScheduledTrigger_shard1_replica_n4/../../../../contrib/clustering/lib filtered by .*\.jar to classpath: /home/jenkins/jenkins-slave/workspace/Lucene-Solr-Tests-master/solr/build/solr-core/test/J2/temp/solr.cloud.autoscaling.ScheduledTriggerIntegrationTest_933DC23F75D426F1-001/tempDir-001/node2/testScheduledTrigger_shard1_replica_n4/../../../../contrib/clustering/lib
   [junit4]   2> 1043842 WARN  (qtp1993298941-4492) [n:127.0.0.1:40048_solr c:testScheduledTrigger s:shard1 r:core_node6 x:testScheduledTrigger_shard1_replica_n4] o.a.s.c.SolrConfig Couldn't add files from /home/jenkins/jenkins-slave/workspace/Lucene-Solr-Tests-master/solr/build/solr-core/test/J2/temp/solr.cloud.autoscaling.ScheduledTriggerIntegrationTest_933DC23F75D426F1-001/tempDir-001/node2/testScheduledTrigger_shard1_replica_n4/../../../../dist filtered by solr-clustering-\d.*\.jar to classpath: /home/jenkins/jenkins-slave/workspace/Lucene-Solr-Tests-master/solr/build/solr-core/test/J2/temp/solr.cloud.autoscaling.ScheduledTriggerIntegrationTest_933DC23F75D426F1-001/tempDir-001/node2/testScheduledTrigger_shard1_replica_n4/../../../../dist
   [junit4]   2> 1043842 WARN  (qtp1993298941-4492) [n:127.0.0.1:40048_solr c:testScheduledTrigger s:shard1 r:core_node6 x:testScheduledTrigger_shard1_replica_n4] o.a.s.c.SolrConfig Couldn't add files from /home/jenkins/jenkins-slave/workspace/Lucene-Solr-Tests-master/solr/build/solr-core/test/J2/temp/solr.cloud.autoscaling.ScheduledTriggerIntegrationTest_933DC23F75D426F1-001/tempDir-001/node2/testScheduledTrigger_shard1_replica_n4/../../../../contrib/langid/lib filtered by .*\.jar to classpath: /home/jenkins/jenkins-slave/workspace/Lucene-Solr-Tests-master/solr/build/solr-core/test/J2/temp/solr.cloud.autoscaling.ScheduledTriggerIntegrationTest_933DC23F75D426F1-001/tempDir-001/node2/testScheduledTrigger_shard1_replica_n4/../../../../contrib/langid/lib
   [junit4]   2> 1043842 WARN  (qtp1993298941-4492) [n:127.0.0.1:40048_solr c:testScheduledTrigger s:shard1 r:core_node6 x:testScheduledTrigger_shard1_replica_n4] o.a.s.c.SolrConfig Couldn't add files from /home/jenkins/jenkins-slave/workspace/Lucene-Solr-Tests-master/solr/build/solr-core/test/J2/temp/solr.cloud.autoscaling.ScheduledTriggerIntegrationTest_933DC23F75D426F1-001/tempDir-001/node2/testScheduledTrigger_shard1_replica_n4/../../../../dist filtered by solr-langid-\d.*\.jar to classpath: /home/jenkins/jenkins-slave/workspace/Lucene-Solr-Tests-master/solr/build/solr-core/test/J2/temp/solr.cloud.autoscaling.ScheduledTriggerIntegrationTest_933DC23F75D426F1-001/tempDir-001/node2/testScheduledTrigger_shard1_replica_n4/../../../../dist
   [junit4]   2> 1043842 WARN  (qtp1993298941-4492) [n:127.0.0.1:40048_solr c:testScheduledTrigger s:shard1 r:core_node6 x:testScheduledTrigger_shard1_replica_n4] o.a.s.c.SolrConfig Couldn't add files from /home/jenkins/jenkins-slave/workspace/Lucene-Solr-Tests-master/solr/build/solr-core/test/J2/temp/solr.cloud.autoscaling.ScheduledTriggerIntegrationTest_933DC23F75D426F1-001/tempDir-001/node2/testScheduledTrigger_shard1_replica_n4/../../../../contrib/velocity/lib filtered by .*\.jar to classpath: /home/jenkins/jenkins-slave/workspace/Lucene-Solr-Tests-master/solr/build/solr-core/test/J2/temp/solr.cloud.autoscaling.ScheduledTriggerIntegrationTest_933DC23F75D426F1-001/tempDir-001/node2/testScheduledTrigger_shard1_replica_n4/../../../../contrib/velocity/lib
   [junit4]   2> 1043843 WARN  (qtp1993298941-4492) [n:127.0.0.1:40048_solr c:testScheduledTrigger s:shard1 r:core_node6 x:testScheduledTrigger_shard1_replica_n4] o.a.s.c.SolrConfig Couldn't add files from /home/jenkins/jenkins-slave/workspace/Lucene-Solr-Tests-master/solr/build/solr-core/test/J2/temp/solr.cloud.autoscaling.ScheduledTriggerIntegrationTest_933DC23F75D426F1-001/tempDir-001/node2/testScheduledTrigger_shard1_replica_n4/../../../../dist filtered by solr-velocity-\d.*\.jar to classpath: /home/jenkins/jenkins-slave/workspace/Lucene-Solr-Tests-master/solr/build/solr-core/test/J2/temp/solr.cloud.autoscaling.ScheduledTriggerIntegrationTest_933DC23F75D426F1-001/tempDir-001/node2/testScheduledTrigger_shard1_replica_n4/../../../../dist
   [junit4]   2> 1043843 WARN  (qtp1993298941-4492) [n:127.0.0.1:40048_solr c:testScheduledTrigger s:shard1 r:core_node6 x:testScheduledTrigger_shard1_replica_n4] o.a.s.c.SolrConfig Couldn't add files from /home/jenkins/jenkins-slave/workspace/Lucene-Solr-Tests-master/solr/build/solr-core/test/J2/temp/solr.cloud.autoscaling.ScheduledTriggerIntegrationTest_933DC23F75D426F1-001/tempDir-001/node2/testScheduledTrigger_shard1_replica_n4/../../../../dist filtered by solr-ltr-\d.*\.jar to classpath: /home/jenkins/jenkins-slave/workspace/Lucene-Solr-Tests-master/solr/build/solr-core/test/J2/temp/solr.cloud.autoscaling.ScheduledTriggerIntegrationTest_933DC23F75D426F1-001/tempDir-001/node2/testScheduledTrigger_shard1_replica_n4/../../../../dist
   [junit4]   2> 1043905 INFO  (qtp1993298941-4492) [n:127.0.0.1:40048_solr c:testScheduledTrigger s:shard1 r:core_node6 x:testScheduledTrigger_shard1_replica_n4] o.a.s.c.SolrConfig Using Lucene MatchVersion: 8.0.0
   [junit4]   2> 1043984 INFO  (qtp1993298941-4491) [n:127.0.0.1:40048_solr c:testScheduledTrigger s:shard1 r:core_node3 x:testScheduledTrigger_shard1_replica_n1] o.a.s.c.RequestParams conf resource params.json loaded . version : 0
   [junit4]   2> 1043984 INFO  (qtp1993298941-4491) [n:127.0.0.1:40048_solr c:testScheduledTrigger s:shard1 r:core_node3 x:testScheduledTrigger_shard1_replica_n1] o.a.s.c.RequestParams request params refreshed to version 0
   [junit4]   2> 1043985 WARN  (qtp1993298941-4491) [n:127.0.0.1:40048_solr c:testScheduledTrigger s:shard1 r:core_node3 x:testScheduledTrigger_shard1_replica_n1] o.a.s.c.SolrConfig Couldn't add files from /home/jenkins/jenkins-slave/workspace/Lucene-Solr-Tests-master/solr/build/solr-core/test/J2/temp/solr.cloud.autoscaling.ScheduledTriggerIntegrationTest_933DC23F75D426F1-001/tempDir-001/node2/testScheduledTrigger_shard1_replica_n1/../../../../contrib/extraction/lib filtered by .*\.jar to classpath: /home/jenkins/jenkins-slave/workspace/Lucene-Solr-Tests-master/solr/build/solr-core/test/J2/temp/solr.cloud.autoscaling.ScheduledTriggerIntegrationTest_933DC23F75D426F1-001/tempDir-001/node2/testScheduledTrigger_shard1_replica_n1/../../../../contrib/extraction/lib
   [junit4]   2> 1043985 WARN  (qtp1993298941-4491) [n:127.0.0.1:40048_solr c:testScheduledTrigger s:shard1 r:core_node3 x:testScheduledTrigger_shard1_replica_n1] o.a.s.c.SolrConfig Couldn't add files from /home/jenkins/jenkins-slave/workspace/Lucene-Solr-Tests-master/solr/build/solr-core/test/J2/temp/solr.cloud.autoscaling.ScheduledTriggerIntegrationTest_933DC23F75D426F1-001/tempDir-001/node2/testScheduledTrigger_shard1_replica_n1/../../../../dist filtered by solr-cell-\d.*\.jar to classpath: /home/jenkins/jenkins-slave/workspace/Lucene-Solr-Tests-master/solr/build/solr-core/test/J2/temp/solr.cloud.autoscaling.ScheduledTriggerIntegrationTest_933DC23F75D426F1-001/tempDir-001/node2/testScheduledTrigger_shard1_replica_n1/../../../../dist
   [junit4]   2> 1043985 WARN  (qtp1993298941-4491) [n:127.0.0.1:40048_solr c:testScheduledTrigger s:shard1 r:core_node3 x:testScheduledTrigger_shard1_replica_n1] o.a.s.c.SolrConfig Couldn't add files from /home/jenkins/jenkins-slave/workspace/Lucene-Solr-Tests-master/solr/build/solr-core/test/J2/temp/solr.cloud.autoscaling.ScheduledTriggerIntegrationTest_933DC23F75D426F1-001/tempDir-001/node2/testScheduledTrigger_shard1_replica_n1/../../../../contrib/clustering/lib filtered by .*\.jar to classpath: /home/jenkins/jenkins-slave/workspace/Lucene-Solr-Tests-master/solr/build/solr-core/test/J2/temp/solr.cloud.autoscaling.ScheduledTriggerIntegrationTest_933DC23F75D426F1-001/tempDir-001/node2/testScheduledTrigger_shard1_replica_n1/../../../../contrib/clustering/lib
   [junit4]   2> 1043985 WARN  (qtp1993298941-4491) [n:127.0.0.1:40048_solr c:testScheduledTrigger s:shard1 r:core_node3 x:testScheduledTrigger_shard1_replica_n1] o.a.s.c.SolrConfig Couldn't add files from /home/jenkins/jenkins-slave/workspace/Lucene-Solr-Tests-master/solr/build/solr-core/test/J2/temp/solr.cloud.autoscaling.ScheduledTriggerIntegrationTest_933DC23F75D426F1-001/tempDir-001/node2/testScheduledTrigger_shard1_replica_n1/../../../../dist filtered by solr-clustering-\d.*\.jar to classpath: /home/jenkins/jenkins-slave/workspace/Lucene-Solr-Tests-master/solr/build/solr-core/test/J2/temp/solr.cloud.autoscaling.ScheduledTriggerIntegrationTest_933DC23F75D426F1-001/tempDir-001/node2/testScheduledTrigger_shard1_replica_n1/../../../../dist
   [junit4]   2> 1043985 WARN  (qtp1993298941-4491) [n:127.0.0.1:40048_solr c:testScheduledTrigger s:shard1 r:core_node3 x:testScheduledTrigger_shard1_replica_n1] o.a.s.c.SolrConfig Couldn't add files from /home/jenkins/jenkins-slave/workspace/Lucene-Solr-Tests-master/solr/build/solr-core/test/J2/temp/solr.cloud.autoscaling.ScheduledTriggerIntegrationTest_933DC23F75D426F1-001/tempDir-001/node2/testScheduledTrigger_shard1_replica_n1/../../../../contrib/langid/lib filtered by .*\.jar to classpath: /home/jenkins/jenkins-slave/workspace/Lucene-Solr-Tests-master/solr/build/solr-core/test/J2/temp/solr.cloud.autoscaling.ScheduledTriggerIntegrationTest_933DC23F75D426F1-001/tempDir-001/node2/testScheduledTrigger_shard1_replica_n1/../../../../contrib/langid/lib
   [junit4]   2> 1043985 WARN  (qtp1993298941-4491) [n:127.0.0.1:40048_solr c:testScheduledTrigger s:shard1 r:core_node3 x:testScheduledTrigger_shard1_replica_n1] o.a.s.c.SolrConfig Couldn't add files from /home/jenkins/jenkins-slave/workspace/Lucene-Solr-Tests-master/solr/build/solr-core/test/J2/temp/solr.cloud.autoscaling.ScheduledTriggerIntegrationTest_933DC23F75D426F1-001/tempDir-001/node2/testScheduledTrigger_shard1_replica_n1/../../../../dist filtered by solr-langid-\d.*\.jar to classpath: /home/jenkins/jenkins-slave/workspace/Lucene-Solr-Tests-master/solr/build/solr-core/test/J2/temp/solr.cloud.autoscaling.ScheduledTriggerIntegrationTest_933DC23F75D426F1-001/tempDir-001/node2/testScheduledTrigger_shard1_replica_n1/../../../../dist
   [junit4]   2> 1043986 WARN  (qtp1993298941-4491) [n:127.0.0.1:40048_solr c:testScheduledTrigger s:shard1 r:core_node3 x:testScheduledTrigger_shard1_replica_n1] o.a.s.c.SolrConfig Couldn't add files from /home/jenkins/jenkins-slave/workspace/Lucene-Solr-Tests-master/solr/build/solr-core/test/J2/temp/solr.cloud.autoscaling.ScheduledTriggerIntegrationTest_933DC23F75D426F1-001/tempDir-001/node2/testScheduledTrigger_shard1_replica_n1/../../../../contrib/velocity/lib filtered by .*\.jar to classpath: /home/jenkins/jenkins-slave/workspace/Lucene-Solr-Tests-master/solr/build/solr-core/test/J2/temp/solr.cloud.autoscaling.ScheduledTriggerIntegrationTest_933DC23F75D426F1-001/tempDir-001/node2/testScheduledTrigger_shard1_replica_n1/../../../../contrib/velocity/lib
   [junit4]   2> 1043986 WARN  (qtp1993298941-4491) [n:127.0.0.1:40048_solr c:testScheduledTrigger s:shard1 r:core_node3 x:testScheduledTrigger_shard1_replica_n1] o.a.s.c.SolrConfig Couldn't add files from /home/jenkins/jenkins-slave/workspace/Lucene-Solr-Tests-master/solr/build/solr-core/test/J2/temp/solr.cloud.autoscaling.ScheduledTriggerIntegrationTest_933DC23F75D426F1-001/tempDir-001/node2/testScheduledTrigger_shard1_replica_n1/../../../../dist filtered by solr-velocity-\d.*\.jar to classpath: /home/jenkins/jenkins-slave/workspace/Lucene-Solr-Tests-master/solr/build/solr-core/test/J2/temp/solr.cloud.autoscaling.ScheduledTriggerIntegrationTest_933DC23F75D426F1-001/tempDir-001/node2/testScheduledTrigger_shard1_replica_n1/../../../../dist
   [junit4]   2> 1043986 WARN  (qtp1993298941-4491) [n:127.0.0.1:40048_solr c:testScheduledTrigger s:shard1 r:core_node3 x:testScheduledTrigger_shard1_replica_n1] o.a.s.c.SolrConfig Couldn't add files from /home/jenkins/jenkins-slave/workspace/Lucene-Solr-Tests-master/solr/build/solr-core/test/J2/temp/solr.cloud.autoscaling.ScheduledTriggerIntegrationTest_933DC23F75D426F1-001/tempDir-001/node2/testScheduledTrigger_shard1_replica_n1/../../../../dist filtered by solr-ltr-\d.*\.jar to classpath: /home/jenkins/jenkins-slave/workspace/Lucene-Solr-Tests-master/solr/build/solr-core/test/J2/temp/solr.cloud.autoscaling.ScheduledTriggerIntegrationTest_933DC23F75D426F1-001/tempDir-001/node2/testScheduledTrigger_shard1_replica_n1/../../../../dist
   [junit4]   2> 1044061 INFO  (qtp1993298941-4491) [n:127.0.0.1:40048_solr c:testScheduledTrigger s:shard1 r:core_node3 x:testScheduledTrigger_shard1_replica_n1] o.a.s.c.SolrConfig Using Lucene MatchVersion: 8.0.0
   [junit4]   2> 1044085 INFO  (qtp1623350403-4482) [n:127.0.0.1:40218_solr c:testScheduledTrigger s:shard1 r:core_node5 x:testScheduledTrigger_shard1_replica_n2] o.a.s.c.RequestParams conf resource params.json loaded . version : 0
   [junit4]   2> 1044086 INFO  (qtp1623350403-4482) [n:127.0.0.1:40218_solr c:testScheduledTrigger s:shard1 r:core_node5 x:testScheduledTrigger_shard1_replica_n2] o.a.s.c.RequestParams request params refreshed to version 0
   [junit4]   2> 1044086 WARN  (qtp1623350403-4482) [n:127.0.0.1:40218_solr c:testScheduledTrigger s:shard1 r:core_node5 x:testScheduledTrigger_shard1_replica_n2] o.a.s.c.SolrConfig Couldn't add files from /home/jenkins/jenkins-slave/workspace/Lucene-Solr-Tests-master/solr/build/solr-core/test/J2/temp/solr.cloud.autoscaling.ScheduledTriggerIntegrationTest_933DC23F75D426F1-001/tempDir-001/node1/testScheduledTrigger_shard1_replica_n2/../../../../contrib/extraction/lib filtered by .*\.jar to classpath: /home/jenkins/jenkins-slave/workspace/Lucene-Solr-Tests-master/solr/build/solr-core/test/J2/temp/solr.cloud.autoscaling.ScheduledTriggerIntegrationTest_933DC23F75D426F1-001/tempDir-001/node1/testScheduledTrigger_shard1_replica_n2/../../../../contrib/extraction/lib
   [junit4]   2> 1044086 WARN  (qtp1623350403-4482) [n:127.0.0.1:40218_solr c:testScheduledTrigger s:shard1 r:core_node5 x:testScheduledTrigger_shard1_replica_n2] o.a.s.c.SolrConfig Couldn't add files from /home/jenkins/jenkins-slave/workspace/Lucene-Solr-Tests-master/solr/build/solr-core/test/J2/temp/solr.cloud.autoscaling.ScheduledTriggerIntegrationTest_933DC23F75D426F1-001/tempDir-001/node1/testScheduledTrigger_shard1_replica_n2/../../../../dist filtered by solr-cell-\d.*\.jar to classpath: /home/jenkins/jenkins-slave/workspace/Lucene-Solr-Tests-master/solr/build/solr-core/test/J2/temp/solr.cloud.autoscaling.ScheduledTriggerIntegrationTest_933DC23F75D426F1-001/tempDir-001/node1/testScheduledTrigger_shard1_replica_n2/../../../../dist
   [junit4]   2> 1044087 WARN  (qtp1623350403-4482) [n:127.0.0.1:40218_solr c:testScheduledTrigger s:shard1 r:core_node5 x:testScheduledTrigger_shard1_replica_n2] o.a.s.c.SolrConfig Couldn't add files from /home/jenkins/jenkins-slave/workspace/Lucene-Solr-Tests-master/solr/build/solr-core/test/J2/temp/solr.cloud.autoscaling.ScheduledTriggerIntegrationTest_933DC23F75D426F1-001/tempDir-001/node1/testScheduledTrigger_shard1_replica_n2/../../../../contrib/clustering/lib filtered by .*\.jar to classpath: /home/jenkins/jenkins-slave/workspace/Lucene-Solr-Tests-master/solr/build/solr-core/test/J2/temp/solr.cloud.autoscaling.ScheduledTriggerIntegrationTest_933DC23F75D426F1-001/tempDir-001/node1/testScheduledTrigger_shard1_replica_n2/../../../../contrib/clustering/lib
   [junit4]   2> 1044087 WARN  (qtp1623350403-4482) [n:127.0.0.1:40218_solr c:testScheduledTrigger s:shard1 r:core_node5 x:testScheduledTrigger_shard1_replica_n2] o.a.s.c.SolrConfig Couldn't add files from /home/jenkins/jenkins-slave/workspace/Lucene-Solr-Tests-master/solr/build/solr-core/test/J2/temp/solr.cloud.autoscaling.ScheduledTriggerIntegrationTest_933DC23F75D426F1-001/tempDir-001/node1/testScheduledTrigger_shard1_replica_n2/../../../../dist filtered by solr-clustering-\d.*\.jar to classpath: /home/jenkins/jenkins-slave/workspace/Lucene-Solr-Tests-master/solr/build/solr-core/test/J2/temp/solr.cloud.autoscaling.ScheduledTriggerIntegrationTest_933DC23F75D426F1-001/tempDir-001/node1/testScheduledTrigger_shard1_replica_n2/../../../../dist
   [junit4]   2> 1044087 WARN  (qtp1623350403-4482) [n:127.0.0.1:40218_solr c:testScheduledTrigger s:shard1 r:core_node5 x:testScheduledTrigger_shard1_replica_n2] o.a.s.c.SolrConfig Couldn't add files from /home/jenkins/jenkins-slave/workspace/Lucene-Solr-Tests-master/solr/build/solr-core/test/J2/temp/solr.cloud.autoscaling.ScheduledTriggerIntegrationTest_933DC23F75D426F1-001/tempDir-001/node1/testScheduledTrigger_shard1_replica_n2/../../../../contrib/langid/lib filtered by .*\.jar to classpath: /home/jenkins/jenkins-slave/workspace/Lucene-Solr-Tests-master/solr/build/solr-core/test/J2/temp/solr.cloud.autoscaling.ScheduledTriggerIntegrationTest_933DC23F75D426F1-001/tempDir-001/node1/testScheduledTrigger_shard1_replica_n2/../../../../contrib/langid/lib
   [junit4]   2> 1044087 WARN  (qtp1623350403-4482) [n:127.0.0.1:40218_solr c:testScheduledTrigger s:shard1 r:core_node5 x:testScheduledTrigger_shard1_replica_n2] o.a.s.c.SolrConfig Couldn't add files from /home/jenkins/jenkins-slave/workspace/Lucene-Solr-Tests-master/solr/build/solr-core/test/J2/temp/solr.cloud.autoscaling.ScheduledTriggerIntegrationTest_933DC23F75D426F1-001/tempDir-001/node1/testScheduledTrigger_shard1_replica_n2/../../../../dist filtered by solr-langid-\d.*\.jar to classpath: /home/jenkins/jenkins-slave/workspace/Lucene-Solr-Tests-master/solr/build/solr-core/test/J2/temp/solr.cloud.autoscaling.ScheduledTriggerIntegrationTest_933DC23F75D426F1-001/tempDir-001/node1/testScheduledTrigger_shard1_replica_n2/../../../../dist
   [junit4]   2> 1044087 WARN  (qtp1623350403-4482) [n:127.0.0.1:40218_solr c:testScheduledTrigger s:shard1 r:core_node5 x:testScheduledTrigger_shard1_replica_n2] o.a.s.c.SolrConfig Couldn't add files from /home/jenkins/jenkins-slave/workspace/Lucene-Solr-Tests-master/solr/build/solr-core/test/J2/temp/solr.cloud.autoscaling.ScheduledTriggerIntegrationTest_933DC23F75D426F1-001/tempDir-001/node1/testScheduledTrigger_shard1_replica_n2/../../../../contrib/velocity/lib filtered by .*\.jar to classpath: /home/jenkins/jenkins-slave/workspace/Lucene-Solr-Tests-master/solr/build/solr-core/test/J2/temp/solr.cloud.autoscaling.ScheduledTriggerIntegrationTest_933DC23F75D426F1-001/tempDir-001/node1/testScheduledTrigger_shard1_replica_n2/../../../../contrib/velocity/lib
   [junit4]   2> 1044088 WARN  (qtp1623350403-4482) [n:127.0.0.1:40218_solr c:testScheduledTrigger s:shard1 r:core_node5 x:testScheduledTrigger_shard1_replica_n2] o.a.s.c.SolrConfig Couldn't add files from /home/jenkins/jenkins-slave/workspace/Lucene-Solr-Tests-master/solr/build/solr-core/test/J2/temp/solr.cloud.autoscaling.ScheduledTriggerIntegrationTest_933DC23F75D426F1-001/tempDir-001/node1/testScheduledTrigger_shard1_replica_n2/../../../../dist filtered by solr-velocity-\d.*\.jar to classpath: /home/jenkins/jenkins-slave/workspace/Lucene-Solr-Tests-master/solr/build/solr-core/test/J2/temp/solr.cloud.autoscaling.ScheduledTriggerIntegrationTest_933DC23F75D426F1-001/tempDir-001/node1/testScheduledTrigger_shard1_replica_n2/../../../../dist
   [junit4]   2> 1044088 WARN  (qtp1623350403-4482) [n:127.0.0.1:40218_solr c:testScheduledTrigger s:shard1 r:core_node5 x:testScheduledTrigger_shard1_replica_n2] o.a.s.c.SolrConfig Couldn't add files from /home/jenkins/jenkins-slave/workspace/Lucene-Solr-Tests-master/solr/build/solr-core/test/J2/temp/solr.cloud.autoscaling.ScheduledTriggerIntegrationTest_933DC23F75D426F1-001/tempDir-001/node1/testScheduledTrigger_shard1_replica_n2/../../../../dist filtered by solr-ltr-\d.*\.jar to classpath: /home/jenkins/jenkins-slave/workspace/Lucene-Solr-Tests-master/solr/build/solr-core/test/J2/temp/solr.cloud.autoscaling.ScheduledTriggerIntegrationTest_933DC23F75D426F1-001/tempDir-001/node1/testScheduledTrigger_shard1_replica_n2/../../../../dist
   [junit4]   2> 1044160 INFO  (qtp1623350403-4482) [n:127.0.0.1:40218_solr c:testScheduledTrigger s:shard1 r:core_node5 x:testScheduledTrigger_shard1_replica_n2] o.a.s.c.SolrConfig Using Lucene MatchVersion: 8.0.0
   [junit4]   2> 1044197 INFO  (qtp1993298941-4491) [n:127.0.0.1:40048_solr c:testScheduledTrigger s:shard1 r:core_node3 x:testScheduledTrigger_shard1_replica_n1] o.a.s.s.IndexSchema [testScheduledTrigger_shard1_replica_n1] Schema name=default-config
   [junit4]   2> 1044212 INFO  (qtp1993298941-4492) [n:127.0.0.1:40048_solr c:testScheduledTrigger s:shard1 r:core_node6 x:testScheduledTrigger_shard1_replica_n4] o.a.s.s.IndexSchema [testScheduledTrigger_shard1_replica_n4] Schema name=default-config
   [junit4]   2> 1044244 DEBUG (ScheduledTrigger-1509-thread-3) [    ] o.a.s.c.a.NodeLostTrigger Running NodeLostTrigger: .auto_add_replicas with currently live nodes: 2
   [junit4]   2> 1044657 INFO  (qtp1623350403-4482) [n:127.0.0.1:40218_solr c:testScheduledTrigger s:shard1 r:core_node5 x:testScheduledTrigger_shard1_replica_n2] o.a.s.s.IndexSchema [testScheduledTrigger_shard1_replica_n2] Schema name=default-config
   [junit4]   2> 1045374 DEBUG (ScheduledTrigger-1509-thread-3) [    ] o.a.s.c.a.NodeLostTrigger Running NodeLostTrigger: .auto_add_replicas with currently live nodes: 2
   [junit4]   2> 1046385 DEBUG (ScheduledTrigger-1509-thread-3) [    ] o.a.s.c.a.NodeLostTrigger Running NodeLostTrigger: .auto_add_replicas with currently live nodes: 2
   [junit4]   2> 1047121 INFO  (qtp1993298941-4491) [n:127.0.0.1:40048_solr c:testScheduledTrigger s:shard1 r:core_node3 x:testScheduledTrigger_shard1_replica_n1] o.a.s.s.IndexSchema Loaded schema default-config/1.6 with uniqueid field id
   [junit4]   2> 1047141 INFO  (qtp1623350403-4482) [n:127.0.0.1:40218_solr c:testScheduledTrigger s:shard1 r:core_node5 x:testScheduledTrigger_shard1_replica_n2] o.a.s.s.IndexSchema Loaded schema default-config/1.6 with uniqueid field id
   [junit4]   2> 1047393 DEBUG (ScheduledTrigger-1509-thread-3) [    ] o.a.s.c.a.NodeLostTrigger Running NodeLostTrigger: .auto_add_replicas with currently live nodes: 2
   [junit4]   2> 1047505 INFO  (qtp1623350403-4482) [n:127.0.0.1:40218_solr c:testScheduledTrigger s:shard1 r:core_node5 x:testScheduledTrigger_shard1_replica_n2] o.a.s.c.CoreContainer Creating SolrCore 'testScheduledTrigger_shard1_replica_n2' using configuration from collection testScheduledTrigger, trusted=true
   [junit4]   2> 1047505 INFO  (qtp1623350403-4482) [n:127.0.0.1:40218_solr c:testScheduledTrigger s:shard1 r:core_node5 x:testScheduledTrigger_shard1_replica_n2] o.a.s.m.r.SolrJmxReporter JMX monitoring for 'solr_40218.solr.core.testScheduledTrigger.shard1.replica_n2' (registry 'solr.core.testScheduledTrigger.shard1.replica_n2') enabled at server: com.sun.jmx.mbeanserver.JmxMBeanServer@24048d84
   [junit4]   2> 1047505 INFO  (qtp1623350403-4482) [n:127.0.0.1:40218_solr c:testScheduledTrigger s:shard1 r:core_node5 x:testScheduledTrigger_shard1_replica_n2] o.a.s.c.SolrCore solr.RecoveryStrategy.Builder
   [junit4]   2> 1047505 INFO  (qtp1623350403-4482) [n:127.0.0.1:40218_solr c:testScheduledTrigger s:shard1 r:core_node5 x:testScheduledTrigger_shard1_replica_n2] o.a.s.c.SolrCore [[testScheduledTrigger_shard1_replica_n2] ] Opening new SolrCore at [/home/jenkins/jenkins-slave/workspace/Lucene-Solr-Tests-master/solr/build/solr-core/test/J2/temp/solr.cloud.autoscaling.ScheduledTriggerIntegrationTest_933DC23F75D426F1-001/tempDir-001/node1/testScheduledTrigger_shard1_replica_n2], dataDir=[/home/jenkins/jenkins-slave/workspace/Lucene-Solr-Tests-master/solr/build/solr-core/test/J2/temp/solr.cloud.autoscaling.ScheduledTriggerIntegrationTest_933DC23F75D426F1-001/tempDir-001/node1/./testScheduledTrigger_shard1_replica_n2/data/]
   [junit4]   2> 1048050 INFO  (qtp1623350403-4482) [n:127.0.0.1:40218_solr c:testScheduledTrigger s:shard1 r:core_node5 x:testScheduledTrigger_shard1_replica_n2] o.a.s.r.XSLTResponseWriter xsltCacheLifetimeSeconds=5
   [junit4]   2> 1048123 INFO  (qtp1993298941-4491) [n:127.0.0.1:40048_solr c:testScheduledTrigger s:shard1 r:core_node3 x:testScheduledTrigger_shard1_replica_n1] o.a.s.c.CoreContainer Creating SolrCore 'testScheduledTrigger_shard1_replica_n1' using configuration from collection testScheduledTrigger, trusted=true
   [junit4]   2> 1048124 INFO  (qtp1993298941-4491) [n:127.0.0.1:40048_solr c:testScheduledTrigger s:shard1 r:core_node3 x:testScheduledTrigger_shard1_replica_n1] o.a.s.m.r.SolrJmxReporter JMX monitoring for 'solr_40048.solr.core.testScheduledTrigger.shard1.replica_n1' (registry 'solr.core.testScheduledTrigger.shard1.replica_n1') enabled at server: com.sun.jmx.mbeanserver.JmxMBeanServer@24048d84
   [junit4]   2> 1048124 INFO  (qtp1993298941-4491) [n:127.0.0.1:40048_solr c:testScheduledTrigger s:shard1 r:core_node3 x:testScheduledTrigger_shard1_replica_n1] o.a.s.c.SolrCore solr.RecoveryStrategy.Builder
   [junit4]   2> 1048124 INFO  (qtp1993298941-4491) [n:127.0.0.1:40048_solr c:testScheduledTrigger s:shard1 r:core_node3 x:testScheduledTrigger_shard1_replica_n1] o.a.s.c.SolrCore [[testScheduledTrigger_shard1_replica_n1] ] Opening new SolrCore at [/home/jenkins/jenkins-slave/workspace/Lucene-Solr-Tests-master/solr/build/solr-core/test/J2/temp/solr.cloud.autoscaling.ScheduledTriggerIntegrationTest_933DC23F75D426F1-001/tempDir-001/node2/testScheduledTrigger_shard1_replica_n1], dataDir=[/home/jenkins/jenkins-slave/workspace/Lucene-Solr-Tests-master/solr/build/solr-core/test/J2/temp/solr.cloud.autoscaling.ScheduledTriggerIntegrationTest_933DC23F75D426F1-001/tempDir-001/node2/./testScheduledTrigger_shard1_replica_n1/data/]
   [junit4]   2> 1048247 INFO  (qtp1993298941-4491) [n:127.0.0.1:40048_solr c:testScheduledTrigger s:shard1 r:core_node3 x:testScheduledTrigger_shard1_replica_n1] o.a.s.r.XSLTResponseWriter xsltCacheLifetimeSeconds=5
   [junit4]   2> 1048397 DEBUG (ScheduledTrigger-1509-thread-3) [    ] o.a.s.c.a.NodeLostTrigger Running NodeLostTrigger: .auto_add_replicas with currently live nodes: 2
   [junit4]   2> 1049356 INFO  (qtp1993298941-4492) [n:127.0.0.1:40048_solr c:testScheduledTrigger s:shard1 r:core_node6 x:testScheduledTrigger_shard1_replica_n4] o.a.s.s.IndexSchema Loaded schema default-config/1.6 with uniqueid field id
   [junit4]   2> 1049405 DEBUG (ScheduledTrigger-1509-thread-3) [    ] o.a.s.c.a.NodeLostTrigger Running NodeLostTrigger: .auto_add_replicas with currently live nodes: 2
   [junit4]   2> 1050177 INFO  (qtp1993298941-4491) [n:127.0.0.1:40048_solr c:testScheduledTrigger s:shard1 r:core_node3 x:testScheduledTrigger_shard1_replica_n1] o.a.s.u.UpdateHandler Using UpdateLog implementation: org.apache.solr.update.UpdateLog
   [junit4]   2> 1050177 INFO  (qtp1993298941-4491) [n:127.0.0.1:40048_solr c:testScheduledTrigger s:shard1 r:core_node3 x:testScheduledTrigger_shard1_replica_n1] o.a.s.u.UpdateLog Initializing UpdateLog: dataDir= defaultSyncLevel=FLUSH numRecordsToKeep=100 maxNumLogsToKeep=10 numVersionBuckets=65536
   [junit4]   2> 1050325 INFO  (qtp1993298941-4491) [n:127.0.0.1:40048_solr c:testScheduledTrigger s:shard1 r:core_node3 x:testScheduledTrigger_shard1_replica_n1] o.a.s.u.CommitTracker Hard AutoCommit: if uncommited for 15000ms;
   [junit4]   2> 1050325 INFO  (qtp1993298941-4491) [n:127.0.0.1:40048_solr c:testScheduledTrigger s:shard1 r:core_node3 x:testScheduledTrigger_shard1_replica_n1] o.a.s.u.CommitTracker Soft AutoCommit: disabled
   [junit4]   2> 1050359 INFO  (qtp1623350403-4482) [n:127.0.0.1:40218_solr c:testScheduledTrigger s:shard1 r:core_node5 x:testScheduledTrigger_shard1_replica_n2] o.a.s.u.UpdateHandler Using UpdateLog implementation: org.apache.solr.update.UpdateLog
   [junit4]   2> 1050359 INFO  (qtp1623350403-4482) [n:127.0.0.1:40218_solr c:testScheduledTrigger s:shard1 r:core_node5 x:testScheduledTrigger_shard1_replica_n2] o.a.s.u.UpdateLog Initializing UpdateLog: dataDir= defaultSyncLevel=FLUSH numRecordsToKeep=100 maxNumLogsToKeep=10 numVersionBuckets=65536
   [junit4]   2> 1050361 INFO  (qtp1623350403-4482) [n:127.0.0.1:40218_solr c:testScheduledTrigger s:shard1 r:core_node5 x:testScheduledTrigger_shard1_replica_n2] o.a.s.u.CommitTracker Hard AutoCommit: if uncommited for 15000ms;
   [junit4]   2> 1050361 INFO  (qtp1623350403-4482) [n:127.0.0.1:40218_solr c:testScheduledTrigger s:shard1 r:core_node5 x:testScheduledTrigger_shard1_replica_n2] o.a.s.u.CommitTracker Soft AutoCommit: disabled
   [junit4]   2> 1050477 DEBUG (ScheduledTrigger-1509-thread-3) [    ] o.a.s.c.a.NodeLostTrigger Running NodeLostTrigger: .auto_add_replicas with currently live nodes: 2
   [junit4]   2> 1050480 INFO  (qtp1623350403-4482) [n:127.0.0.1:40218_solr c:testScheduledTrigger s:shard1 r:core_node5 x:testScheduledTrigger_shard1_replica_n2] o.a.s.s.SolrIndexSearcher Opening [Searcher@15e90515[testScheduledTrigger_shard1_replica_n2] main]
   [junit4]   2> 1050480 INFO  (qtp1993298941-4491) [n:127.0.0.1:40048_solr c:testScheduledTrigger s:shard1 r:core_node3 x:testScheduledTrigger_shard1_replica_n1] o.a.s.s.SolrIndexSearcher Opening [Searcher@3325bacb[testScheduledTrigger_shard1_replica_n1] main]
   [junit4]   2> 1050502 INFO  (qtp1623350403-4482) [n:127.0.0.1:40218_solr c:testScheduledTrigger s:shard1 r:core_node5 x:testScheduledTrigger_shard1_replica_n2] o.a.s.r.ManagedResourceStorage Configured ZooKeeperStorageIO with znodeBase: /configs/testScheduledTrigger.AUTOCREATED
   [junit4]   2> 1050502 INFO  (qtp1623350403-4482) [n:127.0.0.1:40218_solr c:testScheduledTrigger s:shard1 r:core_node5 x:testScheduledTrigger_shard1_replica_n2] o.a.s.r.ManagedResourceStorage Loaded null at path _rest_managed.json using ZooKeeperStorageIO:path=/configs/testScheduledTrigger.AUTOCREATED
   [junit4]   2> 1050539 INFO  (qtp1623350403-4482) [n:127.0.0.1:40218_solr c:testScheduledTrigger s:shard1 r:core_node5 x:testScheduledTrigger_shard1_replica_n2] o.a.s.s.ZkIndexSchemaReader Creating ZooKeeper watch for the managed schema at /configs/testScheduledTrigger.AUTOCREATED/managed-schema
   [junit4]   2> 1050540 INFO  (qtp1623350403-4482) [n:127.0.0.1:40218_solr c:testScheduledTrigger s:shard1 r:core_node5 x:testScheduledTrigger_shard1_replica_n2] o.a.s.s.ZkIndexSchemaReader Current schema version 0 is already the latest
   [junit4]   2> 1050541 INFO  (qtp1623350403-4482) [n:127.0.0.1:40218_solr c:testScheduledTrigger s:shard1 r:core_node5 x:testScheduledTrigger_shard1_replica_n2] o.a.s.h.c.SpellCheckComponent Initializing spell checkers
   [junit4]   2> 1050590 INFO  (qtp1993298941-4491) [n:127.0.0.1:40048_solr c:testScheduledTrigger s:shard1 r:core_node3 x:testScheduledTrigger_shard1_replica_n1] o.a.s.r.ManagedResourceStorage Configured ZooKeeperStorageIO with znodeBase: /configs/testScheduledTrigger.AUTOCREATED
   [junit4]   2> 1050623 INFO  (qtp1993298941-4491) [n:127.0.0.1:40048_solr c:testScheduledTrigger s:shard1 r:core_node3 x:testScheduledTrigger_shard1_replica_n1] o.a.s.r.ManagedResourceStorage Loaded null at path _rest_managed.json using ZooKeeperStorageIO:path=/configs/testScheduledTrigger.AUTOCREATED
   [junit4]   2> 1050623 INFO  (qtp1993298941-4491) [n:127.0.0.1:40048_solr c:testScheduledTrigger s:shard1 r:core_node3 x:testScheduledTrigger_shard1_replica_n1] o.a.s.s.ZkIndexSchemaReader Creating ZooKeeper watch for the managed schema at /configs/testScheduledTrigger.AUTOCREATED/managed-schema
   [junit4]   2> 1050630 INFO  (qtp1623350403-4482) [n:127.0.0.1:40218_solr c:testScheduledTrigger s:shard1 r:core_node5 x:testScheduledTrigger_shard1_replica_n2] o.a.s.s.DirectSolrSpellChecker init: {name=default,field=_text_,classname=solr.DirectSolrSpellChecker,distanceMeasure=internal,accuracy=0.5,maxEdits=2,minPrefix=1,maxInspections=5,minQueryLength=4,maxQueryFrequency=0.01}
   [junit4]   2> 1050660 INFO  (qtp1993298941-4491) [n:127.0.0.1:40048_solr c:testScheduledTrigger s:shard1 r:core_node3 x:testScheduledTrigger_shard1_replica_n1] o.a.s.s.ZkIndexSchemaReader Current schema version 0 is already the latest
   [junit4]   2> 1050661 INFO  (qtp1993298941-4491) [n:127.0.0.1:40048_solr c:testScheduledTrigger s:shard1 r:core_node3 x:testScheduledTrigger_shard1_replica_n1] o.a.s.h.c.SpellCheckComponent Initializing spell checkers
   [junit4]   2> 1050661 INFO  (qtp1993298941-4491) [n:127.0.0.1:40048_solr c:testScheduledTrigger s:shard1 r:core_node3 x:testScheduledTrigger_shard1_replica_n1] o.a.s.s.DirectSolrSpellChecker init: {name=default,field=_text_,classname=solr.DirectSolrSpellChecker,distanceMeasure=internal,accuracy=0.5,maxEdits=2,minPrefix=1,maxInspections=5,minQueryLength=4,maxQueryFrequency=0.01}
   [junit4]   2> 1050794 INFO  (qtp1623350403-4482) [n:127.0.0.1:40218_solr c:testScheduledTrigger s:shard1 r:core_node5 x:testScheduledTrigger_shard1_replica_n2] o.a.s.h.ReplicationHandler Commits will be reserved for 10000ms.
   [junit4]   2> 1050806 INFO  (searcherExecutor-1523-thread-1-processing-n:127.0.0.1:40218_solr x:testScheduledTrigger_shard1_replica_n2 c:testScheduledTrigger s:shard1 r:core_node5) [n:127.0.0.1:40218_solr c:testScheduledTrigger s:shard1 r:core_node5 x:testScheduledTrigger_shard1_replica_n2] o.a.s.c.QuerySenderListener QuerySenderListener sending requests to Searcher@15e90515[testScheduledTrigger_shard1_replica_n2] main{ExitableDirectoryReader(UninvertingDirectoryReader())}
   [junit4]   2> 1050806 INFO  (searcherExecutor-1523-thread-1-processing-n:127.0.0.1:40218_solr x:testScheduledTrigger_shard1_replica_n2 c:testScheduledTrigger s:shard1 r:core_node5) [n:127.0.0.1:40218_solr c:testScheduledTrigger s:shard1 r:core_node5 x:testScheduledTrigger_shard1_replica_n2] o.a.s.c.QuerySenderListener QuerySenderListener done.
   [junit4]   2> 1050807 INFO  (searcherExecutor-1523-thread-1-processing-n:127.0.0.1:40218_solr x:testScheduledTrigger_shard1_replica_n2 c:testScheduledTrigger s:shard1 r:core_node5) [n:127.0.0.1:40218_solr c:testScheduledTrigger s:shard1 r:core_node5 x:testScheduledTrigger_shard1_replica_n2] o.a.s.h.c.SpellCheckComponent Loading spell index for spellchecker: default
   [junit4]   2> 1050807 INFO  (searcherExecutor-1523-thread-1-processing-n:127.0.0.1:40218_solr x:testScheduledTrigger_shard1_replica_n2 c:testScheduledTrigger s:shard1 r:core_node5) [n:127.0.0.1:40218_solr c:testScheduledTrigger s:shard1 r:core_node5 x:testScheduledTrigger_shard1_replica_n2] o.a.s.c.SolrCore [testScheduledTrigger_shard1_replica_n2] Registered new searcher Searcher@15e90515[testScheduledTrigger_shard1_replica_n2] main{ExitableDirectoryReader(UninvertingDirectoryReader())}
   [junit4]   2> 1050807 INFO  (qtp1993298941-4491) [n:127.0.0.1:40048_solr c:testScheduledTrigger s:shard1 r:core_node3 x:testScheduledTrigger_shard1_replica_n1] o.a.s.h.ReplicationHandler Commits will be reserved for 10000ms.
   [junit4]   2> 1050808 INFO  (qtp1623350403-4482) [n:127.0.0.1:40218_solr c:testScheduledTrigger s:shard1 r:core_node5 x:testScheduledTrigger_shard1_replica_n2] o.a.s.u.UpdateLog Could not find max version in index or recent updates, using new clock 1605731399891943424
   [junit4]   2> 1050818 INFO  (searcherExecutor-1524-thread-1-processing-n:127.0.0.1:40048_solr x:testScheduledTrigger_shard1_replica_n1 c:testScheduledTrigger s:shard1 r:core_node3) [n:127.0.0.1:40048_solr c:testScheduledTrigger s:shard1 r:core_node3 x:testScheduledTrigger_shard1_replica_n1] o.a.s.c.QuerySenderListener QuerySenderListener sending requests to Searcher@3325bacb[testScheduledTrigger_shard1_replica_n1] main{ExitableDirectoryReader(UninvertingDirectoryReader())}
   [junit4]   2> 1050818 INFO  (searcherExecutor-1524-thread-1-processing-n:127.0.0.1:40048_solr x:testScheduledTrigger_shard1_replica_n1 c:testScheduledTrigger s:shard1 r:core_node3) [n:127.0.0.1:40048_solr c:testScheduledTrigger s:shard1 r:core_node3 x:testScheduledTrigger_shard1_replica_n1] o.a.s.c.QuerySenderListener QuerySenderListener done.
   [junit4]   2> 1050818 INFO  (searcherExecutor-1524-thread-1-processing-n:127.0.0.1:40048_solr x:testScheduledTrigger_shard1_replica_n1 c:testScheduledTrigger s:shard1 r:core_node3) [n:127.0.0.1:40048_solr c:testScheduledTrigger s:shard1 r:core_node3 x:testScheduledTrigger_shard1_replica_n1] o.a.s.h.c.SpellCheckComponent Loading spell index for spellchecker: default
   [junit4]   2> 1050819 INFO  (searcherExecutor-1524-thread-1-processing-n:127.0.0.1:40048_solr x:testScheduledTrigger_shard1_replica_n1 c:testScheduledTrigger s:shard1 r:core_node3) [n:127.0.0.1:40048_solr c:testScheduledTrigger s:shard1 r:core_node3 x:testScheduledTrigger_shard1_replica_n1] o.a.s.c.SolrCore [testScheduledTrigger_shard1_replica_n1] Registered new searcher Searcher@3325bacb[testScheduledTrigger_shard1_replica_n1] main{ExitableDirectoryReader(UninvertingDirectoryReader())}
   [junit4]   2> 1050850 INFO  (qtp1993298941-4491) [n:127.0.0.1:40048_solr c:testScheduledTrigger s:shard1 r:core_node3 x:testScheduledTrigger_shard1_replica_n1] o.a.s.u.UpdateLog Could not find max version in index or recent updates, using new clock 1605731399935983616
   [junit4]   2> 1050958 INFO  (qtp1623350403-4482) [n:127.0.0.1:40218_solr c:testScheduledTrigger s:shard1 r:core_node5 x:testScheduledTrigger_shard1_replica_n2] o.a.s.c.ZkShardTerms Successful update of terms at /collections/testScheduledTrigger/terms/shard1 to Terms{values={core_node5=0}, version=0}
   [junit4]   2> 1050975 INFO  (qtp1623350403-4482) [n:127.0.0.1:40218_solr c:testScheduledTrigger s:shard1 r:core_node5 x:testScheduledTrigger_shard1_replica_n2] o.a.s.c.ShardLeaderElectionContext Waiting until we see more replicas up for shard shard1: total=3 found=1 timeoutin=9999ms
   [junit4]   2> 1051020 INFO  (qtp1993298941-4491) [n:127.0.0.1:40048_solr c:testScheduledTrigger s:shard1 r:core_node3 x:testScheduledTrigger_shard1_replica_n1] o.a.s.c.ZkShardTerms Successful update of terms at /collections/testScheduledTrigger/terms/shard1 to Terms{values={core_node3=0, core_node5=0}, version=1}
   [junit4]   2> 1051354 INFO  (qtp1993298941-4492) [n:127.0.0.1:40048_solr c:testScheduledTrigger s:shard1 r:core_node6 x:testScheduledTrigger_shard1_replica_n4] o.a.s.c.CoreContainer Creating SolrCore 'testScheduledTrigger_shard1_replica_n4' using configuration from collection testScheduledTrigger, trusted=true
   [junit4]   2> 1051355 INFO  (qtp1993298941-4492) [n:127.0.0.1:40048_solr c:testScheduledTrigger s:shard1 r:core_node6 x:testScheduledTrigger_shard1_replica_n4] o.a.s.m.r.SolrJmxReporter JMX monitoring for 'solr_40048.solr.core.testScheduledTrigger.shard1.replica_n4' (registry 'solr.core.testScheduledTrigger.shard1.replica_n4') enabled at server: com.sun.jmx.mbeanserver.JmxMBeanServer@24048d84
   [junit4]   2> 1051355 INFO  (qtp1993298941-4492) [n:127.0.0.1:40048_solr c:testScheduledTrigger s:shard1 r:core_node6 x:testScheduledTrigger_shard1_replica_n4] o.a.s.c.SolrCore solr.RecoveryStrategy.Builder
   [junit4]   2> 1051356 INFO  (qtp1993298941-4492) [n:127.0.0.1:40048_solr c:testScheduledTrigger s:shard1 r:core_node6 x:testScheduledTrigger_shard1_replica_n4] o.a.s.c.SolrCore [[testScheduledTrigger_shard1_replica_n4] ] Opening new SolrCore at [/home/jenkins/jenkins-slave/workspace/Lucene-Solr-Tests-master/solr/build/solr-core/test/J2/temp/solr.cloud.autoscaling.ScheduledTriggerIntegrationTest_933DC23F75D426F1-001/tempDir-001/node2/testScheduledTrigger_shard1_replica_n4], dataDir=[/home/jenkins/jenkins-slave/workspace/Lucene-Solr-Tests-master/solr/build/solr-core/test/J2/temp/solr.cloud.autoscaling.ScheduledTriggerIntegrationTest_933DC23F75D426F1-001/tempDir-001/node2/./testScheduledTrigger_shard1_replica_n4/data/]
   [junit4]   2> 1051395 INFO  (qtp1993298941-4492) [n:127.0.0.1:40048_solr c:testScheduledTrigger s:shard1 r:core_node6 x:testScheduledTrigger_shard1_replica_n4] o.a.s.r.XSLTResponseWriter xsltCacheLifetimeSeconds=5
   [junit4]   2> 1051493 DEBUG (ScheduledTrigger-1509-thread-3) [    ] o.a.s.c.a.NodeLostTrigger Running NodeLostTrigger: .auto_add_replicas with currently live nodes: 2
   [junit4]   2> 1051708 INFO  (qtp1993298941-4492) [n:127.0.0.1:40048_solr c:testScheduledTrigger s:shard1 r:core_node6 x:testScheduledTrigger_shard1_replica_n4] o.a.s.u.UpdateHandler Using UpdateLog implementation: org.apache.solr.update.UpdateLog
   [junit4]   2> 1051708 INFO  (qtp1993298941-4492) [n:127.0.0.1:40048_solr c:testScheduledTrigger s:shard1 r:core_node6 x:testScheduledTrigger_shard1_replica_n4] o.a.s.u.UpdateLog Initializing UpdateLog: dataDir= defaultSyncLevel=FLUSH numRecordsToKeep=100 maxNumLogsToKeep=10 numVersionBuckets=65536
   [junit4]   2> 1051710 INFO  (qtp1993298941-4492) [n:127.0.0.1:40048_solr c:testScheduledTrigger s:shard1 r:core_node6 x:testScheduledTrigger_shard1_replica_n4] o.a.s.u.CommitTracker Hard AutoCommit: if uncommited for 15000ms;
   [junit4]   2> 1051710 INFO  (qtp1993298941-4492) [n:127.0.0.1:40048_solr c:testScheduledTrigger s:shard1 r:core_node6 x:testScheduledTrigger_shard1_replica_n4] o.a.s.u.CommitTracker Soft AutoCommit: disabled
   [junit4]   2> 1051711 INFO  (qtp1993298941-4492) [n:127.0.0.1:40048_solr c:testScheduledTrigger s:shard1 r:core_node6 x:testScheduledTrigger_shard1_replica_n4] o.a.s.s.SolrIndexSearcher Opening [Searcher@36ac497b[testScheduledTrigger_shard1_replica_n4] main]
   [junit4]   2> 1051743 INFO  (qtp1993298941-4492) [n:127.0.0.1:40048_solr c:testScheduledTrigger s:shard1 r:core_node6 x:testScheduledTrigger_shard1_replica_n4] o.a.s.r.ManagedResourceStorage Configured ZooKeeperStorageIO with znodeBase: /configs/testScheduledTrigger.AUTOCREATED
   [junit4]   2> 1051744 INFO  (qtp1993298941-4492) [n:127.0.0.1:40048_solr c:testScheduledTrigger s:shard1 r:core_node6 x:testScheduledTrigger_shard1_replica_n4] o.a.s.r.ManagedResourceStorage Loaded null at path _rest_managed.json using ZooKeeperStorageIO:path=/configs/testScheduledTrigger.AUTOCREATED
   [junit4]   2> 1051744 INFO  (qtp1993298941-4492) [n:127.0.0.1:40048_solr c:testScheduledTrigger s:shard1 r:core_node6 x:t

[...truncated too long message...]


-ivy-fail-disallowed-ivy-version:

ivy-fail:

ivy-fail:

ivy-configure:
[ivy:configure] :: loading settings :: file = /home/jenkins/jenkins-slave/workspace/Lucene-Solr-Tests-master/lucene/top-level-ivy-settings.xml

resolve:

ivy-availability-check:
[loadresource] Do not set property disallowed.ivy.jars.list as its length is 0.

-ivy-fail-disallowed-ivy-version:

ivy-fail:

ivy-configure:
[ivy:configure] :: loading settings :: file = /home/jenkins/jenkins-slave/workspace/Lucene-Solr-Tests-master/lucene/top-level-ivy-settings.xml

resolve:

ivy-availability-check:
[loadresource] Do not set property disallowed.ivy.jars.list as its length is 0.

-ivy-fail-disallowed-ivy-version:

ivy-fail:

ivy-fail:

ivy-configure:
[ivy:configure] :: loading settings :: file = /home/jenkins/jenkins-slave/workspace/Lucene-Solr-Tests-master/lucene/top-level-ivy-settings.xml

resolve:

ivy-availability-check:
[loadresource] Do not set property disallowed.ivy.jars.list as its length is 0.

-ivy-fail-disallowed-ivy-version:

ivy-fail:

ivy-configure:
[ivy:configure] :: loading settings :: file = /home/jenkins/jenkins-slave/workspace/Lucene-Solr-Tests-master/lucene/top-level-ivy-settings.xml

resolve:

ivy-availability-check:
[loadresource] Do not set property disallowed.ivy.jars.list as its length is 0.

-ivy-fail-disallowed-ivy-version:

ivy-fail:

ivy-fail:

ivy-configure:
[ivy:configure] :: loading settings :: file = /home/jenkins/jenkins-slave/workspace/Lucene-Solr-Tests-master/lucene/top-level-ivy-settings.xml

resolve:

ivy-availability-check:
[loadresource] Do not set property disallowed.ivy.jars.list as its length is 0.

-ivy-fail-disallowed-ivy-version:

ivy-fail:

ivy-fail:

ivy-configure:
[ivy:configure] :: loading settings :: file = /home/jenkins/jenkins-slave/workspace/Lucene-Solr-Tests-master/lucene/top-level-ivy-settings.xml

resolve:

ivy-availability-check:
[loadresource] Do not set property disallowed.ivy.jars.list as its length is 0.

-ivy-fail-disallowed-ivy-version:

ivy-fail:

ivy-fail:

ivy-configure:
[ivy:configure] :: loading settings :: file = /home/jenkins/jenkins-slave/workspace/Lucene-Solr-Tests-master/lucene/top-level-ivy-settings.xml

resolve:

ivy-availability-check:
[loadresource] Do not set property disallowed.ivy.jars.list as its length is 0.

-ivy-fail-disallowed-ivy-version:

ivy-fail:

ivy-fail:

ivy-configure:
[ivy:configure] :: loading settings :: file = /home/jenkins/jenkins-slave/workspace/Lucene-Solr-Tests-master/lucene/top-level-ivy-settings.xml

resolve:

ivy-availability-check:
[loadresource] Do not set property disallowed.ivy.jars.list as its length is 0.

-ivy-fail-disallowed-ivy-version:

ivy-fail:

ivy-fail:

ivy-configure:
[ivy:configure] :: loading settings :: file = /home/jenkins/jenkins-slave/workspace/Lucene-Solr-Tests-master/lucene/top-level-ivy-settings.xml

resolve:

ivy-availability-check:
[loadresource] Do not set property disallowed.ivy.jars.list as its length is 0.

-ivy-fail-disallowed-ivy-version:

ivy-fail:

ivy-fail:

ivy-configure:
[ivy:configure] :: loading settings :: file = /home/jenkins/jenkins-slave/workspace/Lucene-Solr-Tests-master/lucene/top-level-ivy-settings.xml

resolve:

ivy-availability-check:
[loadresource] Do not set property disallowed.ivy.jars.list as its length is 0.

-ivy-fail-disallowed-ivy-version:

ivy-fail:

ivy-fail:

ivy-configure:
[ivy:configure] :: loading settings :: file = /home/jenkins/jenkins-slave/workspace/Lucene-Solr-Tests-master/lucene/top-level-ivy-settings.xml

resolve:

ivy-availability-check:
[loadresource] Do not set property disallowed.ivy.jars.list as its length is 0.

-ivy-fail-disallowed-ivy-version:

ivy-fail:

ivy-fail:

ivy-configure:
[ivy:configure] :: loading settings :: file = /home/jenkins/jenkins-slave/workspace/Lucene-Solr-Tests-master/lucene/top-level-ivy-settings.xml

resolve:

ivy-availability-check:
[loadresource] Do not set property disallowed.ivy.jars.list as its length is 0.

-ivy-fail-disallowed-ivy-version:

ivy-fail:

ivy-fail:

ivy-configure:
[ivy:configure] :: loading settings :: file = /home/jenkins/jenkins-slave/workspace/Lucene-Solr-Tests-master/lucene/top-level-ivy-settings.xml

resolve:

ivy-availability-check:
[loadresource] Do not set property disallowed.ivy.jars.list as its length is 0.

-ivy-fail-disallowed-ivy-version:

ivy-fail:

ivy-fail:

ivy-configure:
[ivy:configure] :: loading settings :: file = /home/jenkins/jenkins-slave/workspace/Lucene-Solr-Tests-master/lucene/top-level-ivy-settings.xml

resolve:

jar-checksums:
    [mkdir] Created dir: /home/jenkins/jenkins-slave/workspace/Lucene-Solr-Tests-master/solr/null462485103
     [copy] Copying 241 files to /home/jenkins/jenkins-slave/workspace/Lucene-Solr-Tests-master/solr/null462485103
   [delete] Deleting directory /home/jenkins/jenkins-slave/workspace/Lucene-Solr-Tests-master/solr/null462485103

check-working-copy:
[ivy:cachepath] :: resolving dependencies :: org.eclipse.jgit#org.eclipse.jgit-caller;working
[ivy:cachepath] confs: [default]
[ivy:cachepath] found org.eclipse.jgit#org.eclipse.jgit;4.6.0.201612231935-r in public
[ivy:cachepath] found com.jcraft#jsch;0.1.53 in public
[ivy:cachepath] found com.googlecode.javaewah#JavaEWAH;1.1.6 in public
[ivy:cachepath] found org.apache.httpcomponents#httpclient;4.3.6 in public
[ivy:cachepath] found org.apache.httpcomponents#httpcore;4.3.3 in public
[ivy:cachepath] found commons-logging#commons-logging;1.1.3 in public
[ivy:cachepath] found commons-codec#commons-codec;1.6 in public
[ivy:cachepath] found org.slf4j#slf4j-api;1.7.2 in public
[ivy:cachepath] :: resolution report :: resolve 164ms :: artifacts dl 37ms
        ---------------------------------------------------------------------
        |                  |            modules            ||   artifacts   |
        |       conf       | number| search|dwnlded|evicted|| number|dwnlded|
        ---------------------------------------------------------------------
        |      default     |   8   |   0   |   0   |   0   ||   8   |   0   |
        ---------------------------------------------------------------------
[wc-checker] Initializing working copy...
[wc-checker] SLF4J: Failed to load class "org.slf4j.impl.StaticLoggerBinder".
[wc-checker] SLF4J: Defaulting to no-operation (NOP) logger implementation
[wc-checker] SLF4J: See http://www.slf4j.org/codes.html#StaticLoggerBinder for further details.
[wc-checker] Checking working copy status...

-jenkins-base:

BUILD SUCCESSFUL
Total time: 202 minutes 4 seconds
Archiving artifacts
java.lang.InterruptedException: no matches found within 10000
        at hudson.FilePath$34.hasMatch(FilePath.java:2678)
        at hudson.FilePath$34.invoke(FilePath.java:2557)
        at hudson.FilePath$34.invoke(FilePath.java:2547)
        at hudson.FilePath$FileCallableWrapper.call(FilePath.java:2918)
Also:   hudson.remoting.Channel$CallSiteStackTrace: Remote call to lucene2
                at hudson.remoting.Channel.attachCallSiteStackTrace(Channel.java:1741)
                at hudson.remoting.UserRequest$ExceptionResponse.retrieve(UserRequest.java:357)
                at hudson.remoting.Channel.call(Channel.java:955)
                at hudson.FilePath.act(FilePath.java:1036)
                at hudson.FilePath.act(FilePath.java:1025)
                at hudson.FilePath.validateAntFileMask(FilePath.java:2547)
                at hudson.tasks.ArtifactArchiver.perform(ArtifactArchiver.java:243)
                at hudson.tasks.BuildStepCompatibilityLayer.perform(BuildStepCompatibilityLayer.java:81)
                at hudson.tasks.BuildStepMonitor$1.perform(BuildStepMonitor.java:20)
                at hudson.model.AbstractBuild$AbstractBuildExecution.perform(AbstractBuild.java:744)
                at hudson.model.AbstractBuild$AbstractBuildExecution.performAllBuildSteps(AbstractBuild.java:690)
                at hudson.model.Build$BuildExecution.post2(Build.java:186)
                at hudson.model.AbstractBuild$AbstractBuildExecution.post(AbstractBuild.java:635)
                at hudson.model.Run.execute(Run.java:1819)
                at hudson.model.FreeStyleBuild.run(FreeStyleBuild.java:43)
                at hudson.model.ResourceController.execute(ResourceController.java:97)
                at hudson.model.Executor.run(Executor.java:429)
Caused: hudson.FilePath$TunneledInterruptedException
        at hudson.FilePath$FileCallableWrapper.call(FilePath.java:2920)
        at hudson.remoting.UserRequest.perform(UserRequest.java:212)
        at hudson.remoting.UserRequest.perform(UserRequest.java:54)
        at hudson.remoting.Request$2.run(Request.java:369)
        at hudson.remoting.InterceptingExecutorService$1.call(InterceptingExecutorService.java:72)
        at java.util.concurrent.FutureTask.run(FutureTask.java:266)
        at java.util.concurrent.ThreadPoolExecutor.runWorker(ThreadPoolExecutor.java:1142)
        at java.util.concurrent.ThreadPoolExecutor$Worker.run(ThreadPoolExecutor.java:617)
        at java.lang.Thread.run(Thread.java:748)
Caused: java.lang.InterruptedException: java.lang.InterruptedException: no matches found within 10000
        at hudson.FilePath.act(FilePath.java:1038)
        at hudson.FilePath.act(FilePath.java:1025)
        at hudson.FilePath.validateAntFileMask(FilePath.java:2547)
        at hudson.tasks.ArtifactArchiver.perform(ArtifactArchiver.java:243)
        at hudson.tasks.BuildStepCompatibilityLayer.perform(BuildStepCompatibilityLayer.java:81)
        at hudson.tasks.BuildStepMonitor$1.perform(BuildStepMonitor.java:20)
        at hudson.model.AbstractBuild$AbstractBuildExecution.perform(AbstractBuild.java:744)
        at hudson.model.AbstractBuild$AbstractBuildExecution.performAllBuildSteps(AbstractBuild.java:690)
        at hudson.model.Build$BuildExecution.post2(Build.java:186)
        at hudson.model.AbstractBuild$AbstractBuildExecution.post(AbstractBuild.java:635)
        at hudson.model.Run.execute(Run.java:1819)
        at hudson.model.FreeStyleBuild.run(FreeStyleBuild.java:43)
        at hudson.model.ResourceController.execute(ResourceController.java:97)
        at hudson.model.Executor.run(Executor.java:429)
No artifacts found that match the file pattern "**/*.events,heapdumps/**,**/hs_err_pid*". Configuration error?
Recording test results
Build step 'Publish JUnit test result report' changed build result to UNSTABLE
Email was triggered for: Unstable (Test Failures)
Sending email for trigger: Unstable (Test Failures)


---------------------------------------------------------------------
To unsubscribe, e-mail: [hidden email]
For additional commands, e-mail: [hidden email]