[JENKINS] Lucene-Solr-Tests-master - Build # 2866 - Unstable

classic Classic list List threaded Threaded
1 message Options
Reply | Threaded
Open this post in threaded view
|

[JENKINS] Lucene-Solr-Tests-master - Build # 2866 - Unstable

Apache Jenkins Server-2
Build: https://builds.apache.org/job/Lucene-Solr-Tests-master/2866/

2 tests failed.
FAILED:  org.apache.solr.client.solrj.impl.CloudSolrClientTest.testRouting

Error Message:
Error from server at http://127.0.0.1:38797/solr/collection1_shard2_replica_n3: Expected mime type application/octet-stream but got text/html. <html> <head> <meta http-equiv="Content-Type" content="text/html;charset=utf-8"/> <title>Error 404 Can not find: /solr/collection1_shard2_replica_n3/update</title> </head> <body><h2>HTTP ERROR 404</h2> <p>Problem accessing /solr/collection1_shard2_replica_n3/update. Reason: <pre>    Can not find: /solr/collection1_shard2_replica_n3/update</pre></p><hr><a href="http://eclipse.org/jetty">Powered by Jetty:// 9.4.11.v20180605</a><hr/>  </body> </html>

Stack Trace:
org.apache.solr.client.solrj.impl.CloudSolrClient$RouteException: Error from server at http://127.0.0.1:38797/solr/collection1_shard2_replica_n3: Expected mime type application/octet-stream but got text/html. <html>
<head>
<meta http-equiv="Content-Type" content="text/html;charset=utf-8"/>
<title>Error 404 Can not find: /solr/collection1_shard2_replica_n3/update</title>
</head>
<body><h2>HTTP ERROR 404</h2>
<p>Problem accessing /solr/collection1_shard2_replica_n3/update. Reason:
<pre>    Can not find: /solr/collection1_shard2_replica_n3/update</pre></p><hr><a href="http://eclipse.org/jetty">Powered by Jetty:// 9.4.11.v20180605</a><hr/>

</body>
</html>

        at __randomizedtesting.SeedInfo.seed([939F7A6612DD48C3:5128460E119DB8BB]:0)
        at org.apache.solr.client.solrj.impl.CloudSolrClient.directUpdate(CloudSolrClient.java:551)
        at org.apache.solr.client.solrj.impl.CloudSolrClient.sendRequest(CloudSolrClient.java:1016)
        at org.apache.solr.client.solrj.impl.CloudSolrClient.requestWithRetryOnStaleState(CloudSolrClient.java:884)
        at org.apache.solr.client.solrj.impl.CloudSolrClient.requestWithRetryOnStaleState(CloudSolrClient.java:949)
        at org.apache.solr.client.solrj.impl.CloudSolrClient.requestWithRetryOnStaleState(CloudSolrClient.java:949)
        at org.apache.solr.client.solrj.impl.CloudSolrClient.requestWithRetryOnStaleState(CloudSolrClient.java:949)
        at org.apache.solr.client.solrj.impl.CloudSolrClient.requestWithRetryOnStaleState(CloudSolrClient.java:949)
        at org.apache.solr.client.solrj.impl.CloudSolrClient.requestWithRetryOnStaleState(CloudSolrClient.java:949)
        at org.apache.solr.client.solrj.impl.CloudSolrClient.request(CloudSolrClient.java:817)
        at org.apache.solr.client.solrj.impl.CloudSolrClientTest.testRouting(CloudSolrClientTest.java:238)
        at sun.reflect.NativeMethodAccessorImpl.invoke0(Native Method)
        at sun.reflect.NativeMethodAccessorImpl.invoke(NativeMethodAccessorImpl.java:62)
        at sun.reflect.DelegatingMethodAccessorImpl.invoke(DelegatingMethodAccessorImpl.java:43)
        at java.lang.reflect.Method.invoke(Method.java:498)
        at com.carrotsearch.randomizedtesting.RandomizedRunner.invoke(RandomizedRunner.java:1742)
        at com.carrotsearch.randomizedtesting.RandomizedRunner$8.evaluate(RandomizedRunner.java:935)
        at com.carrotsearch.randomizedtesting.RandomizedRunner$9.evaluate(RandomizedRunner.java:971)
        at com.carrotsearch.randomizedtesting.RandomizedRunner$10.evaluate(RandomizedRunner.java:985)
        at org.junit.rules.ExpectedException$ExpectedExceptionStatement.evaluate(ExpectedException.java:110)
        at com.carrotsearch.randomizedtesting.rules.SystemPropertiesRestoreRule$1.evaluate(SystemPropertiesRestoreRule.java:57)
        at org.apache.lucene.util.TestRuleSetupTeardownChained$1.evaluate(TestRuleSetupTeardownChained.java:49)
        at org.apache.lucene.util.AbstractBeforeAfterRule$1.evaluate(AbstractBeforeAfterRule.java:45)
        at org.apache.lucene.util.TestRuleThreadAndTestName$1.evaluate(TestRuleThreadAndTestName.java:48)
        at org.apache.lucene.util.TestRuleIgnoreAfterMaxFailures$1.evaluate(TestRuleIgnoreAfterMaxFailures.java:64)
        at org.apache.lucene.util.TestRuleMarkFailure$1.evaluate(TestRuleMarkFailure.java:47)
        at com.carrotsearch.randomizedtesting.rules.StatementAdapter.evaluate(StatementAdapter.java:36)
        at com.carrotsearch.randomizedtesting.ThreadLeakControl$StatementRunner.run(ThreadLeakControl.java:368)
        at com.carrotsearch.randomizedtesting.ThreadLeakControl.forkTimeoutingTask(ThreadLeakControl.java:817)
        at com.carrotsearch.randomizedtesting.ThreadLeakControl$3.evaluate(ThreadLeakControl.java:468)
        at com.carrotsearch.randomizedtesting.RandomizedRunner.runSingleTest(RandomizedRunner.java:944)
        at com.carrotsearch.randomizedtesting.RandomizedRunner$5.evaluate(RandomizedRunner.java:830)
        at com.carrotsearch.randomizedtesting.RandomizedRunner$6.evaluate(RandomizedRunner.java:880)
        at com.carrotsearch.randomizedtesting.RandomizedRunner$7.evaluate(RandomizedRunner.java:891)
        at com.carrotsearch.randomizedtesting.rules.StatementAdapter.evaluate(StatementAdapter.java:36)
        at com.carrotsearch.randomizedtesting.rules.SystemPropertiesRestoreRule$1.evaluate(SystemPropertiesRestoreRule.java:57)
        at org.apache.lucene.util.AbstractBeforeAfterRule$1.evaluate(AbstractBeforeAfterRule.java:45)
        at com.carrotsearch.randomizedtesting.rules.StatementAdapter.evaluate(StatementAdapter.java:36)
        at org.apache.lucene.util.TestRuleStoreClassName$1.evaluate(TestRuleStoreClassName.java:41)
        at com.carrotsearch.randomizedtesting.rules.NoShadowingOrOverridesOnMethodsRule$1.evaluate(NoShadowingOrOverridesOnMethodsRule.java:40)
        at com.carrotsearch.randomizedtesting.rules.NoShadowingOrOverridesOnMethodsRule$1.evaluate(NoShadowingOrOverridesOnMethodsRule.java:40)
        at com.carrotsearch.randomizedtesting.rules.StatementAdapter.evaluate(StatementAdapter.java:36)
        at com.carrotsearch.randomizedtesting.rules.StatementAdapter.evaluate(StatementAdapter.java:36)
        at com.carrotsearch.randomizedtesting.rules.StatementAdapter.evaluate(StatementAdapter.java:36)
        at org.apache.lucene.util.TestRuleAssertionsRequired$1.evaluate(TestRuleAssertionsRequired.java:53)
        at org.apache.lucene.util.TestRuleMarkFailure$1.evaluate(TestRuleMarkFailure.java:47)
        at org.apache.lucene.util.TestRuleIgnoreAfterMaxFailures$1.evaluate(TestRuleIgnoreAfterMaxFailures.java:64)
        at org.apache.lucene.util.TestRuleIgnoreTestSuites$1.evaluate(TestRuleIgnoreTestSuites.java:54)
        at com.carrotsearch.randomizedtesting.rules.StatementAdapter.evaluate(StatementAdapter.java:36)
        at com.carrotsearch.randomizedtesting.ThreadLeakControl$StatementRunner.run(ThreadLeakControl.java:368)
        at java.lang.Thread.run(Thread.java:748)
Caused by: org.apache.solr.client.solrj.impl.HttpSolrClient$RemoteSolrException: Error from server at http://127.0.0.1:38797/solr/collection1_shard2_replica_n3: Expected mime type application/octet-stream but got text/html. <html>
<head>
<meta http-equiv="Content-Type" content="text/html;charset=utf-8"/>
<title>Error 404 Can not find: /solr/collection1_shard2_replica_n3/update</title>
</head>
<body><h2>HTTP ERROR 404</h2>
<p>Problem accessing /solr/collection1_shard2_replica_n3/update. Reason:
<pre>    Can not find: /solr/collection1_shard2_replica_n3/update</pre></p><hr><a href="http://eclipse.org/jetty">Powered by Jetty:// 9.4.11.v20180605</a><hr/>

</body>
</html>

        at org.apache.solr.client.solrj.impl.HttpSolrClient.executeMethod(HttpSolrClient.java:607)
        at org.apache.solr.client.solrj.impl.HttpSolrClient.request(HttpSolrClient.java:255)
        at org.apache.solr.client.solrj.impl.HttpSolrClient.request(HttpSolrClient.java:244)
        at org.apache.solr.client.solrj.impl.LBHttpSolrClient.doRequest(LBHttpSolrClient.java:483)
        at org.apache.solr.client.solrj.impl.LBHttpSolrClient.request(LBHttpSolrClient.java:413)
        at org.apache.solr.client.solrj.impl.CloudSolrClient.lambda$directUpdate$0(CloudSolrClient.java:528)
        at java.util.concurrent.FutureTask.run(FutureTask.java:266)
        at org.apache.solr.common.util.ExecutorUtil$MDCAwareThreadPoolExecutor.lambda$execute$0(ExecutorUtil.java:209)
        at java.util.concurrent.ThreadPoolExecutor.runWorker(ThreadPoolExecutor.java:1149)
        at java.util.concurrent.ThreadPoolExecutor$Worker.run(ThreadPoolExecutor.java:624)
        ... 1 more


FAILED:  org.apache.solr.client.solrj.impl.CloudSolrClientTest.testParallelUpdateQTime

Error Message:
Error from server at http://127.0.0.1:38797/solr/collection1_shard2_replica_n3: Expected mime type application/octet-stream but got text/html. <html> <head> <meta http-equiv="Content-Type" content="text/html;charset=utf-8"/> <title>Error 404 Can not find: /solr/collection1_shard2_replica_n3/update</title> </head> <body><h2>HTTP ERROR 404</h2> <p>Problem accessing /solr/collection1_shard2_replica_n3/update. Reason: <pre>    Can not find: /solr/collection1_shard2_replica_n3/update</pre></p><hr><a href="http://eclipse.org/jetty">Powered by Jetty:// 9.4.11.v20180605</a><hr/>  </body> </html>

Stack Trace:
org.apache.solr.client.solrj.impl.CloudSolrClient$RouteException: Error from server at http://127.0.0.1:38797/solr/collection1_shard2_replica_n3: Expected mime type application/octet-stream but got text/html. <html>
<head>
<meta http-equiv="Content-Type" content="text/html;charset=utf-8"/>
<title>Error 404 Can not find: /solr/collection1_shard2_replica_n3/update</title>
</head>
<body><h2>HTTP ERROR 404</h2>
<p>Problem accessing /solr/collection1_shard2_replica_n3/update. Reason:
<pre>    Can not find: /solr/collection1_shard2_replica_n3/update</pre></p><hr><a href="http://eclipse.org/jetty">Powered by Jetty:// 9.4.11.v20180605</a><hr/>

</body>
</html>

        at __randomizedtesting.SeedInfo.seed([939F7A6612DD48C3:7D4701F75CA29D50]:0)
        at org.apache.solr.client.solrj.impl.CloudSolrClient.directUpdate(CloudSolrClient.java:551)
        at org.apache.solr.client.solrj.impl.CloudSolrClient.sendRequest(CloudSolrClient.java:1016)
        at org.apache.solr.client.solrj.impl.CloudSolrClient.requestWithRetryOnStaleState(CloudSolrClient.java:884)
        at org.apache.solr.client.solrj.impl.CloudSolrClient.requestWithRetryOnStaleState(CloudSolrClient.java:949)
        at org.apache.solr.client.solrj.impl.CloudSolrClient.requestWithRetryOnStaleState(CloudSolrClient.java:949)
        at org.apache.solr.client.solrj.impl.CloudSolrClient.requestWithRetryOnStaleState(CloudSolrClient.java:949)
        at org.apache.solr.client.solrj.impl.CloudSolrClient.requestWithRetryOnStaleState(CloudSolrClient.java:949)
        at org.apache.solr.client.solrj.impl.CloudSolrClient.requestWithRetryOnStaleState(CloudSolrClient.java:949)
        at org.apache.solr.client.solrj.impl.CloudSolrClient.request(CloudSolrClient.java:817)
        at org.apache.solr.client.solrj.SolrRequest.process(SolrRequest.java:194)
        at org.apache.solr.client.solrj.impl.CloudSolrClientTest.testParallelUpdateQTime(CloudSolrClientTest.java:146)
        at sun.reflect.NativeMethodAccessorImpl.invoke0(Native Method)
        at sun.reflect.NativeMethodAccessorImpl.invoke(NativeMethodAccessorImpl.java:62)
        at sun.reflect.DelegatingMethodAccessorImpl.invoke(DelegatingMethodAccessorImpl.java:43)
        at java.lang.reflect.Method.invoke(Method.java:498)
        at com.carrotsearch.randomizedtesting.RandomizedRunner.invoke(RandomizedRunner.java:1742)
        at com.carrotsearch.randomizedtesting.RandomizedRunner$8.evaluate(RandomizedRunner.java:935)
        at com.carrotsearch.randomizedtesting.RandomizedRunner$9.evaluate(RandomizedRunner.java:971)
        at com.carrotsearch.randomizedtesting.RandomizedRunner$10.evaluate(RandomizedRunner.java:985)
        at org.junit.rules.ExpectedException$ExpectedExceptionStatement.evaluate(ExpectedException.java:110)
        at com.carrotsearch.randomizedtesting.rules.SystemPropertiesRestoreRule$1.evaluate(SystemPropertiesRestoreRule.java:57)
        at org.apache.lucene.util.TestRuleSetupTeardownChained$1.evaluate(TestRuleSetupTeardownChained.java:49)
        at org.apache.lucene.util.AbstractBeforeAfterRule$1.evaluate(AbstractBeforeAfterRule.java:45)
        at org.apache.lucene.util.TestRuleThreadAndTestName$1.evaluate(TestRuleThreadAndTestName.java:48)
        at org.apache.lucene.util.TestRuleIgnoreAfterMaxFailures$1.evaluate(TestRuleIgnoreAfterMaxFailures.java:64)
        at org.apache.lucene.util.TestRuleMarkFailure$1.evaluate(TestRuleMarkFailure.java:47)
        at com.carrotsearch.randomizedtesting.rules.StatementAdapter.evaluate(StatementAdapter.java:36)
        at com.carrotsearch.randomizedtesting.ThreadLeakControl$StatementRunner.run(ThreadLeakControl.java:368)
        at com.carrotsearch.randomizedtesting.ThreadLeakControl.forkTimeoutingTask(ThreadLeakControl.java:817)
        at com.carrotsearch.randomizedtesting.ThreadLeakControl$3.evaluate(ThreadLeakControl.java:468)
        at com.carrotsearch.randomizedtesting.RandomizedRunner.runSingleTest(RandomizedRunner.java:944)
        at com.carrotsearch.randomizedtesting.RandomizedRunner$5.evaluate(RandomizedRunner.java:830)
        at com.carrotsearch.randomizedtesting.RandomizedRunner$6.evaluate(RandomizedRunner.java:880)
        at com.carrotsearch.randomizedtesting.RandomizedRunner$7.evaluate(RandomizedRunner.java:891)
        at com.carrotsearch.randomizedtesting.rules.StatementAdapter.evaluate(StatementAdapter.java:36)
        at com.carrotsearch.randomizedtesting.rules.SystemPropertiesRestoreRule$1.evaluate(SystemPropertiesRestoreRule.java:57)
        at org.apache.lucene.util.AbstractBeforeAfterRule$1.evaluate(AbstractBeforeAfterRule.java:45)
        at com.carrotsearch.randomizedtesting.rules.StatementAdapter.evaluate(StatementAdapter.java:36)
        at org.apache.lucene.util.TestRuleStoreClassName$1.evaluate(TestRuleStoreClassName.java:41)
        at com.carrotsearch.randomizedtesting.rules.NoShadowingOrOverridesOnMethodsRule$1.evaluate(NoShadowingOrOverridesOnMethodsRule.java:40)
        at com.carrotsearch.randomizedtesting.rules.NoShadowingOrOverridesOnMethodsRule$1.evaluate(NoShadowingOrOverridesOnMethodsRule.java:40)
        at com.carrotsearch.randomizedtesting.rules.StatementAdapter.evaluate(StatementAdapter.java:36)
        at com.carrotsearch.randomizedtesting.rules.StatementAdapter.evaluate(StatementAdapter.java:36)
        at com.carrotsearch.randomizedtesting.rules.StatementAdapter.evaluate(StatementAdapter.java:36)
        at org.apache.lucene.util.TestRuleAssertionsRequired$1.evaluate(TestRuleAssertionsRequired.java:53)
        at org.apache.lucene.util.TestRuleMarkFailure$1.evaluate(TestRuleMarkFailure.java:47)
        at org.apache.lucene.util.TestRuleIgnoreAfterMaxFailures$1.evaluate(TestRuleIgnoreAfterMaxFailures.java:64)
        at org.apache.lucene.util.TestRuleIgnoreTestSuites$1.evaluate(TestRuleIgnoreTestSuites.java:54)
        at com.carrotsearch.randomizedtesting.rules.StatementAdapter.evaluate(StatementAdapter.java:36)
        at com.carrotsearch.randomizedtesting.ThreadLeakControl$StatementRunner.run(ThreadLeakControl.java:368)
        at java.lang.Thread.run(Thread.java:748)
Caused by: org.apache.solr.client.solrj.impl.HttpSolrClient$RemoteSolrException: Error from server at http://127.0.0.1:38797/solr/collection1_shard2_replica_n3: Expected mime type application/octet-stream but got text/html. <html>
<head>
<meta http-equiv="Content-Type" content="text/html;charset=utf-8"/>
<title>Error 404 Can not find: /solr/collection1_shard2_replica_n3/update</title>
</head>
<body><h2>HTTP ERROR 404</h2>
<p>Problem accessing /solr/collection1_shard2_replica_n3/update. Reason:
<pre>    Can not find: /solr/collection1_shard2_replica_n3/update</pre></p><hr><a href="http://eclipse.org/jetty">Powered by Jetty:// 9.4.11.v20180605</a><hr/>

</body>
</html>

        at org.apache.solr.client.solrj.impl.HttpSolrClient.executeMethod(HttpSolrClient.java:607)
        at org.apache.solr.client.solrj.impl.HttpSolrClient.request(HttpSolrClient.java:255)
        at org.apache.solr.client.solrj.impl.HttpSolrClient.request(HttpSolrClient.java:244)
        at org.apache.solr.client.solrj.impl.LBHttpSolrClient.doRequest(LBHttpSolrClient.java:483)
        at org.apache.solr.client.solrj.impl.LBHttpSolrClient.request(LBHttpSolrClient.java:413)
        at org.apache.solr.client.solrj.impl.CloudSolrClient.lambda$directUpdate$0(CloudSolrClient.java:528)
        at java.util.concurrent.FutureTask.run(FutureTask.java:266)
        at org.apache.solr.common.util.ExecutorUtil$MDCAwareThreadPoolExecutor.lambda$execute$0(ExecutorUtil.java:209)
        at java.util.concurrent.ThreadPoolExecutor.runWorker(ThreadPoolExecutor.java:1149)
        at java.util.concurrent.ThreadPoolExecutor$Worker.run(ThreadPoolExecutor.java:624)
        ... 1 more




Build Log:
[...truncated 16397 lines...]
   [junit4] Suite: org.apache.solr.client.solrj.impl.CloudSolrClientTest
   [junit4]   2> Creating dataDir: /x1/jenkins/jenkins-slave/workspace/Lucene-Solr-Tests-master/solr/build/solr-solrj/test/J1/temp/solr.client.solrj.impl.CloudSolrClientTest_939F7A6612DD48C3-001/init-core-data-001
   [junit4]   1> 16:29:00.752 [Thread-237] ERROR org.apache.zookeeper.server.ZooKeeperServer - ZKShutdownHandler is not registered, so ZooKeeper server won't take any action on ERROR or SHUTDOWN server state changes
   [junit4]   1> 16:29:00.865 [jetty-launcher-390-thread-3] ERROR org.apache.solr.util.StartupLoggingUtils - Missing Java Option solr.log.dir. Logging may be missing or incomplete.
   [junit4]   1> 16:29:00.873 [jetty-launcher-390-thread-2] ERROR org.apache.solr.util.StartupLoggingUtils - Missing Java Option solr.log.dir. Logging may be missing or incomplete.
   [junit4]   1> 16:29:00.892 [jetty-launcher-390-thread-1] ERROR org.apache.solr.util.StartupLoggingUtils - Missing Java Option solr.log.dir. Logging may be missing or incomplete.
   [junit4]   1> 16:29:01.971 [TEST-CloudSolrClientTest.testShutdown-seed#[939F7A6612DD48C3]-SendThread(ff01::114:33332)] ERROR org.apache.zookeeper.ClientCnxnSocketNIO - Unable to open socket to ff01::114/ff01:0:0:0:0:0:0:114:33332
   [junit4]   1> 16:29:03.110 [TEST-CloudSolrClientTest.testShutdown-seed#[939F7A6612DD48C3]-SendThread(ff01::114:33332)] ERROR org.apache.zookeeper.ClientCnxnSocketNIO - Unable to open socket to ff01::114/ff01:0:0:0:0:0:0:114:33332
   [junit4]   1> 16:29:24.796 [indexFetcher-775-thread-1] ERROR org.apache.solr.handler.ReplicationHandler - Index fetch failed :java.lang.NullPointerException
   [junit4]   1> at org.apache.solr.handler.IndexFetcher.getLeaderReplica(IndexFetcher.java:688)
   [junit4]   1> at org.apache.solr.handler.IndexFetcher.fetchLatestIndex(IndexFetcher.java:382)
   [junit4]   1> at org.apache.solr.handler.IndexFetcher.fetchLatestIndex(IndexFetcher.java:347)
   [junit4]   1> at org.apache.solr.handler.ReplicationHandler.doFetch(ReplicationHandler.java:421)
   [junit4]   1> at org.apache.solr.handler.ReplicationHandler.lambda$setupPolling$13(ReplicationHandler.java:1156)
   [junit4]   1> at java.util.concurrent.Executors$RunnableAdapter.call(Executors.java:511)
   [junit4]   1> at java.util.concurrent.FutureTask.runAndReset(FutureTask.java:308)
   [junit4]   1> at java.util.concurrent.ScheduledThreadPoolExecutor$ScheduledFutureTask.access$301(ScheduledThreadPoolExecutor.java:180)
   [junit4]   1> at java.util.concurrent.ScheduledThreadPoolExecutor$ScheduledFutureTask.run(ScheduledThreadPoolExecutor.java:294)
   [junit4]   1> at java.util.concurrent.ThreadPoolExecutor.runWorker(ThreadPoolExecutor.java:1149)
   [junit4]   1> at java.util.concurrent.ThreadPoolExecutor$Worker.run(ThreadPoolExecutor.java:624)
   [junit4]   1> at java.lang.Thread.run(Thread.java:748)
   [junit4]   1>
   [junit4]   1> 16:29:28.623 [TEST-CloudSolrClientTest.testRouting-seed#[939F7A6612DD48C3]] ERROR org.apache.solr.client.solrj.impl.CloudSolrClient - Request to collection [collection1] failed due to (404) org.apache.solr.client.solrj.impl.HttpSolrClient$RemoteSolrException: Error from server at http://127.0.0.1:38797/solr/collection1_shard2_replica_n3: Expected mime type application/octet-stream but got text/html. <html>
   [junit4]   1> <head>
   [junit4]   1> <meta http-equiv="Content-Type" content="text/html;charset=utf-8"/>
   [junit4]   1> <title>Error 404 Can not find: /solr/collection1_shard2_replica_n3/update</title>
   [junit4]   1> </head>
   [junit4]   1> <body><h2>HTTP ERROR 404</h2>
   [junit4]   1> <p>Problem accessing /solr/collection1_shard2_replica_n3/update. Reason:
   [junit4]   1> <pre>    Can not find: /solr/collection1_shard2_replica_n3/update</pre></p><hr><a href="http://eclipse.org/jetty">Powered by Jetty:// 9.4.11.v20180605</a><hr/>
   [junit4]   1>
   [junit4]   1> </body>
   [junit4]   1> </html>
   [junit4]   1> , retry? 0
   [junit4]   1> 16:29:28.644 [TEST-CloudSolrClientTest.testRouting-seed#[939F7A6612DD48C3]] ERROR org.apache.solr.client.solrj.impl.CloudSolrClient - Request to collection [collection1] failed due to (404) org.apache.solr.client.solrj.impl.HttpSolrClient$RemoteSolrException: Error from server at http://127.0.0.1:38797/solr/collection1_shard2_replica_n3: Expected mime type application/octet-stream but got text/html. <html>
   [junit4]   1> <head>
   [junit4]   1> <meta http-equiv="Content-Type" content="text/html;charset=utf-8"/>
   [junit4]   1> <title>Error 404 Can not find: /solr/collection1_shard2_replica_n3/update</title>
   [junit4]   1> </head>
   [junit4]   1> <body><h2>HTTP ERROR 404</h2>
   [junit4]   1> <p>Problem accessing /solr/collection1_shard2_replica_n3/update. Reason:
   [junit4]   1> <pre>    Can not find: /solr/collection1_shard2_replica_n3/update</pre></p><hr><a href="http://eclipse.org/jetty">Powered by Jetty:// 9.4.11.v20180605</a><hr/>
   [junit4]   1>
   [junit4]   1> </body>
   [junit4]   1> </html>
   [junit4]   1> , retry? 1
   [junit4]   1> 16:29:28.652 [TEST-CloudSolrClientTest.testRouting-seed#[939F7A6612DD48C3]] ERROR org.apache.solr.client.solrj.impl.CloudSolrClient - Request to collection [collection1] failed due to (404) org.apache.solr.client.solrj.impl.HttpSolrClient$RemoteSolrException: Error from server at http://127.0.0.1:38797/solr/collection1_shard2_replica_n3: Expected mime type application/octet-stream but got text/html. <html>
   [junit4]   1> <head>
   [junit4]   1> <meta http-equiv="Content-Type" content="text/html;charset=utf-8"/>
   [junit4]   1> <title>Error 404 Can not find: /solr/collection1_shard2_replica_n3/update</title>
   [junit4]   1> </head>
   [junit4]   1> <body><h2>HTTP ERROR 404</h2>
   [junit4]   1> <p>Problem accessing /solr/collection1_shard2_replica_n3/update. Reason:
   [junit4]   1> <pre>    Can not find: /solr/collection1_shard2_replica_n3/update</pre></p><hr><a href="http://eclipse.org/jetty">Powered by Jetty:// 9.4.11.v20180605</a><hr/>
   [junit4]   1>
   [junit4]   1> </body>
   [junit4]   1> </html>
   [junit4]   1> , retry? 2
   [junit4]   1> 16:29:28.660 [TEST-CloudSolrClientTest.testRouting-seed#[939F7A6612DD48C3]] ERROR org.apache.solr.client.solrj.impl.CloudSolrClient - Request to collection [collection1] failed due to (404) org.apache.solr.client.solrj.impl.HttpSolrClient$RemoteSolrException: Error from server at http://127.0.0.1:38797/solr/collection1_shard2_replica_n3: Expected mime type application/octet-stream but got text/html. <html>
   [junit4]   1> <head>
   [junit4]   1> <meta http-equiv="Content-Type" content="text/html;charset=utf-8"/>
   [junit4]   1> <title>Error 404 Can not find: /solr/collection1_shard2_replica_n3/update</title>
   [junit4]   1> </head>
   [junit4]   1> <body><h2>HTTP ERROR 404</h2>
   [junit4]   1> <p>Problem accessing /solr/collection1_shard2_replica_n3/update. Reason:
   [junit4]   1> <pre>    Can not find: /solr/collection1_shard2_replica_n3/update</pre></p><hr><a href="http://eclipse.org/jetty">Powered by Jetty:// 9.4.11.v20180605</a><hr/>
   [junit4]   1>
   [junit4]   1> </body>
   [junit4]   1> </html>
   [junit4]   1> , retry? 3
   [junit4]   1> 16:29:28.666 [TEST-CloudSolrClientTest.testRouting-seed#[939F7A6612DD48C3]] ERROR org.apache.solr.client.solrj.impl.CloudSolrClient - Request to collection [collection1] failed due to (404) org.apache.solr.client.solrj.impl.HttpSolrClient$RemoteSolrException: Error from server at http://127.0.0.1:38797/solr/collection1_shard2_replica_n3: Expected mime type application/octet-stream but got text/html. <html>
   [junit4]   1> <head>
   [junit4]   1> <meta http-equiv="Content-Type" content="text/html;charset=utf-8"/>
   [junit4]   1> <title>Error 404 Can not find: /solr/collection1_shard2_replica_n3/update</title>
   [junit4]   1> </head>
   [junit4]   1> <body><h2>HTTP ERROR 404</h2>
   [junit4]   1> <p>Problem accessing /solr/collection1_shard2_replica_n3/update. Reason:
   [junit4]   1> <pre>    Can not find: /solr/collection1_shard2_replica_n3/update</pre></p><hr><a href="http://eclipse.org/jetty">Powered by Jetty:// 9.4.11.v20180605</a><hr/>
   [junit4]   1>
   [junit4]   1> </body>
   [junit4]   1> </html>
   [junit4]   1> , retry? 4
   [junit4]   1> 16:29:28.670 [TEST-CloudSolrClientTest.testRouting-seed#[939F7A6612DD48C3]] ERROR org.apache.solr.client.solrj.impl.CloudSolrClient - Request to collection [collection1] failed due to (404) org.apache.solr.client.solrj.impl.HttpSolrClient$RemoteSolrException: Error from server at http://127.0.0.1:38797/solr/collection1_shard2_replica_n3: Expected mime type application/octet-stream but got text/html. <html>
   [junit4]   1> <head>
   [junit4]   1> <meta http-equiv="Content-Type" content="text/html;charset=utf-8"/>
   [junit4]   1> <title>Error 404 Can not find: /solr/collection1_shard2_replica_n3/update</title>
   [junit4]   1> </head>
   [junit4]   1> <body><h2>HTTP ERROR 404</h2>
   [junit4]   1> <p>Problem accessing /solr/collection1_shard2_replica_n3/update. Reason:
   [junit4]   1> <pre>    Can not find: /solr/collection1_shard2_replica_n3/update</pre></p><hr><a href="http://eclipse.org/jetty">Powered by Jetty:// 9.4.11.v20180605</a><hr/>
   [junit4]   1>
   [junit4]   1> </body>
   [junit4]   1> </html>
   [junit4]   1> , retry? 5
   [junit4]   2> NOTE: reproduce with: ant test  -Dtestcase=CloudSolrClientTest -Dtests.method=testRouting -Dtests.seed=939F7A6612DD48C3 -Dtests.multiplier=2 -Dtests.slow=true -Dtests.locale=ko-KR -Dtests.timezone=America/Indiana/Petersburg -Dtests.asserts=true -Dtests.file.encoding=ISO-8859-1
   [junit4] ERROR   4.19s J1 | CloudSolrClientTest.testRouting <<<
   [junit4]    > Throwable #1: org.apache.solr.client.solrj.impl.CloudSolrClient$RouteException: Error from server at http://127.0.0.1:38797/solr/collection1_shard2_replica_n3: Expected mime type application/octet-stream but got text/html. <html>
   [junit4]    > <head>
   [junit4]    > <meta http-equiv="Content-Type" content="text/html;charset=utf-8"/>
   [junit4]    > <title>Error 404 Can not find: /solr/collection1_shard2_replica_n3/update</title>
   [junit4]    > </head>
   [junit4]    > <body><h2>HTTP ERROR 404</h2>
   [junit4]    > <p>Problem accessing /solr/collection1_shard2_replica_n3/update. Reason:
   [junit4]    > <pre>    Can not find: /solr/collection1_shard2_replica_n3/update</pre></p><hr><a href="http://eclipse.org/jetty">Powered by Jetty:// 9.4.11.v20180605</a><hr/>
   [junit4]    > </body>
   [junit4]    > </html>
   [junit4]    > at __randomizedtesting.SeedInfo.seed([939F7A6612DD48C3:5128460E119DB8BB]:0)
   [junit4]    > at org.apache.solr.client.solrj.impl.CloudSolrClient.directUpdate(CloudSolrClient.java:551)
   [junit4]    > at org.apache.solr.client.solrj.impl.CloudSolrClient.sendRequest(CloudSolrClient.java:1016)
   [junit4]    > at org.apache.solr.client.solrj.impl.CloudSolrClient.requestWithRetryOnStaleState(CloudSolrClient.java:884)
   [junit4]    > at org.apache.solr.client.solrj.impl.CloudSolrClient.requestWithRetryOnStaleState(CloudSolrClient.java:949)
   [junit4]    > at org.apache.solr.client.solrj.impl.CloudSolrClient.requestWithRetryOnStaleState(CloudSolrClient.java:949)
   [junit4]    > at org.apache.solr.client.solrj.impl.CloudSolrClient.requestWithRetryOnStaleState(CloudSolrClient.java:949)
   [junit4]    > at org.apache.solr.client.solrj.impl.CloudSolrClient.requestWithRetryOnStaleState(CloudSolrClient.java:949)
   [junit4]    > at org.apache.solr.client.solrj.impl.CloudSolrClient.requestWithRetryOnStaleState(CloudSolrClient.java:949)
   [junit4]    > at org.apache.solr.client.solrj.impl.CloudSolrClient.request(CloudSolrClient.java:817)
   [junit4]    > at org.apache.solr.client.solrj.impl.CloudSolrClientTest.testRouting(CloudSolrClientTest.java:238)
   [junit4]    > at java.lang.Thread.run(Thread.java:748)
   [junit4]    > Caused by: org.apache.solr.client.solrj.impl.HttpSolrClient$RemoteSolrException: Error from server at http://127.0.0.1:38797/solr/collection1_shard2_replica_n3: Expected mime type application/octet-stream but got text/html. <html>
   [junit4]    > <head>
   [junit4]    > <meta http-equiv="Content-Type" content="text/html;charset=utf-8"/>
   [junit4]    > <title>Error 404 Can not find: /solr/collection1_shard2_replica_n3/update</title>
   [junit4]    > </head>
   [junit4]    > <body><h2>HTTP ERROR 404</h2>
   [junit4]    > <p>Problem accessing /solr/collection1_shard2_replica_n3/update. Reason:
   [junit4]    > <pre>    Can not find: /solr/collection1_shard2_replica_n3/update</pre></p><hr><a href="http://eclipse.org/jetty">Powered by Jetty:// 9.4.11.v20180605</a><hr/>
   [junit4]    > </body>
   [junit4]    > </html>
   [junit4]    > at org.apache.solr.client.solrj.impl.HttpSolrClient.executeMethod(HttpSolrClient.java:607)
   [junit4]    > at org.apache.solr.client.solrj.impl.HttpSolrClient.request(HttpSolrClient.java:255)
   [junit4]    > at org.apache.solr.client.solrj.impl.HttpSolrClient.request(HttpSolrClient.java:244)
   [junit4]    > at org.apache.solr.client.solrj.impl.LBHttpSolrClient.doRequest(LBHttpSolrClient.java:483)
   [junit4]    > at org.apache.solr.client.solrj.impl.LBHttpSolrClient.request(LBHttpSolrClient.java:413)
   [junit4]    > at org.apache.solr.client.solrj.impl.CloudSolrClient.lambda$directUpdate$0(CloudSolrClient.java:528)
   [junit4]    > at java.util.concurrent.FutureTask.run(FutureTask.java:266)
   [junit4]    > at org.apache.solr.common.util.ExecutorUtil$MDCAwareThreadPoolExecutor.lambda$execute$0(ExecutorUtil.java:209)
   [junit4]    > at java.util.concurrent.ThreadPoolExecutor.runWorker(ThreadPoolExecutor.java:1149)
   [junit4]    > at java.util.concurrent.ThreadPoolExecutor$Worker.run(ThreadPoolExecutor.java:624)
   [junit4]    > ... 1 more
   [junit4]   1> -
   [junit4]   1> replica:core_node2 rstate:active live:true
   [junit4]   1> no one is recoverying
   [junit4]   1> -
   [junit4]   1> replica:core_node2 rstate:active live:true
   [junit4]   1> replica:core_node4 rstate:down live:true
   [junit4]   1> -
   [junit4]   1> replica:core_node2 rstate:active live:true
   [junit4]   1> replica:core_node4 rstate:recovering live:true
   [junit4]   1> -
   [junit4]   1> replica:core_node2 rstate:active live:true
   [junit4]   1> replica:core_node4 rstate:active live:true
   [junit4]   1> no one is recoverying
   [junit4]   1> -
   [junit4]   1> replica:core_node4 rstate:active live:true
   [junit4]   1> no one is recoverying
   [junit4]   1> 16:29:43.655 [TEST-CloudSolrClientTest.testRetryUpdatesWhenClusterStateIsStale-seed#[939F7A6612DD48C3]] ERROR org.apache.solr.client.solrj.impl.CloudSolrClient - Request to collection [stale_state_test_col] failed due to (404) org.apache.solr.client.solrj.impl.HttpSolrClient$RemoteSolrException: Error from server at http://127.0.0.1:33223/solr/stale_state_test_col_shard1_replica_n1: Expected mime type application/octet-stream but got text/html. <html>
   [junit4]   1> <head>
   [junit4]   1> <meta http-equiv="Content-Type" content="text/html;charset=utf-8"/>
   [junit4]   1> <title>Error 404 Can not find: /solr/stale_state_test_col_shard1_replica_n1/update</title>
   [junit4]   1> </head>
   [junit4]   1> <body><h2>HTTP ERROR 404</h2>
   [junit4]   1> <p>Problem accessing /solr/stale_state_test_col_shard1_replica_n1/update. Reason:
   [junit4]   1> <pre>    Can not find: /solr/stale_state_test_col_shard1_replica_n1/update</pre></p><hr><a href="http://eclipse.org/jetty">Powered by Jetty:// 9.4.11.v20180605</a><hr/>
   [junit4]   1>
   [junit4]   1> </body>
   [junit4]   1> </html>
   [junit4]   1> , retry? 0
   [junit4]   1> 16:29:59.630 [qtp1440776419-1510] ERROR org.apache.solr.handler.RequestHandlerBase - org.apache.solr.common.SolrException: Collection: boguscollectionname not found
   [junit4]   1> at org.apache.solr.handler.admin.ClusterStatus.getClusterStatus(ClusterStatus.java:103)
   [junit4]   1> at org.apache.solr.handler.admin.CollectionsHandler$CollectionOperation.lambda$static$22(CollectionsHandler.java:858)
   [junit4]   1> at org.apache.solr.handler.admin.CollectionsHandler$CollectionOperation.execute(CollectionsHandler.java:1170)
   [junit4]   1> at org.apache.solr.handler.admin.CollectionsHandler.invokeAction(CollectionsHandler.java:257)
   [junit4]   1> at org.apache.solr.handler.admin.CollectionsHandler.handleRequestBody(CollectionsHandler.java:245)
   [junit4]   1> at org.apache.solr.handler.RequestHandlerBase.handleRequest(RequestHandlerBase.java:199)
   [junit4]   1> at org.apache.solr.servlet.HttpSolrCall.handleAdmin(HttpSolrCall.java:734)
   [junit4]   1> at org.apache.solr.servlet.HttpSolrCall.handleAdminRequest(HttpSolrCall.java:715)
   [junit4]   1> at org.apache.solr.servlet.HttpSolrCall.call(HttpSolrCall.java:496)
   [junit4]   1> at org.apache.solr.servlet.SolrDispatchFilter.doFilter(SolrDispatchFilter.java:377)
   [junit4]   1> at org.apache.solr.servlet.SolrDispatchFilter.doFilter(SolrDispatchFilter.java:323)
   [junit4]   1> at org.eclipse.jetty.servlet.ServletHandler$CachedChain.doFilter(ServletHandler.java:1642)
   [junit4]   1> at org.apache.solr.client.solrj.embedded.JettySolrRunner$DebugFilter.doFilter(JettySolrRunner.java:139)
   [junit4]   1> at org.eclipse.jetty.servlet.ServletHandler$CachedChain.doFilter(ServletHandler.java:1642)
   [junit4]   1> at org.eclipse.jetty.servlet.ServletHandler.doHandle(ServletHandler.java:533)
   [junit4]   1> at org.eclipse.jetty.server.handler.ScopedHandler.nextHandle(ScopedHandler.java:255)
   [junit4]   1> at org.eclipse.jetty.server.session.SessionHandler.doHandle(SessionHandler.java:1595)
   [junit4]   1> at org.eclipse.jetty.server.handler.ScopedHandler.nextHandle(ScopedHandler.java:255)
   [junit4]   1> at org.eclipse.jetty.server.handler.ContextHandler.doHandle(ContextHandler.java:1317)
   [junit4]   1> at org.eclipse.jetty.server.handler.ScopedHandler.nextScope(ScopedHandler.java:203)
   [junit4]   1> at org.eclipse.jetty.servlet.ServletHandler.doScope(ServletHandler.java:473)
   [junit4]   1> at org.eclipse.jetty.server.session.SessionHandler.doScope(SessionHandler.java:1564)
   [junit4]   1> at org.eclipse.jetty.server.handler.ScopedHandler.nextScope(ScopedHandler.java:201)
   [junit4]   1> at org.eclipse.jetty.server.handler.ContextHandler.doScope(ContextHandler.java:1219)
   [junit4]   1> at org.eclipse.jetty.server.handler.ScopedHandler.handle(ScopedHandler.java:144)
   [junit4]   1> at org.eclipse.jetty.server.handler.gzip.GzipHandler.handle(GzipHandler.java:724)
   [junit4]   1> at org.eclipse.jetty.server.handler.HandlerWrapper.handle(HandlerWrapper.java:132)
   [junit4]   1> at org.eclipse.jetty.server.Server.handle(Server.java:531)
   [junit4]   1> at org.eclipse.jetty.server.HttpChannel.handle(HttpChannel.java:352)
   [junit4]   1> at org.eclipse.jetty.server.HttpConnection.onFillable(HttpConnection.java:260)
   [junit4]   1> at org.eclipse.jetty.io.AbstractConnection$ReadCallback.succeeded(AbstractConnection.java:281)
   [junit4]   1> at org.eclipse.jetty.io.FillInterest.fillable(FillInterest.java:102)
   [junit4]   1> at org.eclipse.jetty.io.ChannelEndPoint$2.run(ChannelEndPoint.java:118)
   [junit4]   1> at org.eclipse.jetty.util.thread.strategy.EatWhatYouKill.runTask(EatWhatYouKill.java:333)
   [junit4]   1> at org.eclipse.jetty.util.thread.strategy.EatWhatYouKill.doProduce(EatWhatYouKill.java:310)
   [junit4]   1> at org.eclipse.jetty.util.thread.strategy.EatWhatYouKill.tryProduce(EatWhatYouKill.java:168)
   [junit4]   1> at org.eclipse.jetty.util.thread.strategy.EatWhatYouKill.run(EatWhatYouKill.java:126)
   [junit4]   1> at org.eclipse.jetty.util.thread.ReservedThreadExecutor$ReservedThread.run(ReservedThreadExecutor.java:366)
   [junit4]   1> at org.eclipse.jetty.util.thread.QueuedThreadPool.runJob(QueuedThreadPool.java:762)
   [junit4]   1> at org.eclipse.jetty.util.thread.QueuedThreadPool$2.run(QueuedThreadPool.java:680)
   [junit4]   1> at java.lang.Thread.run(Thread.java:748)
   [junit4]   1>
   [junit4]   1> 16:29:59.640 [qtp1440776419-1510] ERROR org.apache.solr.handler.RequestHandlerBase - org.apache.solr.common.SolrException: Collection: boguscollectionname not found
   [junit4]   1> at org.apache.solr.handler.admin.ClusterStatus.getClusterStatus(ClusterStatus.java:103)
   [junit4]   1> at org.apache.solr.handler.admin.CollectionsHandler$CollectionOperation.lambda$static$22(CollectionsHandler.java:858)
   [junit4]   1> at org.apache.solr.handler.admin.CollectionsHandler$CollectionOperation.execute(CollectionsHandler.java:1170)
   [junit4]   1> at org.apache.solr.handler.admin.CollectionsHandler.invokeAction(CollectionsHandler.java:257)
   [junit4]   1> at org.apache.solr.handler.admin.CollectionsHandler.handleRequestBody(CollectionsHandler.java:245)
   [junit4]   1> at org.apache.solr.handler.RequestHandlerBase.handleRequest(RequestHandlerBase.java:199)
   [junit4]   1> at org.apache.solr.servlet.HttpSolrCall.handleAdmin(HttpSolrCall.java:734)
   [junit4]   1> at org.apache.solr.servlet.HttpSolrCall.handleAdminRequest(HttpSolrCall.java:715)
   [junit4]   1> at org.apache.solr.servlet.HttpSolrCall.call(HttpSolrCall.java:496)
   [junit4]   1> at org.apache.solr.servlet.SolrDispatchFilter.doFilter(SolrDispatchFilter.java:377)
   [junit4]   1> at org.apache.solr.servlet.SolrDispatchFilter.doFilter(SolrDispatchFilter.java:323)
   [junit4]   1> at org.eclipse.jetty.servlet.ServletHandler$CachedChain.doFilter(ServletHandler.java:1642)
   [junit4]   1> at org.apache.solr.client.solrj.embedded.JettySolrRunner$DebugFilter.doFilter(JettySolrRunner.java:139)
   [junit4]   1> at org.eclipse.jetty.servlet.ServletHandler$CachedChain.doFilter(ServletHandler.java:1642)
   [junit4]   1> at org.eclipse.jetty.servlet.ServletHandler.doHandle(ServletHandler.java:533)
   [junit4]   1> at org.eclipse.jetty.server.handler.ScopedHandler.nextHandle(ScopedHandler.java:255)
   [junit4]   1> at org.eclipse.jetty.server.session.SessionHandler.doHandle(SessionHandler.java:1595)
   [junit4]   1> at org.eclipse.jetty.server.handler.ScopedHandler.nextHandle(ScopedHandler.java:255)
   [junit4]   1> at org.eclipse.jetty.server.handler.ContextHandler.doHandle(ContextHandler.java:1317)
   [junit4]   1> at org.eclipse.jetty.server.handler.ScopedHandler.nextScope(ScopedHandler.java:203)
   [junit4]   1> at org.eclipse.jetty.servlet.ServletHandler.doScope(ServletHandler.java:473)
   [junit4]   1> at org.eclipse.jetty.server.session.SessionHandler.doScope(SessionHandler.java:1564)
   [junit4]   1> at org.eclipse.jetty.server.handler.ScopedHandler.nextScope(ScopedHandler.java:201)
   [junit4]   1> at org.eclipse.jetty.server.handler.ContextHandler.doScope(ContextHandler.java:1219)
   [junit4]   1> at org.eclipse.jetty.server.handler.ScopedHandler.handle(ScopedHandler.java:144)
   [junit4]   1> at org.eclipse.jetty.server.handler.gzip.GzipHandler.handle(GzipHandler.java:724)
   [junit4]   1> at org.eclipse.jetty.server.handler.HandlerWrapper.handle(HandlerWrapper.java:132)
   [junit4]   1> at org.eclipse.jetty.server.Server.handle(Server.java:531)
   [junit4]   1> at org.eclipse.jetty.server.HttpChannel.handle(HttpChannel.java:352)
   [junit4]   1> at org.eclipse.jetty.server.HttpConnection.onFillable(HttpConnection.java:260)
   [junit4]   1> at org.eclipse.jetty.io.AbstractConnection$ReadCallback.succeeded(AbstractConnection.java:281)
   [junit4]   1> at org.eclipse.jetty.io.FillInterest.fillable(FillInterest.java:102)
   [junit4]   1> at org.eclipse.jetty.io.ChannelEndPoint$2.run(ChannelEndPoint.java:118)
   [junit4]   1> at org.eclipse.jetty.util.thread.strategy.EatWhatYouKill.runTask(EatWhatYouKill.java:333)
   [junit4]   1> at org.eclipse.jetty.util.thread.strategy.EatWhatYouKill.doProduce(EatWhatYouKill.java:310)
   [junit4]   1> at org.eclipse.jetty.util.thread.strategy.EatWhatYouKill.tryProduce(EatWhatYouKill.java:168)
   [junit4]   1> at org.eclipse.jetty.util.thread.strategy.EatWhatYouKill.run(EatWhatYouKill.java:126)
   [junit4]   1> at org.eclipse.jetty.util.thread.ReservedThreadExecutor$ReservedThread.run(ReservedThreadExecutor.java:366)
   [junit4]   1> at org.eclipse.jetty.util.thread.QueuedThreadPool.runJob(QueuedThreadPool.java:762)
   [junit4]   1> at org.eclipse.jetty.util.thread.QueuedThreadPool$2.run(QueuedThreadPool.java:680)
   [junit4]   1> at java.lang.Thread.run(Thread.java:748)
   [junit4]   1>
   [junit4]   1> 16:30:02.564 [TEST-CloudSolrClientTest.testParallelUpdateQTime-seed#[939F7A6612DD48C3]] ERROR org.apache.solr.client.solrj.impl.CloudSolrClient - Request to collection [collection1] failed due to (404) org.apache.solr.client.solrj.impl.HttpSolrClient$RemoteSolrException: Error from server at http://127.0.0.1:38797/solr/collection1_shard2_replica_n3: Expected mime type application/octet-stream but got text/html. <html>
   [junit4]   1> <head>
   [junit4]   1> <meta http-equiv="Content-Type" content="text/html;charset=utf-8"/>
   [junit4]   1> <title>Error 404 Can not find: /solr/collection1_shard2_replica_n3/update</title>
   [junit4]   1> </head>
   [junit4]   1> <body><h2>HTTP ERROR 404</h2>
   [junit4]   1> <p>Problem accessing /solr/collection1_shard2_replica_n3/update. Reason:
   [junit4]   1> <pre>    Can not find: /solr/collection1_shard2_replica_n3/update</pre></p><hr><a href="http://eclipse.org/jetty">Powered by Jetty:// 9.4.11.v20180605</a><hr/>
   [junit4]   1>
   [junit4]   1> </body>
   [junit4]   1> </html>
   [junit4]   1> , retry? 0
   [junit4]   1> 16:30:02.569 [TEST-CloudSolrClientTest.testParallelUpdateQTime-seed#[939F7A6612DD48C3]] ERROR org.apache.solr.client.solrj.impl.CloudSolrClient - Request to collection [collection1] failed due to (404) org.apache.solr.client.solrj.impl.HttpSolrClient$RemoteSolrException: Error from server at http://127.0.0.1:38797/solr/collection1_shard2_replica_n3: Expected mime type application/octet-stream but got text/html. <html>
   [junit4]   1> <head>
   [junit4]   1> <meta http-equiv="Content-Type" content="text/html;charset=utf-8"/>
   [junit4]   1> <title>Error 404 Can not find: /solr/collection1_shard2_replica_n3/update</title>
   [junit4]   1> </head>
   [junit4]   1> <body><h2>HTTP ERROR 404</h2>
   [junit4]   1> <p>Problem accessing /solr/collection1_shard2_replica_n3/update. Reason:
   [junit4]   1> <pre>    Can not find: /solr/collection1_shard2_replica_n3/update</pre></p><hr><a href="http://eclipse.org/jetty">Powered by Jetty:// 9.4.11.v20180605</a><hr/>
   [junit4]   1>
   [junit4]   1> </body>
   [junit4]   1> </html>
   [junit4]   1> , retry? 1
   [junit4]   1> 16:30:02.573 [TEST-CloudSolrClientTest.testParallelUpdateQTime-seed#[939F7A6612DD48C3]] ERROR org.apache.solr.client.solrj.impl.CloudSolrClient - Request to collection [collection1] failed due to (404) org.apache.solr.client.solrj.impl.HttpSolrClient$RemoteSolrException: Error from server at http://127.0.0.1:38797/solr/collection1_shard2_replica_n3: Expected mime type application/octet-stream but got text/html. <html>
   [junit4]   1> <head>
   [junit4]   1> <meta http-equiv="Content-Type" content="text/html;charset=utf-8"/>
   [junit4]   1> <title>Error 404 Can not find: /solr/collection1_shard2_replica_n3/update</title>
   [junit4]   1> </head>
   [junit4]   1> <body><h2>HTTP ERROR 404</h2>
   [junit4]   1> <p>Problem accessing /solr/collection1_shard2_replica_n3/update. Reason:
   [junit4]   1> <pre>    Can not find: /solr/collection1_shard2_replica_n3/update</pre></p><hr><a href="http://eclipse.org/jetty">Powered by Jetty:// 9.4.11.v20180605</a><hr/>
   [junit4]   1>
   [junit4]   1> </body>
   [junit4]   1> </html>
   [junit4]   1> , retry? 2
   [junit4]   1> 16:30:02.576 [TEST-CloudSolrClientTest.testParallelUpdateQTime-seed#[939F7A6612DD48C3]] ERROR org.apache.solr.client.solrj.impl.CloudSolrClient - Request to collection [collection1] failed due to (404) org.apache.solr.client.solrj.impl.HttpSolrClient$RemoteSolrException: Error from server at http://127.0.0.1:38797/solr/collection1_shard2_replica_n3: Expected mime type application/octet-stream but got text/html. <html>
   [junit4]   1> <head>
   [junit4]   1> <meta http-equiv="Content-Type" content="text/html;charset=utf-8"/>
   [junit4]   1> <title>Error 404 Can not find: /solr/collection1_shard2_replica_n3/update</title>
   [junit4]   1> </head>
   [junit4]   1> <body><h2>HTTP ERROR 404</h2>
   [junit4]   1> <p>Problem accessing /solr/collection1_shard2_replica_n3/update. Reason:
   [junit4]   1> <pre>    Can not find: /solr/collection1_shard2_replica_n3/update</pre></p><hr><a href="http://eclipse.org/jetty">Powered by Jetty:// 9.4.11.v20180605</a><hr/>
   [junit4]   1>
   [junit4]   1> </body>
   [junit4]   1> </html>
   [junit4]   1> , retry? 3
   [junit4]   1> 16:30:02.582 [TEST-CloudSolrClientTest.testParallelUpdateQTime-seed#[939F7A6612DD48C3]] ERROR org.apache.solr.client.solrj.impl.CloudSolrClient - Request to collection [collection1] failed due to (404) org.apache.solr.client.solrj.impl.HttpSolrClient$RemoteSolrException: Error from server at http://127.0.0.1:38797/solr/collection1_shard2_replica_n3: Expected mime type application/octet-stream but got text/html. <html>
   [junit4]   1> <head>
   [junit4]   1> <meta http-equiv="Content-Type" content="text/html;charset=utf-8"/>
   [junit4]   1> <title>Error 404 Can not find: /solr/collection1_shard2_replica_n3/update</title>
   [junit4]   1> </head>
   [junit4]   1> <body><h2>HTTP ERROR 404</h2>
   [junit4]   1> <p>Problem accessing /solr/collection1_shard2_replica_n3/update. Reason:
   [junit4]   1> <pre>    Can not find: /solr/collection1_shard2_replica_n3/update</pre></p><hr><a href="http://eclipse.org/jetty">Powered by Jetty:// 9.4.11.v20180605</a><hr/>
   [junit4]   1>
   [junit4]   1> </body>
   [junit4]   1> </html>
   [junit4]   1> , retry? 4
   [junit4]   1> 16:30:02.585 [TEST-CloudSolrClientTest.testParallelUpdateQTime-seed#[939F7A6612DD48C3]] ERROR org.apache.solr.client.solrj.impl.CloudSolrClient - Request to collection [collection1] failed due to (404) org.apache.solr.client.solrj.impl.HttpSolrClient$RemoteSolrException: Error from server at http://127.0.0.1:38797/solr/collection1_shard2_replica_n3: Expected mime type application/octet-stream but got text/html. <html>
   [junit4]   1> <head>
   [junit4]   1> <meta http-equiv="Content-Type" content="text/html;charset=utf-8"/>
   [junit4]   1> <title>Error 404 Can not find: /solr/collection1_shard2_replica_n3/update</title>
   [junit4]   1> </head>
   [junit4]   1> <body><h2>HTTP ERROR 404</h2>
   [junit4]   1> <p>Problem accessing /solr/collection1_shard2_replica_n3/update. Reason:
   [junit4]   1> <pre>    Can not find: /solr/collection1_shard2_replica_n3/update</pre></p><hr><a href="http://eclipse.org/jetty">Powered by Jetty:// 9.4.11.v20180605</a><hr/>
   [junit4]   1>
   [junit4]   1> </body>
   [junit4]   1> </html>
   [junit4]   1> , retry? 5
   [junit4]   2> NOTE: reproduce with: ant test  -Dtestcase=CloudSolrClientTest -Dtests.method=testParallelUpdateQTime -Dtests.seed=939F7A6612DD48C3 -Dtests.multiplier=2 -Dtests.slow=true -Dtests.locale=ko-KR -Dtests.timezone=America/Indiana/Petersburg -Dtests.asserts=true -Dtests.file.encoding=ISO-8859-1
   [junit4] ERROR   2.95s J1 | CloudSolrClientTest.testParallelUpdateQTime <<<
   [junit4]    > Throwable #1: org.apache.solr.client.solrj.impl.CloudSolrClient$RouteException: Error from server at http://127.0.0.1:38797/solr/collection1_shard2_replica_n3: Expected mime type application/octet-stream but got text/html. <html>
   [junit4]    > <head>
   [junit4]    > <meta http-equiv="Content-Type" content="text/html;charset=utf-8"/>
   [junit4]    > <title>Error 404 Can not find: /solr/collection1_shard2_replica_n3/update</title>
   [junit4]    > </head>
   [junit4]    > <body><h2>HTTP ERROR 404</h2>
   [junit4]    > <p>Problem accessing /solr/collection1_shard2_replica_n3/update. Reason:
   [junit4]    > <pre>    Can not find: /solr/collection1_shard2_replica_n3/update</pre></p><hr><a href="http://eclipse.org/jetty">Powered by Jetty:// 9.4.11.v20180605</a><hr/>
   [junit4]    > </body>
   [junit4]    > </html>
   [junit4]    > at __randomizedtesting.SeedInfo.seed([939F7A6612DD48C3:7D4701F75CA29D50]:0)
   [junit4]    > at org.apache.solr.client.solrj.impl.CloudSolrClient.directUpdate(CloudSolrClient.java:551)
   [junit4]    > at org.apache.solr.client.solrj.impl.CloudSolrClient.sendRequest(CloudSolrClient.java:1016)
   [junit4]    > at org.apache.solr.client.solrj.impl.CloudSolrClient.requestWithRetryOnStaleState(CloudSolrClient.java:884)
   [junit4]    > at org.apache.solr.client.solrj.impl.CloudSolrClient.requestWithRetryOnStaleState(CloudSolrClient.java:949)
   [junit4]    > at org.apache.solr.client.solrj.impl.CloudSolrClient.requestWithRetryOnStaleState(CloudSolrClient.java:949)
   [junit4]    > at org.apache.solr.client.solrj.impl.CloudSolrClient.requestWithRetryOnStaleState(CloudSolrClient.java:949)
   [junit4]    > at org.apache.solr.client.solrj.impl.CloudSolrClient.requestWithRetryOnStaleState(CloudSolrClient.java:949)
   [junit4]    > at org.apache.solr.client.solrj.impl.CloudSolrClient.requestWithRetryOnStaleState(CloudSolrClient.java:949)
   [junit4]    > at org.apache.solr.client.solrj.impl.CloudSolrClient.request(CloudSolrClient.java:817)
   [junit4]    > at org.apache.solr.client.solrj.SolrRequest.process(SolrRequest.java:194)
   [junit4]    > at org.apache.solr.client.solrj.impl.CloudSolrClientTest.testParallelUpdateQTime(CloudSolrClientTest.java:146)
   [junit4]    > at java.lang.Thread.run(Thread.java:748)
   [junit4]    > Caused by: org.apache.solr.client.solrj.impl.HttpSolrClient$RemoteSolrException: Error from server at http://127.0.0.1:38797/solr/collection1_shard2_replica_n3: Expected mime type application/octet-stream but got text/html. <html>
   [junit4]    > <head>
   [junit4]    > <meta http-equiv="Content-Type" content="text/html;charset=utf-8"/>
   [junit4]    > <title>Error 404 Can not find: /solr/collection1_shard2_replica_n3/update</title>
   [junit4]    > </head>
   [junit4]    > <body><h2>HTTP ERROR 404</h2>
   [junit4]    > <p>Problem accessing /solr/collection1_shard2_replica_n3/update. Reason:
   [junit4]    > <pre>    Can not find: /solr/collection1_shard2_replica_n3/update</pre></p><hr><a href="http://eclipse.org/jetty">Powered by Jetty:// 9.4.11.v20180605</a><hr/>
   [junit4]    > </body>
   [junit4]    > </html>
   [junit4]    > at org.apache.solr.client.solrj.impl.HttpSolrClient.executeMethod(HttpSolrClient.java:607)
   [junit4]    > at org.apache.solr.client.solrj.impl.HttpSolrClient.request(HttpSolrClient.java:255)
   [junit4]    > at org.apache.solr.client.solrj.impl.HttpSolrClient.request(HttpSolrClient.java:244)
   [junit4]    > at org.apache.solr.client.solrj.impl.LBHttpSolrClient.doRequest(LBHttpSolrClient.java:483)
   [junit4]    > at org.apache.solr.client.solrj.impl.LBHttpSolrClient.request(LBHttpSolrClient.java:413)
   [junit4]    > at org.apache.solr.client.solrj.impl.CloudSolrClient.lambda$directUpdate$0(CloudSolrClient.java:528)
   [junit4]    > at java.util.concurrent.FutureTask.run(FutureTask.java:266)
   [junit4]    > at org.apache.solr.common.util.ExecutorUtil$MDCAwareThreadPoolExecutor.lambda$execute$0(ExecutorUtil.java:209)
   [junit4]    > at java.util.concurrent.ThreadPoolExecutor.runWorker(ThreadPoolExecutor.java:1149)
   [junit4]    > at java.util.concurrent.ThreadPoolExecutor$Worker.run(ThreadPoolExecutor.java:624)
   [junit4]    > ... 1 more
   [junit4]   1> -
   [junit4]   1> replica:core_node3 rstate:active live:true
   [junit4]   1> replica:core_node5 rstate:active live:true
   [junit4]   1> replica:core_node6 rstate:active live:true
   [junit4]   1> no one is recoverying
   [junit4]   1> 16:30:07.609 [qtp729542021-1526] ERROR org.apache.solr.handler.RequestHandlerBase - org.apache.solr.common.SolrException: Unknown action: foobar
   [junit4]   1> at org.apache.solr.handler.admin.ConfigSetsHandler.handleRequestBody(ConfigSetsHandler.java:109)
   [junit4]   1> at org.apache.solr.handler.RequestHandlerBase.handleRequest(RequestHandlerBase.java:199)
   [junit4]   1> at org.apache.solr.servlet.HttpSolrCall.handleAdmin(HttpSolrCall.java:734)
   [junit4]   1> at org.apache.solr.servlet.HttpSolrCall.handleAdminRequest(HttpSolrCall.java:715)
   [junit4]   1> at org.apache.solr.servlet.HttpSolrCall.call(HttpSolrCall.java:496)
   [junit4]   1> at org.apache.solr.servlet.SolrDispatchFilter.doFilter(SolrDispatchFilter.java:377)
   [junit4]   1> at org.apache.solr.servlet.SolrDispatchFilter.doFilter(SolrDispatchFilter.java:323)
   [junit4]   1> at org.eclipse.jetty.servlet.ServletHandler$CachedChain.doFilter(ServletHandler.java:1642)
   [junit4]   1> at org.apache.solr.client.solrj.embedded.JettySolrRunner$DebugFilter.doFilter(JettySolrRunner.java:139)
   [junit4]   1> at org.eclipse.jetty.servlet.ServletHandler$CachedChain.doFilter(ServletHandler.java:1642)
   [junit4]   1> at org.eclipse.jetty.servlet.ServletHandler.doHandle(ServletHandler.java:533)
   [junit4]   1> at org.eclipse.jetty.server.handler.ScopedHandler.nextHandle(ScopedHandler.java:255)
   [junit4]   1> at org.eclipse.jetty.server.session.SessionHandler.doHandle(SessionHandler.java:1595)
   [junit4]   1> at org.eclipse.jetty.server.handler.ScopedHandler.nextHandle(ScopedHandler.java:255)
   [junit4]   1> at org.eclipse.jetty.server.handler.ContextHandler.doHandle(ContextHandler.java:1317)
   [junit4]   1> at org.eclipse.jetty.server.handler.ScopedHandler.nextScope(ScopedHandler.java:203)
   [junit4]   1> at org.eclipse.jetty.servlet.ServletHandler.doScope(ServletHandler.java:473)
   [junit4]   1> at org.eclipse.jetty.server.session.SessionHandler.doScope(SessionHandler.java:1564)
   [junit4]   1> at org.eclipse.jetty.server.handler.ScopedHandler.nextScope(ScopedHandler.java:201)
   [junit4]   1> at org.eclipse.jetty.server.handler.ContextHandler.doScope(ContextHandler.java:1219)
   [junit4]   1> at org.eclipse.jetty.server.handler.ScopedHandler.handle(ScopedHandler.java:144)
   [junit4]   1> at org.eclipse.jetty.server.handler.gzip.GzipHandler.handle(GzipHandler.java:724)
   [junit4]   1> at org.eclipse.jetty.server.handler.HandlerWrapper.handle(HandlerWrapper.java:132)
   [junit4]   1> at org.eclipse.jetty.server.Server.handle(Server.java:531)
   [junit4]   1> at org.eclipse.jetty.server.HttpChannel.handle(HttpChannel.java:352)
   [junit4]   1> at org.eclipse.jetty.server.HttpConnection.onFillable(HttpConnection.java:260)
   [junit4]   1> at org.eclipse.jetty.io.AbstractConnection$ReadCallback.succeeded(AbstractConnection.java:281)
   [junit4]   1> at org.eclipse.jetty.io.FillInterest.fillable(FillInterest.java:102)
   [junit4]   1> at org.eclipse.jetty.io.ChannelEndPoint$2.run(ChannelEndPoint.java:118)
   [junit4]   1> at org.eclipse.jetty.util.thread.strategy.EatWhatYouKill.runTask(EatWhatYouKill.java:333)
   [junit4]   1> at org.eclipse.jetty.util.thread.strategy.EatWhatYouKill.doProduce(EatWhatYouKill.java:310)
   [junit4]   1> at org.eclipse.jetty.util.thread.strategy.EatWhatYouKill.tryProduce(EatWhatYouKill.java:168)
   [junit4]   1> at org.eclipse.jetty.util.thread.strategy.EatWhatYouKill.run(EatWhatYouKill.java:126)
   [junit4]   1> at org.eclipse.jetty.util.thread.ReservedThreadExecutor$ReservedThread.run(ReservedThreadExecutor.java:366)
   [junit4]   1> at org.eclipse.jetty.util.thread.QueuedThreadPool.runJob(QueuedThreadPool.java:762)
   [junit4]   1> at org.eclipse.jetty.util.thread.QueuedThreadPool$2.run(QueuedThreadPool.java:680)
   [junit4]   1> at java.lang.Thread.run(Thread.java:748)
   [junit4]   1>
   [junit4]   1> 16:30:07.627 [qtp729542021-1526] ERROR org.apache.solr.handler.RequestHandlerBase - org.apache.solr.common.SolrException: Unknown action: foobar
   [junit4]   1> at org.apache.solr.handler.admin.CollectionsHandler.handleRequestBody(CollectionsHandler.java:240)
   [junit4]   1> at org.apache.solr.handler.RequestHandlerBase.handleRequest(RequestHandlerBase.java:199)
   [junit4]   1> at org.apache.solr.servlet.HttpSolrCall.handleAdmin(HttpSolrCall.java:734)
   [junit4]   1> at org.apache.solr.servlet.HttpSolrCall.handleAdminRequest(HttpSolrCall.java:715)
   [junit4]   1> at org.apache.solr.servlet.HttpSolrCall.call(HttpSolrCall.java:496)
   [junit4]   1> at org.apache.solr.servlet.SolrDispatchFilter.doFilter(SolrDispatchFilter.java:377)
   [junit4]   1> at org.apache.solr.servlet.SolrDispatchFilter.doFilter(SolrDispatchFilter.java:323)
   [junit4]   1> at org.eclipse.jetty.servlet.ServletHandler$CachedChain.doFilter(ServletHandler.java:1642)
   [junit4]   1> at org.apache.solr.client.solrj.embedded.JettySolrRunner$DebugFilter.doFilter(JettySolrRunner.java:139)
   [junit4]   1> at org.eclipse.jetty.servlet.ServletHandler$CachedChain.doFilter(ServletHandler.java:1642)
   [junit4]   1> at org.eclipse.jetty.servlet.ServletHandler.doHandle(ServletHandler.java:533)
   [junit4]   1> at org.eclipse.jetty.server.handler.ScopedHandler.nextHandle(ScopedHandler.java:255)
   [junit4]   1> at org.eclipse.jetty.server.session.SessionHandler.doHandle(SessionHandler.java:1595)
   [junit4]   1> at org.eclipse.jetty.server.handler.ScopedHandler.nextHandle(ScopedHandler.java:255)
   [junit4]   1> at org.eclipse.jetty.server.handler.ContextHandler.doHandle(ContextHandler.java:1317)
   [junit4]   1> at org.eclipse.jetty.server.handler.ScopedHandler.nextScope(ScopedHandler.java:203)
   [junit4]   1> at org.eclipse.jetty.servlet.ServletHandler.doScope(ServletHandler.java:473)
   [junit4]   1> at org.eclipse.jetty.server.session.SessionHandler.doScope(SessionHandler.java:1564)
   [junit4]   1> at org.eclipse.jetty.server.handler.ScopedHandler.nextScope(ScopedHandler.java:201)
   [junit4]   1> at org.eclipse.jetty.server.handler.ContextHandler.doScope(ContextHandler.java:1219)
   [junit4]   1> at org.eclipse.jetty.server.handler.ScopedHandler.handle(ScopedHandler.java:144)
   [junit4]   1> at org.eclipse.jetty.server.handler.gzip.GzipHandler.handle(GzipHandler.java:724)
   [junit4]   1> at org.eclipse.jetty.server.handler.HandlerWrapper.handle(HandlerWrapper.java:132)
   [junit4]   1> at org.eclipse.jetty.server.Server.handle(Server.java:531)
   [junit4]   1> at org.eclipse.jetty.server.HttpChannel.handle(HttpChannel.java:352)
   [junit4]   1> at org.eclipse.jetty.server.HttpConnection.onFillable(HttpConnection.java:260)
   [junit4]   1> at org.eclipse.jetty.io.AbstractConnection$ReadCallback.succeeded(AbstractConnection.java:281)
   [junit4]   1> at org.eclipse.jetty.io.FillInterest.fillable(FillInterest.java:102)
   [junit4]   1> at org.eclipse.jetty.io.ChannelEndPoint$2.run(ChannelEndPoint.java:118)
   [junit4]   1> at org.eclipse.jetty.util.thread.strategy.EatWhatYouKill.runTask(EatWhatYouKill.java:333)
   [junit4]   1> at org.eclipse.jetty.util.thread.strategy.EatWhatYouKill.doProduce(EatWhatYouKill.java:310)
   [junit4]   1> at org.eclipse.jetty.util.thread.strategy.EatWhatYouKill.tryProduce(EatWhatYouKill.java:168)
   [junit4]   1> at org.eclipse.jetty.util.thread.strategy.EatWhatYouKill.run(EatWhatYouKill.java:126)
   [junit4]   1> at org.eclipse.jetty.util.thread.ReservedThreadExecutor$ReservedThread.run(ReservedThreadExecutor.java:366)
   [junit4]   1> at org.eclipse.jetty.util.thread.QueuedThreadPool.runJob(QueuedThreadPool.java:762)
   [junit4]   1> at org.eclipse.jetty.util.thread.QueuedThreadPool$2.run(QueuedThreadPool.java:680)
   [junit4]   1> at java.lang.Thread.run(Thread.java:748)
   [junit4]   1>
   [junit4]   1> 16:30:07.645 [qtp729542021-1524] ERROR org.apache.solr.handler.RequestHandlerBase - org.apache.solr.common.SolrException: Unsupported operation: foobar
   [junit4]   1> at org.apache.solr.handler.admin.CoreAdminHandler.handleCustomAction(CoreAdminHandler.java:220)
   [junit4]   1> at org.apache.solr.handler.admin.CoreAdminHandler.handleRequestBody(CoreAdminHandler.java:169)
   [junit4]   1> at org.apache.solr.handler.RequestHandlerBase.handleRequest(RequestHandlerBase.java:199)
   [junit4]   1> at org.apache.solr.servlet.HttpSolrCall.handleAdmin(HttpSolrCall.java:734)
   [junit4]   1> at org.apache.solr.servlet.HttpSolrCall.handleAdminRequest(HttpSolrCall.java:715)
   [junit4]   1> at org.apache.solr.servlet.HttpSolrCall.call(HttpSolrCall.java:496)
   [junit4]   1> at org.apache.solr.servlet.SolrDispatchFilter.doFilter(SolrDispatchFilter.java:377)
   [junit4]   1> at org.apache.solr.servlet.SolrDispatchFilter.doFilter(SolrDispatchFilter.java:323)
   [junit4]   1> at org.eclipse.jetty.servlet.ServletHandler$CachedChain.doFilter(ServletHandler.java:1642)
   [junit4]   1> at org.apache.solr.client.solrj.embedded.JettySolrRunner$DebugFilter.doFilter(JettySolrRunner.java:139)
   [junit4]   1> at org.eclipse.jetty.servlet.ServletHandler$CachedChain.doFilter(ServletHandler.java:1642)
   [junit4]   1> at org.eclipse.jetty.servlet.ServletHandler.doHandle(ServletHandler.java:533)
   [junit4]   1> at org.eclipse.jetty.server.handler.ScopedHandler.nextHandle(ScopedHandler.java:255)
   [junit4]   1> at org.eclipse.jetty.server.session.SessionHandler.doHandle(SessionHandler.java:1595)
   [junit4]   1> at org.eclipse.jetty.server.handler.ScopedHandler.nextHandle(ScopedHandler.java:255)
   [junit4]   1> at org.eclipse.jetty.server.handler.ContextHandler.doHandle(ContextHandler.java:1317)
   [junit4]   1> at org.eclipse.jetty.server.handler.ScopedHandler.nextScope(ScopedHandler.java:203)
   [junit4]   1> at org.eclipse.jetty.servlet.ServletHandler.doScope(ServletHandler.java:473)
   [junit4]   1> at org.eclipse.jetty.server.session.SessionHandler.doScope(SessionHandler.java:1564)
   [junit4]   1> at org.eclipse.jetty.server.handler.ScopedHandler.nextScope(ScopedHandler.java:201)
   [junit4]   1> at org.eclipse.jetty.server.handler.ContextHandler.doScope(ContextHandler.java:1219)
   [junit4]   1> at org.eclipse.jetty.server.handler.ScopedHandler.handle(ScopedHandler.java:144)
   [junit4]   1> at org.eclipse.jetty.server.handler.gzip.GzipHandler.handle(GzipHandler.java:724)
   [junit4]   1> at org.eclipse.jetty.server.handler.HandlerWrapper.handle(HandlerWrapper.java:132)
   [junit4]   1> at org.eclipse.jetty.server.Server.handle(Server.java:531)
   [junit4]   1> at org.eclipse.jetty.server.HttpChannel.handle(HttpChannel.java:352)
   [junit4]   1> at org.eclipse.jetty.server.HttpConnection.onFillable(HttpConnection.java:260)
   [junit4]   1> at org.eclipse.jetty.io.AbstractConnection$ReadCallback.succeeded(AbstractConnection.java:281)
   [junit4]   1> at org.eclipse.jetty.io.FillInterest.fillable(FillInterest.java:102)
   [junit4]   1> at org.eclipse.jetty.io.ChannelEndPoint$2.run(ChannelEndPoint.java:118)
   [junit4]   1> at org.eclipse.jetty.util.thread.strategy.EatWhatYouKill.runTask(EatWhatYouKill.java:333)
   [junit4]   1> at org.eclipse.jetty.util.thread.strategy.EatWhatYouKill.doProduce(EatWhatYouKill.java:310)
   [junit4]   1> at org.eclipse.jetty.util.thread.strategy.EatWhatYouKill.tryProduce(EatWhatYouKill.java:168)
   [junit4]   1> at org.eclipse.jetty.util.thread.strategy.EatWhatYouKill.run(EatWhatYouKill.java:126)
   [junit4]   1> at org.eclipse.jetty.util.thread.ReservedThreadExecutor$ReservedThread.run(ReservedThreadExecutor.java:366)
   [junit4]   1> at org.eclipse.jetty.util.thread.QueuedThreadPool.runJob(QueuedThreadPool.java:762)
   [junit4]   1> at org.eclipse.jetty.util.thread.QueuedThreadPool$2.run(QueuedThreadPool.java:680)
   [junit4]   1> at java.lang.Thread.run(Thread.java:748)
   [junit4]   1>
   [junit4]   1> 16:30:09.288 [SUITE-CloudSolrClientTest-seed#[939F7A6612DD48C3]-worker] ERROR org.apache.zookeeper.server.ZooKeeperServer - ZKShutdownHandler is not registered, so ZooKeeper server won't take any action on ERROR or SHUTDOWN server state changes
   [junit4]   2> NOTE: leaving temporary files on disk at: /x1/jenkins/jenkins-slave/workspace/Lucene-Solr-Tests-master/solr/build/solr-solrj/test/J1/temp/solr.client.solrj.impl.CloudSolrClientTest_939F7A6612DD48C3-001
   [junit4]   2> Oct 11, 2018 4:30:09 PM com.carrotsearch.randomizedtesting.ThreadLeakControl checkThreadLeaks
   [junit4]   2> WARNING: Will linger awaiting termination of 1 leaked thread(s).
   [junit4]   2> NOTE: test params are: codec=Asserting(Lucene80): {_version_=PostingsFormat(name=LuceneFixedGap), multiDefault=FST50, a_t=PostingsFormat(name=LuceneFixedGap), title_s=FST50, intDefault=PostingsFormat(name=LuceneFixedGap), id=FSTOrd50, text=PostingsFormat(name=Asserting), timestamp=PostingsFormat(name=LuceneFixedGap)}, docValues:{_version_=DocValuesFormat(name=Lucene70), multiDefault=DocValuesFormat(name=Lucene70), a_t=DocValuesFormat(name=Lucene70), title_s=DocValuesFormat(name=Lucene70), intDefault=DocValuesFormat(name=Lucene70), id=DocValuesFormat(name=Direct), text=DocValuesFormat(name=Asserting), timestamp=DocValuesFormat(name=Lucene70)}, maxPointsInLeafNode=1281, maxMBSortInHeap=5.448651022772722, sim=Asserting(org.apache.lucene.search.similarities.AssertingSimilarity@4dd3aff8), locale=ko-KR, timezone=America/Indiana/Petersburg
   [junit4]   2> NOTE: Linux 4.4.0-137-generic amd64/Oracle Corporation 1.8.0_172 (64-bit)/cpus=4,threads=1,free=243874080,total=448266240
   [junit4]   2> NOTE: All tests run in this JVM: [GraphExpressionTest, ConcurrentUpdateSolrClientBuilderTest, SelectWithEvaluatorsTest, TestCloudCollectionsListeners, UniformDistributionEvaluatorTest, HttpClientUtilTest, SolrPingTest, HttpSolrClientSSLAuthConPoolTest, ArcTangentEvaluatorTest, TestCoreAdmin, SolrExampleXMLTest, CeilingEvaluatorTest, TestValidatingJsonMap, ShardParamsTest, FloorEvaluatorTest, ModuloEvaluatorTest, RecursiveEvaluatorTest, SolrExampleEmbeddedTest, LargeVolumeEmbeddedTest, TestPolicy2, StreamExpressionToExpessionTest, BasicHttpSolrClientTest, ConcatOperationTest, AppendEvaluatorTest, CollectionAdminRequestRequiredParamsTest, UsingSolrJRefGuideExamplesTest, SolrQueryTest, SolrSchemalessExampleTest, TestBatchUpdate, TestSolrJErrorHandling, TestDocumentObjectBinder, MergeIndexesEmbeddedTest, SolrExampleStreamingBinaryTest, SolrExampleStreamingTest, CloudSolrClientTest]
   [junit4] Completed [157/157 (1!)] on J1 in 68.95s, 16 tests, 2 errors <<< FAILURES!

[...truncated 47637 lines...]
[asciidoctor:convert] asciidoctor: ERROR: about-this-guide.adoc: line 1: invalid part, must have at least one section (e.g., chapter, appendix, etc.)
[asciidoctor:convert] asciidoctor: ERROR: solr-glossary.adoc: line 1: invalid part, must have at least one section (e.g., chapter, appendix, etc.)
     [java] Processed 2432 links (1984 relative) to 3172 anchors in 246 files
     [echo] Validated Links & Anchors via: /x1/jenkins/jenkins-slave/workspace/Lucene-Solr-Tests-master/solr/build/solr-ref-guide/bare-bones-html/

-documentation-lint:
    [jtidy] Checking for broken html (such as invalid tags)...
   [delete] Deleting directory /x1/jenkins/jenkins-slave/workspace/Lucene-Solr-Tests-master/lucene/build/jtidy_tmp
     [echo] Checking for broken links...
     [exec]
     [exec] Crawl/parse...
     [exec]
     [exec] Verify...
     [echo] Checking for malformed docs...

jar-checksums:

resolve:

ivy-availability-check:
[loadresource] Do not set property disallowed.ivy.jars.list as its length is 0.

-ivy-fail-disallowed-ivy-version:

ivy-fail:

ivy-configure:
[ivy:configure] :: loading settings :: file = /x1/jenkins/jenkins-slave/workspace/Lucene-Solr-Tests-master/lucene/top-level-ivy-settings.xml

resolve:

ivy-availability-check:
[loadresource] Do not set property disallowed.ivy.jars.list as its length is 0.

-ivy-fail-disallowed-ivy-version:

ivy-fail:

ivy-configure:
[ivy:configure] :: loading settings :: file = /x1/jenkins/jenkins-slave/workspace/Lucene-Solr-Tests-master/lucene/top-level-ivy-settings.xml

resolve:

resolve:

ivy-availability-check:
[loadresource] Do not set property disallowed.ivy.jars.list as its length is 0.

-ivy-fail-disallowed-ivy-version:

ivy-fail:

ivy-configure:
[ivy:configure] :: loading settings :: file = /x1/jenkins/jenkins-slave/workspace/Lucene-Solr-Tests-master/lucene/top-level-ivy-settings.xml

resolve:

ivy-availability-check:
[loadresource] Do not set property disallowed.ivy.jars.list as its length is 0.

-ivy-fail-disallowed-ivy-version:

ivy-fail:

ivy-configure:
[ivy:configure] :: loading settings :: file = /x1/jenkins/jenkins-slave/workspace/Lucene-Solr-Tests-master/lucene/top-level-ivy-settings.xml

resolve:

ivy-availability-check:
[loadresource] Do not set property disallowed.ivy.jars.list as its length is 0.

-ivy-fail-disallowed-ivy-version:

ivy-fail:

ivy-configure:
[ivy:configure] :: loading settings :: file = /x1/jenkins/jenkins-slave/workspace/Lucene-Solr-Tests-master/lucene/top-level-ivy-settings.xml

resolve:

ivy-availability-check:
[loadresource] Do not set property disallowed.ivy.jars.list as its length is 0.

-ivy-fail-disallowed-ivy-version:

ivy-fail:

ivy-configure:
[ivy:configure] :: loading settings :: file = /x1/jenkins/jenkins-slave/workspace/Lucene-Solr-Tests-master/lucene/top-level-ivy-settings.xml

resolve:

ivy-availability-check:
[loadresource] Do not set property disallowed.ivy.jars.list as its length is 0.

-ivy-fail-disallowed-ivy-version:

ivy-fail:

ivy-configure:
[ivy:configure] :: loading settings :: file = /x1/jenkins/jenkins-slave/workspace/Lucene-Solr-Tests-master/lucene/top-level-ivy-settings.xml

resolve:

ivy-availability-check:
[loadresource] Do not set property disallowed.ivy.jars.list as its length is 0.

-ivy-fail-disallowed-ivy-version:

ivy-fail:

ivy-configure:
[ivy:configure] :: loading settings :: file = /x1/jenkins/jenkins-slave/workspace/Lucene-Solr-Tests-master/lucene/top-level-ivy-settings.xml

resolve:

ivy-availability-check:
[loadresource] Do not set property disallowed.ivy.jars.list as its length is 0.

-ivy-fail-disallowed-ivy-version:

ivy-fail:

ivy-configure:
[ivy:configure] :: loading settings :: file = /x1/jenkins/jenkins-slave/workspace/Lucene-Solr-Tests-master/lucene/top-level-ivy-settings.xml

resolve:

ivy-availability-check:
[loadresource] Do not set property disallowed.ivy.jars.list as its length is 0.

-ivy-fail-disallowed-ivy-version:

ivy-fail:

ivy-configure:
[ivy:configure] :: loading settings :: file = /x1/jenkins/jenkins-slave/workspace/Lucene-Solr-Tests-master/lucene/top-level-ivy-settings.xml

resolve:

ivy-availability-check:
[loadresource] Do not set property disallowed.ivy.jars.list as its length is 0.

-ivy-fail-disallowed-ivy-version:

ivy-fail:

ivy-configure:
[ivy:configure] :: loading settings :: file = /x1/jenkins/jenkins-slave/workspace/Lucene-Solr-Tests-master/lucene/top-level-ivy-settings.xml

resolve:

ivy-availability-check:
[loadresource] Do not set property disallowed.ivy.jars.list as its length is 0.

-ivy-fail-disallowed-ivy-version:

ivy-fail:

ivy-configure:
[ivy:configure] :: loading settings :: file = /x1/jenkins/jenkins-slave/workspace/Lucene-Solr-Tests-master/lucene/top-level-ivy-settings.xml

resolve:

ivy-availability-check:
[loadresource] Do not set property disallowed.ivy.jars.list as its length is 0.

-ivy-fail-disallowed-ivy-version:

ivy-fail:

ivy-configure:
[ivy:configure] :: loading settings :: file = /x1/jenkins/jenkins-slave/workspace/Lucene-Solr-Tests-master/lucene/top-level-ivy-settings.xml

resolve:

ivy-availability-check:
[loadresource] Do not set property disallowed.ivy.jars.list as its length is 0.

-ivy-fail-disallowed-ivy-version:

ivy-fail:

ivy-configure:
[ivy:configure] :: loading settings :: file = /x1/jenkins/jenkins-slave/workspace/Lucene-Solr-Tests-master/lucene/top-level-ivy-settings.xml

resolve:

ivy-availability-check:
[loadresource] Do not set property disallowed.ivy.jars.list as its length is 0.

-ivy-fail-disallowed-ivy-version:

ivy-fail:

ivy-configure:
[ivy:configure] :: loading settings :: file = /x1/jenkins/jenkins-slave/workspace/Lucene-Solr-Tests-master/lucene/top-level-ivy-settings.xml

resolve:

ivy-availability-check:
[loadresource] Do not set property disallowed.ivy.jars.list as its length is 0.

-ivy-fail-disallowed-ivy-version:

ivy-fail:

ivy-configure:
[ivy:configure] :: loading settings :: file = /x1/jenkins/jenkins-slave/workspace/Lucene-Solr-Tests-master/lucene/top-level-ivy-settings.xml

resolve:

ivy-availability-check:
[loadresource] Do not set property disallowed.ivy.jars.list as its length is 0.

-ivy-fail-disallowed-ivy-version:

ivy-fail:

ivy-configure:
[ivy:configure] :: loading settings :: file = /x1/jenkins/jenkins-slave/workspace/Lucene-Solr-Tests-master/lucene/top-level-ivy-settings.xml

resolve:

ivy-availability-check:
[loadresource] Do not set property disallowed.ivy.jars.list as its length is 0.

-ivy-fail-disallowed-ivy-version:

ivy-fail:

ivy-configure:
[ivy:configure] :: loading settings :: file = /x1/jenkins/jenkins-slave/workspace/Lucene-Solr-Tests-master/lucene/top-level-ivy-settings.xml

resolve:

ivy-availability-check:
[loadresource] Do not set property disallowed.ivy.jars.list as its length is 0.

-ivy-fail-disallowed-ivy-version:

ivy-fail:

ivy-configure:
[ivy:configure] :: loading settings :: file = /x1/jenkins/jenkins-slave/workspace/Lucene-Solr-Tests-master/lucene/top-level-ivy-settings.xml

resolve:

ivy-availability-check:
[loadresource] Do not set property disallowed.ivy.jars.list as its length is 0.

-ivy-fail-disallowed-ivy-version:

ivy-fail:

ivy-configure:
[ivy:configure] :: loading settings :: file = /x1/jenkins/jenkins-slave/workspace/Lucene-Solr-Tests-master/lucene/top-level-ivy-settings.xml

resolve:

ivy-availability-check:
[loadresource] Do not set property disallowed.ivy.jars.list as its length is 0.

-ivy-fail-disallowed-ivy-version:

ivy-fail:

ivy-configure:
[ivy:configure] :: loading settings :: file = /x1/jenkins/jenkins-slave/workspace/Lucene-Solr-Tests-master/lucene/top-level-ivy-settings.xml

resolve:

ivy-availability-check:
[loadresource] Do not set property disallowed.ivy.jars.list as its length is 0.

-ivy-fail-disallowed-ivy-version:

ivy-fail:

ivy-configure:
[ivy:configure] :: loading settings :: file = /x1/jenkins/jenkins-slave/workspace/Lucene-Solr-Tests-master/lucene/top-level-ivy-settings.xml

resolve:

ivy-availability-check:
[loadresource] Do not set property disallowed.ivy.jars.list as its length is 0.

-ivy-fail-disallowed-ivy-version:

ivy-fail:

ivy-configure:
[ivy:configure] :: loading settings :: file = /x1/jenkins/jenkins-slave/workspace/Lucene-Solr-Tests-master/lucene/top-level-ivy-settings.xml

resolve:

ivy-availability-check:
[loadresource] Do not set property disallowed.ivy.jars.list as its length is 0.

-ivy-fail-disallowed-ivy-version:

ivy-fail:

ivy-configure:
[ivy:configure] :: loading settings :: file = /x1/jenkins/jenkins-slave/workspace/Lucene-Solr-Tests-master/lucene/top-level-ivy-settings.xml

resolve:

ivy-availability-check:
[loadresource] Do not set property disallowed.ivy.jars.list as its length is 0.

-ivy-fail-disallowed-ivy-version:

ivy-fail:

ivy-configure:
[ivy:configure] :: loading settings :: file = /x1/jenkins/jenkins-slave/workspace/Lucene-Solr-Tests-master/lucene/top-level-ivy-settings.xml

resolve:

ivy-availability-check:
[loadresource] Do not set property disallowed.ivy.jars.list as its length is 0.

-ivy-fail-disallowed-ivy-version:

ivy-fail:

ivy-configure:
[ivy:configure] :: loading settings :: file = /x1/jenkins/jenkins-slave/workspace/Lucene-Solr-Tests-master/lucene/top-level-ivy-settings.xml

common.resolve:

resolve:

ivy-availability-check:
[loadresource] Do not set property disallowed.ivy.jars.list as its length is 0.

-ivy-fail-disallowed-ivy-version:

ivy-fail:

ivy-configure:
[ivy:configure] :: loading settings :: file = /x1/jenkins/jenkins-slave/workspace/Lucene-Solr-Tests-master/lucene/top-level-ivy-settings.xml

resolve:

ivy-availability-check:
[loadresource] Do not set property disallowed.ivy.jars.list as its length is 0.

-ivy-fail-disallowed-ivy-version:

ivy-fail:

ivy-configure:
[ivy:configure] :: loading settings :: file = /x1/jenkins/jenkins-slave/workspace/Lucene-Solr-Tests-master/lucene/top-level-ivy-settings.xml

resolve:

ivy-availability-check:
[loadresource] Do not set property disallowed.ivy.jars.list as its length is 0.

-ivy-fail-disallowed-ivy-version:

ivy-fail:

ivy-configure:
[ivy:configure] :: loading settings :: file = /x1/jenkins/jenkins-slave/workspace/Lucene-Solr-Tests-master/lucene/top-level-ivy-settings.xml

resolve:

ivy-availability-check:
[loadresource] Do not set property disallowed.ivy.jars.list as its length is 0.

-ivy-fail-disallowed-ivy-version:

ivy-fail:

ivy-configure:
[ivy:configure] :: loading settings :: file = /x1/jenkins/jenkins-slave/workspace/Lucene-Solr-Tests-master/lucene/top-level-ivy-settings.xml

resolve:

ivy-availability-check:
[loadresource] Do not set property disallowed.ivy.jars.list as its length is 0.

-ivy-fail-disallowed-ivy-version:

ivy-fail:

ivy-configure:
[ivy:configure] :: loading settings :: file = /x1/jenkins/jenkins-slave/workspace/Lucene-Solr-Tests-master/lucene/top-level-ivy-settings.xml

resolve:

jar-checksums:
    [mkdir] Created dir: /x1/jenkins/jenkins-slave/workspace/Lucene-Solr-Tests-master/lucene/null442028330
     [copy] Copying 35 files to /x1/jenkins/jenkins-slave/workspace/Lucene-Solr-Tests-master/lucene/null442028330
   [delete] Deleting directory /x1/jenkins/jenkins-slave/workspace/Lucene-Solr-Tests-master/lucene/null442028330

resolve-example:

ivy-availability-check:
[loadresource] Do not set property disallowed.ivy.jars.list as its length is 0.

-ivy-fail-disallowed-ivy-version:

ivy-fail:

ivy-configure:
[ivy:configure] :: loading settings :: file = /x1/jenkins/jenkins-slave/workspace/Lucene-Solr-Tests-master/lucene/top-level-ivy-settings.xml

resolve:

resolve-server:

ivy-availability-check:
[loadresource] Do not set property disallowed.ivy.jars.list as its length is 0.

-ivy-fail-disallowed-ivy-version:

ivy-fail:

ivy-fail:

ivy-configure:
[ivy:configure] :: loading settings :: file = /x1/jenkins/jenkins-slave/workspace/Lucene-Solr-Tests-master/lucene/top-level-ivy-settings.xml

resolve:

resolve:

ivy-availability-check:
[loadresource] Do not set property disallowed.ivy.jars.list as its length is 0.

-ivy-fail-disallowed-ivy-version:

ivy-fail:

ivy-fail:

ivy-configure:
[ivy:configure] :: loading settings :: file = /x1/jenkins/jenkins-slave/workspace/Lucene-Solr-Tests-master/lucene/top-level-ivy-settings.xml

resolve:

ivy-availability-check:
[loadresource] Do not set property disallowed.ivy.jars.list as its length is 0.

-ivy-fail-disallowed-ivy-version:

ivy-fail:

ivy-fail:

ivy-configure:
[ivy:configure] :: loading settings :: file = /x1/jenkins/jenkins-slave/workspace/Lucene-Solr-Tests-master/lucene/top-level-ivy-settings.xml

resolve:

ivy-availability-check:
[loadresource] Do not set property disallowed.ivy.jars.list as its length is 0.

-ivy-fail-disallowed-ivy-version:

ivy-fail:

ivy-configure:
[ivy:configure] :: loading settings :: file = /x1/jenkins/jenkins-slave/workspace/Lucene-Solr-Tests-master/lucene/top-level-ivy-settings.xml

resolve:

ivy-availability-check:
[loadresource] Do not set property disallowed.ivy.jars.list as its length is 0.

-ivy-fail-disallowed-ivy-version:

ivy-fail:

ivy-fail:

ivy-configure:
[ivy:configure] :: loading settings :: file = /x1/jenkins/jenkins-slave/workspace/Lucene-Solr-Tests-master/lucene/top-level-ivy-settings.xml

resolve:

ivy-availability-check:
[loadresource] Do not set property disallowed.ivy.jars.list as its length is 0.

-ivy-fail-disallowed-ivy-version:

ivy-fail:

ivy-configure:
[ivy:configure] :: loading settings :: file = /x1/jenkins/jenkins-slave/workspace/Lucene-Solr-Tests-master/lucene/top-level-ivy-settings.xml

resolve:

ivy-availability-check:
[loadresource] Do not set property disallowed.ivy.jars.list as its length is 0.

-ivy-fail-disallowed-ivy-version:

ivy-fail:

ivy-fail:

ivy-configure:
[ivy:configure] :: loading settings :: file = /x1/jenkins/jenkins-slave/workspace/Lucene-Solr-Tests-master/lucene/top-level-ivy-settings.xml

resolve:

ivy-availability-check:
[loadresource] Do not set property disallowed.ivy.jars.list as its length is 0.

-ivy-fail-disallowed-ivy-version:

ivy-fail:

ivy-fail:

ivy-configure:
[ivy:configure] :: loading settings :: file = /x1/jenkins/jenkins-slave/workspace/Lucene-Solr-Tests-master/lucene/top-level-ivy-settings.xml

resolve:

ivy-availability-check:
[loadresource] Do not set property disallowed.ivy.jars.list as its length is 0.

-ivy-fail-disallowed-ivy-version:

ivy-fail:

ivy-fail:

ivy-configure:
[ivy:configure] :: loading settings :: file = /x1/jenkins/jenkins-slave/workspace/Lucene-Solr-Tests-master/lucene/top-level-ivy-settings.xml

resolve:

ivy-availability-check:
[loadresource] Do not set property disallowed.ivy.jars.list as its length is 0.

-ivy-fail-disallowed-ivy-version:

ivy-fail:

ivy-fail:

ivy-configure:
[ivy:configure] :: loading settings :: file = /x1/jenkins/jenkins-slave/workspace/Lucene-Solr-Tests-master/lucene/top-level-ivy-settings.xml

resolve:

ivy-availability-check:
[loadresource] Do not set property disallowed.ivy.jars.list as its length is 0.

-ivy-fail-disallowed-ivy-version:

ivy-fail:

ivy-fail:

ivy-configure:
[ivy:configure] :: loading settings :: file = /x1/jenkins/jenkins-slave/workspace/Lucene-Solr-Tests-master/lucene/top-level-ivy-settings.xml

resolve:

ivy-availability-check:
[loadresource] Do not set property disallowed.ivy.jars.list as its length is 0.

-ivy-fail-disallowed-ivy-version:

ivy-fail:

ivy-fail:

ivy-configure:
[ivy:configure] :: loading settings :: file = /x1/jenkins/jenkins-slave/workspace/Lucene-Solr-Tests-master/lucene/top-level-ivy-settings.xml

resolve:

ivy-availability-check:
[loadresource] Do not set property disallowed.ivy.jars.list as its length is 0.

-ivy-fail-disallowed-ivy-version:

ivy-fail:

ivy-fail:

ivy-configure:
[ivy:configure] :: loading settings :: file = /x1/jenkins/jenkins-slave/workspace/Lucene-Solr-Tests-master/lucene/top-level-ivy-settings.xml

resolve:

ivy-availability-check:
[loadresource] Do not set property disallowed.ivy.jars.list as its length is 0.

-ivy-fail-disallowed-ivy-version:

ivy-fail:

ivy-fail:

ivy-configure:
[ivy:configure] :: loading settings :: file = /x1/jenkins/jenkins-slave/workspace/Lucene-Solr-Tests-master/lucene/top-level-ivy-settings.xml

resolve:

ivy-availability-check:
[loadresource] Do not set property disallowed.ivy.jars.list as its length is 0.

-ivy-fail-disallowed-ivy-version:

ivy-fail:

ivy-fail:

ivy-configure:
[ivy:configure] :: loading settings :: file = /x1/jenkins/jenkins-slave/workspace/Lucene-Solr-Tests-master/lucene/top-level-ivy-settings.xml

resolve:

ivy-availability-check:
[loadresource] Do not set property disallowed.ivy.jars.list as its length is 0.

-ivy-fail-disallowed-ivy-version:

ivy-fail:

ivy-fail:

ivy-configure:
[ivy:configure] :: loading settings :: file = /x1/jenkins/jenkins-slave/workspace/Lucene-Solr-Tests-master/lucene/top-level-ivy-settings.xml

resolve:

jar-checksums:
    [mkdir] Created dir: /x1/jenkins/jenkins-slave/workspace/Lucene-Solr-Tests-master/solr/null1300740303
     [copy] Copying 238 files to /x1/jenkins/jenkins-slave/workspace/Lucene-Solr-Tests-master/solr/null1300740303
   [delete] Deleting directory /x1/jenkins/jenkins-slave/workspace/Lucene-Solr-Tests-master/solr/null1300740303

check-working-copy:
[ivy:cachepath] :: resolving dependencies :: org.eclipse.jgit#org.eclipse.jgit-caller;working
[ivy:cachepath] confs: [default]
[ivy:cachepath] found org.eclipse.jgit#org.eclipse.jgit;4.6.0.201612231935-r in public
[ivy:cachepath] found com.jcraft#jsch;0.1.53 in public
[ivy:cachepath] found com.googlecode.javaewah#JavaEWAH;1.1.6 in public
[ivy:cachepath] found org.apache.httpcomponents#httpclient;4.3.6 in public
[ivy:cachepath] found org.apache.httpcomponents#httpcore;4.3.3 in public
[ivy:cachepath] found commons-logging#commons-logging;1.1.3 in public
[ivy:cachepath] found commons-codec#commons-codec;1.6 in public
[ivy:cachepath] found org.slf4j#slf4j-api;1.7.2 in public
[ivy:cachepath] :: resolution report :: resolve 30ms :: artifacts dl 2ms
        ---------------------------------------------------------------------
        |                  |            modules            ||   artifacts   |
        |       conf       | number| search|dwnlded|evicted|| number|dwnlded|
        ---------------------------------------------------------------------
        |      default     |   8   |   0   |   0   |   0   ||   8   |   0   |
        ---------------------------------------------------------------------
[wc-checker] Initializing working copy...
[wc-checker] SLF4J: Failed to load class "org.slf4j.impl.StaticLoggerBinder".
[wc-checker] SLF4J: Defaulting to no-operation (NOP) logger implementation
[wc-checker] SLF4J: See http://www.slf4j.org/codes.html#StaticLoggerBinder for further details.
[wc-checker] Checking working copy status...

-jenkins-base:

BUILD SUCCESSFUL
Total time: 116 minutes 59 seconds
Archiving artifacts
java.lang.InterruptedException: no matches found within 10000
        at hudson.FilePath$34.hasMatch(FilePath.java:2678)
        at hudson.FilePath$34.invoke(FilePath.java:2557)
        at hudson.FilePath$34.invoke(FilePath.java:2547)
        at hudson.FilePath$FileCallableWrapper.call(FilePath.java:2918)
Also:   hudson.remoting.Channel$CallSiteStackTrace: Remote call to lucene
                at hudson.remoting.Channel.attachCallSiteStackTrace(Channel.java:1741)
                at hudson.remoting.UserRequest$ExceptionResponse.retrieve(UserRequest.java:357)
                at hudson.remoting.Channel.call(Channel.java:955)
                at hudson.FilePath.act(FilePath.java:1036)
                at hudson.FilePath.act(FilePath.java:1025)
                at hudson.FilePath.validateAntFileMask(FilePath.java:2547)
                at hudson.tasks.ArtifactArchiver.perform(ArtifactArchiver.java:243)
                at hudson.tasks.BuildStepCompatibilityLayer.perform(BuildStepCompatibilityLayer.java:81)
                at hudson.tasks.BuildStepMonitor$1.perform(BuildStepMonitor.java:20)
                at hudson.model.AbstractBuild$AbstractBuildExecution.perform(AbstractBuild.java:744)
                at hudson.model.AbstractBuild$AbstractBuildExecution.performAllBuildSteps(AbstractBuild.java:690)
                at hudson.model.Build$BuildExecution.post2(Build.java:186)
                at hudson.model.AbstractBuild$AbstractBuildExecution.post(AbstractBuild.java:635)
                at hudson.model.Run.execute(Run.java:1819)
                at hudson.model.FreeStyleBuild.run(FreeStyleBuild.java:43)
                at hudson.model.ResourceController.execute(ResourceController.java:97)
                at hudson.model.Executor.run(Executor.java:429)
Caused: hudson.FilePath$TunneledInterruptedException
        at hudson.FilePath$FileCallableWrapper.call(FilePath.java:2920)
        at hudson.remoting.UserRequest.perform(UserRequest.java:212)
        at hudson.remoting.UserRequest.perform(UserRequest.java:54)
        at hudson.remoting.Request$2.run(Request.java:369)
        at hudson.remoting.InterceptingExecutorService$1.call(InterceptingExecutorService.java:72)
        at java.util.concurrent.FutureTask.run(FutureTask.java:266)
        at java.util.concurrent.ThreadPoolExecutor.runWorker(ThreadPoolExecutor.java:1142)
        at java.util.concurrent.ThreadPoolExecutor$Worker.run(ThreadPoolExecutor.java:617)
        at java.lang.Thread.run(Thread.java:748)
Caused: java.lang.InterruptedException: java.lang.InterruptedException: no matches found within 10000
        at hudson.FilePath.act(FilePath.java:1038)
        at hudson.FilePath.act(FilePath.java:1025)
        at hudson.FilePath.validateAntFileMask(FilePath.java:2547)
        at hudson.tasks.ArtifactArchiver.perform(ArtifactArchiver.java:243)
        at hudson.tasks.BuildStepCompatibilityLayer.perform(BuildStepCompatibilityLayer.java:81)
        at hudson.tasks.BuildStepMonitor$1.perform(BuildStepMonitor.java:20)
        at hudson.model.AbstractBuild$AbstractBuildExecution.perform(AbstractBuild.java:744)
        at hudson.model.AbstractBuild$AbstractBuildExecution.performAllBuildSteps(AbstractBuild.java:690)
        at hudson.model.Build$BuildExecution.post2(Build.java:186)
        at hudson.model.AbstractBuild$AbstractBuildExecution.post(AbstractBuild.java:635)
        at hudson.model.Run.execute(Run.java:1819)
        at hudson.model.FreeStyleBuild.run(FreeStyleBuild.java:43)
        at hudson.model.ResourceController.execute(ResourceController.java:97)
        at hudson.model.Executor.run(Executor.java:429)
No artifacts found that match the file pattern "**/*.events,heapdumps/**,**/hs_err_pid*". Configuration error?
Recording test results
Build step 'Publish JUnit test result report' changed build result to UNSTABLE
Email was triggered for: Unstable (Test Failures)
Sending email for trigger: Unstable (Test Failures)


---------------------------------------------------------------------
To unsubscribe, e-mail: [hidden email]
For additional commands, e-mail: [hidden email]