[JENKINS] Lucene-Solr-Tests-master - Build # 3290 - Unstable

classic Classic list List threaded Threaded
1 message Options
Reply | Threaded
Open this post in threaded view
|

[JENKINS] Lucene-Solr-Tests-master - Build # 3290 - Unstable

Apache Jenkins Server-2
Build: https://builds.apache.org/job/Lucene-Solr-Tests-master/3290/

1 tests failed.
FAILED:  org.apache.solr.client.solrj.impl.CloudHttp2SolrClientTest.stateVersionParamTest

Error Message:
Error from server at http://127.0.0.1:41077/solr/collection1: no servers hosting shard: shard2

Stack Trace:
org.apache.solr.client.solrj.impl.HttpSolrClient$RemoteSolrException: Error from server at http://127.0.0.1:41077/solr/collection1: no servers hosting shard: shard2
        at __randomizedtesting.SeedInfo.seed([2278DD4918FBB937:8741D031B3E113BE]:0)
        at org.apache.solr.client.solrj.impl.HttpSolrClient.executeMethod(HttpSolrClient.java:649)
        at org.apache.solr.client.solrj.impl.HttpSolrClient.request(HttpSolrClient.java:255)
        at org.apache.solr.client.solrj.impl.HttpSolrClient.request(HttpSolrClient.java:244)
        at org.apache.solr.client.solrj.SolrRequest.process(SolrRequest.java:207)
        at org.apache.solr.client.solrj.SolrClient.query(SolrClient.java:987)
        at org.apache.solr.client.solrj.SolrClient.query(SolrClient.java:1002)
        at org.apache.solr.client.solrj.impl.CloudHttp2SolrClientTest.stateVersionParamTest(CloudHttp2SolrClientTest.java:626)
        at java.base/jdk.internal.reflect.NativeMethodAccessorImpl.invoke0(Native Method)
        at java.base/jdk.internal.reflect.NativeMethodAccessorImpl.invoke(NativeMethodAccessorImpl.java:62)
        at java.base/jdk.internal.reflect.DelegatingMethodAccessorImpl.invoke(DelegatingMethodAccessorImpl.java:43)
        at java.base/java.lang.reflect.Method.invoke(Method.java:566)
        at com.carrotsearch.randomizedtesting.RandomizedRunner.invoke(RandomizedRunner.java:1750)
        at com.carrotsearch.randomizedtesting.RandomizedRunner$8.evaluate(RandomizedRunner.java:938)
        at com.carrotsearch.randomizedtesting.RandomizedRunner$9.evaluate(RandomizedRunner.java:974)
        at com.carrotsearch.randomizedtesting.RandomizedRunner$10.evaluate(RandomizedRunner.java:988)
        at org.junit.rules.ExpectedException$ExpectedExceptionStatement.evaluate(ExpectedException.java:239)
        at com.carrotsearch.randomizedtesting.rules.SystemPropertiesRestoreRule$1.evaluate(SystemPropertiesRestoreRule.java:57)
        at org.apache.lucene.util.TestRuleSetupTeardownChained$1.evaluate(TestRuleSetupTeardownChained.java:49)
        at org.apache.lucene.util.AbstractBeforeAfterRule$1.evaluate(AbstractBeforeAfterRule.java:45)
        at org.apache.lucene.util.TestRuleThreadAndTestName$1.evaluate(TestRuleThreadAndTestName.java:48)
        at org.apache.lucene.util.TestRuleIgnoreAfterMaxFailures$1.evaluate(TestRuleIgnoreAfterMaxFailures.java:64)
        at org.apache.lucene.util.TestRuleMarkFailure$1.evaluate(TestRuleMarkFailure.java:47)
        at com.carrotsearch.randomizedtesting.rules.StatementAdapter.evaluate(StatementAdapter.java:36)
        at com.carrotsearch.randomizedtesting.ThreadLeakControl$StatementRunner.run(ThreadLeakControl.java:368)
        at com.carrotsearch.randomizedtesting.ThreadLeakControl.forkTimeoutingTask(ThreadLeakControl.java:817)
        at com.carrotsearch.randomizedtesting.ThreadLeakControl$3.evaluate(ThreadLeakControl.java:468)
        at com.carrotsearch.randomizedtesting.RandomizedRunner.runSingleTest(RandomizedRunner.java:947)
        at com.carrotsearch.randomizedtesting.RandomizedRunner$5.evaluate(RandomizedRunner.java:832)
        at com.carrotsearch.randomizedtesting.RandomizedRunner$6.evaluate(RandomizedRunner.java:883)
        at com.carrotsearch.randomizedtesting.RandomizedRunner$7.evaluate(RandomizedRunner.java:894)
        at com.carrotsearch.randomizedtesting.rules.StatementAdapter.evaluate(StatementAdapter.java:36)
        at com.carrotsearch.randomizedtesting.rules.SystemPropertiesRestoreRule$1.evaluate(SystemPropertiesRestoreRule.java:57)
        at org.apache.lucene.util.AbstractBeforeAfterRule$1.evaluate(AbstractBeforeAfterRule.java:45)
        at com.carrotsearch.randomizedtesting.rules.StatementAdapter.evaluate(StatementAdapter.java:36)
        at org.apache.lucene.util.TestRuleStoreClassName$1.evaluate(TestRuleStoreClassName.java:41)
        at com.carrotsearch.randomizedtesting.rules.NoShadowingOrOverridesOnMethodsRule$1.evaluate(NoShadowingOrOverridesOnMethodsRule.java:40)
        at com.carrotsearch.randomizedtesting.rules.NoShadowingOrOverridesOnMethodsRule$1.evaluate(NoShadowingOrOverridesOnMethodsRule.java:40)
        at com.carrotsearch.randomizedtesting.rules.StatementAdapter.evaluate(StatementAdapter.java:36)
        at com.carrotsearch.randomizedtesting.rules.StatementAdapter.evaluate(StatementAdapter.java:36)
        at org.apache.lucene.util.TestRuleAssertionsRequired$1.evaluate(TestRuleAssertionsRequired.java:53)
        at org.apache.lucene.util.TestRuleMarkFailure$1.evaluate(TestRuleMarkFailure.java:47)
        at org.apache.lucene.util.TestRuleIgnoreAfterMaxFailures$1.evaluate(TestRuleIgnoreAfterMaxFailures.java:64)
        at org.apache.lucene.util.TestRuleIgnoreTestSuites$1.evaluate(TestRuleIgnoreTestSuites.java:54)
        at com.carrotsearch.randomizedtesting.rules.StatementAdapter.evaluate(StatementAdapter.java:36)
        at com.carrotsearch.randomizedtesting.ThreadLeakControl$StatementRunner.run(ThreadLeakControl.java:368)
        at java.base/java.lang.Thread.run(Thread.java:834)




Build Log:
[...truncated 16307 lines...]
   [junit4] Suite: org.apache.solr.client.solrj.impl.CloudHttp2SolrClientTest
   [junit4]   2> Creating dataDir: /home/jenkins/jenkins-slave/workspace/Lucene-Solr-Tests-master/solr/build/solr-solrj/test/J1/temp/solr.client.solrj.impl.CloudHttp2SolrClientTest_2278DD4918FBB937-001/init-core-data-001
   [junit4]   2> 431222 WARN  (SUITE-CloudHttp2SolrClientTest-seed#[2278DD4918FBB937]-worker) [    ] o.a.s.SolrTestCaseJ4 startTrackingSearchers: numOpens=146 numCloses=146
   [junit4]   2> 431222 INFO  (SUITE-CloudHttp2SolrClientTest-seed#[2278DD4918FBB937]-worker) [    ] o.a.s.SolrTestCaseJ4 Using PointFields (NUMERIC_POINTS_SYSPROP=true) w/NUMERIC_DOCVALUES_SYSPROP=true
   [junit4]   2> 431223 INFO  (SUITE-CloudHttp2SolrClientTest-seed#[2278DD4918FBB937]-worker) [    ] o.a.s.SolrTestCaseJ4 Randomized ssl (false) and clientAuth (true) via: @org.apache.solr.util.RandomizeSSL(reason="", ssl=0.0/0.0, value=0.0/0.0, clientAuth=0.0/0.0)
   [junit4]   2> 431223 INFO  (SUITE-CloudHttp2SolrClientTest-seed#[2278DD4918FBB937]-worker) [    ] o.a.s.SolrTestCaseJ4 SecureRandom sanity checks: test.solr.allowed.securerandom=null & java.security.egd=file:/dev/./urandom
   [junit4]   2> 431226 INFO  (TEST-CloudHttp2SolrClientTest.testInitializationWithSolrUrls-seed#[2278DD4918FBB937]) [    ] o.a.s.SolrTestCaseJ4 ###Starting testInitializationWithSolrUrls
   [junit4]   2> 431226 INFO  (TEST-CloudHttp2SolrClientTest.testInitializationWithSolrUrls-seed#[2278DD4918FBB937]) [    ] o.a.s.c.MiniSolrCloudCluster Starting cluster of 3 servers in /home/jenkins/jenkins-slave/workspace/Lucene-Solr-Tests-master/solr/build/solr-solrj/test/J1/temp/solr.client.solrj.impl.CloudHttp2SolrClientTest_2278DD4918FBB937-001/tempDir-001
   [junit4]   2> 431226 INFO  (TEST-CloudHttp2SolrClientTest.testInitializationWithSolrUrls-seed#[2278DD4918FBB937]) [    ] o.a.s.c.ZkTestServer STARTING ZK TEST SERVER
   [junit4]   2> 431227 INFO  (ZkTestServer Run Thread) [    ] o.a.s.c.ZkTestServer client port:0.0.0.0/0.0.0.0:0
   [junit4]   2> 431227 INFO  (ZkTestServer Run Thread) [    ] o.a.s.c.ZkTestServer Starting server
   [junit4]   2> 431327 INFO  (TEST-CloudHttp2SolrClientTest.testInitializationWithSolrUrls-seed#[2278DD4918FBB937]) [    ] o.a.s.c.ZkTestServer start zk server on port:39879
   [junit4]   2> 431327 INFO  (TEST-CloudHttp2SolrClientTest.testInitializationWithSolrUrls-seed#[2278DD4918FBB937]) [    ] o.a.s.c.ZkTestServer parse host and port list: 127.0.0.1:39879
   [junit4]   2> 431327 INFO  (TEST-CloudHttp2SolrClientTest.testInitializationWithSolrUrls-seed#[2278DD4918FBB937]) [    ] o.a.s.c.ZkTestServer connecting to 127.0.0.1 39879
   [junit4]   2> 431331 INFO  (zkConnectionManagerCallback-1036-thread-1) [    ] o.a.s.c.c.ConnectionManager zkClient has connected
   [junit4]   2> 431334 INFO  (zkConnectionManagerCallback-1038-thread-1) [    ] o.a.s.c.c.ConnectionManager zkClient has connected
   [junit4]   2> 431336 INFO  (zkConnectionManagerCallback-1040-thread-1) [    ] o.a.s.c.c.ConnectionManager zkClient has connected
   [junit4]   2> 431338 WARN  (NIOServerCxn.Factory:0.0.0.0/0.0.0.0:0) [    ] o.a.z.s.NIOServerCnxn Unable to read additional data from client sessionid 0x108d1bcc19e0002, likely client has closed socket
   [junit4]   2> 431338 WARN  (jetty-launcher-1041-thread-1) [    ] o.e.j.s.AbstractConnector Ignoring deprecated socket close linger time
   [junit4]   2> 431339 WARN  (jetty-launcher-1041-thread-3) [    ] o.e.j.s.AbstractConnector Ignoring deprecated socket close linger time
   [junit4]   2> 431339 INFO  (jetty-launcher-1041-thread-1) [    ] o.a.s.c.s.e.JettySolrRunner Start Jetty (original configured port=0)
   [junit4]   2> 431339 INFO  (jetty-launcher-1041-thread-1) [    ] o.a.s.c.s.e.JettySolrRunner Trying to start Jetty on port 0 try number 1 ...
   [junit4]   2> 431339 INFO  (jetty-launcher-1041-thread-3) [    ] o.a.s.c.s.e.JettySolrRunner Start Jetty (original configured port=0)
   [junit4]   2> 431339 INFO  (jetty-launcher-1041-thread-3) [    ] o.a.s.c.s.e.JettySolrRunner Trying to start Jetty on port 0 try number 1 ...
   [junit4]   2> 431339 INFO  (jetty-launcher-1041-thread-1) [    ] o.e.j.s.Server jetty-9.4.14.v20181114; built: 2018-11-14T21:20:31.478Z; git: c4550056e785fb5665914545889f21dc136ad9e6; jvm 11.0.1+13-LTS
   [junit4]   2> 431339 INFO  (jetty-launcher-1041-thread-3) [    ] o.e.j.s.Server jetty-9.4.14.v20181114; built: 2018-11-14T21:20:31.478Z; git: c4550056e785fb5665914545889f21dc136ad9e6; jvm 11.0.1+13-LTS
   [junit4]   2> 431340 WARN  (jetty-launcher-1041-thread-2) [    ] o.e.j.s.AbstractConnector Ignoring deprecated socket close linger time
   [junit4]   2> 431340 INFO  (jetty-launcher-1041-thread-2) [    ] o.a.s.c.s.e.JettySolrRunner Start Jetty (original configured port=0)
   [junit4]   2> 431340 INFO  (jetty-launcher-1041-thread-2) [    ] o.a.s.c.s.e.JettySolrRunner Trying to start Jetty on port 0 try number 1 ...
   [junit4]   2> 431340 INFO  (jetty-launcher-1041-thread-2) [    ] o.e.j.s.Server jetty-9.4.14.v20181114; built: 2018-11-14T21:20:31.478Z; git: c4550056e785fb5665914545889f21dc136ad9e6; jvm 11.0.1+13-LTS
   [junit4]   2> 431340 INFO  (jetty-launcher-1041-thread-3) [    ] o.e.j.s.session DefaultSessionIdManager workerName=node0
   [junit4]   2> 431340 INFO  (jetty-launcher-1041-thread-3) [    ] o.e.j.s.session No SessionScavenger set, using defaults
   [junit4]   2> 431340 INFO  (jetty-launcher-1041-thread-3) [    ] o.e.j.s.session node0 Scavenging every 600000ms
   [junit4]   2> 431340 INFO  (jetty-launcher-1041-thread-1) [    ] o.e.j.s.session DefaultSessionIdManager workerName=node0
   [junit4]   2> 431340 INFO  (jetty-launcher-1041-thread-1) [    ] o.e.j.s.session No SessionScavenger set, using defaults
   [junit4]   2> 431340 INFO  (jetty-launcher-1041-thread-1) [    ] o.e.j.s.session node0 Scavenging every 600000ms
   [junit4]   2> 431341 INFO  (jetty-launcher-1041-thread-1) [    ] o.e.j.s.h.ContextHandler Started o.e.j.s.ServletContextHandler@f3a566b{/solr,null,AVAILABLE}
   [junit4]   2> 431341 INFO  (jetty-launcher-1041-thread-3) [    ] o.e.j.s.h.ContextHandler Started o.e.j.s.ServletContextHandler@6cc9808d{/solr,null,AVAILABLE}
   [junit4]   2> 431341 INFO  (jetty-launcher-1041-thread-3) [    ] o.e.j.s.AbstractConnector Started ServerConnector@3be2497b{HTTP/1.1,[http/1.1, h2c]}{127.0.0.1:35284}
   [junit4]   2> 431341 INFO  (jetty-launcher-1041-thread-3) [    ] o.e.j.s.Server Started @431525ms
   [junit4]   2> 431341 INFO  (jetty-launcher-1041-thread-2) [    ] o.e.j.s.session DefaultSessionIdManager workerName=node0
   [junit4]   2> 431341 INFO  (jetty-launcher-1041-thread-2) [    ] o.e.j.s.session No SessionScavenger set, using defaults
   [junit4]   2> 431341 INFO  (jetty-launcher-1041-thread-2) [    ] o.e.j.s.session node0 Scavenging every 660000ms
   [junit4]   2> 431341 INFO  (jetty-launcher-1041-thread-3) [    ] o.a.s.c.s.e.JettySolrRunner Jetty properties: {hostContext=/solr, hostPort=35284}
   [junit4]   2> 431342 ERROR (jetty-launcher-1041-thread-3) [    ] o.a.s.u.StartupLoggingUtils Missing Java Option solr.log.dir. Logging may be missing or incomplete.
   [junit4]   2> 431342 INFO  (jetty-launcher-1041-thread-3) [    ] o.a.s.s.SolrDispatchFilter Using logger factory org.apache.logging.slf4j.Log4jLoggerFactory
   [junit4]   2> 431342 INFO  (jetty-launcher-1041-thread-2) [    ] o.e.j.s.h.ContextHandler Started o.e.j.s.ServletContextHandler@2580aa87{/solr,null,AVAILABLE}
   [junit4]   2> 431342 INFO  (jetty-launcher-1041-thread-3) [    ] o.a.s.s.SolrDispatchFilter  ___      _       Welcome to Apache Solr? version 9.0.0
   [junit4]   2> 431342 INFO  (jetty-launcher-1041-thread-3) [    ] o.a.s.s.SolrDispatchFilter / __| ___| |_ _   Starting in cloud mode on port null
   [junit4]   2> 431342 INFO  (jetty-launcher-1041-thread-3) [    ] o.a.s.s.SolrDispatchFilter \__ \/ _ \ | '_|  Install dir: null
   [junit4]   2> 431342 INFO  (jetty-launcher-1041-thread-3) [    ] o.a.s.s.SolrDispatchFilter |___/\___/_|_|    Start time: 2019-04-17T22:45:46.023249Z
   [junit4]   2> 431342 INFO  (jetty-launcher-1041-thread-1) [    ] o.e.j.s.AbstractConnector Started ServerConnector@245d79d7{HTTP/1.1,[http/1.1, h2c]}{127.0.0.1:43665}
   [junit4]   2> 431342 INFO  (jetty-launcher-1041-thread-1) [    ] o.e.j.s.Server Started @431526ms
   [junit4]   2> 431342 INFO  (jetty-launcher-1041-thread-1) [    ] o.a.s.c.s.e.JettySolrRunner Jetty properties: {hostContext=/solr, hostPort=43665}
   [junit4]   2> 431343 ERROR (jetty-launcher-1041-thread-1) [    ] o.a.s.u.StartupLoggingUtils Missing Java Option solr.log.dir. Logging may be missing or incomplete.
   [junit4]   2> 431343 INFO  (jetty-launcher-1041-thread-1) [    ] o.a.s.s.SolrDispatchFilter Using logger factory org.apache.logging.slf4j.Log4jLoggerFactory
   [junit4]   2> 431343 INFO  (jetty-launcher-1041-thread-1) [    ] o.a.s.s.SolrDispatchFilter  ___      _       Welcome to Apache Solr? version 9.0.0
   [junit4]   2> 431343 INFO  (jetty-launcher-1041-thread-1) [    ] o.a.s.s.SolrDispatchFilter / __| ___| |_ _   Starting in cloud mode on port null
   [junit4]   2> 431343 INFO  (jetty-launcher-1041-thread-1) [    ] o.a.s.s.SolrDispatchFilter \__ \/ _ \ | '_|  Install dir: null
   [junit4]   2> 431343 INFO  (jetty-launcher-1041-thread-1) [    ] o.a.s.s.SolrDispatchFilter |___/\___/_|_|    Start time: 2019-04-17T22:45:46.024252Z
   [junit4]   2> 431343 INFO  (jetty-launcher-1041-thread-2) [    ] o.e.j.s.AbstractConnector Started ServerConnector@644abc50{HTTP/1.1,[http/1.1, h2c]}{127.0.0.1:33280}
   [junit4]   2> 431343 INFO  (jetty-launcher-1041-thread-2) [    ] o.e.j.s.Server Started @431527ms
   [junit4]   2> 431343 INFO  (jetty-launcher-1041-thread-2) [    ] o.a.s.c.s.e.JettySolrRunner Jetty properties: {hostContext=/solr, hostPort=33280}
   [junit4]   2> 431343 ERROR (jetty-launcher-1041-thread-2) [    ] o.a.s.u.StartupLoggingUtils Missing Java Option solr.log.dir. Logging may be missing or incomplete.
   [junit4]   2> 431343 INFO  (jetty-launcher-1041-thread-2) [    ] o.a.s.s.SolrDispatchFilter Using logger factory org.apache.logging.slf4j.Log4jLoggerFactory
   [junit4]   2> 431343 INFO  (jetty-launcher-1041-thread-2) [    ] o.a.s.s.SolrDispatchFilter  ___      _       Welcome to Apache Solr? version 9.0.0
   [junit4]   2> 431343 INFO  (jetty-launcher-1041-thread-2) [    ] o.a.s.s.SolrDispatchFilter / __| ___| |_ _   Starting in cloud mode on port null
   [junit4]   2> 431343 INFO  (jetty-launcher-1041-thread-2) [    ] o.a.s.s.SolrDispatchFilter \__ \/ _ \ | '_|  Install dir: null
   [junit4]   2> 431343 INFO  (jetty-launcher-1041-thread-2) [    ] o.a.s.s.SolrDispatchFilter |___/\___/_|_|    Start time: 2019-04-17T22:45:46.024945Z
   [junit4]   2> 431348 INFO  (zkConnectionManagerCallback-1043-thread-1) [    ] o.a.s.c.c.ConnectionManager zkClient has connected
   [junit4]   2> 431354 INFO  (jetty-launcher-1041-thread-3) [    ] o.a.s.s.SolrDispatchFilter solr.xml found in ZooKeeper. Loading...
   [junit4]   2> 431354 INFO  (zkConnectionManagerCallback-1045-thread-1) [    ] o.a.s.c.c.ConnectionManager zkClient has connected
   [junit4]   2> 431358 INFO  (jetty-launcher-1041-thread-1) [    ] o.a.s.s.SolrDispatchFilter solr.xml found in ZooKeeper. Loading...
   [junit4]   2> 431386 INFO  (zkConnectionManagerCallback-1047-thread-1) [    ] o.a.s.c.c.ConnectionManager zkClient has connected
   [junit4]   2> 431386 INFO  (jetty-launcher-1041-thread-2) [    ] o.a.s.s.SolrDispatchFilter solr.xml found in ZooKeeper. Loading...
   [junit4]   2> 431433 INFO  (jetty-launcher-1041-thread-3) [    ] o.a.s.h.c.HttpShardHandlerFactory Host whitelist initialized: WhitelistHostChecker [whitelistHosts=null, whitelistHostCheckingEnabled=true]
   [junit4]   2> 431434 WARN  (jetty-launcher-1041-thread-3) [    ] o.e.j.u.s.S.config No Client EndPointIdentificationAlgorithm configured for SslContextFactory@4734bde8[provider=null,keyStore=null,trustStore=null]
   [junit4]   2> 431444 WARN  (jetty-launcher-1041-thread-3) [    ] o.e.j.u.s.S.config No Client EndPointIdentificationAlgorithm configured for SslContextFactory@1f45a0fa[provider=null,keyStore=null,trustStore=null]
   [junit4]   2> 431445 INFO  (jetty-launcher-1041-thread-3) [    ] o.a.s.c.ZkContainer Zookeeper client=127.0.0.1:39879/solr
   [junit4]   2> 431462 INFO  (zkConnectionManagerCallback-1056-thread-1) [    ] o.a.s.c.c.ConnectionManager zkClient has connected
   [junit4]   2> 431466 INFO  (jetty-launcher-1041-thread-2) [    ] o.a.s.h.c.HttpShardHandlerFactory Host whitelist initialized: WhitelistHostChecker [whitelistHosts=null, whitelistHostCheckingEnabled=true]
   [junit4]   2> 431467 WARN  (jetty-launcher-1041-thread-2) [    ] o.e.j.u.s.S.config No Client EndPointIdentificationAlgorithm configured for SslContextFactory@5878af52[provider=null,keyStore=null,trustStore=null]
   [junit4]   2> 431468 INFO  (zkConnectionManagerCallback-1058-thread-1) [    ] o.a.s.c.c.ConnectionManager zkClient has connected
   [junit4]   2> 431471 WARN  (jetty-launcher-1041-thread-2) [    ] o.e.j.u.s.S.config No Client EndPointIdentificationAlgorithm configured for SslContextFactory@150e8e6f[provider=null,keyStore=null,trustStore=null]
   [junit4]   2> 431472 INFO  (jetty-launcher-1041-thread-2) [    ] o.a.s.c.ZkContainer Zookeeper client=127.0.0.1:39879/solr
   [junit4]   2> 431479 INFO  (zkConnectionManagerCallback-1066-thread-1) [    ] o.a.s.c.c.ConnectionManager zkClient has connected
   [junit4]   2> 431485 WARN  (jetty-launcher-1041-thread-3) [n:127.0.0.1:35284_solr    ] o.a.s.c.ZkController The _default configset could not be uploaded. Please provide 'solr.default.confdir' parameter that points to a configset intended to be the default. Current 'solr.default.confdir' value: null
   [junit4]   2> 431490 INFO  (jetty-launcher-1041-thread-3) [n:127.0.0.1:35284_solr    ] o.a.s.c.OverseerElectionContext I am going to be the leader 127.0.0.1:35284_solr
   [junit4]   2> 431490 INFO  (jetty-launcher-1041-thread-3) [n:127.0.0.1:35284_solr    ] o.a.s.c.Overseer Overseer (id=74540002484027399-127.0.0.1:35284_solr-n_0000000000) starting
   [junit4]   2> 431498 INFO  (zkConnectionManagerCallback-1068-thread-1) [    ] o.a.s.c.c.ConnectionManager zkClient has connected
   [junit4]   2> 431502 INFO  (zkConnectionManagerCallback-1073-thread-1) [    ] o.a.s.c.c.ConnectionManager zkClient has connected
   [junit4]   2> 431502 WARN  (jetty-launcher-1041-thread-2) [n:127.0.0.1:33280_solr    ] o.a.s.c.ZkController The _default configset could not be uploaded. Please provide 'solr.default.confdir' parameter that points to a configset intended to be the default. Current 'solr.default.confdir' value: null
   [junit4]   2> 431506 INFO  (jetty-launcher-1041-thread-1) [    ] o.a.s.h.c.HttpShardHandlerFactory Host whitelist initialized: WhitelistHostChecker [whitelistHosts=null, whitelistHostCheckingEnabled=true]
   [junit4]   2> 431507 INFO  (jetty-launcher-1041-thread-3) [n:127.0.0.1:35284_solr    ] o.a.s.c.s.i.ZkClientClusterStateProvider Cluster at 127.0.0.1:39879/solr ready
   [junit4]   2> 431507 WARN  (jetty-launcher-1041-thread-1) [    ] o.e.j.u.s.S.config No Client EndPointIdentificationAlgorithm configured for SslContextFactory@4c5a012b[provider=null,keyStore=null,trustStore=null]
   [junit4]   2> 431508 INFO  (OverseerStateUpdate-74540002484027399-127.0.0.1:35284_solr-n_0000000000) [n:127.0.0.1:35284_solr    ] o.a.s.c.Overseer Starting to work on the main queue : 127.0.0.1:35284_solr
   [junit4]   2> 431508 INFO  (jetty-launcher-1041-thread-3) [n:127.0.0.1:35284_solr    ] o.a.s.c.ZkController Register node as live in ZooKeeper:/live_nodes/127.0.0.1:35284_solr
   [junit4]   2> 431509 WARN  (jetty-launcher-1041-thread-1) [    ] o.e.j.u.s.S.config No Client EndPointIdentificationAlgorithm configured for SslContextFactory@5736c9e[provider=null,keyStore=null,trustStore=null]
   [junit4]   2> 431510 INFO  (jetty-launcher-1041-thread-1) [    ] o.a.s.c.ZkContainer Zookeeper client=127.0.0.1:39879/solr
   [junit4]   2> 431511 INFO  (jetty-launcher-1041-thread-2) [n:127.0.0.1:33280_solr    ] o.a.s.c.ZkController Publish node=127.0.0.1:33280_solr as DOWN
   [junit4]   2> 431511 INFO  (zkCallback-1067-thread-1) [    ] o.a.s.c.c.ZkStateReader Updated live nodes from ZooKeeper... (0) -> (1)
   [junit4]   2> 431511 INFO  (zkCallback-1072-thread-1) [    ] o.a.s.c.c.ZkStateReader Updated live nodes from ZooKeeper... (0) -> (1)
   [junit4]   2> 431514 INFO  (zkConnectionManagerCallback-1081-thread-1) [    ] o.a.s.c.c.ConnectionManager zkClient has connected
   [junit4]   2> 431524 INFO  (jetty-launcher-1041-thread-2) [n:127.0.0.1:33280_solr    ] o.a.s.c.TransientSolrCoreCacheDefault Allocating transient cache for 2147483647 transient cores
   [junit4]   2> 431524 INFO  (jetty-launcher-1041-thread-2) [n:127.0.0.1:33280_solr    ] o.a.s.c.ZkController Register node as live in ZooKeeper:/live_nodes/127.0.0.1:33280_solr
   [junit4]   2> 431524 INFO  (zkCallback-1057-thread-1) [    ] o.a.s.c.c.ZkStateReader Updated live nodes from ZooKeeper... (0) -> (1)
   [junit4]   2> 431525 INFO  (zkCallback-1072-thread-1) [    ] o.a.s.c.c.ZkStateReader Updated live nodes from ZooKeeper... (1) -> (2)
   [junit4]   2> 431526 INFO  (zkCallback-1067-thread-1) [    ] o.a.s.c.c.ZkStateReader Updated live nodes from ZooKeeper... (1) -> (2)
   [junit4]   2> 431527 INFO  (zkCallback-1057-thread-1) [    ] o.a.s.c.c.ZkStateReader Updated live nodes from ZooKeeper... (1) -> (2)
   [junit4]   2> 431529 INFO  (zkConnectionManagerCallback-1083-thread-1) [    ] o.a.s.c.c.ConnectionManager zkClient has connected
   [junit4]   2> 431533 WARN  (jetty-launcher-1041-thread-1) [n:127.0.0.1:43665_solr    ] o.a.s.c.ZkController The _default configset could not be uploaded. Please provide 'solr.default.confdir' parameter that points to a configset intended to be the default. Current 'solr.default.confdir' value: null
   [junit4]   2> 431533 INFO  (jetty-launcher-1041-thread-1) [n:127.0.0.1:43665_solr    ] o.a.s.c.c.ZkStateReader Updated live nodes from ZooKeeper... (0) -> (2)
   [junit4]   2> 431537 INFO  (jetty-launcher-1041-thread-1) [n:127.0.0.1:43665_solr    ] o.a.s.c.ZkController Publish node=127.0.0.1:43665_solr as DOWN
   [junit4]   2> 431538 INFO  (jetty-launcher-1041-thread-1) [n:127.0.0.1:43665_solr    ] o.a.s.c.TransientSolrCoreCacheDefault Allocating transient cache for 2147483647 transient cores
   [junit4]   2> 431538 INFO  (jetty-launcher-1041-thread-1) [n:127.0.0.1:43665_solr    ] o.a.s.c.ZkController Register node as live in ZooKeeper:/live_nodes/127.0.0.1:43665_solr
   [junit4]   2> 431540 INFO  (zkCallback-1072-thread-1) [    ] o.a.s.c.c.ZkStateReader Updated live nodes from ZooKeeper... (2) -> (3)
   [junit4]   2> 431546 INFO  (zkCallback-1057-thread-2) [    ] o.a.s.c.c.ZkStateReader Updated live nodes from ZooKeeper... (2) -> (3)
   [junit4]   2> 431546 INFO  (zkCallback-1067-thread-1) [    ] o.a.s.c.c.ZkStateReader Updated live nodes from ZooKeeper... (2) -> (3)
   [junit4]   2> 431558 INFO  (zkCallback-1082-thread-1) [    ] o.a.s.c.c.ZkStateReader Updated live nodes from ZooKeeper... (2) -> (3)
   [junit4]   2> 431567 INFO  (jetty-launcher-1041-thread-3) [n:127.0.0.1:35284_solr    ] o.a.s.h.a.MetricsHistoryHandler No .system collection, keeping metrics history in memory.
   [junit4]   2> 431567 INFO  (zkConnectionManagerCallback-1091-thread-1) [    ] o.a.s.c.c.ConnectionManager zkClient has connected
   [junit4]   2> 431568 INFO  (jetty-launcher-1041-thread-1) [n:127.0.0.1:43665_solr    ] o.a.s.c.c.ZkStateReader Updated live nodes from ZooKeeper... (0) -> (3)
   [junit4]   2> 431569 INFO  (jetty-launcher-1041-thread-1) [n:127.0.0.1:43665_solr    ] o.a.s.c.s.i.ZkClientClusterStateProvider Cluster at 127.0.0.1:39879/solr ready
   [junit4]   2> 431574 INFO  (jetty-launcher-1041-thread-1) [n:127.0.0.1:43665_solr    ] o.a.s.h.a.MetricsHistoryHandler No .system collection, keeping metrics history in memory.
   [junit4]   2> 431579 INFO  (zkConnectionManagerCallback-1096-thread-1) [    ] o.a.s.c.c.ConnectionManager zkClient has connected
   [junit4]   2> 431585 INFO  (jetty-launcher-1041-thread-2) [n:127.0.0.1:33280_solr    ] o.a.s.c.c.ZkStateReader Updated live nodes from ZooKeeper... (0) -> (3)
   [junit4]   2> 431586 INFO  (jetty-launcher-1041-thread-2) [n:127.0.0.1:33280_solr    ] o.a.s.c.s.i.ZkClientClusterStateProvider Cluster at 127.0.0.1:39879/solr ready
   [junit4]   2> 431590 INFO  (jetty-launcher-1041-thread-3) [n:127.0.0.1:35284_solr    ] o.a.s.m.r.SolrJmxReporter JMX monitoring for 'solr_35284.solr.node' (registry 'solr.node') enabled at server: com.sun.jmx.mbeanserver.JmxMBeanServer@3e187b65
   [junit4]   2> 431593 INFO  (jetty-launcher-1041-thread-1) [n:127.0.0.1:43665_solr    ] o.a.s.m.r.SolrJmxReporter JMX monitoring for 'solr_43665.solr.node' (registry 'solr.node') enabled at server: com.sun.jmx.mbeanserver.JmxMBeanServer@3e187b65
   [junit4]   2> 431598 INFO  (jetty-launcher-1041-thread-3) [n:127.0.0.1:35284_solr    ] o.a.s.m.r.SolrJmxReporter JMX monitoring for 'solr_35284.solr.jvm' (registry 'solr.jvm') enabled at server: com.sun.jmx.mbeanserver.JmxMBeanServer@3e187b65
   [junit4]   2> 431598 INFO  (jetty-launcher-1041-thread-3) [n:127.0.0.1:35284_solr    ] o.a.s.m.r.SolrJmxReporter JMX monitoring for 'solr_35284.solr.jetty' (registry 'solr.jetty') enabled at server: com.sun.jmx.mbeanserver.JmxMBeanServer@3e187b65
   [junit4]   2> 431599 INFO  (jetty-launcher-1041-thread-3) [n:127.0.0.1:35284_solr    ] o.a.s.c.CorePropertiesLocator Found 0 core definitions underneath /home/jenkins/jenkins-slave/workspace/Lucene-Solr-Tests-master/solr/build/solr-solrj/test/J1/temp/solr.client.solrj.impl.CloudHttp2SolrClientTest_2278DD4918FBB937-001/tempDir-001/node3/.
   [junit4]   2> 431601 INFO  (jetty-launcher-1041-thread-1) [n:127.0.0.1:43665_solr    ] o.a.s.m.r.SolrJmxReporter JMX monitoring for 'solr_43665.solr.jvm' (registry 'solr.jvm') enabled at server: com.sun.jmx.mbeanserver.JmxMBeanServer@3e187b65
   [junit4]   2> 431601 INFO  (jetty-launcher-1041-thread-1) [n:127.0.0.1:43665_solr    ] o.a.s.m.r.SolrJmxReporter JMX monitoring for 'solr_43665.solr.jetty' (registry 'solr.jetty') enabled at server: com.sun.jmx.mbeanserver.JmxMBeanServer@3e187b65
   [junit4]   2> 431602 INFO  (jetty-launcher-1041-thread-1) [n:127.0.0.1:43665_solr    ] o.a.s.c.CorePropertiesLocator Found 0 core definitions underneath /home/jenkins/jenkins-slave/workspace/Lucene-Solr-Tests-master/solr/build/solr-solrj/test/J1/temp/solr.client.solrj.impl.CloudHttp2SolrClientTest_2278DD4918FBB937-001/tempDir-001/node1/.
   [junit4]   2> 431606 INFO  (jetty-launcher-1041-thread-2) [n:127.0.0.1:33280_solr    ] o.a.s.h.a.MetricsHistoryHandler No .system collection, keeping metrics history in memory.
   [junit4]   2> 431621 INFO  (jetty-launcher-1041-thread-2) [n:127.0.0.1:33280_solr    ] o.a.s.m.r.SolrJmxReporter JMX monitoring for 'solr_33280.solr.node' (registry 'solr.node') enabled at server: com.sun.jmx.mbeanserver.JmxMBeanServer@3e187b65
   [junit4]   2> 431630 INFO  (jetty-launcher-1041-thread-2) [n:127.0.0.1:33280_solr    ] o.a.s.m.r.SolrJmxReporter JMX monitoring for 'solr_33280.solr.jvm' (registry 'solr.jvm') enabled at server: com.sun.jmx.mbeanserver.JmxMBeanServer@3e187b65
   [junit4]   2> 431630 INFO  (jetty-launcher-1041-thread-2) [n:127.0.0.1:33280_solr    ] o.a.s.m.r.SolrJmxReporter JMX monitoring for 'solr_33280.solr.jetty' (registry 'solr.jetty') enabled at server: com.sun.jmx.mbeanserver.JmxMBeanServer@3e187b65
   [junit4]   2> 431631 INFO  (jetty-launcher-1041-thread-2) [n:127.0.0.1:33280_solr    ] o.a.s.c.CorePropertiesLocator Found 0 core definitions underneath /home/jenkins/jenkins-slave/workspace/Lucene-Solr-Tests-master/solr/build/solr-solrj/test/J1/temp/solr.client.solrj.impl.CloudHttp2SolrClientTest_2278DD4918FBB937-001/tempDir-001/node2/.
   [junit4]   2> 431717 INFO  (zkConnectionManagerCallback-1103-thread-1) [    ] o.a.s.c.c.ConnectionManager zkClient has connected
   [junit4]   2> 431718 INFO  (TEST-CloudHttp2SolrClientTest.testInitializationWithSolrUrls-seed#[2278DD4918FBB937]) [    ] o.a.s.c.c.ZkStateReader Updated live nodes from ZooKeeper... (0) -> (3)
   [junit4]   2> 431719 INFO  (TEST-CloudHttp2SolrClientTest.testInitializationWithSolrUrls-seed#[2278DD4918FBB937]) [    ] o.a.s.c.s.i.ZkClientClusterStateProvider Cluster at 127.0.0.1:39879/solr ready
   [junit4]   2> 431741 WARN  (TEST-CloudHttp2SolrClientTest.testInitializationWithSolrUrls-seed#[2278DD4918FBB937]) [    ] o.e.j.u.s.S.config No Client EndPointIdentificationAlgorithm configured for SslContextFactory@381e5451[provider=null,keyStore=null,trustStore=null]
   [junit4]   2> 431759 INFO  (qtp1814118038-2657) [n:127.0.0.1:35284_solr    ] o.a.s.h.a.CollectionsHandler Invoked Collection Action :clusterstatus with params action=CLUSTERSTATUS&wt=javabin&version=2 and sendToOCPQueue=true
   [junit4]   2> 431761 INFO  (qtp1814118038-2657) [n:127.0.0.1:35284_solr    ] o.a.s.s.HttpSolrCall [admin] webapp=null path=/admin/collections params={action=CLUSTERSTATUS&wt=javabin&version=2} status=0 QTime=1
   [junit4]   2> 431764 WARN  (TEST-CloudHttp2SolrClientTest.testInitializationWithSolrUrls-seed#[2278DD4918FBB937]) [    ] o.e.j.u.s.S.config No Client EndPointIdentificationAlgorithm configured for SslContextFactory@4450fc26[provider=null,keyStore=null,trustStore=null]
   [junit4]   2> 431765 WARN  (TEST-CloudHttp2SolrClientTest.testInitializationWithSolrUrls-seed#[2278DD4918FBB937]) [    ] o.e.j.u.s.S.config No Client EndPointIdentificationAlgorithm configured for SslContextFactory@947da8c[provider=null,keyStore=null,trustStore=null]
   [junit4]   2> 431767 INFO  (qtp1696532494-2668) [n:127.0.0.1:33280_solr    ] o.a.s.h.a.CollectionsHandler Invoked Collection Action :create with params collection.configName=conf&name=collection1&nrtReplicas=1&action=CREATE&numShards=2&wt=javabin&version=2 and sendToOCPQueue=true
   [junit4]   2> 431770 INFO  (OverseerThreadFactory-654-thread-1-processing-n:127.0.0.1:35284_solr) [n:127.0.0.1:35284_solr    ] o.a.s.c.a.c.CreateCollectionCmd Create collection collection1
   [junit4]   2> 431882 INFO  (OverseerStateUpdate-74540002484027399-127.0.0.1:35284_solr-n_0000000000) [n:127.0.0.1:35284_solr    ] o.a.s.c.o.SliceMutator createReplica() {
   [junit4]   2>   "operation":"ADDREPLICA",
   [junit4]   2>   "collection":"collection1",
   [junit4]   2>   "shard":"shard1",
   [junit4]   2>   "core":"collection1_shard1_replica_n1",
   [junit4]   2>   "state":"down",
   [junit4]   2>   "base_url":"http://127.0.0.1:43665/solr",
   [junit4]   2>   "type":"NRT",
   [junit4]   2>   "waitForFinalState":"false"}
   [junit4]   2> 431890 INFO  (OverseerStateUpdate-74540002484027399-127.0.0.1:35284_solr-n_0000000000) [n:127.0.0.1:35284_solr    ] o.a.s.c.o.SliceMutator createReplica() {
   [junit4]   2>   "operation":"ADDREPLICA",
   [junit4]   2>   "collection":"collection1",
   [junit4]   2>   "shard":"shard2",
   [junit4]   2>   "core":"collection1_shard2_replica_n2",
   [junit4]   2>   "state":"down",
   [junit4]   2>   "base_url":"http://127.0.0.1:33280/solr",
   [junit4]   2>   "type":"NRT",
   [junit4]   2>   "waitForFinalState":"false"}
   [junit4]   2> 432122 INFO  (qtp1708730501-2654) [n:127.0.0.1:43665_solr    x:collection1_shard1_replica_n1] o.a.s.h.a.CoreAdminOperation core create command qt=/admin/cores&coreNodeName=core_node3&collection.configName=conf&newCollection=true&name=collection1_shard1_replica_n1&action=CREATE&numShards=2&collection=collection1&shard=shard1&wt=javabin&version=2&replicaType=NRT
   [junit4]   2> 432122 INFO  (qtp1696532494-2670) [n:127.0.0.1:33280_solr    x:collection1_shard2_replica_n2] o.a.s.h.a.CoreAdminOperation core create command qt=/admin/cores&coreNodeName=core_node4&collection.configName=conf&newCollection=true&name=collection1_shard2_replica_n2&action=CREATE&numShards=2&collection=collection1&shard=shard2&wt=javabin&version=2&replicaType=NRT
   [junit4]   2> 433164 INFO  (qtp1708730501-2654) [n:127.0.0.1:43665_solr c:collection1 s:shard1 r:core_node3 x:collection1_shard1_replica_n1] o.a.s.c.SolrConfig Using Lucene MatchVersion: 9.0.0
   [junit4]   2> 433178 INFO  (qtp1696532494-2670) [n:127.0.0.1:33280_solr c:collection1 s:shard2 r:core_node4 x:collection1_shard2_replica_n2] o.a.s.c.SolrConfig Using Lucene MatchVersion: 9.0.0
   [junit4]   2> 433193 INFO  (qtp1708730501-2654) [n:127.0.0.1:43665_solr c:collection1 s:shard1 r:core_node3 x:collection1_shard1_replica_n1] o.a.s.s.IndexSchema [collection1_shard1_replica_n1] Schema name=test
   [junit4]   2> 433195 INFO  (qtp1696532494-2670) [n:127.0.0.1:33280_solr c:collection1 s:shard2 r:core_node4 x:collection1_shard2_replica_n2] o.a.s.s.IndexSchema [collection1_shard2_replica_n2] Schema name=test
   [junit4]   2> 433253 WARN  (qtp1708730501-2654) [n:127.0.0.1:43665_solr c:collection1 s:shard1 r:core_node3 x:collection1_shard1_replica_n1] o.a.s.s.IndexSchema Field lowerfilt1and2 is not multivalued and destination for multiple copyFields (2)
   [junit4]   2> 433253 WARN  (qtp1708730501-2654) [n:127.0.0.1:43665_solr c:collection1 s:shard1 r:core_node3 x:collection1_shard1_replica_n1] o.a.s.s.IndexSchema Field text is not multivalued and destination for multiple copyFields (3)
   [junit4]   2> 433253 INFO  (qtp1708730501-2654) [n:127.0.0.1:43665_solr c:collection1 s:shard1 r:core_node3 x:collection1_shard1_replica_n1] o.a.s.s.IndexSchema Loaded schema test/1.6 with uniqueid field id
   [junit4]   2> 433253 INFO  (qtp1708730501-2654) [n:127.0.0.1:43665_solr c:collection1 s:shard1 r:core_node3 x:collection1_shard1_replica_n1] o.a.s.c.CoreContainer Creating SolrCore 'collection1_shard1_replica_n1' using configuration from collection collection1, trusted=true
   [junit4]   2> 433254 INFO  (qtp1708730501-2654) [n:127.0.0.1:43665_solr c:collection1 s:shard1 r:core_node3 x:collection1_shard1_replica_n1] o.a.s.m.r.SolrJmxReporter JMX monitoring for 'solr_43665.solr.core.collection1.shard1.replica_n1' (registry 'solr.core.collection1.shard1.replica_n1') enabled at server: com.sun.jmx.mbeanserver.JmxMBeanServer@3e187b65
   [junit4]   2> 433254 INFO  (qtp1708730501-2654) [n:127.0.0.1:43665_solr c:collection1 s:shard1 r:core_node3 x:collection1_shard1_replica_n1] o.a.s.c.SolrCore [[collection1_shard1_replica_n1] ] Opening new SolrCore at [/home/jenkins/jenkins-slave/workspace/Lucene-Solr-Tests-master/solr/build/solr-solrj/test/J1/temp/solr.client.solrj.impl.CloudHttp2SolrClientTest_2278DD4918FBB937-001/tempDir-001/node1/collection1_shard1_replica_n1], dataDir=[/home/jenkins/jenkins-slave/workspace/Lucene-Solr-Tests-master/solr/build/solr-solrj/test/J1/temp/solr.client.solrj.impl.CloudHttp2SolrClientTest_2278DD4918FBB937-001/tempDir-001/node1/./collection1_shard1_replica_n1/data/]
   [junit4]   2> 433260 WARN  (qtp1696532494-2670) [n:127.0.0.1:33280_solr c:collection1 s:shard2 r:core_node4 x:collection1_shard2_replica_n2] o.a.s.s.IndexSchema Field lowerfilt1and2 is not multivalued and destination for multiple copyFields (2)
   [junit4]   2> 433260 WARN  (qtp1696532494-2670) [n:127.0.0.1:33280_solr c:collection1 s:shard2 r:core_node4 x:collection1_shard2_replica_n2] o.a.s.s.IndexSchema Field text is not multivalued and destination for multiple copyFields (3)
   [junit4]   2> 433260 INFO  (qtp1696532494-2670) [n:127.0.0.1:33280_solr c:collection1 s:shard2 r:core_node4 x:collection1_shard2_replica_n2] o.a.s.s.IndexSchema Loaded schema test/1.6 with uniqueid field id
   [junit4]   2> 433260 INFO  (qtp1696532494-2670) [n:127.0.0.1:33280_solr c:collection1 s:shard2 r:core_node4 x:collection1_shard2_replica_n2] o.a.s.c.CoreContainer Creating SolrCore 'collection1_shard2_replica_n2' using configuration from collection collection1, trusted=true
   [junit4]   2> 433261 INFO  (qtp1696532494-2670) [n:127.0.0.1:33280_solr c:collection1 s:shard2 r:core_node4 x:collection1_shard2_replica_n2] o.a.s.m.r.SolrJmxReporter JMX monitoring for 'solr_33280.solr.core.collection1.shard2.replica_n2' (registry 'solr.core.collection1.shard2.replica_n2') enabled at server: com.sun.jmx.mbeanserver.JmxMBeanServer@3e187b65
   [junit4]   2> 433261 INFO  (qtp1696532494-2670) [n:127.0.0.1:33280_solr c:collection1 s:shard2 r:core_node4 x:collection1_shard2_replica_n2] o.a.s.c.SolrCore [[collection1_shard2_replica_n2] ] Opening new SolrCore at [/home/jenkins/jenkins-slave/workspace/Lucene-Solr-Tests-master/solr/build/solr-solrj/test/J1/temp/solr.client.solrj.impl.CloudHttp2SolrClientTest_2278DD4918FBB937-001/tempDir-001/node2/collection1_shard2_replica_n2], dataDir=[/home/jenkins/jenkins-slave/workspace/Lucene-Solr-Tests-master/solr/build/solr-solrj/test/J1/temp/solr.client.solrj.impl.CloudHttp2SolrClientTest_2278DD4918FBB937-001/tempDir-001/node2/./collection1_shard2_replica_n2/data/]
   [junit4]   2> 433335 INFO  (qtp1708730501-2654) [n:127.0.0.1:43665_solr c:collection1 s:shard1 r:core_node3 x:collection1_shard1_replica_n1] o.a.s.u.UpdateHandler Using UpdateLog implementation: org.apache.solr.update.UpdateLog
   [junit4]   2> 433335 INFO  (qtp1708730501-2654) [n:127.0.0.1:43665_solr c:collection1 s:shard1 r:core_node3 x:collection1_shard1_replica_n1] o.a.s.u.UpdateLog Initializing UpdateLog: dataDir= defaultSyncLevel=FLUSH numRecordsToKeep=100 maxNumLogsToKeep=10 numVersionBuckets=65536
   [junit4]   2> 433338 INFO  (qtp1708730501-2654) [n:127.0.0.1:43665_solr c:collection1 s:shard1 r:core_node3 x:collection1_shard1_replica_n1] o.a.s.u.CommitTracker Hard AutoCommit: disabled
   [junit4]   2> 433338 INFO  (qtp1708730501-2654) [n:127.0.0.1:43665_solr c:collection1 s:shard1 r:core_node3 x:collection1_shard1_replica_n1] o.a.s.u.CommitTracker Soft AutoCommit: disabled
   [junit4]   2> 433339 INFO  (qtp1708730501-2654) [n:127.0.0.1:43665_solr c:collection1 s:shard1 r:core_node3 x:collection1_shard1_replica_n1] o.a.s.s.SolrIndexSearcher Opening [Searcher@3abdd9fd[collection1_shard1_replica_n1] main]
   [junit4]   2> 433340 INFO  (qtp1708730501-2654) [n:127.0.0.1:43665_solr c:collection1 s:shard1 r:core_node3 x:collection1_shard1_replica_n1] o.a.s.r.ManagedResourceStorage Configured ZooKeeperStorageIO with znodeBase: /configs/conf
   [junit4]   2> 433341 INFO  (qtp1708730501-2654) [n:127.0.0.1:43665_solr c:collection1 s:shard1 r:core_node3 x:collection1_shard1_replica_n1] o.a.s.r.ManagedResourceStorage Loaded null at path _rest_managed.json using ZooKeeperStorageIO:path=/configs/conf
   [junit4]   2> 433341 INFO  (qtp1708730501-2654) [n:127.0.0.1:43665_solr c:collection1 s:shard1 r:core_node3 x:collection1_shard1_replica_n1] o.a.s.h.ReplicationHandler Commits will be reserved for 10000ms.
   [junit4]   2> 433341 INFO  (qtp1708730501-2654) [n:127.0.0.1:43665_solr c:collection1 s:shard1 r:core_node3 x:collection1_shard1_replica_n1] o.a.s.u.UpdateLog Could not find max version in index or recent updates, using new clock 1631103114828316672
   [junit4]   2> 433345 INFO  (searcherExecutor-667-thread-1-processing-n:127.0.0.1:43665_solr x:collection1_shard1_replica_n1 c:collection1 s:shard1 r:core_node3) [n:127.0.0.1:43665_solr c:collection1 s:shard1 r:core_node3 x:collection1_shard1_replica_n1] o.a.s.c.SolrCore [collection1_shard1_replica_n1] Registered new searcher Searcher@3abdd9fd[collection1_shard1_replica_n1] main{ExitableDirectoryReader(UninvertingDirectoryReader())}
   [junit4]   2> 433352 INFO  (qtp1708730501-2654) [n:127.0.0.1:43665_solr c:collection1 s:shard1 r:core_node3 x:collection1_shard1_replica_n1] o.a.s.c.ZkShardTerms Successful update of terms at /collections/collection1/terms/shard1 to Terms{values={core_node3=0}, version=0}
   [junit4]   2> 433352 INFO  (qtp1708730501-2654) [n:127.0.0.1:43665_solr c:collection1 s:shard1 r:core_node3 x:collection1_shard1_replica_n1] o.a.s.c.ShardLeaderElectionContextBase make sure parent is created /collections/collection1/leaders/shard1
   [junit4]   2> 433355 INFO  (qtp1708730501-2654) [n:127.0.0.1:43665_solr c:collection1 s:shard1 r:core_node3 x:collection1_shard1_replica_n1] o.a.s.c.ShardLeaderElectionContext Enough replicas found to continue.
   [junit4]   2> 433355 INFO  (qtp1708730501-2654) [n:127.0.0.1:43665_solr c:collection1 s:shard1 r:core_node3 x:collection1_shard1_replica_n1] o.a.s.c.ShardLeaderElectionContext I may be the new leader - try and sync
   [junit4]   2> 433355 INFO  (qtp1708730501-2654) [n:127.0.0.1:43665_solr c:collection1 s:shard1 r:core_node3 x:collection1_shard1_replica_n1] o.a.s.c.SyncStrategy Sync replicas to http://127.0.0.1:43665/solr/collection1_shard1_replica_n1/
   [junit4]   2> 433356 INFO  (qtp1708730501-2654) [n:127.0.0.1:43665_solr c:collection1 s:shard1 r:core_node3 x:collection1_shard1_replica_n1] o.a.s.c.SyncStrategy Sync Success - now sync replicas to me
   [junit4]   2> 433356 INFO  (qtp1708730501-2654) [n:127.0.0.1:43665_solr c:collection1 s:shard1 r:core_node3 x:collection1_shard1_replica_n1] o.a.s.c.SyncStrategy http://127.0.0.1:43665/solr/collection1_shard1_replica_n1/ has no replicas
   [junit4]   2> 433356 INFO  (qtp1708730501-2654) [n:127.0.0.1:43665_solr c:collection1 s:shard1 r:core_node3 x:collection1_shard1_replica_n1] o.a.s.c.ShardLeaderElectionContextBase Creating leader registration node /collections/collection1/leaders/shard1/leader after winning as /collections/collection1/leader_elect/shard1/election/74540002484027404-core_node3-n_0000000000
   [junit4]   2> 433358 INFO  (qtp1708730501-2654) [n:127.0.0.1:43665_solr c:collection1 s:shard1 r:core_node3 x:collection1_shard1_replica_n1] o.a.s.c.ShardLeaderElectionContext I am the new leader: http://127.0.0.1:43665/solr/collection1_shard1_replica_n1/ shard1
   [junit4]   2> 433377 INFO  (qtp1696532494-2670) [n:127.0.0.1:33280_solr c:collection1 s:shard2 r:core_node4 x:collection1_shard2_replica_n2] o.a.s.u.UpdateHandler Using UpdateLog implementation: org.apache.solr.update.UpdateLog
   [junit4]   2> 433378 INFO  (qtp1696532494-2670) [n:127.0.0.1:33280_solr c:collection1 s:shard2 r:core_node4 x:collection1_shard2_replica_n2] o.a.s.u.UpdateLog Initializing UpdateLog: dataDir= defaultSyncLevel=FLUSH numRecordsToKeep=100 maxNumLogsToKeep=10 numVersionBuckets=65536
   [junit4]   2> 433380 INFO  (qtp1696532494-2670) [n:127.0.0.1:33280_solr c:collection1 s:shard2 r:core_node4 x:collection1_shard2_replica_n2] o.a.s.u.CommitTracker Hard AutoCommit: disabled
   [junit4]   2> 433380 INFO  (qtp1696532494-2670) [n:127.0.0.1:33280_solr c:collection1 s:shard2 r:core_node4 x:collection1_shard2_replica_n2] o.a.s.u.CommitTracker Soft AutoCommit: disabled
   [junit4]   2> 433381 INFO  (qtp1696532494-2670) [n:127.0.0.1:33280_solr c:collection1 s:shard2 r:core_node4 x:collection1_shard2_replica_n2] o.a.s.s.SolrIndexSearcher Opening [Searcher@c665b1c[collection1_shard2_replica_n2] main]
   [junit4]   2> 433383 INFO  (qtp1696532494-2670) [n:127.0.0.1:33280_solr c:collection1 s:shard2 r:core_node4 x:collection1_shard2_replica_n2] o.a.s.r.ManagedResourceStorage Configured ZooKeeperStorageIO with znodeBase: /configs/conf
   [junit4]   2> 433383 INFO  (qtp1696532494-2670) [n:127.0.0.1:33280_solr c:collection1 s:shard2 r:core_node4 x:collection1_shard2_replica_n2] o.a.s.r.ManagedResourceStorage Loaded null at path _rest_managed.json using ZooKeeperStorageIO:path=/configs/conf
   [junit4]   2> 433384 INFO  (qtp1696532494-2670) [n:127.0.0.1:33280_solr c:collection1 s:shard2 r:core_node4 x:collection1_shard2_replica_n2] o.a.s.h.ReplicationHandler Commits will be reserved for 10000ms.
   [junit4]   2> 433384 INFO  (qtp1696532494-2670) [n:127.0.0.1:33280_solr c:collection1 s:shard2 r:core_node4 x:collection1_shard2_replica_n2] o.a.s.u.UpdateLog Could not find max version in index or recent updates, using new clock 1631103114873405440
   [junit4]   2> 433388 INFO  (searcherExecutor-668-thread-1-processing-n:127.0.0.1:33280_solr x:collection1_shard2_replica_n2 c:collection1 s:shard2 r:core_node4) [n:127.0.0.1:33280_solr c:collection1 s:shard2 r:core_node4 x:collection1_shard2_replica_n2] o.a.s.c.SolrCore [collection1_shard2_replica_n2] Registered new searcher Searcher@c665b1c[collection1_shard2_replica_n2] main{ExitableDirectoryReader(UninvertingDirectoryReader())}
   [junit4]   2> 433391 INFO  (qtp1696532494-2670) [n:127.0.0.1:33280_solr c:collection1 s:shard2 r:core_node4 x:collection1_shard2_replica_n2] o.a.s.c.ZkShardTerms Successful update of terms at /collections/collection1/terms/shard2 to Terms{values={core_node4=0}, version=0}
   [junit4]   2> 433391 INFO  (qtp1696532494-2670) [n:127.0.0.1:33280_solr c:collection1 s:shard2 r:core_node4 x:collection1_shard2_replica_n2] o.a.s.c.ShardLeaderElectionContextBase make sure parent is created /collections/collection1/leaders/shard2
   [junit4]   2> 433395 INFO  (qtp1696532494-2670) [n:127.0.0.1:33280_solr c:collection1 s:shard2 r:core_node4 x:collection1_shard2_replica_n2] o.a.s.c.ShardLeaderElectionContext Enough replicas found to continue.
   [junit4]   2> 433395 INFO  (qtp1696532494-2670) [n:127.0.0.1:33280_solr c:collection1 s:shard2 r:core_node4 x:collection1_shard2_replica_n2] o.a.s.c.ShardLeaderElectionContext I may be the new leader - try and sync
   [junit4]   2> 433395 INFO  (qtp1696532494-2670) [n:127.0.0.1:33280_solr c:collection1 s:shard2 r:core_node4 x:collection1_shard2_replica_n2] o.a.s.c.SyncStrategy Sync replicas to http://127.0.0.1:33280/solr/collection1_shard2_replica_n2/
   [junit4]   2> 433395 INFO  (qtp1696532494-2670) [n:127.0.0.1:33280_solr c:collection1 s:shard2 r:core_node4 x:collection1_shard2_replica_n2] o.a.s.c.SyncStrategy Sync Success - now sync replicas to me
   [junit4]   2> 433396 INFO  (qtp1696532494-2670) [n:127.0.0.1:33280_solr c:collection1 s:shard2 r:core_node4 x:collection1_shard2_replica_n2] o.a.s.c.SyncStrategy http://127.0.0.1:33280/solr/collection1_shard2_replica_n2/ has no replicas
   [junit4]   2> 433396 INFO  (qtp1696532494-2670) [n:127.0.0.1:33280_solr c:collection1 s:shard2 r:core_node4 x:collection1_shard2_replica_n2] o.a.s.c.ShardLeaderElectionContextBase Creating leader registration node /collections/collection1/leaders/shard2/leader after winning as /collections/collection1/leader_elect/shard2/election/74540002484027401-core_node4-n_0000000000
   [junit4]   2> 433397 INFO  (qtp1696532494-2670) [n:127.0.0.1:33280_solr c:collection1 s:shard2 r:core_node4 x:collection1_shard2_replica_n2] o.a.s.c.ShardLeaderElectionContext I am the new leader: http://127.0.0.1:33280/solr/collection1_shard2_replica_n2/ shard2
   [junit4]   2> 433499 INFO  (zkCallback-1082-thread-1) [    ] o.a.s.c.c.ZkStateReader A cluster state change: [WatchedEvent state:SyncConnected type:NodeDataChanged path:/collections/collection1/state.json] for collection [collection1] has occurred - updating... (live nodes size: [3])
   [junit4]   2> 433500 INFO  (zkCallback-1067-thread-1) [    ] o.a.s.c.c.ZkStateReader A cluster state change: [WatchedEvent state:SyncConnected type:NodeDataChanged path:/collections/collection1/state.json] for collection [collection1] has occurred - updating... (live nodes size: [3])
   [junit4]   2> 433502 INFO  (zkCallback-1067-thread-2) [    ] o.a.s.c.c.ZkStateReader A cluster state change: [WatchedEvent state:SyncConnected type:NodeDataChanged path:/collections/collection1/state.json] for collection [collection1] has occurred - updating... (live nodes size: [3])
   [junit4]   2> 433503 INFO  (qtp1708730501-2654) [n:127.0.0.1:43665_solr c:collection1 s:shard1 r:core_node3 x:collection1_shard1_replica_n1] o.a.s.c.ZkController I am the leader, no recovery necessary
   [junit4]   2> 433505 INFO  (qtp1708730501-2654) [n:127.0.0.1:43665_solr c:collection1 s:shard1 r:core_node3 x:collection1_shard1_replica_n1] o.a.s.s.HttpSolrCall [admin] webapp=null path=/admin/cores params={qt=/admin/cores&coreNodeName=core_node3&collection.configName=conf&newCollection=true&name=collection1_shard1_replica_n1&action=CREATE&numShards=2&collection=collection1&shard=shard1&wt=javabin&version=2&replicaType=NRT} status=0 QTime=1383
   [junit4]   2> 433507 INFO  (qtp1696532494-2670) [n:127.0.0.1:33280_solr c:collection1 s:shard2 r:core_node4 x:collection1_shard2_replica_n2] o.a.s.c.ZkController I am the leader, no recovery necessary
   [junit4]   2> 433513 INFO  (qtp1696532494-2670) [n:127.0.0.1:33280_solr c:collection1 s:shard2 r:core_node4 x:collection1_shard2_replica_n2] o.a.s.s.HttpSolrCall [admin] webapp=null path=/admin/cores params={qt=/admin/cores&coreNodeName=core_node4&collection.configName=conf&newCollection=true&name=collection1_shard2_replica_n2&action=CREATE&numShards=2&collection=collection1&shard=shard2&wt=javabin&version=2&replicaType=NRT} status=0 QTime=1391
   [junit4]   2> 433522 INFO  (qtp1696532494-2668) [n:127.0.0.1:33280_solr    ] o.a.s.h.a.CollectionsHandler Wait for new collection to be active for at most 45 seconds. Check all shard replicas
   [junit4]   2> 433611 INFO  (zkCallback-1082-thread-2) [    ] o.a.s.c.c.ZkStateReader A cluster state change: [WatchedEvent state:SyncConnected type:NodeDataChanged path:/collections/collection1/state.json] for collection [collection1] has occurred - updating... (live nodes size: [3])
   [junit4]   2> 433611 INFO  (zkCallback-1067-thread-2) [    ] o.a.s.c.c.ZkStateReader A cluster state change: [WatchedEvent state:SyncConnected type:NodeDataChanged path:/collections/collection1/state.json] for collection [collection1] has occurred - updating... (live nodes size: [3])
   [junit4]   2> 433611 INFO  (zkCallback-1082-thread-1) [    ] o.a.s.c.c.ZkStateReader A cluster state change: [WatchedEvent state:SyncConnected type:NodeDataChanged path:/collections/collection1/state.json] for collection [collection1] has occurred - updating... (live nodes size: [3])
   [junit4]   2> 433611 INFO  (zkCallback-1067-thread-1) [    ] o.a.s.c.c.ZkStateReader A cluster state change: [WatchedEvent state:SyncConnected type:NodeDataChanged path:/collections/collection1/state.json] for collection [collection1] has occurred - updating... (live nodes size: [3])
   [junit4]   2> 433612 INFO  (qtp1696532494-2668) [n:127.0.0.1:33280_solr    ] o.a.s.s.HttpSolrCall [admin] webapp=null path=/admin/collections params={collection.configName=conf&name=collection1&nrtReplicas=1&action=CREATE&numShards=2&wt=javabin&version=2} status=0 QTime=1845
   [junit4]   2> 433613 INFO  (zkCallback-1067-thread-3) [    ] o.a.s.c.c.ZkStateReader A cluster state change: [WatchedEvent state:SyncConnected type:NodeDataChanged path:/collections/collection1/state.json] for collection [collection1] has occurred - updating... (live nodes size: [3])
   [junit4]   2> 433623 INFO  (qtp1696532494-2669) [n:127.0.0.1:33280_solr    ] o.a.s.h.a.CollectionsHandler Invoked Collection Action :clusterstatus with params action=CLUSTERSTATUS&collection=collection1&wt=javabin&version=2 and sendToOCPQueue=true
   [junit4]   2> 433625 INFO  (qtp1696532494-2669) [n:127.0.0.1:33280_solr c:collection1   ] o.a.s.s.HttpSolrCall [admin] webapp=null path=/admin/collections params={action=CLUSTERSTATUS&collection=collection1&wt=javabin&version=2} status=0 QTime=2
   [junit4]   2> 433627 INFO  (qtp1696532494-2670) [n:127.0.0.1:33280_solr    ] o.a.s.h.a.CollectionsHandler Invoked Collection Action :clusterstatus with params action=CLUSTERSTATUS&collection=collection1&wt=javabin&version=2 and sendToOCPQueue=true
   [junit4]   2> 433630 INFO  (qtp1696532494-2670) [n:127.0.0.1:33280_solr c:collection1   ] o.a.s.s.HttpSolrCall [admin] webapp=null path=/admin/collections params={action=CLUSTERSTATUS&collection=collection1&wt=javabin&version=2} status=0 QTime=3
   [junit4]   2> 433632 INFO  (qtp1696532494-2668) [n:127.0.0.1:33280_solr    ] o.a.s.h.a.CollectionsHandler Invoked Collection Action :listaliases with params action=LISTALIASES&wt=javabin&version=2 and sendToOCPQueue=true
   [junit4]   2> 433633 INFO  (qtp1696532494-2668) [n:127.0.0.1:33280_solr    ] o.a.s.s.HttpSolrCall [admin] webapp=null path=/admin/collections params={action=LISTALIASES&wt=javabin&version=2} status=0 QTime=0
   [junit4]   2> 433634 INFO  (qtp1696532494-2671) [n:127.0.0.1:33280_solr    ] o.a.s.h.a.CollectionsHandler Invoked Collection Action :clusterstatus with params action=CLUSTERSTATUS&collection=collection1&wt=javabin&version=2 and sendToOCPQueue=true
   [junit4]   2> 433636 INFO  (qtp1696532494-2671) [n:127.0.0.1:33280_solr c:collection1   ] o.a.s.s.HttpSolrCall [admin] webapp=null path=/admin/collections params={action=CLUSTERSTATUS&collection=collection1&wt=javabin&version=2} status=0 QTime=1
   [junit4]   2> 433715 INFO  (qtp1708730501-2661) [n:127.0.0.1:43665_solr c:collection1 s:shard1 r:core_node3 x:collection1_shard1_replica_n1] o.a.s.c.ZkShardTerms Successful update of terms at /collections/collection1/terms/shard1 to Terms{values={core_node3=1}, version=1}
   [junit4]   2> 433715 INFO  (qtp1708730501-2661) [n:127.0.0.1:43665_solr c:collection1 s:shard1 r:core_node3 x:collection1_shard1_replica_n1] o.a.s.u.p.LogUpdateProcessorFactory [collection1_shard1_replica_n1]  webapp=/solr path=/update params={wt=javabin&version=2}{add=[1 (1631103115158618112)]} 0 59
   [junit4]   2> 433717 INFO  (qtp1696532494-2667) [n:127.0.0.1:33280_solr    ] o.a.s.h.a.CollectionsHandler Invoked Collection Action :clusterstatus with params action=CLUSTERSTATUS&collection=collection1&wt=javabin&version=2 and sendToOCPQueue=true
   [junit4]   2> 433719 INFO  (qtp1696532494-2667) [n:127.0.0.1:33280_solr c:collection1   ] o.a.s.s.HttpSolrCall [admin] webapp=null path=/admin/collections params={action=CLUSTERSTATUS&collection=collection1&wt=javabin&version=2} status=0 QTime=1
   [junit4]   2> 433720 INFO  (qtp1696532494-2669) [n:127.0.0.1:33280_solr    ] o.a.s.h.a.CollectionsHandler Invoked Collection Action :clusterstatus with params action=CLUSTERSTATUS&collection=collection1&wt=javabin&version=2 and sendToOCPQueue=true
   [junit4]   2> 433721 INFO  (qtp1696532494-2669) [n:127.0.0.1:33280_solr c:collection1   ] o.a.s.s.HttpSolrCall [admin] webapp=null path=/admin/collections params={action=CLUSTERSTATUS&collection=collection1&wt=javabin&version=2} status=0 QTime=1
   [junit4]   2> 433723 INFO  (qtp1696532494-2670) [n:127.0.0.1:33280_solr    ] o.a.s.h.a.CollectionsHandler Invoked Collection Action :clusterstatus with params action=CLUSTERSTATUS&collection=collection1&wt=javabin&version=2 and sendToOCPQueue=true
   [junit4]   2> 433724 INFO  (qtp1696532494-2670) [n:127.0.0.1:33280_solr c:collection1   ] o.a.s.s.HttpSolrCall [admin] webapp=null path=/admin/collections params={action=CLUSTERSTATUS&collection=collection1&wt=javabin&version=2} status=0 QTime=1
   [junit4]   2> 433725 INFO  (qtp1696532494-2668) [n:127.0.0.1:33280_solr    ] o.a.s.h.a.CollectionsHandler Invoked Collection Action :clusterstatus with params action=CLUSTERSTATUS&collection=collection1&wt=javabin&version=2 and sendToOCPQueue=true
   [junit4]   2> 433726 INFO  (qtp1696532494-2668) [n:127.0.0.1:33280_solr c:collection1   ] o.a.s.s.HttpSolrCall [admin] webapp=null path=/admin/collections params={action=CLUSTERSTATUS&collection=collection1&wt=javabin&version=2} status=0 QTime=1
   [junit4]   2> 433729 INFO  (qtp1696532494-2671) [n:127.0.0.1:33280_solr    ] o.a.s.h.a.CollectionsHandler Invoked Collection Action :clusterstatus with params action=CLUSTERSTATUS&collection=collection1&wt=javabin&version=2 and sendToOCPQueue=true
   [junit4]   2> 433730 INFO  (qtp1696532494-2671) [n:127.0.0.1:33280_solr c:collection1   ] o.a.s.s.HttpSolrCall [admin] webapp=null path=/admin/collections params={action=CLUSTERSTATUS&collection=collection1&wt=javabin&version=2} status=0 QTime=1
   [junit4]   2> 433760 INFO  (qtp1696532494-2670) [n:127.0.0.1:33280_solr c:collection1 s:shard2 r:core_node4 x:collection1_shard2_replica_n2] o.a.s.u.DirectUpdateHandler2 start commit{_version_=1631103115267670016,optimize=false,openSearcher=true,waitSearcher=true,expungeDeletes=false,softCommit=false,prepareCommit=false}
   [junit4]   2> 433760 INFO  (qtp1696532494-2670) [n:127.0.0.1:33280_solr c:collection1 s:shard2 r:core_node4 x:collection1_shard2_replica_n2] o.a.s.u.DirectUpdateHandler2 No uncommitted changes. Skipping IW.commit.
   [junit4]   2> 433761 INFO  (qtp1696532494-2670) [n:127.0.0.1:33280_solr c:collection1 s:shard2 r:core_node4 x:collection1_shard2_replica_n2] o.a.s.u.DirectUpdateHandler2 end_commit_flush
   [junit4]   2> 433761 INFO  (qtp1696532494-2670) [n:127.0.0.1:33280_solr c:collection1 s:shard2 r:core_node4 x:collection1_shard2_replica_n2] o.a.s.u.p.LogUpdateProcessorFactory [collection1_shard2_replica_n2]  webapp=/solr path=/update params={update.distrib=TOLEADER&waitSearcher=true&openSearcher=true&commit=true&softCommit=false&distrib.from=http://127.0.0.1:43665/solr/collection1_shard1_replica_n1/&commit_end_point=leaders&wt=javabin&version=2&expungeDeletes=false}{commit=} 0 1
   [junit4]   2> 433761 INFO  (qtp1708730501-2652) [n:127.0.0.1:43665_solr c:collection1 s:shard1 r:core_node3 x:collection1_shard1_replica_n1] o.a.s.u.DirectUpdateHandler2 start commit{_version_=1631103115268718592,optimize=false,openSearcher=true,waitSearcher=true,expungeDeletes=false,softCommit=false,prepareCommit=false}
   [junit4]   2> 433761 INFO  (qtp1708730501-2652) [n:127.0.0.1:43665_solr c:collection1 s:shard1 r:core_node3 x:collection1_shard1_replica_n1] o.a.s.u.SolrIndexWriter Calling setCommitData with IW:org.apache.solr.update.SolrIndexWriter@339fdfc1 commitCommandVersion:1631103115268718592
   [junit4]   2> 433767 INFO  (qtp1708730501-2652) [n:127.0.0.1:43665_solr c:collection1 s:shard1 r:core_node3 x:collection1_shard1_replica_n1] o.a.s.s.SolrIndexSearcher Opening [Searcher@17cbb1e7[collection1_shard1_replica_n1] main]
   [junit4]   2> 433768 INFO  (qtp1708730501-2652) [n:127.0.0.1:43665_solr c:collection1 s:shard1 r:core_node3 x:collection1_shard1_replica_n1] o.a.s.u.DirectUpdateHandler2 end_commit_flush
   [junit4]   2> 433769 INFO  (searcherExecutor-667-thread-1-processing-n:127.0.0.1:43665_solr x:collection1_shard1_replica_n1 c:collection1 s:shard1 r:core_node3) [n:127.0.0.1:43665_solr c:collection1 s:shard1 r:core_node3 x:collection1_shard1_replica_n1] o.a.s.c.SolrCore [collection1_shard1_replica_n1] Registered new searcher Searcher@17cbb1e7[collection1_shard1_replica_n1] main{ExitableDirectoryReader(UninvertingDirectoryReader(_0(9.0.0):c1:[diagnostics={java.vendor=Oracle Corporation, timestamp=1555541148445, java.version=11.0.1, java.vm.version=11.0.1+13-LTS, lucene.version=9.0.0, source=flush, os.arch=amd64, java.runtime.version=11.0.1+13-LTS, os.version=4.4.0-112-generic, os=Linux}]:[attributes={Lucene50StoredFieldsFormat.mode=BEST_COMPRESSION}]))}
   [junit4]   2> 433769 INFO  (qtp1708730501-2652) [n:127.0.0.1:43665_solr c:collection1 s:shard1 r:core_node3 x:collection1_shard1_replica_n1] o.a.s.u.p.LogUpdateProcessorFactory [collection1_shard1_replica_n1]  webapp=/solr path=/update params={waitSearcher=true&commit=true&softCommit=false&wt=javabin&version=2}{commit=} 0 38
   [junit4]   2> 433771 INFO  (qtp1696532494-2668) [n:127.0.0.1:33280_solr    ] o.a.s.h.a.CollectionsHandler Invoked Collection Action :clusterstatus with params action=CLUSTERSTATUS&collection=collection1&wt=javabin&version=2 and sendToOCPQueue=true
   [junit4]   2> 433774 INFO  (OverseerCollectionConfigSetProcessor-74540002484027399-127.0.0.1:35284_solr-n_0000000000) [n:127.0.0.1:35284_solr    ] o.a.s.c.OverseerTaskQueue Response ZK path: /overseer/collection-queue-work/qnr-0000000000 doesn't exist.  Requestor may have disconnected from ZooKeeper
   [junit4]   2> 433776 INFO  (qtp1696532494-2668) [n:127.0.0.1:33280_solr c:collection1   ] o.a.s.s.HttpSolrCall [admin] webapp=null path=/admin/collections params={action=CLUSTERSTATUS&collection=collection1&wt=javabin&version=2} status=0 QTime=5
   [junit4]   2> 433777 INFO  (qtp1696532494-2671) [n:127.0.0.1:33280_solr    ] o.a.s.h.a.CollectionsHandler Invoked Collection Action :clusterstatus with params action=CLUSTERSTATUS&collection=collection1&wt=javabin&version=2 and sendToOCPQueue=true
   [junit4]   2> 433778 INFO  (qtp1696532494-2671) [n:127.0.0.1:33280_solr c:collection1   ] o.a.s.s.HttpSolrCall [admin] webapp=null path=/admin/collections params={action=CLUSTERSTATUS&collection=collection1&wt=javabin&version=2} status=0 QTime=1
   [junit4]   2> 433780 INFO  (qtp1696532494-2667) [n:127.0.0.1:33280_solr    ] o.a.s.h.a.CollectionsHandler Invoked Collection Action :clusterstatus with params action=CLUSTERSTATUS&collection=collection1&wt=javabin&version=2 and sendToOCPQueue=true
   [junit4]   2> 433781 INFO  (qtp1696532494-2667) [n:127.0.0.1:33280_solr c:collection1   ] o.a.s.s.HttpSolrCall [admin] webapp=null path=/admin/collections params={action=CLUSTERSTATUS&collection=collection1&wt=javabin&version=2} status=0 QTime=1
   [junit4]   2> 433782 INFO  (qtp1696532494-2669) [n:127.0.0.1:33280_solr    ] o.a.s.h.a.CollectionsHandler Invoked Collection Action :clusterstatus with params action=CLUSTERSTATUS&collection=collection1&wt=javabin&version=2 and sendToOCPQueue=true
   [junit4]   2> 433783 INFO  (qtp1696532494-2669) [n:127.0.0.1:33280_solr c:collection1   ] o.a.s.s.HttpSolrCall [admin] webapp=null path=/admin/collections params={action=CLUSTERSTATUS&collection=collection1&wt=javabin&version=2} status=0 QTime=1
   [junit4]   2> 433802 INFO  (qtp1696532494-2671) [n:127.0.0.1:33280_solr c:collection1 s:shard2 r:core_node4 x:collection1_shard2_replica_n2] o.a.s.c.S.Request [collection1_shard2_replica_n2]  webapp=/solr path=/select params={df=text&distrib=false&fl=id&fl=score&shards.purpose=4&start=0&fsv=true&shard.url=http://127.0.0.1:33280/solr/collection1_shard2_replica_n2/&rows=10&version=2&q=*:*&NOW=1555541148465&isShard=true&wt=javabin} hits=0 status=0 QTime=1
   [junit4]   2> 433809 INFO  (qtp1708730501-2661) [n:127.0.0.1:43665_solr c:collection1 s:shard1 r:core_node3 x:collection1_shard1_replica_n1] o.a.s.c.S.Request [collection1_shard1_replica_n1]  webapp=/solr path=/select params={df=text&distrib=false&fl=id&fl=score&shards.purpose=4&start=0&fsv=true&shard.url=http://127.0.0.1:43665/solr/collection1_shard1_replica_n1/&rows=10&version=2&q=*:*&NOW=1555541148465&isShard=true&wt=javabin} hits=1 status=0 QTime=0
   [junit4]   2> 433812 INFO  (qtp1708730501-2652) [n:127.0.0.1:43665_solr c:collection1 s:shard1 r:core_node3 x:collection1_shard1_replica_n1] o.a.s.c.S.Request [collection1_shard1_replica_n1]  webapp=/solr path=/select params={q=*:*&df=text&distrib=false&shards.purpose=64&NOW=1555541148465&ids=1&isShard=true&shard.url=http://127.0.0.1:43665/solr/collection1_shard1_replica_n1/&wt=javabin&version=2} status=0 QTime=0
   [junit4]   2> 433813 INFO  (qtp1708730501-2654) [n:127.0.0.1:43665_solr c:collection1 s:shard1 r:core_node3 x:collection1_shard1_replica_n1] o.a.s.c.S.Request [collection1_shard1_replica_n1]  webapp=/solr path=/select params={q=*:*&wt=javabin&version=2} hits=1 status=0 QTime=29
   [junit4]   2> 433850 INFO  (jetty-closer-1111-thread-1) [    ] o.a.s.c.CoreContainer Shutting down CoreContainer instance=1681185926
   [junit4]   2> 433851 INFO  (jetty-closer-1111-thread-1) [    ] o.a.s.c.ZkController Remove node as live in ZooKeeper:/live_nodes/127.0.0.1:35284_solr
   [junit4]   2> 433852 INFO  (jetty-closer-1111-thread-1) [    ] o.a.s.c.ZkController Publish this node as DOWN...
   [junit4]   2> 433852 INFO  (jetty-closer-1111-thread-1) [    ] o.a.s.c.ZkController Publish node=127.0.0.1:35284_solr as DOWN
   [junit4]   2> 433859 INFO  (jetty-closer-1111-thread-2) [    ] o.a.s.c.CoreContainer Shutting down CoreContainer instance=981458058
   [junit4]   2> 433859 INFO  (jetty-closer-1111-thread-2) [    ] o.a.s.c.ZkController Remove node as live in ZooKeeper:/live_nodes/127.0.0.1:43665_solr
   [junit4]   2> 433860 INFO  (jetty-closer-1111-thread-2) [    ] o.a.s.c.ZkController Publish this node as DOWN...
   [junit4]   2> 433860 INFO  (jetty-closer-1111-thread-2) [    ] o.a.s.c.ZkController Publish node=127.0.0.1:43665_solr as DOWN
   [junit4]   2> 433867 INFO  (jetty-closer-1111-thread-3) [    ] o.a.s.c.CoreContainer Shutting down CoreContainer instance=1955626923
   [junit4]   2> 433867 INFO  (jetty-closer-1111-thread-3) [    ] o.a.s.c.ZkController Remove node as live in ZooKeeper:/live_nodes/127.0.0.1:33280_solr
   [junit4]   2> 433867 INFO  (jetty-closer-1111-thread-3) [    ] o.a.s.c.ZkController Publish this node as DOWN...
   [junit4]   2> 433867 INFO  (jetty-closer-1111-thread-3) [    ] o.a.s.c.ZkController Publish node=127.0.0.1:33280_solr as DOWN
   [junit4]   2> 433902 INFO  (jetty-closer-1111-thread-1) [    ] o.a.s.c.TransientSolrCoreCacheDefault Allocating transient cache for 2147483647 transient cores
   [junit4]   2> 433934 INFO  (jetty-closer-1111-thread-1) [    ] o.a.s.m.SolrMetricManager Closing metric reporters for registry=solr.node, tag=null
   [junit4]   2> 433934 INFO  (jetty-closer-1111-thread-1) [    ] o.a.s.m.r.SolrJmxReporter Closing reporter [org.apache.solr.metrics.reporters.SolrJmxReporter@7ac2dd84: rootName = solr_35284, domain = solr.node, service url = null, agent id = null] for registry solr.node / com.codahale.metrics.MetricRegistry@54f24217
   [junit4]   2> 433940 INFO  (jetty-closer-1111-thread-1) [    ] o.a.s.m.SolrMetricManager Closing metric reporters for registry=solr.jvm, tag=null
   [junit4]   2> 433940 INFO  (jetty-closer-1111-thread-1) [    ] o.a.s.m.r.SolrJmxReporter Closing reporter [org.apache.solr.metrics.reporters.SolrJmxReporter@1f6e6414: rootName = solr_35284, domain = solr.jvm, service url = null, agent id = null] for registry solr.jvm / com.codahale.metrics.MetricRegistry@359c5cc7
   [junit4]   2> 433943 INFO  (jetty-closer-1111-thread-1) [    ] o.a.s.m.SolrMetricManager Closing metric reporters for registry=solr.jetty, tag=null
   [junit4]   2> 433943 INFO  (jetty-closer-1111-thread-1) [    ] o.a.s.m.r.SolrJmxReporter Closing reporter [org.apache.solr.metrics.reporters.SolrJmxReporter@20fc2bc3: rootName = solr_35284, domain = solr.jetty, service url = null, agent id = null] for registry solr.jetty / com.codahale.metrics.MetricRegistry@69432f2e
   [junit4]   2> 433943 INFO  (jetty-closer-1111-thread-1) [    ] o.a.s.m.SolrMetricManager Closing metric reporters for registry=solr.cluster, tag=null
   [junit4]   2> 433954 INFO  (coreCloseExecutor-679-thread-1) [n:127.0.0.1:33280_solr c:collection1 s:shard2 r:core_node4 x:collection1_shard2_replica_n2] o.a.s.c.SolrCore [collection1_shard2_replica_n2]  CLOSING SolrCore org.apache.solr.core.SolrCore@25640228
   [junit4]   2> 433954 INFO  (coreCloseExecutor-679-thread-1) [n:127.0.0.1:33280_solr c:collection1 s:shard2 r:core_node4 x:collection1_shard2_replica_n2] o.a.s.m.SolrMetricManager Closing metric reporters for registry=solr.core.collection1.shard2.replica_n2, tag=25640228
   [junit4]   2> 433970 INFO  (zkCallback-1067-thread-3) [    ] o.a.s.c.c.ZkStateReader A cluster state change: [WatchedEvent state:SyncConnected type:NodeDataChanged path:/collections/collection1/state.json] for collection [collection1] has occurred - updating... (live nodes size: [3])
   [junit4]   2> 433971 INFO  (zkCallback-1082-thread-2) [    ] o.a.s.c.c.ZkStateReader A cluster state change: [WatchedEvent state:SyncConnected type:NodeDataChanged path:/collections/collection1/state.json] for collection [collection1] has occurred - updating... (live nodes size: [3])
   [junit4]   2> 433971 INFO  (zkCallback-1067-thread-2) [    ] o.a.s.c.c.ZkStateReader A cluster state change: [WatchedEvent state:SyncConnected type:NodeDataChanged path:/collections/collection1/state.json] for collection [collection1] has occurred - updating... (live nodes size: [3])
   [junit4]   2> 433971 INFO  (zkCallback-1067-thread-1) [    ] o.a.s.c.c.ZkStateReader A cluster state change: [WatchedEvent state:SyncConnected type:NodeDataChanged path:/collections/collection1/state.json] for collection [collection1] has occurred - updating... (live nodes size: [3])
   [junit4]   2> 433970 INFO  (zkCallback-1082-thread-1) [    ] o.a.s.c.c.ZkStateReader A cluster state change: [WatchedEvent state:SyncConnected type:NodeDataChanged path:/collections/collection1/state.json] for collection [collection1] has occurred - updating... (live nodes size: [3])
   [junit4]   2> 433973 INFO  (coreCloseExecutor-678-thread-1) [n:127.0.0.1:43665_solr c:collection1 s:shard1 r:core_node3 x:collection1_shard1_replica_n1] o.a.s.c.SolrCore [collection1_shard1_replica_n1]  CLOSING SolrCore org.apache.solr.core.SolrCore@1a6d719e
   [junit4]   2> 433973 INFO  (coreCloseExecutor-678-thread-1) [n:127.0.0.1:43665_solr c:collection1 s:shard1 r:core_node3 x:collection1_shard1_replica_n1] o.a.s.m.SolrMetricManager Closing metric reporters for registry=solr.core.collection1.shard1.replica_n1, tag=1a6d719e
   [junit4]   2> 433973 INFO  (coreCloseExecutor-678-thread-1) [n:127.0.0.1:43665_solr c:collection1 s:shard1 r:core_node3 x:collection1_shard1_replica_n1] o.a.s.m.r.SolrJmxReporter Closing reporter [org.apache.solr.metrics.reporters.SolrJmxReporter@2a6653d1: rootName = solr_43665, domain = solr.core.collection1.shard1.replica_n1, service url = null, agent id = null] for registry solr.core.collection1.shard1.replica_n1 / com.codahale.metrics.MetricRegistry@331f0f3f
   [junit4]   2> 433994 INFO  (coreCloseExecutor-679-thread-1) [n:127.0.0.1:33280_solr c:collection1 s:shard2 r:core_node4 x:collection1_shard2_replica_n2] o.a.s.m.r.SolrJmxReporter Closing reporter [org.apache.solr.metrics.reporters.SolrJmxReporter@216c151: rootName = solr_33280, domain = solr.core.collection1.shard2.replica_n2, service url = null, agent id = null] for registry solr.core.collection1.shard2.replica_n2 / com.codahale.metrics.MetricRegistry@60f64803
   [junit4]   2> 434002 INFO  (closeThreadPool-1121-thread-2) [    ] o.a.s.c.Overseer Overseer (id=74540002484027399-127.0.0.1:35284_solr-n_0000000000) closing
   [junit4]   2> 434002 INFO  (OverseerStateUpdate-74540002484027399-127.0.0.1:35284_solr-n_0000000000) [n:127.0.0.1:35284_solr    ] o.a.s.c.Overseer Overseer Loop exiting : 127.0.0.1:35284_solr
   [junit4]   2> 434002 INFO  (OverseerAutoScalingTriggerThread-74540002484027399-127.0.0.1:35284_solr-n_0000000000) [    ] o.a.s.c.a.OverseerTriggerThread OverseerTriggerThread woken up but we are closed, exiting.
   [junit4]   2> 434030 INFO  (coreCloseExecutor-678-thread-1) [n:127.0.0.1:43665_solr c:collection1 s:shard1 r:core_node3 x:collection1_shard1_replica_n1] o.a.s.m.SolrMetricManager Closing metric reporters for registry=solr.collection.collection1.shard1.leader, tag=1a6d719e
   [junit4]   2> 434043 WARN  (NIOServerCxn.Factory:0.0.0.0/0.0.0.0:0) [    ] o.a.z.s.NIOServerCnxn Unable to read additional data from client sessionid 0x108d1bcc19e0007, likely client has closed socket
   [junit4]   2> 434044 INFO  (zkCallback-1090-thread-1) [    ] o.a.s.c.c.ZkStateReader Updated live nodes from ZooKeeper... (3) -> (2)
   [junit4]   2> 434044 INFO  (zkCallback-1082-thread-1) [    ] o.a.s.c.c.ZkStateReader Updated live nodes from ZooKeeper... (3) -> (2)
   [junit4]   2> 434044 INFO  (zkCallback-1095-thread-1) [    ] o.a.s.c.c.ZkStateReader Updated live nodes from ZooKeeper... (3) -> (2)
   [junit4]   2> 434044 INFO  (zkCallback-1067-thread-3) [    ] o.a.s.c.c.ZkStateReader Updated live nodes from ZooKeeper... (3) -> (2)
   [junit4]   2> 434044 INFO  (zkCallback-1067-thread-2) [    ] o.a.s.c.OverseerElectionContext I am going to be the leader 127.0.0.1:33280_solr
   [junit4]   2> 434062 INFO  (jetty-closer-1111-thread-1) [    ] o.a.s.c.Overseer Overseer (id=74540002484027399-127.0.0.1:35284_solr-n_0000000000) closing
   [junit4]   2> 434062 INFO  (closeThreadPool-1121-thread-1) [    ] o.a.s.c.Overseer Overseer (id=74540002484027399-127.0.0.1:35284_solr-n_0000000000) closing
   [junit4]   2> 434062 INFO  (coreCloseExecutor-679-thread-1) [n:127.0.0.1:33280_solr c:collection1 s:shard2 r:core_node4 x:collection1_shard2_replica_n2] o.a.s.m.SolrMetricManager Closing metric reporters for registry=solr.collection.collection1.shard2.leader, tag=25640228
   [junit4]   2> 434066 INFO  (jetty-closer-1111-thread-3) [    ] o.a.s.m.SolrMetricManager Closing metric reporters for registry=solr.node, tag=null
   [junit4]   2> 434066 INFO  (jetty-closer-1111-thread-3) [    ] o.a.s.m.r.SolrJmxReporter Closing reporter [org.apache.solr.metrics.reporters.SolrJmxReporter@5946ad36: rootName = solr_33280, domain = solr.node, service url = null, agent id = null] for registry solr.node / com.codahale.metrics.MetricRegistry@655da698
   [junit4]   2> 434070 INFO  (jetty-closer-1111-thread-3) [    ] o.a.s.m.SolrMetricManager Closing metric reporters for registry=solr.jvm, tag=null
   [junit4]   2> 434070 INFO  (jetty-closer-1111-thread-3) [    ] o.a.s.m.r.SolrJmxReporter Closing reporter [org.apache.solr.metrics.reporters.SolrJmxReporter@111cc040: rootName = solr_33280, domain = solr.jvm, service url = null, agent id = null] for registry solr.jvm / com.codahale.metrics.MetricRegistry@359c5cc7
   [junit4]   2> 434081 INFO  (jetty-closer-1111-thread-1) [    ] o.e.j.s.AbstractConnector Stopped ServerConnector@3be2497b{HTTP/1.1,[http/1.1, h2c]}{127.0.0.1:0}
   [junit4]   2> 434082 INFO  (jetty-closer-1111-thread-1) [    ] o.e.j.s.h.ContextHandler Stopped o.e.j.s.ServletContextHandler@6cc9808d{/solr,null,UNAVAILABLE}
   [junit4]   2> 434082 INFO  (jetty-closer-1111-thread-1) [    ] o.e.j.s.session node0 Stopped scavenging
   [junit4]   2> 434084 INFO  (jetty-closer-1111-thread-3) [    ] o.a.s.m.SolrMetricManager Closing metric reporters for registry=solr.jetty, tag=null
   [junit4]   2> 434084 INFO  (jetty-closer-1111-thread-3) [    ] o.a.s.m.r.SolrJmxReporter Closing reporter [org.apache.solr.metrics.reporters.SolrJmxReporter@baa9eec: rootName = solr_33280, domain = solr.jetty, service url = null, agent id = null] for registry solr.jetty / com.codahale.metrics.MetricRegistry@69432f2e
   [junit4]   2> 434084 INFO  (jetty-closer-1111-thread-3) [    ] o.a.s.m.SolrMetricManager Closing metric reporters for registry=solr.cluster, tag=null
   [junit4]   2> 434087 INFO  (zkCallback-1090-thread-1) [    ] o.a.s.c.c.ZkStateReader Updated live nodes from ZooKeeper... (2) -> (1)
   [junit4]   2> 434087 INFO  (zkCallback-1095-thread-1) [    ] o.a.s.c.c.ZkStateReader Updated live nodes from ZooKeeper... (2) -> (1)
   [junit4]   2> 434087 INFO  (zkCallback-1082-thread-2) [    ] o.a.s.c.c.ZkStateReader Updated live nodes from ZooKeeper... (2) -> (1)
   [junit4]   2> 434087 INFO  (zkCallback-1082-thread-1) [    ] o.a.s.c.OverseerElectionContext I am going to be the leader 127.0.0.1:43665_solr
   [junit4]   2> 434106 INFO  (jetty-closer-1111-thread-3) [    ] o.e.j.s.AbstractConnector Stopped ServerConnector@644abc50{HTTP/1.1,[http/1.1, h2c]}{127.0.0.1:0}
   [junit4]   2> 434110 INFO  (jetty-closer-1111-thread-3) [    ] o.e.j.s.h.ContextHandler Stopped o.e.j.s.ServletContextHandler@2580aa87{/solr,null,UNAVAILABLE}
   [junit4]   2> 434147 INFO  (jetty-closer-1111-thread-3) [    ] o.e.j.s.session node0 Stopped scavenging
   [junit4]   2> 434147 INFO  (jetty-closer-1111-thread-2) [    ] o.a.s.m.SolrMetricManager Closing metric reporters for registry=solr.node, tag=null
   [junit4]   2> 434147 INFO  (jetty-closer-1111-thread-2) [    ] o.a.s.m.r.SolrJmxReporter Closing reporter [org.apache.solr.metrics.reporters.SolrJmxReporter@71f7c589: rootName = solr_43665, domain = solr.node, service url = null, agent id = null] for registry solr.node / com.codahale.metrics.MetricRegistry@348eba9d
   [junit4]   2> 434152 INFO  (jetty-closer-1111-thread-2) [    ] o.a.s.m.SolrMetricManager Closing metric reporters for registry=solr.jvm, tag=null
   [junit4]   2> 434152 INFO  (jetty-closer-1111-thread-2) [    ] o.a.s.m.r.SolrJmxReporter Closing reporter [org.apache.solr.metrics.reporters.SolrJmxReporter@73f79e58: rootName = solr_43665, domain = solr.jvm, service url = null, agent id = null] for registry solr.jvm / com.codahale.metrics.MetricRegistry@359c5cc7
   [junit4]   2> 434155 INFO  (jetty-closer-1111-thread-2) [    ] o.a.s.m.SolrMetricManager Closing metric reporters for registry=solr.jetty, tag=null
   [junit4]   2> 434155 INFO  (jetty-closer-1111-thread-2) [    ] o.a.s.m.r.SolrJmxReporter Closing reporter [org.apache.solr.metrics.reporters.SolrJmxReporter@2d13b3a3: rootName = solr_43665, domain = solr.jetty, service url = null, agent id = null] for registry solr.jetty / com.codahale.metrics.MetricRegistry@69432f2e
   [junit4]   2> 434155 INFO  (jetty-closer-1111-thread-2) [    ] o.a.s.m.SolrMetricManager Closing metric reporters for registry=solr.cluster, tag=null
   [junit4]   2> 434228 INFO  (jetty-closer-1111-thread-2) [    ] o.e.j.s.AbstractConnector Stopped ServerConnector@245d79d7{HTTP/1.1,[http/1.1, h2c]}{127.0.0.1:0}
   [junit4]   2> 434228 INFO  (jetty-closer-1111-thread-2) [    ] o.e.j.s.h.ContextHandler Stopped o.e.j.s.ServletContextHandler@f3a566b{/solr,null,UNAVAILABLE}
   [junit4]   2> 434228 INFO  (jetty-closer-1111-thread-2) [    ] o.e.j.s.session node0 Stopped scavenging
   [junit4]   2> 434230 INFO  (TEST-CloudHttp2SolrClientTest.testInitializationWithSolrUrls-seed#[2278DD4918FBB937]) [    ] o.a.s.c.ZkTestServer Shutting down ZkTestServer.
   [junit4]   2> 434230 WARN  (NIOServerCxn.Factory:0.0.0.0/0.0.0.0:0) [    ] o.a.z.s.NIOServerCnxn Unable to read additional data from client sessionid 0x108d1bcc19e0000, likely client has closed socket
   [junit4]   2> 434231 WARN  (ZkTestServer Run Thread) [    ] o.a.s.c.ZkTestServer Watch limit violations:
   [junit4]   2> Maximum concurrent create/delete watches above limit:
   [junit4]   2>
   [junit4]   2> 7 /solr/aliases.json
   [junit4]   2> 7 /solr/clusterprops.json
   [junit4]   2> 3 /solr/security.json
   [junit4]   2> 3 /solr/collections/collection1/terms/shard1
   [junit4]   2> 2 /solr/collections/collection1/terms/shard2
   [junit4]   2> 2 /solr/configs/conf
   [junit4]   2>
   [junit4]   2> Maximum concurrent data watches above limit:
   [junit4]   2>
   [junit4]   2> 14 /solr/collections/collection1/state.json
   [junit4]   2> 7 /solr/clusterstate.json
   [junit4]   2>
   [junit4]   2> Maximum concurrent children watches above limit:
   [junit4]   2>
   [junit4]   2> 7 /solr/live_nodes
   [junit4]   2> 7 /solr/collections
   [junit4]   2>
   [junit4]   2> 434233 INFO  (TEST-CloudHttp2SolrClientTest.testInitializationWithSolrUrls-seed#[2278DD4918FBB937]) [    ] o.a.s.c.ZkTestServer parse host and port list: 127.0.0.1:39879
   [junit4]   2> 434233 INFO  (TEST-CloudHttp2SolrClientTest.testInitializationWithSolrUrls-seed#[2278DD4918FBB937]) [    ] o.a.s.c.ZkTestServer connecting to 127.0.0.1 39879
   [junit4]   2> 434233 INFO  (TEST-CloudHttp2SolrClientTest.testInitializationWithSolrUrls-seed#[2278DD4918FBB937]) [    ] o.a.s.SolrTestCaseJ4 ###Ending testInitializationWithSolrUrls
   [junit4]   2> 434237 INFO  (TEST-CloudHttp2SolrClientTest.preferLocalShardsTest-seed#[2278DD4918FBB937]) [    ] o.a.s.SolrTestCaseJ4 ###Starting preferLocalShardsTest
   [junit4]   2> 434237 INFO  (TEST-CloudHttp2SolrClientTest.preferLocalShardsTest-seed#[2278DD4918FBB937]) [    ] o.a.s.c.MiniSolrCloudCluster Starting cluster of 3 servers in /home/jenkins/jenkins-slave/workspace/Lucene-Solr-Tests-master/solr/build/solr-solrj/test/J1/temp/solr.client.solrj.impl.CloudHttp2SolrClientTest_2278DD4918FBB937-001/tempDir-002
   [junit4]   2> 434237 INFO  (TEST-CloudHttp2SolrClientTest.preferLocalShardsTest-seed#[2278DD4918FBB937]) [    ] o.a.s.c.ZkTestServer STARTING ZK TEST SERVER
   [junit4]   2> 434238 INFO  (ZkTestServer Run Thread) [    ] o.a.s.c.ZkTestServer client port:0.0.0.0/0.0.0.0:0
   [junit4]   2> 434238 INFO  (ZkTestServer Run Thread) [    ] o.a.s.c.ZkTestServer Starting server
   [junit4]   2> 434338 INFO  (TEST-CloudHttp2SolrClientTest.preferLocalShardsTest-seed#[2278DD4918FBB937]) [    ] o.a.s.c.ZkTestServer start zk server on port:46717
   [junit4]   2> 434338 INFO  (TEST-CloudHttp2SolrClientTest.preferLocalShardsTest-seed#[2278DD4918FBB937]) [    ] o.a.s.c.ZkTestServer parse host and port list: 127.0.0.1:46717
   [junit4]   2> 434338 INFO  (TEST-CloudHttp2SolrClientTest.preferLocalShardsTest-seed#[2278DD4918FBB937]) [    ] o.a.s.c.ZkTestServer connecting to 127.0.0.1 46717
   [junit4]   2> 434382 INFO  (zkConnectionManagerCallback-1125-thread-1) [    ] o.a.s.c.c.ConnectionManager zkClient has connected
   [junit4]   2> 434430 INFO  (zkConnectionManagerCallback-1127-thread-1) [    ] o.a.s.c.c.ConnectionManager zkClient has connected
   [junit4]   2> 434450 INFO  (zkConnectionManagerCallback-1129-thread-1) [    ] o.a.s.c.c.ConnectionManager zkClient has connected
   [junit4]   2> 434462 WARN  (jetty-launcher-1130-thread-1) [    ] o.e.j.s.AbstractConnector Ignoring deprecated socket close linger time
   [junit4]   2> 434462 INFO  (jetty-launcher-1130-thread-1) [    ] o.a.s.c.s.e.JettySolrRunner Start Jetty (original configured port=0)
   [junit4]   2> 434463 INFO  (jetty-launcher-1130-thread-1) [    ] o.a.s.c.s.e.JettySolrRunner Trying to start Jetty on port 0 try number 1 ...
   [junit4]   2> 434463 INFO  (jetty-launcher-1130-thread-1) [    ] o.e.j.s.Server jetty-9.4.14.v20181114; built: 2018-11-14T21:20:31.478Z; git: c4550056e785fb5665914545889f21dc136ad9e6; jvm 11.0.1+13-LTS
   [junit4]   2> 434466 WARN  (jetty-launcher-1130-thread-2) [    ] o.e.j.s.AbstractConnector Ignoring deprecated socket close linger time
   [junit4]   2> 434466 INFO  (jetty-launcher-1130-thread-2) [    ] o.a.s.c.s.e.JettySolrRunner Start Jetty (original configured port=0)
   [junit4]   2> 434466 INFO  (jetty-launcher-1130-thread-2) [    ] o.a.s.c.s.e.JettySolrRunner Trying to start Jetty on port 0 try number 1 ...
   [junit4]   2> 434466 INFO  (jetty-launcher-1130-thread-2) [    ] o.e.j.s.Server jetty-9.4.14.v20181114; built: 2018-11-14T21:20:31.478Z; git: c4550056e785fb5665914545889f21dc136ad9e6; jvm 11.0.1+13-LTS
   [junit4]   2> 434470 WARN  (jetty-launcher-1130-thread-3) [    ] o.e.j.s.AbstractConnector Ignoring deprecated socket close linger time
   [junit4]   2> 434470 INFO  (jetty-launcher-1130-thread-3) [    ] o.a.s.c.s.e.JettySolrRunner Start Jetty (original configured port=0)
   [junit4]   2> 434470 INFO  (jetty-launcher-1130-thread-3) [    ] o.a.s.c.s.e.JettySolrRunner Trying to start Jetty on port 0 try number 1 ...
   [junit4]   2> 434470 INFO  (jetty-launcher-1130-thread-3) [    ] o.e.j.s.Server jetty-9.4.14.v20181114; built: 2018-11-14T21:20:31.478Z; git: c4550056e785fb5665914545889f21dc136ad9e6; jvm 11.0.1+13-LTS
   [junit4]   2> 434506 INFO  (jetty-launcher-1130-thread-2) [    ] o.e.j.s.session DefaultSessionIdManager workerName=node0
   [junit4]   2> 434507 INFO  (jetty-launcher-1130-thread-2) [    ] o.e.j.s.session No SessionScavenger set, using defaults
   [junit4]   2> 434507 INFO  (jetty-launcher-1130-thread-2) [    ] o.e.j.s.session node0 Scavenging every 660000ms
   [junit4]   2> 434510 INFO  (jetty-launcher-1130-thread-2) [    ] o.e.j.s.h.ContextHandler Started o.e.j.s.ServletContextHandler@23637261{/solr,null,AVAILABLE}
   [junit4]   2> 434511 INFO  (jetty-launcher-1130-thread-2) [    ] o.e.j.s.AbstractConnector Started ServerConnector@62d437aa{HTTP/1.1,[http/1.1, h2c]}{127.0.0.1:44117}
   [junit4]   2> 434511 INFO  (jetty-launcher-1130-thread-2) [    ] o.e.j.s.Server Started @434694ms
   [junit4]   2> 434511 INFO  (jetty-launcher-1130-thread-2) [    ] o.a.s.c.s.e.JettySolrRunner Jetty properties: {hostContext=/solr, hostPort=44117}
   [junit4]   2> 434511 ERROR (jetty-launcher-1130-thread-2) [    ] o.a.s.u.StartupLoggingUtils Missing Java Option solr.log.dir. Logging may be missing or incomplete.
   [junit4]   2> 434511 INFO  (jetty-launcher-1130-thread-2) [    ] o.a.s.s.SolrDispatchFilter Using logger factory org.apache.logging.slf4j.Log4jLoggerFactory
   [junit4]   2> 434511 INFO  (jetty-launcher-1130-thread-2) [    ] o.a.s.s.SolrDispatchFilter  ___      _       Welcome to Apache Solr? version 9.0.0
   [junit4]   2> 434511 INFO  (jetty-launcher-1130-thread-2) [    ] o.a.s.s.SolrDispatchFilter / __| ___| |_ _   Starting in cloud mode on port null
   [junit4]   2> 434511 INFO  (jetty-launcher-1130-thread-2) [    ] o.a.s.s.SolrDispatchFilter \__ \/ _ \ | '_|  Install dir: null
   [junit4]   2> 434511 INFO  (jetty-launcher-1130-thread-2) [    ] o.a.s.s.SolrDispatchFilter |___/\___/_|_|    Start time: 2019-04-17T22:45:49.192697Z
   [junit4]   2> 434542 INFO  (jetty-launcher-1130-thread-1) [    ] o.e.j.s.session DefaultSessionIdManager workerName=node0
   [junit4]   2> 434542 INFO  (jetty-launcher-1130-thread-1) [    ] o.e.j.s.session No SessionScavenger set, using defaults
   [junit4]   2> 434542 INFO  (jetty-launcher-1130-thread-1) [    ] o.e.j.s.session node0 Scavenging every 600000ms
   [junit4]   2> 434558 INFO  (jetty-launcher-1130-thread-1) [    ] o.e.j.s.h.ContextHandler Started o.e.j.s.ServletContextHandler@6e31998a{/solr,null,AVAILABLE}
   [junit4]   2> 434561 INFO  (jetty-launcher-1130-thread-1) [    ] o.e.j.s.AbstractConnector Started ServerConnector@1f2476cd{HTTP/1.1,[http/1.1, h2c]}{127.0.0.1:39220}
   [junit4]   2> 434561 INFO  (jetty-launcher-1130-thread-1) [    ] o.e.j.s.Server Started @434744ms
   [junit4]   2> 434561 INFO  (jetty-launcher-1130-thread-1) [    ] o.a.s.c.s.e.JettySolrRunner Jetty properties: {hostContext=/solr, hostPort=39220}
   [junit4]   2> 434561 ERROR (jetty-launcher-1130-thread-1) [    ] o.a.s.u.StartupLoggingUtils Missing Java Option solr.log.dir. Logging may be missing or incomplete.
   [junit4]   2> 434561 INFO  (jetty-launcher-1130-thread-1) [    ] o.a.s.s.SolrDispatchFilter Using logger factory org.apache.logging.slf4j.Log4jLoggerFactory
   [junit4]   2> 434561 INFO  (jetty-launcher-1130-thread-1) [    ] o.a.s.s.SolrDispatchFilter  ___      _       Welcome to Apache Solr? version 9.0.0
   [junit4]   2> 434561 INFO  (jetty-launcher-1130-thread-1) [    ] o.a.s.s.SolrDispatchFilter / __| ___| |_ _   Starting in cloud mode on port null
   [junit4]   2> 434561 INFO  (jetty-launcher-1130-thread-1) [    ] o.a.s.s.SolrDispatchFilter \__ \/ _ \ | '_|  Install dir: null
   [junit4]   2> 434561 INFO  (jetty-launcher-1130-thread-1) [    ] o.a.s.s.SolrDispatchFilter |___/\___/_|_|    Start time: 2019-04-17T22:45:49.242770Z
   [junit4]   2> 434598 INFO  (jetty-launcher-1130-thread-3) [    ] o.e.j.s.session DefaultSessionIdManager workerName=node0
   [junit4]   2> 434598 INFO  (jetty-launcher-1130-thread-3) [    ] o.e.j.s.session No SessionScavenger set, using defaults
   [junit4]   2> 434598 INFO  (jetty-launcher-1130-thread-3) [    ] o.e.j.s.session node0 Scavenging every 600000ms
   [junit4]   2> 434603 INFO  (jetty-launcher-1130-thread-3) [    ] o.e.j.s.h.ContextHandler Started o.e.j.s.ServletContextHandler@27c20d04{/solr,null,AVAILABLE}
   [junit4]   2> 434604 INFO  (jetty-launcher-1130-thread-3) [    ] o.e.j.s.AbstractConnector Started ServerConnector@241f582c{HTTP/1.1,[http/1.1, h2c]}{127.0.0.1:36054}
   [junit4]   2> 434604 INFO  (jetty-launcher-1130-thread-3) [    ] o.e.j.s.Server Started @434788ms
   [junit4]   2> 434604 INFO  (jetty-launcher-1130-thread-3) [    ] o.a.s.c.s.e.JettySolrRunner Jetty properties: {hostContext=/solr, hostPort=36054}
   [junit4]   2> 434605 ERROR (jetty-launcher-1130-thread-3) [    ] o.a.s.u.StartupLoggingUtils Missing Java Option solr.log.dir. Logging may be missing or incomplete.
   [junit4]   2> 434605 INFO  (jetty-launcher-1130-thread-3) [    ] o.a.s.s.SolrDispatchFilter Using logger factory org.apache.logging.slf4j.Log4jLoggerFactory
   [junit4]   2> 434605 INFO  (jetty-launcher-1130-thread-3) [    ] o.a.s.s.SolrDispatchFilter  ___      _       Welcome to Apache Solr? version 9.0.0
   [junit4]   2> 434605 INFO  (jetty-launcher-1130-thread-3) [    ] o.a.s.s.SolrDispatchFilter / __| ___| |_ _   Starting in cloud mode on port null
   [junit4]   2> 434605 INFO  (jetty-launcher-1130-thread-3) [    ] o.a.s.s.SolrDispatchFilter \__ \/ _ \ | '_|  Install dir: null
   [junit4]   2> 434605 INFO  (jetty-launcher-1130-thread-3) [    ] o.a.s.s.SolrDispatchFilter |___/\___/_|_|    Start time: 2019-04-17T22:45:49.286440Z
   [junit4]   2> 434606 INFO  (zkConnectionManagerCallback-1132-thread-1) [    ] o.a.s.c.c.ConnectionManager zkClient has connected
   [junit4]   2> 434606 INFO  (jetty-launcher-1130-thread-2) [    ] o.a.s.s.SolrDispatchFilter solr.xml found in ZooKeeper. Loading...
   [junit4]   2> 434630 INFO  (zkConnectionManagerCallback-1134-thread-1) [    ] o.a.s.c.c.ConnectionManager zkClient has connected
   [junit4]   2> 434630 INFO  (jetty-launcher-1130-thread-1) [    ] o.a.s.s.SolrDispatchFilter solr.xml found in ZooKeeper. Loading...
   [junit4]   2> 434634 INFO  (zkConnectionManagerCallback-1136-thread-1) [    ] o.a.s.c.c.ConnectionManager zkClient has connected
   [junit4]   2> 434634 INFO  (jetty-launcher-1130-thread-3) [    ] o.a.s.s.SolrDispatchFilter solr.xml found in ZooKeeper. Loading...
   [junit4]   2> 434801 INFO  (jetty-launcher-1130-thread-2) [    ] o.a.s.h.c.HttpShardHandlerFactory Host whitelist initialized: WhitelistHostChecker [whitelistHosts=null, whitelistHostCheckingEnabled=true]
   [junit4]   2> 434802 WAR

[...truncated too long message...]

il:

ivy-configure:
[ivy:configure] :: loading settings :: file = /home/jenkins/jenkins-slave/workspace/Lucene-Solr-Tests-master/lucene/top-level-ivy-settings.xml

resolve:

ivy-availability-check:
[loadresource] Do not set property disallowed.ivy.jars.list as its length is 0.

-ivy-fail-disallowed-ivy-version:

ivy-fail:

ivy-configure:
[ivy:configure] :: loading settings :: file = /home/jenkins/jenkins-slave/workspace/Lucene-Solr-Tests-master/lucene/top-level-ivy-settings.xml

resolve:

ivy-availability-check:
[loadresource] Do not set property disallowed.ivy.jars.list as its length is 0.

-ivy-fail-disallowed-ivy-version:

ivy-fail:

ivy-fail:

ivy-configure:
[ivy:configure] :: loading settings :: file = /home/jenkins/jenkins-slave/workspace/Lucene-Solr-Tests-master/lucene/top-level-ivy-settings.xml

resolve:

ivy-availability-check:
[loadresource] Do not set property disallowed.ivy.jars.list as its length is 0.

-ivy-fail-disallowed-ivy-version:

ivy-fail:

ivy-configure:
[ivy:configure] :: loading settings :: file = /home/jenkins/jenkins-slave/workspace/Lucene-Solr-Tests-master/lucene/top-level-ivy-settings.xml

resolve:

ivy-availability-check:
[loadresource] Do not set property disallowed.ivy.jars.list as its length is 0.

-ivy-fail-disallowed-ivy-version:

ivy-fail:

ivy-fail:

ivy-configure:
[ivy:configure] :: loading settings :: file = /home/jenkins/jenkins-slave/workspace/Lucene-Solr-Tests-master/lucene/top-level-ivy-settings.xml

resolve:

ivy-availability-check:
[loadresource] Do not set property disallowed.ivy.jars.list as its length is 0.

-ivy-fail-disallowed-ivy-version:

ivy-fail:

ivy-fail:

ivy-configure:
[ivy:configure] :: loading settings :: file = /home/jenkins/jenkins-slave/workspace/Lucene-Solr-Tests-master/lucene/top-level-ivy-settings.xml

resolve:

ivy-availability-check:
[loadresource] Do not set property disallowed.ivy.jars.list as its length is 0.

-ivy-fail-disallowed-ivy-version:

ivy-fail:

ivy-fail:

ivy-configure:
[ivy:configure] :: loading settings :: file = /home/jenkins/jenkins-slave/workspace/Lucene-Solr-Tests-master/lucene/top-level-ivy-settings.xml

resolve:

ivy-availability-check:
[loadresource] Do not set property disallowed.ivy.jars.list as its length is 0.

-ivy-fail-disallowed-ivy-version:

ivy-fail:

ivy-fail:

ivy-configure:
[ivy:configure] :: loading settings :: file = /home/jenkins/jenkins-slave/workspace/Lucene-Solr-Tests-master/lucene/top-level-ivy-settings.xml

resolve:

ivy-availability-check:
[loadresource] Do not set property disallowed.ivy.jars.list as its length is 0.

-ivy-fail-disallowed-ivy-version:

ivy-fail:

ivy-fail:

ivy-configure:
[ivy:configure] :: loading settings :: file = /home/jenkins/jenkins-slave/workspace/Lucene-Solr-Tests-master/lucene/top-level-ivy-settings.xml

resolve:

ivy-availability-check:
[loadresource] Do not set property disallowed.ivy.jars.list as its length is 0.

-ivy-fail-disallowed-ivy-version:

ivy-fail:

ivy-fail:

ivy-configure:
[ivy:configure] :: loading settings :: file = /home/jenkins/jenkins-slave/workspace/Lucene-Solr-Tests-master/lucene/top-level-ivy-settings.xml

resolve:

ivy-availability-check:
[loadresource] Do not set property disallowed.ivy.jars.list as its length is 0.

-ivy-fail-disallowed-ivy-version:

ivy-fail:

ivy-fail:

ivy-configure:
[ivy:configure] :: loading settings :: file = /home/jenkins/jenkins-slave/workspace/Lucene-Solr-Tests-master/lucene/top-level-ivy-settings.xml

resolve:

ivy-availability-check:
[loadresource] Do not set property disallowed.ivy.jars.list as its length is 0.

-ivy-fail-disallowed-ivy-version:

ivy-fail:

ivy-fail:

ivy-configure:
[ivy:configure] :: loading settings :: file = /home/jenkins/jenkins-slave/workspace/Lucene-Solr-Tests-master/lucene/top-level-ivy-settings.xml

resolve:

ivy-availability-check:
[loadresource] Do not set property disallowed.ivy.jars.list as its length is 0.

-ivy-fail-disallowed-ivy-version:

ivy-fail:

ivy-fail:

ivy-configure:
[ivy:configure] :: loading settings :: file = /home/jenkins/jenkins-slave/workspace/Lucene-Solr-Tests-master/lucene/top-level-ivy-settings.xml

resolve:

ivy-availability-check:
[loadresource] Do not set property disallowed.ivy.jars.list as its length is 0.

-ivy-fail-disallowed-ivy-version:

ivy-fail:

ivy-fail:

ivy-configure:
[ivy:configure] :: loading settings :: file = /home/jenkins/jenkins-slave/workspace/Lucene-Solr-Tests-master/lucene/top-level-ivy-settings.xml

resolve:

jar-checksums:
    [mkdir] Created dir: /home/jenkins/jenkins-slave/workspace/Lucene-Solr-Tests-master/solr/null1152903658
     [copy] Copying 240 files to /home/jenkins/jenkins-slave/workspace/Lucene-Solr-Tests-master/solr/null1152903658
   [delete] Deleting directory /home/jenkins/jenkins-slave/workspace/Lucene-Solr-Tests-master/solr/null1152903658

check-working-copy:
[ivy:cachepath] :: resolving dependencies :: org.eclipse.jgit#org.eclipse.jgit-caller;working
[ivy:cachepath] confs: [default]
[ivy:cachepath] found org.eclipse.jgit#org.eclipse.jgit;4.6.0.201612231935-r in public
[ivy:cachepath] found com.jcraft#jsch;0.1.53 in public
[ivy:cachepath] found com.googlecode.javaewah#JavaEWAH;1.1.6 in public
[ivy:cachepath] found org.apache.httpcomponents#httpclient;4.3.6 in public
[ivy:cachepath] found org.apache.httpcomponents#httpcore;4.3.3 in public
[ivy:cachepath] found commons-logging#commons-logging;1.1.3 in public
[ivy:cachepath] found commons-codec#commons-codec;1.6 in public
[ivy:cachepath] found org.slf4j#slf4j-api;1.7.2 in public
[ivy:cachepath] :: resolution report :: resolve 55ms :: artifacts dl 5ms
        ---------------------------------------------------------------------
        |                  |            modules            ||   artifacts   |
        |       conf       | number| search|dwnlded|evicted|| number|dwnlded|
        ---------------------------------------------------------------------
        |      default     |   8   |   0   |   0   |   0   ||   8   |   0   |
        ---------------------------------------------------------------------
[wc-checker] Initializing working copy...
[wc-checker] SLF4J: Failed to load class "org.slf4j.impl.StaticLoggerBinder".
[wc-checker] SLF4J: Defaulting to no-operation (NOP) logger implementation
[wc-checker] SLF4J: See http://www.slf4j.org/codes.html#StaticLoggerBinder for further details.
[wc-checker] Checking working copy status...

-jenkins-base:

BUILD SUCCESSFUL
Total time: 249 minutes 47 seconds
Archiving artifacts
java.lang.InterruptedException: no matches found within 10000
        at hudson.FilePath$ValidateAntFileMask.hasMatch(FilePath.java:2847)
        at hudson.FilePath$ValidateAntFileMask.invoke(FilePath.java:2726)
        at hudson.FilePath$ValidateAntFileMask.invoke(FilePath.java:2707)
        at hudson.FilePath$FileCallableWrapper.call(FilePath.java:3086)
Also:   hudson.remoting.Channel$CallSiteStackTrace: Remote call to lucene2
                at hudson.remoting.Channel.attachCallSiteStackTrace(Channel.java:1741)
                at hudson.remoting.UserRequest$ExceptionResponse.retrieve(UserRequest.java:357)
                at hudson.remoting.Channel.call(Channel.java:955)
                at hudson.FilePath.act(FilePath.java:1072)
                at hudson.FilePath.act(FilePath.java:1061)
                at hudson.FilePath.validateAntFileMask(FilePath.java:2705)
                at hudson.tasks.ArtifactArchiver.perform(ArtifactArchiver.java:243)
                at hudson.tasks.BuildStepCompatibilityLayer.perform(BuildStepCompatibilityLayer.java:81)
                at hudson.tasks.BuildStepMonitor$1.perform(BuildStepMonitor.java:20)
                at hudson.model.AbstractBuild$AbstractBuildExecution.perform(AbstractBuild.java:744)
                at hudson.model.AbstractBuild$AbstractBuildExecution.performAllBuildSteps(AbstractBuild.java:690)
                at hudson.model.Build$BuildExecution.post2(Build.java:186)
                at hudson.model.AbstractBuild$AbstractBuildExecution.post(AbstractBuild.java:635)
                at hudson.model.Run.execute(Run.java:1835)
                at hudson.model.FreeStyleBuild.run(FreeStyleBuild.java:43)
                at hudson.model.ResourceController.execute(ResourceController.java:97)
                at hudson.model.Executor.run(Executor.java:429)
Caused: hudson.FilePath$TunneledInterruptedException
        at hudson.FilePath$FileCallableWrapper.call(FilePath.java:3088)
        at hudson.remoting.UserRequest.perform(UserRequest.java:212)
        at hudson.remoting.UserRequest.perform(UserRequest.java:54)
        at hudson.remoting.Request$2.run(Request.java:369)
        at hudson.remoting.InterceptingExecutorService$1.call(InterceptingExecutorService.java:72)
        at java.util.concurrent.FutureTask.run(FutureTask.java:266)
        at java.util.concurrent.ThreadPoolExecutor.runWorker(ThreadPoolExecutor.java:1142)
        at java.util.concurrent.ThreadPoolExecutor$Worker.run(ThreadPoolExecutor.java:617)
        at java.lang.Thread.run(Thread.java:748)
Caused: java.lang.InterruptedException: java.lang.InterruptedException: no matches found within 10000
        at hudson.FilePath.act(FilePath.java:1074)
        at hudson.FilePath.act(FilePath.java:1061)
        at hudson.FilePath.validateAntFileMask(FilePath.java:2705)
        at hudson.tasks.ArtifactArchiver.perform(ArtifactArchiver.java:243)
        at hudson.tasks.BuildStepCompatibilityLayer.perform(BuildStepCompatibilityLayer.java:81)
        at hudson.tasks.BuildStepMonitor$1.perform(BuildStepMonitor.java:20)
        at hudson.model.AbstractBuild$AbstractBuildExecution.perform(AbstractBuild.java:744)
        at hudson.model.AbstractBuild$AbstractBuildExecution.performAllBuildSteps(AbstractBuild.java:690)
        at hudson.model.Build$BuildExecution.post2(Build.java:186)
        at hudson.model.AbstractBuild$AbstractBuildExecution.post(AbstractBuild.java:635)
        at hudson.model.Run.execute(Run.java:1835)
        at hudson.model.FreeStyleBuild.run(FreeStyleBuild.java:43)
        at hudson.model.ResourceController.execute(ResourceController.java:97)
        at hudson.model.Executor.run(Executor.java:429)
No artifacts found that match the file pattern "**/*.events,heapdumps/**,**/hs_err_pid*". Configuration error?
Recording test results
Build step 'Publish JUnit test result report' changed build result to UNSTABLE
Email was triggered for: Unstable (Test Failures)
Sending email for trigger: Unstable (Test Failures)


---------------------------------------------------------------------
To unsubscribe, e-mail: [hidden email]
For additional commands, e-mail: [hidden email]