[JENKINS] Lucene-Solr-master-Linux (64bit/jdk-9.0.4) - Build # 22022 - Unstable!

Previous Topic Next Topic
 
classic Classic list List threaded Threaded
2 messages Options
Reply | Threaded
Open this post in threaded view
|

[JENKINS] Lucene-Solr-master-Linux (64bit/jdk-9.0.4) - Build # 22022 - Unstable!

Policeman Jenkins Server-2
Build: https://jenkins.thetaphi.de/job/Lucene-Solr-master-Linux/22022/
Java: 64bit/jdk-9.0.4 -XX:-UseCompressedOops -XX:+UseConcMarkSweepGC

2 tests failed.
FAILED:  org.apache.solr.cloud.autoscaling.IndexSizeTriggerTest.testTrigger

Error Message:
waitFor not elapsed but produced an event

Stack Trace:
java.lang.AssertionError: waitFor not elapsed but produced an event
        at __randomizedtesting.SeedInfo.seed([4C0C98576AC83F5F:2FC7AED5F3074C72]:0)
        at org.junit.Assert.fail(Assert.java:93)
        at org.junit.Assert.assertTrue(Assert.java:43)
        at org.junit.Assert.assertNull(Assert.java:551)
        at org.apache.solr.cloud.autoscaling.IndexSizeTriggerTest.testTrigger(IndexSizeTriggerTest.java:180)
        at java.base/jdk.internal.reflect.NativeMethodAccessorImpl.invoke0(Native Method)
        at java.base/jdk.internal.reflect.NativeMethodAccessorImpl.invoke(NativeMethodAccessorImpl.java:62)
        at java.base/jdk.internal.reflect.DelegatingMethodAccessorImpl.invoke(DelegatingMethodAccessorImpl.java:43)
        at java.base/java.lang.reflect.Method.invoke(Method.java:564)
        at com.carrotsearch.randomizedtesting.RandomizedRunner.invoke(RandomizedRunner.java:1737)
        at com.carrotsearch.randomizedtesting.RandomizedRunner$8.evaluate(RandomizedRunner.java:934)
        at com.carrotsearch.randomizedtesting.RandomizedRunner$9.evaluate(RandomizedRunner.java:970)
        at com.carrotsearch.randomizedtesting.RandomizedRunner$10.evaluate(RandomizedRunner.java:984)
        at com.carrotsearch.randomizedtesting.rules.SystemPropertiesRestoreRule$1.evaluate(SystemPropertiesRestoreRule.java:57)
        at org.apache.lucene.util.TestRuleSetupTeardownChained$1.evaluate(TestRuleSetupTeardownChained.java:49)
        at org.apache.lucene.util.AbstractBeforeAfterRule$1.evaluate(AbstractBeforeAfterRule.java:45)
        at org.apache.lucene.util.TestRuleThreadAndTestName$1.evaluate(TestRuleThreadAndTestName.java:48)
        at org.apache.lucene.util.TestRuleIgnoreAfterMaxFailures$1.evaluate(TestRuleIgnoreAfterMaxFailures.java:64)
        at org.apache.lucene.util.TestRuleMarkFailure$1.evaluate(TestRuleMarkFailure.java:47)
        at com.carrotsearch.randomizedtesting.rules.StatementAdapter.evaluate(StatementAdapter.java:36)
        at com.carrotsearch.randomizedtesting.ThreadLeakControl$StatementRunner.run(ThreadLeakControl.java:368)
        at com.carrotsearch.randomizedtesting.ThreadLeakControl.forkTimeoutingTask(ThreadLeakControl.java:817)
        at com.carrotsearch.randomizedtesting.ThreadLeakControl$3.evaluate(ThreadLeakControl.java:468)
        at com.carrotsearch.randomizedtesting.RandomizedRunner.runSingleTest(RandomizedRunner.java:943)
        at com.carrotsearch.randomizedtesting.RandomizedRunner$5.evaluate(RandomizedRunner.java:829)
        at com.carrotsearch.randomizedtesting.RandomizedRunner$6.evaluate(RandomizedRunner.java:879)
        at com.carrotsearch.randomizedtesting.RandomizedRunner$7.evaluate(RandomizedRunner.java:890)
        at com.carrotsearch.randomizedtesting.rules.StatementAdapter.evaluate(StatementAdapter.java:36)
        at com.carrotsearch.randomizedtesting.rules.SystemPropertiesRestoreRule$1.evaluate(SystemPropertiesRestoreRule.java:57)
        at org.apache.lucene.util.AbstractBeforeAfterRule$1.evaluate(AbstractBeforeAfterRule.java:45)
        at com.carrotsearch.randomizedtesting.rules.StatementAdapter.evaluate(StatementAdapter.java:36)
        at org.apache.lucene.util.TestRuleStoreClassName$1.evaluate(TestRuleStoreClassName.java:41)
        at com.carrotsearch.randomizedtesting.rules.NoShadowingOrOverridesOnMethodsRule$1.evaluate(NoShadowingOrOverridesOnMethodsRule.java:40)
        at com.carrotsearch.randomizedtesting.rules.NoShadowingOrOverridesOnMethodsRule$1.evaluate(NoShadowingOrOverridesOnMethodsRule.java:40)
        at com.carrotsearch.randomizedtesting.rules.StatementAdapter.evaluate(StatementAdapter.java:36)
        at com.carrotsearch.randomizedtesting.rules.StatementAdapter.evaluate(StatementAdapter.java:36)
        at org.apache.lucene.util.TestRuleAssertionsRequired$1.evaluate(TestRuleAssertionsRequired.java:53)
        at org.apache.lucene.util.TestRuleMarkFailure$1.evaluate(TestRuleMarkFailure.java:47)
        at org.apache.lucene.util.TestRuleIgnoreAfterMaxFailures$1.evaluate(TestRuleIgnoreAfterMaxFailures.java:64)
        at org.apache.lucene.util.TestRuleIgnoreTestSuites$1.evaluate(TestRuleIgnoreTestSuites.java:54)
        at com.carrotsearch.randomizedtesting.rules.StatementAdapter.evaluate(StatementAdapter.java:36)
        at com.carrotsearch.randomizedtesting.ThreadLeakControl$StatementRunner.run(ThreadLeakControl.java:368)
        at java.base/java.lang.Thread.run(Thread.java:844)


FAILED:  org.apache.solr.cloud.autoscaling.IndexSizeTriggerTest.testSplitIntegration

Error Message:
events: [CapturedEvent{timestamp=1766714704056357, stage=STARTED, actionName='null', event={   "id":"646d08b863c4bT4o01l8j13t97yjou8d1k6r4il",   "source":"index_size_trigger2",   "eventTime":1766711368236107,   "eventType":"INDEXSIZE",   "properties":{     "__start__":1,     "aboveSize":{"testSplitIntegration_collection":["{\"core_node1\":{\n    \"core\":\"testSplitIntegration_collection_shard1_replica_n1\",\n    \"leader\":\"true\",\n    \"SEARCHER.searcher.maxDoc\":25,\n    \"SEARCHER.searcher.deletedDocs\":0,\n    \"INDEX.sizeInBytes\":1,\n    \"__docs__\":25,\n    \"violationType\":\"aboveDocs\",\n    \"node_name\":\"127.0.0.1:10000_solr\",\n    \"state\":\"active\",\n    \"type\":\"NRT\",\n    \"SEARCHER.searcher.numDocs\":25,\n    \"__bytes__\":1,\n    \"shard\":\"shard1\",\n    \"collection\":\"testSplitIntegration_collection\"}}"]},     "belowSize":{},     "_enqueue_time_":1766714686260257,     "requestedOps":["Op{action=SPLITSHARD, hints={COLL_SHARD=[{\n  \"first\":\"testSplitIntegration_collection\",\n  \"second\":\"shard1\"}]}}"]}}, context={}, config={   "trigger":"index_size_trigger2",   "stage":[     "STARTED",     "ABORTED",     "SUCCEEDED",     "FAILED"],   "afterAction":[     "compute_plan",     "execute_plan"],   "class":"org.apache.solr.cloud.autoscaling.IndexSizeTriggerTest$CapturingTriggerListener",   "beforeAction":[     "compute_plan",     "execute_plan"]}, message='null'}, CapturedEvent{timestamp=1766715448838457, stage=BEFORE_ACTION, actionName='compute_plan', event={   "id":"646d08b863c4bT4o01l8j13t97yjou8d1k6r4il",   "source":"index_size_trigger2",   "eventTime":1766711368236107,   "eventType":"INDEXSIZE",   "properties":{     "__start__":1,     "aboveSize":{"testSplitIntegration_collection":["{\"core_node1\":{\n    \"core\":\"testSplitIntegration_collection_shard1_replica_n1\",\n    \"leader\":\"true\",\n    \"SEARCHER.searcher.maxDoc\":25,\n    \"SEARCHER.searcher.deletedDocs\":0,\n    \"INDEX.sizeInBytes\":1,\n    \"__docs__\":25,\n    \"violationType\":\"aboveDocs\",\n    \"node_name\":\"127.0.0.1:10000_solr\",\n    \"state\":\"active\",\n    \"type\":\"NRT\",\n    \"SEARCHER.searcher.numDocs\":25,\n    \"__bytes__\":1,\n    \"shard\":\"shard1\",\n    \"collection\":\"testSplitIntegration_collection\"}}"]},     "belowSize":{},     "_enqueue_time_":1766714686260257,     "requestedOps":["Op{action=SPLITSHARD, hints={COLL_SHARD=[{\n  \"first\":\"testSplitIntegration_collection\",\n  \"second\":\"shard1\"}]}}"]}}, context={properties.BEFORE_ACTION=[compute_plan], source=index_size_trigger2}, config={   "trigger":"index_size_trigger2",   "stage":[     "STARTED",     "ABORTED",     "SUCCEEDED",     "FAILED"],   "afterAction":[     "compute_plan",     "execute_plan"],   "class":"org.apache.solr.cloud.autoscaling.IndexSizeTriggerTest$CapturingTriggerListener",   "beforeAction":[     "compute_plan",     "execute_plan"]}, message='null'}, CapturedEvent{timestamp=1766715903928107, stage=AFTER_ACTION, actionName='compute_plan', event={   "id":"646d08b863c4bT4o01l8j13t97yjou8d1k6r4il",   "source":"index_size_trigger2",   "eventTime":1766711368236107,   "eventType":"INDEXSIZE",   "properties":{     "__start__":1,     "aboveSize":{"testSplitIntegration_collection":["{\"core_node1\":{\n    \"core\":\"testSplitIntegration_collection_shard1_replica_n1\",\n    \"leader\":\"true\",\n    \"SEARCHER.searcher.maxDoc\":25,\n    \"SEARCHER.searcher.deletedDocs\":0,\n    \"INDEX.sizeInBytes\":1,\n    \"__docs__\":25,\n    \"violationType\":\"aboveDocs\",\n    \"node_name\":\"127.0.0.1:10000_solr\",\n    \"state\":\"active\",\n    \"type\":\"NRT\",\n    \"SEARCHER.searcher.numDocs\":25,\n    \"__bytes__\":1,\n    \"shard\":\"shard1\",\n    \"collection\":\"testSplitIntegration_collection\"}}"]},     "belowSize":{},     "_enqueue_time_":1766714686260257,     "requestedOps":["Op{action=SPLITSHARD, hints={COLL_SHARD=[{\n  \"first\":\"testSplitIntegration_collection\",\n  \"second\":\"shard1\"}]}}"]}}, context={properties.operations=[{class=org.apache.solr.client.solrj.request.CollectionAdminRequest$SplitShard, method=GET, params.action=SPLITSHARD, params.collection=testSplitIntegration_collection, params.shard=shard1}], properties.BEFORE_ACTION=[compute_plan], source=index_size_trigger2, properties.AFTER_ACTION=[compute_plan]}, config={   "trigger":"index_size_trigger2",   "stage":[     "STARTED",     "ABORTED",     "SUCCEEDED",     "FAILED"],   "afterAction":[     "compute_plan",     "execute_plan"],   "class":"org.apache.solr.cloud.autoscaling.IndexSizeTriggerTest$CapturingTriggerListener",   "beforeAction":[     "compute_plan",     "execute_plan"]}, message='null'}, CapturedEvent{timestamp=1766715925475407, stage=BEFORE_ACTION, actionName='execute_plan', event={   "id":"646d08b863c4bT4o01l8j13t97yjou8d1k6r4il",   "source":"index_size_trigger2",   "eventTime":1766711368236107,   "eventType":"INDEXSIZE",   "properties":{     "__start__":1,     "aboveSize":{"testSplitIntegration_collection":["{\"core_node1\":{\n    \"core\":\"testSplitIntegration_collection_shard1_replica_n1\",\n    \"leader\":\"true\",\n    \"SEARCHER.searcher.maxDoc\":25,\n    \"SEARCHER.searcher.deletedDocs\":0,\n    \"INDEX.sizeInBytes\":1,\n    \"__docs__\":25,\n    \"violationType\":\"aboveDocs\",\n    \"node_name\":\"127.0.0.1:10000_solr\",\n    \"state\":\"active\",\n    \"type\":\"NRT\",\n    \"SEARCHER.searcher.numDocs\":25,\n    \"__bytes__\":1,\n    \"shard\":\"shard1\",\n    \"collection\":\"testSplitIntegration_collection\"}}"]},     "belowSize":{},     "_enqueue_time_":1766714686260257,     "requestedOps":["Op{action=SPLITSHARD, hints={COLL_SHARD=[{\n  \"first\":\"testSplitIntegration_collection\",\n  \"second\":\"shard1\"}]}}"]}}, context={properties.operations=[{class=org.apache.solr.client.solrj.request.CollectionAdminRequest$SplitShard, method=GET, params.action=SPLITSHARD, params.collection=testSplitIntegration_collection, params.shard=shard1}], properties.BEFORE_ACTION=[compute_plan, execute_plan], source=index_size_trigger2, properties.AFTER_ACTION=[compute_plan]}, config={   "trigger":"index_size_trigger2",   "stage":[     "STARTED",     "ABORTED",     "SUCCEEDED",     "FAILED"],   "afterAction":[     "compute_plan",     "execute_plan"],   "class":"org.apache.solr.cloud.autoscaling.IndexSizeTriggerTest$CapturingTriggerListener",   "beforeAction":[     "compute_plan",     "execute_plan"]}, message='null'}, CapturedEvent{timestamp=1766727046292157, stage=AFTER_ACTION, actionName='execute_plan', event={   "id":"646d08b863c4bT4o01l8j13t97yjou8d1k6r4il",   "source":"index_size_trigger2",   "eventTime":1766711368236107,   "eventType":"INDEXSIZE",   "properties":{     "__start__":1,     "aboveSize":{"testSplitIntegration_collection":["{\"core_node1\":{\n    \"core\":\"testSplitIntegration_collection_shard1_replica_n1\",\n    \"leader\":\"true\",\n    \"SEARCHER.searcher.maxDoc\":25,\n    \"SEARCHER.searcher.deletedDocs\":0,\n    \"INDEX.sizeInBytes\":1,\n    \"__docs__\":25,\n    \"violationType\":\"aboveDocs\",\n    \"node_name\":\"127.0.0.1:10000_solr\",\n    \"state\":\"active\",\n    \"type\":\"NRT\",\n    \"SEARCHER.searcher.numDocs\":25,\n    \"__bytes__\":1,\n    \"shard\":\"shard1\",\n    \"collection\":\"testSplitIntegration_collection\"}}"]},     "belowSize":{},     "_enqueue_time_":1766714686260257,     "requestedOps":["Op{action=SPLITSHARD, hints={COLL_SHARD=[{\n  \"first\":\"testSplitIntegration_collection\",\n  \"second\":\"shard1\"}]}}"]}}, context={properties.operations=[{class=org.apache.solr.client.solrj.request.CollectionAdminRequest$SplitShard, method=GET, params.action=SPLITSHARD, params.async=index_size_trigger2/646d08b863c4bT4o01l8j13t97yjou8d1k6r4il/0, params.waitForFinalState=true, params.collection=testSplitIntegration_collection, params.shard=shard1}], properties.BEFORE_ACTION=[compute_plan, execute_plan], properties.responses=[{status={state=completed,msg=found [index_size_trigger2/646d08b863c4bT4o01l8j13t97yjou8d1k6r4il/0] in completed tasks},success=}], source=index_size_trigger2, properties.AFTER_ACTION=[compute_plan, execute_plan]}, config={   "trigger":"index_size_trigger2",   "stage":[     "STARTED",     "ABORTED",     "SUCCEEDED",     "FAILED"],   "afterAction":[     "compute_plan",     "execute_plan"],   "class":"org.apache.solr.cloud.autoscaling.IndexSizeTriggerTest$CapturingTriggerListener",   "beforeAction":[     "compute_plan",     "execute_plan"]}, message='null'}, CapturedEvent{timestamp=1766727075046307, stage=SUCCEEDED, actionName='null', event={   "id":"646d08b863c4bT4o01l8j13t97yjou8d1k6r4il",   "source":"index_size_trigger2",   "eventTime":1766711368236107,   "eventType":"INDEXSIZE",   "properties":{     "__start__":1,     "aboveSize":{"testSplitIntegration_collection":["{\"core_node1\":{\n    \"core\":\"testSplitIntegration_collection_shard1_replica_n1\",\n    \"leader\":\"true\",\n    \"SEARCHER.searcher.maxDoc\":25,\n    \"SEARCHER.searcher.deletedDocs\":0,\n    \"INDEX.sizeInBytes\":1,\n    \"__docs__\":25,\n    \"violationType\":\"aboveDocs\",\n    \"node_name\":\"127.0.0.1:10000_solr\",\n    \"state\":\"active\",\n    \"type\":\"NRT\",\n    \"SEARCHER.searcher.numDocs\":25,\n    \"__bytes__\":1,\n    \"shard\":\"shard1\",\n    \"collection\":\"testSplitIntegration_collection\"}}"]},     "belowSize":{},     "_enqueue_time_":1766714686260257,     "requestedOps":["Op{action=SPLITSHARD, hints={COLL_SHARD=[{\n  \"first\":\"testSplitIntegration_collection\",\n  \"second\":\"shard1\"}]}}"]}}, context={}, config={   "trigger":"index_size_trigger2",   "stage":[     "STARTED",     "ABORTED",     "SUCCEEDED",     "FAILED"],   "afterAction":[     "compute_plan",     "execute_plan"],   "class":"org.apache.solr.cloud.autoscaling.IndexSizeTriggerTest$CapturingTriggerListener",   "beforeAction":[     "compute_plan",     "execute_plan"]}, message='null'}, CapturedEvent{timestamp=1766735282698807, stage=STARTED, actionName='null', event={   "id":"646d5621f42adT4o01l8j13t97yjou8d1k6r4io",   "source":"index_size_trigger2",   "eventTime":1766732148458157,   "eventType":"INDEXSIZE",   "properties":{     "__start__":3,     "aboveSize":{"testSplitIntegration_collection":[         "{\"core_node10\":{\n    \"leader\":\"true\",\n    \"SEARCHER.searcher.maxDoc\":12,\n    \"SEARCHER.searcher.deletedDocs\":0,\n    \"INDEX.sizeInBytes\":1,\n    \"__docs__\":12,\n    \"violationType\":\"aboveDocs\",\n    \"node_name\":\"127.0.0.1:10000_solr\",\n    \"base_url\":\"http://127.0.0.1:10000/solr\",\n    \"state\":\"active\",\n    \"type\":\"NRT\",\n    \"SEARCHER.searcher.numDocs\":12,\n    \"__bytes__\":1,\n    \"core\":\"testSplitIntegration_collection_shard1_1_replica1\",\n    \"shard\":\"shard1_1\",\n    \"collection\":\"testSplitIntegration_collection\"}}",         "{\"core_node3\":{\n    \"core\":\"testSplitIntegration_collection_shard2_replica_n3\",\n    \"leader\":\"true\",\n    \"SEARCHER.searcher.maxDoc\":25,\n    \"SEARCHER.searcher.deletedDocs\":0,\n    \"INDEX.sizeInBytes\":1,\n    \"__docs__\":25,\n    \"violationType\":\"aboveDocs\",\n    \"node_name\":\"127.0.0.1:10000_solr\",\n    \"state\":\"active\",\n    \"type\":\"NRT\",\n    \"SEARCHER.searcher.numDocs\":25,\n    \"__bytes__\":1,\n    \"shard\":\"shard2\",\n    \"collection\":\"testSplitIntegration_collection\"}}",         "{\"core_node7\":{\n    \"leader\":\"true\",\n    \"SEARCHER.searcher.maxDoc\":13,\n    \"SEARCHER.searcher.deletedDocs\":0,\n    \"INDEX.sizeInBytes\":1,\n    \"__docs__\":13,\n    \"violationType\":\"aboveDocs\",\n    \"node_name\":\"127.0.0.1:10001_solr\",\n    \"base_url\":\"http://127.0.0.1:10001/solr\",\n    \"state\":\"active\",\n    \"type\":\"NRT\",\n    \"SEARCHER.searcher.numDocs\":13,\n    \"__bytes__\":1,\n    \"core\":\"testSplitIntegration_collection_shard1_0_replica0\",\n    \"shard\":\"shard1_0\",\n    \"collection\":\"testSplitIntegration_collection\"}}"]},     "belowSize":{},     "_enqueue_time_":1766735264099007,     "requestedOps":[       "Op{action=SPLITSHARD, hints={COLL_SHARD=[{\n  \"first\":\"testSplitIntegration_collection\",\n  \"second\":\"shard1_1\"}]}}",       "Op{action=SPLITSHARD, hints={COLL_SHARD=[{\n  \"first\":\"testSplitIntegration_collection\",\n  \"second\":\"shard2\"}]}}",       "Op{action=SPLITSHARD, hints={COLL_SHARD=[{\n  \"first\":\"testSplitIntegration_collection\",\n  \"second\":\"shard1_0\"}]}}"]}}, context={}, config={   "trigger":"index_size_trigger2",   "stage":[     "STARTED",     "ABORTED",     "SUCCEEDED",     "FAILED"],   "afterAction":[     "compute_plan",     "execute_plan"],   "class":"org.apache.solr.cloud.autoscaling.IndexSizeTriggerTest$CapturingTriggerListener",   "beforeAction":[     "compute_plan",     "execute_plan"]}, message='null'}, CapturedEvent{timestamp=1766736038946107, stage=BEFORE_ACTION, actionName='compute_plan', event={   "id":"646d5621f42adT4o01l8j13t97yjou8d1k6r4io",   "source":"index_size_trigger2",   "eventTime":1766732148458157,   "eventType":"INDEXSIZE",   "properties":{     "__start__":3,     "aboveSize":{"testSplitIntegration_collection":[         "{\"core_node10\":{\n    \"leader\":\"true\",\n    \"SEARCHER.searcher.maxDoc\":12,\n    \"SEARCHER.searcher.deletedDocs\":0,\n    \"INDEX.sizeInBytes\":1,\n    \"__docs__\":12,\n    \"violationType\":\"aboveDocs\",\n    \"node_name\":\"127.0.0.1:10000_solr\",\n    \"base_url\":\"http://127.0.0.1:10000/solr\",\n    \"state\":\"active\",\n    \"type\":\"NRT\",\n    \"SEARCHER.searcher.numDocs\":12,\n    \"__bytes__\":1,\n    \"core\":\"testSplitIntegration_collection_shard1_1_replica1\",\n    \"shard\":\"shard1_1\",\n    \"collection\":\"testSplitIntegration_collection\"}}",         "{\"core_node3\":{\n    \"core\":\"testSplitIntegration_collection_shard2_replica_n3\",\n    \"leader\":\"true\",\n    \"SEARCHER.searcher.maxDoc\":25,\n    \"SEARCHER.searcher.deletedDocs\":0,\n    \"INDEX.sizeInBytes\":1,\n    \"__docs__\":25,\n    \"violationType\":\"aboveDocs\",\n    \"node_name\":\"127.0.0.1:10000_solr\",\n    \"state\":\"active\",\n    \"type\":\"NRT\",\n    \"SEARCHER.searcher.numDocs\":25,\n    \"__bytes__\":1,\n    \"shard\":\"shard2\",\n    \"collection\":\"testSplitIntegration_collection\"}}",         "{\"core_node7\":{\n    \"leader\":\"true\",\n    \"SEARCHER.searcher.maxDoc\":13,\n    \"SEARCHER.searcher.deletedDocs\":0,\n    \"INDEX.sizeInBytes\":1,\n    \"__docs__\":13,\n    \"violationType\":\"aboveDocs\",\n    \"node_name\":\"127.0.0.1:10001_solr\",\n    \"base_url\":\"http://127.0.0.1:10001/solr\",\n    \"state\":\"active\",\n    \"type\":\"NRT\",\n    \"SEARCHER.searcher.numDocs\":13,\n    \"__bytes__\":1,\n    \"core\":\"testSplitIntegration_collection_shard1_0_replica0\",\n    \"shard\":\"shard1_0\",\n    \"collection\":\"testSplitIntegration_collection\"}}"]},     "belowSize":{},     "_enqueue_time_":1766735264099007,     "requestedOps":[       "Op{action=SPLITSHARD, hints={COLL_SHARD=[{\n  \"first\":\"testSplitIntegration_collection\",\n  \"second\":\"shard1_1\"}]}}",       "Op{action=SPLITSHARD, hints={COLL_SHARD=[{\n  \"first\":\"testSplitIntegration_collection\",\n  \"second\":\"shard2\"}]}}",       "Op{action=SPLITSHARD, hints={COLL_SHARD=[{\n  \"first\":\"testSplitIntegration_collection\",\n  \"second\":\"shard1_0\"}]}}"]}}, context={properties.BEFORE_ACTION=[compute_plan], source=index_size_trigger2}, config={   "trigger":"index_size_trigger2",   "stage":[     "STARTED",     "ABORTED",     "SUCCEEDED",     "FAILED"],   "afterAction":[     "compute_plan",     "execute_plan"],   "class":"org.apache.solr.cloud.autoscaling.IndexSizeTriggerTest$CapturingTriggerListener",   "beforeAction":[     "compute_plan",     "execute_plan"]}, message='null'}, CapturedEvent{timestamp=1766736135620707, stage=AFTER_ACTION, actionName='compute_plan', event={   "id":"646d5621f42adT4o01l8j13t97yjou8d1k6r4io",   "source":"index_size_trigger2",   "eventTime":1766732148458157,   "eventType":"INDEXSIZE",   "properties":{     "__start__":3,     "aboveSize":{"testSplitIntegration_collection":[         "{\"core_node10\":{\n    \"leader\":\"true\",\n    \"SEARCHER.searcher.maxDoc\":12,\n    \"SEARCHER.searcher.deletedDocs\":0,\n    \"INDEX.sizeInBytes\":1,\n    \"__docs__\":12,\n    \"violationType\":\"aboveDocs\",\n    \"node_name\":\"127.0.0.1:10000_solr\",\n    \"base_url\":\"http://127.0.0.1:10000/solr\",\n    \"state\":\"active\",\n    \"type\":\"NRT\",\n    \"SEARCHER.searcher.numDocs\":12,\n    \"__bytes__\":1,\n    \"core\":\"testSplitIntegration_collection_shard1_1_replica1\",\n    \"shard\":\"shard1_1\",\n    \"collection\":\"testSplitIntegration_collection\"}}",         "{\"core_node3\":{\n    \"core\":\"testSplitIntegration_collection_shard2_replica_n3\",\n    \"leader\":\"true\",\n    \"SEARCHER.searcher.maxDoc\":25,\n    \"SEARCHER.searcher.deletedDocs\":0,\n    \"INDEX.sizeInBytes\":1,\n    \"__docs__\":25,\n    \"violationType\":\"aboveDocs\",\n    \"node_name\":\"127.0.0.1:10000_solr\",\n    \"state\":\"active\",\n    \"type\":\"NRT\",\n    \"SEARCHER.searcher.numDocs\":25,\n    \"__bytes__\":1,\n    \"shard\":\"shard2\",\n    \"collection\":\"testSplitIntegration_collection\"}}",         "{\"core_node7\":{\n    \"leader\":\"true\",\n    \"SEARCHER.searcher.maxDoc\":13,\n    \"SEARCHER.searcher.deletedDocs\":0,\n    \"INDEX.sizeInBytes\":1,\n    \"__docs__\":13,\n    \"violationType\":\"aboveDocs\",\n    \"node_name\":\"127.0.0.1:10001_solr\",\n    \"base_url\":\"http://127.0.0.1:10001/solr\",\n    \"state\":\"active\",\n    \"type\":\"NRT\",\n    \"SEARCHER.searcher.numDocs\":13,\n    \"__bytes__\":1,\n    \"core\":\"testSplitIntegration_collection_shard1_0_replica0\",\n    \"shard\":\"shard1_0\",\n    \"collection\":\"testSplitIntegration_collection\"}}"]},     "belowSize":{},     "_enqueue_time_":1766735264099007,     "requestedOps":[       "Op{action=SPLITSHARD, hints={COLL_SHARD=[{\n  \"first\":\"testSplitIntegration_collection\",\n  \"second\":\"shard1_1\"}]}}",       "Op{action=SPLITSHARD, hints={COLL_SHARD=[{\n  \"first\":\"testSplitIntegration_collection\",\n  \"second\":\"shard2\"}]}}",       "Op{action=SPLITSHARD, hints={COLL_SHARD=[{\n  \"first\":\"testSplitIntegration_collection\",\n  \"second\":\"shard1_0\"}]}}"]}}, context={properties.operations=[{class=org.apache.solr.client.solrj.request.CollectionAdminRequest$SplitShard, method=GET, params.action=SPLITSHARD, params.collection=testSplitIntegration_collection, params.shard=shard1_1}, {class=org.apache.solr.client.solrj.request.CollectionAdminRequest$SplitShard, method=GET, params.action=SPLITSHARD, params.collection=testSplitIntegration_collection, params.shard=shard2}, {class=org.apache.solr.client.solrj.request.CollectionAdminRequest$SplitShard, method=GET, params.action=SPLITSHARD, params.collection=testSplitIntegration_collection, params.shard=shard1_0}], properties.BEFORE_ACTION=[compute_plan], source=index_size_trigger2, properties.AFTER_ACTION=[compute_plan]}, config={   "trigger":"index_size_trigger2",   "stage":[     "STARTED",     "ABORTED",     "SUCCEEDED",     "FAILED"],   "afterAction":[     "compute_plan",     "execute_plan"],   "class":"org.apache.solr.cloud.autoscaling.IndexSizeTriggerTest$CapturingTriggerListener",   "beforeAction":[     "compute_plan",     "execute_plan"]}, message='null'}, CapturedEvent{timestamp=1766736163050807, stage=BEFORE_ACTION, actionName='execute_plan', event={   "id":"646d5621f42adT4o01l8j13t97yjou8d1k6r4io",   "source":"index_size_trigger2",   "eventTime":1766732148458157,   "eventType":"INDEXSIZE",   "properties":{     "__start__":3,     "aboveSize":{"testSplitIntegration_collection":[         "{\"core_node10\":{\n    \"leader\":\"true\",\n    \"SEARCHER.searcher.maxDoc\":12,\n    \"SEARCHER.searcher.deletedDocs\":0,\n    \"INDEX.sizeInBytes\":1,\n    \"__docs__\":12,\n    \"violationType\":\"aboveDocs\",\n    \"node_name\":\"127.0.0.1:10000_solr\",\n    \"base_url\":\"http://127.0.0.1:10000/solr\",\n    \"state\":\"active\",\n    \"type\":\"NRT\",\n    \"SEARCHER.searcher.numDocs\":12,\n    \"__bytes__\":1,\n    \"core\":\"testSplitIntegration_collection_shard1_1_replica1\",\n    \"shard\":\"shard1_1\",\n    \"collection\":\"testSplitIntegration_collection\"}}",         "{\"core_node3\":{\n    \"core\":\"testSplitIntegration_collection_shard2_replica_n3\",\n    \"leader\":\"true\",\n    \"SEARCHER.searcher.maxDoc\":25,\n    \"SEARCHER.searcher.deletedDocs\":0,\n    \"INDEX.sizeInBytes\":1,\n    \"__docs__\":25,\n    \"violationType\":\"aboveDocs\",\n    \"node_name\":\"127.0.0.1:10000_solr\",\n    \"state\":\"active\",\n    \"type\":\"NRT\",\n    \"SEARCHER.searcher.numDocs\":25,\n    \"__bytes__\":1,\n    \"shard\":\"shard2\",\n    \"collection\":\"testSplitIntegration_collection\"}}",         "{\"core_node7\":{\n    \"leader\":\"true\",\n    \"SEARCHER.searcher.maxDoc\":13,\n    \"SEARCHER.searcher.deletedDocs\":0,\n    \"INDEX.sizeInBytes\":1,\n    \"__docs__\":13,\n    \"violationType\":\"aboveDocs\",\n    \"node_name\":\"127.0.0.1:10001_solr\",\n    \"base_url\":\"http://127.0.0.1:10001/solr\",\n    \"state\":\"active\",\n    \"type\":\"NRT\",\n    \"SEARCHER.searcher.numDocs\":13,\n    \"__bytes__\":1,\n    \"core\":\"testSplitIntegration_collection_shard1_0_replica0\",\n    \"shard\":\"shard1_0\",\n    \"collection\":\"testSplitIntegration_collection\"}}"]},     "belowSize":{},     "_enqueue_time_":1766735264099007,     "requestedOps":[       "Op{action=SPLITSHARD, hints={COLL_SHARD=[{\n  \"first\":\"testSplitIntegration_collection\",\n  \"second\":\"shard1_1\"}]}}",       "Op{action=SPLITSHARD, hints={COLL_SHARD=[{\n  \"first\":\"testSplitIntegration_collection\",\n  \"second\":\"shard2\"}]}}",       "Op{action=SPLITSHARD, hints={COLL_SHARD=[{\n  \"first\":\"testSplitIntegration_collection\",\n  \"second\":\"shard1_0\"}]}}"]}}, context={properties.operations=[{class=org.apache.solr.client.solrj.request.CollectionAdminRequest$SplitShard, method=GET, params.action=SPLITSHARD, params.collection=testSplitIntegration_collection, params.shard=shard1_1}, {class=org.apache.solr.client.solrj.request.CollectionAdminRequest$SplitShard, method=GET, params.action=SPLITSHARD, params.collection=testSplitIntegration_collection, params.shard=shard2}, {class=org.apache.solr.client.solrj.request.CollectionAdminRequest$SplitShard, method=GET, params.action=SPLITSHARD, params.collection=testSplitIntegration_collection, params.shard=shard1_0}], properties.BEFORE_ACTION=[compute_plan, execute_plan], source=index_size_trigger2, properties.AFTER_ACTION=[compute_plan]}, config={   "trigger":"index_size_trigger2",   "stage":[     "STARTED",     "ABORTED",     "SUCCEEDED",     "FAILED"],   "afterAction":[     "compute_plan",     "execute_plan"],   "class":"org.apache.solr.cloud.autoscaling.IndexSizeTriggerTest$CapturingTriggerListener",   "beforeAction":[     "compute_plan",     "execute_plan"]}, message='null'}] expected:<6> but was:<10>

Stack Trace:
java.lang.AssertionError: events: [CapturedEvent{timestamp=1766714704056357, stage=STARTED, actionName='null', event={
  "id":"646d08b863c4bT4o01l8j13t97yjou8d1k6r4il",
  "source":"index_size_trigger2",
  "eventTime":1766711368236107,
  "eventType":"INDEXSIZE",
  "properties":{
    "__start__":1,
    "aboveSize":{"testSplitIntegration_collection":["{\"core_node1\":{\n    \"core\":\"testSplitIntegration_collection_shard1_replica_n1\",\n    \"leader\":\"true\",\n    \"SEARCHER.searcher.maxDoc\":25,\n    \"SEARCHER.searcher.deletedDocs\":0,\n    \"INDEX.sizeInBytes\":1,\n    \"__docs__\":25,\n    \"violationType\":\"aboveDocs\",\n    \"node_name\":\"127.0.0.1:10000_solr\",\n    \"state\":\"active\",\n    \"type\":\"NRT\",\n    \"SEARCHER.searcher.numDocs\":25,\n    \"__bytes__\":1,\n    \"shard\":\"shard1\",\n    \"collection\":\"testSplitIntegration_collection\"}}"]},
    "belowSize":{},
    "_enqueue_time_":1766714686260257,
    "requestedOps":["Op{action=SPLITSHARD, hints={COLL_SHARD=[{\n  \"first\":\"testSplitIntegration_collection\",\n  \"second\":\"shard1\"}]}}"]}}, context={}, config={
  "trigger":"index_size_trigger2",
  "stage":[
    "STARTED",
    "ABORTED",
    "SUCCEEDED",
    "FAILED"],
  "afterAction":[
    "compute_plan",
    "execute_plan"],
  "class":"org.apache.solr.cloud.autoscaling.IndexSizeTriggerTest$CapturingTriggerListener",
  "beforeAction":[
    "compute_plan",
    "execute_plan"]}, message='null'}, CapturedEvent{timestamp=1766715448838457, stage=BEFORE_ACTION, actionName='compute_plan', event={
  "id":"646d08b863c4bT4o01l8j13t97yjou8d1k6r4il",
  "source":"index_size_trigger2",
  "eventTime":1766711368236107,
  "eventType":"INDEXSIZE",
  "properties":{
    "__start__":1,
    "aboveSize":{"testSplitIntegration_collection":["{\"core_node1\":{\n    \"core\":\"testSplitIntegration_collection_shard1_replica_n1\",\n    \"leader\":\"true\",\n    \"SEARCHER.searcher.maxDoc\":25,\n    \"SEARCHER.searcher.deletedDocs\":0,\n    \"INDEX.sizeInBytes\":1,\n    \"__docs__\":25,\n    \"violationType\":\"aboveDocs\",\n    \"node_name\":\"127.0.0.1:10000_solr\",\n    \"state\":\"active\",\n    \"type\":\"NRT\",\n    \"SEARCHER.searcher.numDocs\":25,\n    \"__bytes__\":1,\n    \"shard\":\"shard1\",\n    \"collection\":\"testSplitIntegration_collection\"}}"]},
    "belowSize":{},
    "_enqueue_time_":1766714686260257,
    "requestedOps":["Op{action=SPLITSHARD, hints={COLL_SHARD=[{\n  \"first\":\"testSplitIntegration_collection\",\n  \"second\":\"shard1\"}]}}"]}}, context={properties.BEFORE_ACTION=[compute_plan], source=index_size_trigger2}, config={
  "trigger":"index_size_trigger2",
  "stage":[
    "STARTED",
    "ABORTED",
    "SUCCEEDED",
    "FAILED"],
  "afterAction":[
    "compute_plan",
    "execute_plan"],
  "class":"org.apache.solr.cloud.autoscaling.IndexSizeTriggerTest$CapturingTriggerListener",
  "beforeAction":[
    "compute_plan",
    "execute_plan"]}, message='null'}, CapturedEvent{timestamp=1766715903928107, stage=AFTER_ACTION, actionName='compute_plan', event={
  "id":"646d08b863c4bT4o01l8j13t97yjou8d1k6r4il",
  "source":"index_size_trigger2",
  "eventTime":1766711368236107,
  "eventType":"INDEXSIZE",
  "properties":{
    "__start__":1,
    "aboveSize":{"testSplitIntegration_collection":["{\"core_node1\":{\n    \"core\":\"testSplitIntegration_collection_shard1_replica_n1\",\n    \"leader\":\"true\",\n    \"SEARCHER.searcher.maxDoc\":25,\n    \"SEARCHER.searcher.deletedDocs\":0,\n    \"INDEX.sizeInBytes\":1,\n    \"__docs__\":25,\n    \"violationType\":\"aboveDocs\",\n    \"node_name\":\"127.0.0.1:10000_solr\",\n    \"state\":\"active\",\n    \"type\":\"NRT\",\n    \"SEARCHER.searcher.numDocs\":25,\n    \"__bytes__\":1,\n    \"shard\":\"shard1\",\n    \"collection\":\"testSplitIntegration_collection\"}}"]},
    "belowSize":{},
    "_enqueue_time_":1766714686260257,
    "requestedOps":["Op{action=SPLITSHARD, hints={COLL_SHARD=[{\n  \"first\":\"testSplitIntegration_collection\",\n  \"second\":\"shard1\"}]}}"]}}, context={properties.operations=[{class=org.apache.solr.client.solrj.request.CollectionAdminRequest$SplitShard, method=GET, params.action=SPLITSHARD, params.collection=testSplitIntegration_collection, params.shard=shard1}], properties.BEFORE_ACTION=[compute_plan], source=index_size_trigger2, properties.AFTER_ACTION=[compute_plan]}, config={
  "trigger":"index_size_trigger2",
  "stage":[
    "STARTED",
    "ABORTED",
    "SUCCEEDED",
    "FAILED"],
  "afterAction":[
    "compute_plan",
    "execute_plan"],
  "class":"org.apache.solr.cloud.autoscaling.IndexSizeTriggerTest$CapturingTriggerListener",
  "beforeAction":[
    "compute_plan",
    "execute_plan"]}, message='null'}, CapturedEvent{timestamp=1766715925475407, stage=BEFORE_ACTION, actionName='execute_plan', event={
  "id":"646d08b863c4bT4o01l8j13t97yjou8d1k6r4il",
  "source":"index_size_trigger2",
  "eventTime":1766711368236107,
  "eventType":"INDEXSIZE",
  "properties":{
    "__start__":1,
    "aboveSize":{"testSplitIntegration_collection":["{\"core_node1\":{\n    \"core\":\"testSplitIntegration_collection_shard1_replica_n1\",\n    \"leader\":\"true\",\n    \"SEARCHER.searcher.maxDoc\":25,\n    \"SEARCHER.searcher.deletedDocs\":0,\n    \"INDEX.sizeInBytes\":1,\n    \"__docs__\":25,\n    \"violationType\":\"aboveDocs\",\n    \"node_name\":\"127.0.0.1:10000_solr\",\n    \"state\":\"active\",\n    \"type\":\"NRT\",\n    \"SEARCHER.searcher.numDocs\":25,\n    \"__bytes__\":1,\n    \"shard\":\"shard1\",\n    \"collection\":\"testSplitIntegration_collection\"}}"]},
    "belowSize":{},
    "_enqueue_time_":1766714686260257,
    "requestedOps":["Op{action=SPLITSHARD, hints={COLL_SHARD=[{\n  \"first\":\"testSplitIntegration_collection\",\n  \"second\":\"shard1\"}]}}"]}}, context={properties.operations=[{class=org.apache.solr.client.solrj.request.CollectionAdminRequest$SplitShard, method=GET, params.action=SPLITSHARD, params.collection=testSplitIntegration_collection, params.shard=shard1}], properties.BEFORE_ACTION=[compute_plan, execute_plan], source=index_size_trigger2, properties.AFTER_ACTION=[compute_plan]}, config={
  "trigger":"index_size_trigger2",
  "stage":[
    "STARTED",
    "ABORTED",
    "SUCCEEDED",
    "FAILED"],
  "afterAction":[
    "compute_plan",
    "execute_plan"],
  "class":"org.apache.solr.cloud.autoscaling.IndexSizeTriggerTest$CapturingTriggerListener",
  "beforeAction":[
    "compute_plan",
    "execute_plan"]}, message='null'}, CapturedEvent{timestamp=1766727046292157, stage=AFTER_ACTION, actionName='execute_plan', event={
  "id":"646d08b863c4bT4o01l8j13t97yjou8d1k6r4il",
  "source":"index_size_trigger2",
  "eventTime":1766711368236107,
  "eventType":"INDEXSIZE",
  "properties":{
    "__start__":1,
    "aboveSize":{"testSplitIntegration_collection":["{\"core_node1\":{\n    \"core\":\"testSplitIntegration_collection_shard1_replica_n1\",\n    \"leader\":\"true\",\n    \"SEARCHER.searcher.maxDoc\":25,\n    \"SEARCHER.searcher.deletedDocs\":0,\n    \"INDEX.sizeInBytes\":1,\n    \"__docs__\":25,\n    \"violationType\":\"aboveDocs\",\n    \"node_name\":\"127.0.0.1:10000_solr\",\n    \"state\":\"active\",\n    \"type\":\"NRT\",\n    \"SEARCHER.searcher.numDocs\":25,\n    \"__bytes__\":1,\n    \"shard\":\"shard1\",\n    \"collection\":\"testSplitIntegration_collection\"}}"]},
    "belowSize":{},
    "_enqueue_time_":1766714686260257,
    "requestedOps":["Op{action=SPLITSHARD, hints={COLL_SHARD=[{\n  \"first\":\"testSplitIntegration_collection\",\n  \"second\":\"shard1\"}]}}"]}}, context={properties.operations=[{class=org.apache.solr.client.solrj.request.CollectionAdminRequest$SplitShard, method=GET, params.action=SPLITSHARD, params.async=index_size_trigger2/646d08b863c4bT4o01l8j13t97yjou8d1k6r4il/0, params.waitForFinalState=true, params.collection=testSplitIntegration_collection, params.shard=shard1}], properties.BEFORE_ACTION=[compute_plan, execute_plan], properties.responses=[{status={state=completed,msg=found [index_size_trigger2/646d08b863c4bT4o01l8j13t97yjou8d1k6r4il/0] in completed tasks},success=}], source=index_size_trigger2, properties.AFTER_ACTION=[compute_plan, execute_plan]}, config={
  "trigger":"index_size_trigger2",
  "stage":[
    "STARTED",
    "ABORTED",
    "SUCCEEDED",
    "FAILED"],
  "afterAction":[
    "compute_plan",
    "execute_plan"],
  "class":"org.apache.solr.cloud.autoscaling.IndexSizeTriggerTest$CapturingTriggerListener",
  "beforeAction":[
    "compute_plan",
    "execute_plan"]}, message='null'}, CapturedEvent{timestamp=1766727075046307, stage=SUCCEEDED, actionName='null', event={
  "id":"646d08b863c4bT4o01l8j13t97yjou8d1k6r4il",
  "source":"index_size_trigger2",
  "eventTime":1766711368236107,
  "eventType":"INDEXSIZE",
  "properties":{
    "__start__":1,
    "aboveSize":{"testSplitIntegration_collection":["{\"core_node1\":{\n    \"core\":\"testSplitIntegration_collection_shard1_replica_n1\",\n    \"leader\":\"true\",\n    \"SEARCHER.searcher.maxDoc\":25,\n    \"SEARCHER.searcher.deletedDocs\":0,\n    \"INDEX.sizeInBytes\":1,\n    \"__docs__\":25,\n    \"violationType\":\"aboveDocs\",\n    \"node_name\":\"127.0.0.1:10000_solr\",\n    \"state\":\"active\",\n    \"type\":\"NRT\",\n    \"SEARCHER.searcher.numDocs\":25,\n    \"__bytes__\":1,\n    \"shard\":\"shard1\",\n    \"collection\":\"testSplitIntegration_collection\"}}"]},
    "belowSize":{},
    "_enqueue_time_":1766714686260257,
    "requestedOps":["Op{action=SPLITSHARD, hints={COLL_SHARD=[{\n  \"first\":\"testSplitIntegration_collection\",\n  \"second\":\"shard1\"}]}}"]}}, context={}, config={
  "trigger":"index_size_trigger2",
  "stage":[
    "STARTED",
    "ABORTED",
    "SUCCEEDED",
    "FAILED"],
  "afterAction":[
    "compute_plan",
    "execute_plan"],
  "class":"org.apache.solr.cloud.autoscaling.IndexSizeTriggerTest$CapturingTriggerListener",
  "beforeAction":[
    "compute_plan",
    "execute_plan"]}, message='null'}, CapturedEvent{timestamp=1766735282698807, stage=STARTED, actionName='null', event={
  "id":"646d5621f42adT4o01l8j13t97yjou8d1k6r4io",
  "source":"index_size_trigger2",
  "eventTime":1766732148458157,
  "eventType":"INDEXSIZE",
  "properties":{
    "__start__":3,
    "aboveSize":{"testSplitIntegration_collection":[
        "{\"core_node10\":{\n    \"leader\":\"true\",\n    \"SEARCHER.searcher.maxDoc\":12,\n    \"SEARCHER.searcher.deletedDocs\":0,\n    \"INDEX.sizeInBytes\":1,\n    \"__docs__\":12,\n    \"violationType\":\"aboveDocs\",\n    \"node_name\":\"127.0.0.1:10000_solr\",\n    \"base_url\":\"http://127.0.0.1:10000/solr\",\n    \"state\":\"active\",\n    \"type\":\"NRT\",\n    \"SEARCHER.searcher.numDocs\":12,\n    \"__bytes__\":1,\n    \"core\":\"testSplitIntegration_collection_shard1_1_replica1\",\n    \"shard\":\"shard1_1\",\n    \"collection\":\"testSplitIntegration_collection\"}}",
        "{\"core_node3\":{\n    \"core\":\"testSplitIntegration_collection_shard2_replica_n3\",\n    \"leader\":\"true\",\n    \"SEARCHER.searcher.maxDoc\":25,\n    \"SEARCHER.searcher.deletedDocs\":0,\n    \"INDEX.sizeInBytes\":1,\n    \"__docs__\":25,\n    \"violationType\":\"aboveDocs\",\n    \"node_name\":\"127.0.0.1:10000_solr\",\n    \"state\":\"active\",\n    \"type\":\"NRT\",\n    \"SEARCHER.searcher.numDocs\":25,\n    \"__bytes__\":1,\n    \"shard\":\"shard2\",\n    \"collection\":\"testSplitIntegration_collection\"}}",
        "{\"core_node7\":{\n    \"leader\":\"true\",\n    \"SEARCHER.searcher.maxDoc\":13,\n    \"SEARCHER.searcher.deletedDocs\":0,\n    \"INDEX.sizeInBytes\":1,\n    \"__docs__\":13,\n    \"violationType\":\"aboveDocs\",\n    \"node_name\":\"127.0.0.1:10001_solr\",\n    \"base_url\":\"http://127.0.0.1:10001/solr\",\n    \"state\":\"active\",\n    \"type\":\"NRT\",\n    \"SEARCHER.searcher.numDocs\":13,\n    \"__bytes__\":1,\n    \"core\":\"testSplitIntegration_collection_shard1_0_replica0\",\n    \"shard\":\"shard1_0\",\n    \"collection\":\"testSplitIntegration_collection\"}}"]},
    "belowSize":{},
    "_enqueue_time_":1766735264099007,
    "requestedOps":[
      "Op{action=SPLITSHARD, hints={COLL_SHARD=[{\n  \"first\":\"testSplitIntegration_collection\",\n  \"second\":\"shard1_1\"}]}}",
      "Op{action=SPLITSHARD, hints={COLL_SHARD=[{\n  \"first\":\"testSplitIntegration_collection\",\n  \"second\":\"shard2\"}]}}",
      "Op{action=SPLITSHARD, hints={COLL_SHARD=[{\n  \"first\":\"testSplitIntegration_collection\",\n  \"second\":\"shard1_0\"}]}}"]}}, context={}, config={
  "trigger":"index_size_trigger2",
  "stage":[
    "STARTED",
    "ABORTED",
    "SUCCEEDED",
    "FAILED"],
  "afterAction":[
    "compute_plan",
    "execute_plan"],
  "class":"org.apache.solr.cloud.autoscaling.IndexSizeTriggerTest$CapturingTriggerListener",
  "beforeAction":[
    "compute_plan",
    "execute_plan"]}, message='null'}, CapturedEvent{timestamp=1766736038946107, stage=BEFORE_ACTION, actionName='compute_plan', event={
  "id":"646d5621f42adT4o01l8j13t97yjou8d1k6r4io",
  "source":"index_size_trigger2",
  "eventTime":1766732148458157,
  "eventType":"INDEXSIZE",
  "properties":{
    "__start__":3,
    "aboveSize":{"testSplitIntegration_collection":[
        "{\"core_node10\":{\n    \"leader\":\"true\",\n    \"SEARCHER.searcher.maxDoc\":12,\n    \"SEARCHER.searcher.deletedDocs\":0,\n    \"INDEX.sizeInBytes\":1,\n    \"__docs__\":12,\n    \"violationType\":\"aboveDocs\",\n    \"node_name\":\"127.0.0.1:10000_solr\",\n    \"base_url\":\"http://127.0.0.1:10000/solr\",\n    \"state\":\"active\",\n    \"type\":\"NRT\",\n    \"SEARCHER.searcher.numDocs\":12,\n    \"__bytes__\":1,\n    \"core\":\"testSplitIntegration_collection_shard1_1_replica1\",\n    \"shard\":\"shard1_1\",\n    \"collection\":\"testSplitIntegration_collection\"}}",
        "{\"core_node3\":{\n    \"core\":\"testSplitIntegration_collection_shard2_replica_n3\",\n    \"leader\":\"true\",\n    \"SEARCHER.searcher.maxDoc\":25,\n    \"SEARCHER.searcher.deletedDocs\":0,\n    \"INDEX.sizeInBytes\":1,\n    \"__docs__\":25,\n    \"violationType\":\"aboveDocs\",\n    \"node_name\":\"127.0.0.1:10000_solr\",\n    \"state\":\"active\",\n    \"type\":\"NRT\",\n    \"SEARCHER.searcher.numDocs\":25,\n    \"__bytes__\":1,\n    \"shard\":\"shard2\",\n    \"collection\":\"testSplitIntegration_collection\"}}",
        "{\"core_node7\":{\n    \"leader\":\"true\",\n    \"SEARCHER.searcher.maxDoc\":13,\n    \"SEARCHER.searcher.deletedDocs\":0,\n    \"INDEX.sizeInBytes\":1,\n    \"__docs__\":13,\n    \"violationType\":\"aboveDocs\",\n    \"node_name\":\"127.0.0.1:10001_solr\",\n    \"base_url\":\"http://127.0.0.1:10001/solr\",\n    \"state\":\"active\",\n    \"type\":\"NRT\",\n    \"SEARCHER.searcher.numDocs\":13,\n    \"__bytes__\":1,\n    \"core\":\"testSplitIntegration_collection_shard1_0_replica0\",\n    \"shard\":\"shard1_0\",\n    \"collection\":\"testSplitIntegration_collection\"}}"]},
    "belowSize":{},
    "_enqueue_time_":1766735264099007,
    "requestedOps":[
      "Op{action=SPLITSHARD, hints={COLL_SHARD=[{\n  \"first\":\"testSplitIntegration_collection\",\n  \"second\":\"shard1_1\"}]}}",
      "Op{action=SPLITSHARD, hints={COLL_SHARD=[{\n  \"first\":\"testSplitIntegration_collection\",\n  \"second\":\"shard2\"}]}}",
      "Op{action=SPLITSHARD, hints={COLL_SHARD=[{\n  \"first\":\"testSplitIntegration_collection\",\n  \"second\":\"shard1_0\"}]}}"]}}, context={properties.BEFORE_ACTION=[compute_plan], source=index_size_trigger2}, config={
  "trigger":"index_size_trigger2",
  "stage":[
    "STARTED",
    "ABORTED",
    "SUCCEEDED",
    "FAILED"],
  "afterAction":[
    "compute_plan",
    "execute_plan"],
  "class":"org.apache.solr.cloud.autoscaling.IndexSizeTriggerTest$CapturingTriggerListener",
  "beforeAction":[
    "compute_plan",
    "execute_plan"]}, message='null'}, CapturedEvent{timestamp=1766736135620707, stage=AFTER_ACTION, actionName='compute_plan', event={
  "id":"646d5621f42adT4o01l8j13t97yjou8d1k6r4io",
  "source":"index_size_trigger2",
  "eventTime":1766732148458157,
  "eventType":"INDEXSIZE",
  "properties":{
    "__start__":3,
    "aboveSize":{"testSplitIntegration_collection":[
        "{\"core_node10\":{\n    \"leader\":\"true\",\n    \"SEARCHER.searcher.maxDoc\":12,\n    \"SEARCHER.searcher.deletedDocs\":0,\n    \"INDEX.sizeInBytes\":1,\n    \"__docs__\":12,\n    \"violationType\":\"aboveDocs\",\n    \"node_name\":\"127.0.0.1:10000_solr\",\n    \"base_url\":\"http://127.0.0.1:10000/solr\",\n    \"state\":\"active\",\n    \"type\":\"NRT\",\n    \"SEARCHER.searcher.numDocs\":12,\n    \"__bytes__\":1,\n    \"core\":\"testSplitIntegration_collection_shard1_1_replica1\",\n    \"shard\":\"shard1_1\",\n    \"collection\":\"testSplitIntegration_collection\"}}",
        "{\"core_node3\":{\n    \"core\":\"testSplitIntegration_collection_shard2_replica_n3\",\n    \"leader\":\"true\",\n    \"SEARCHER.searcher.maxDoc\":25,\n    \"SEARCHER.searcher.deletedDocs\":0,\n    \"INDEX.sizeInBytes\":1,\n    \"__docs__\":25,\n    \"violationType\":\"aboveDocs\",\n    \"node_name\":\"127.0.0.1:10000_solr\",\n    \"state\":\"active\",\n    \"type\":\"NRT\",\n    \"SEARCHER.searcher.numDocs\":25,\n    \"__bytes__\":1,\n    \"shard\":\"shard2\",\n    \"collection\":\"testSplitIntegration_collection\"}}",
        "{\"core_node7\":{\n    \"leader\":\"true\",\n    \"SEARCHER.searcher.maxDoc\":13,\n    \"SEARCHER.searcher.deletedDocs\":0,\n    \"INDEX.sizeInBytes\":1,\n    \"__docs__\":13,\n    \"violationType\":\"aboveDocs\",\n    \"node_name\":\"127.0.0.1:10001_solr\",\n    \"base_url\":\"http://127.0.0.1:10001/solr\",\n    \"state\":\"active\",\n    \"type\":\"NRT\",\n    \"SEARCHER.searcher.numDocs\":13,\n    \"__bytes__\":1,\n    \"core\":\"testSplitIntegration_collection_shard1_0_replica0\",\n    \"shard\":\"shard1_0\",\n    \"collection\":\"testSplitIntegration_collection\"}}"]},
    "belowSize":{},
    "_enqueue_time_":1766735264099007,
    "requestedOps":[
      "Op{action=SPLITSHARD, hints={COLL_SHARD=[{\n  \"first\":\"testSplitIntegration_collection\",\n  \"second\":\"shard1_1\"}]}}",
      "Op{action=SPLITSHARD, hints={COLL_SHARD=[{\n  \"first\":\"testSplitIntegration_collection\",\n  \"second\":\"shard2\"}]}}",
      "Op{action=SPLITSHARD, hints={COLL_SHARD=[{\n  \"first\":\"testSplitIntegration_collection\",\n  \"second\":\"shard1_0\"}]}}"]}}, context={properties.operations=[{class=org.apache.solr.client.solrj.request.CollectionAdminRequest$SplitShard, method=GET, params.action=SPLITSHARD, params.collection=testSplitIntegration_collection, params.shard=shard1_1}, {class=org.apache.solr.client.solrj.request.CollectionAdminRequest$SplitShard, method=GET, params.action=SPLITSHARD, params.collection=testSplitIntegration_collection, params.shard=shard2}, {class=org.apache.solr.client.solrj.request.CollectionAdminRequest$SplitShard, method=GET, params.action=SPLITSHARD, params.collection=testSplitIntegration_collection, params.shard=shard1_0}], properties.BEFORE_ACTION=[compute_plan], source=index_size_trigger2, properties.AFTER_ACTION=[compute_plan]}, config={
  "trigger":"index_size_trigger2",
  "stage":[
    "STARTED",
    "ABORTED",
    "SUCCEEDED",
    "FAILED"],
  "afterAction":[
    "compute_plan",
    "execute_plan"],
  "class":"org.apache.solr.cloud.autoscaling.IndexSizeTriggerTest$CapturingTriggerListener",
  "beforeAction":[
    "compute_plan",
    "execute_plan"]}, message='null'}, CapturedEvent{timestamp=1766736163050807, stage=BEFORE_ACTION, actionName='execute_plan', event={
  "id":"646d5621f42adT4o01l8j13t97yjou8d1k6r4io",
  "source":"index_size_trigger2",
  "eventTime":1766732148458157,
  "eventType":"INDEXSIZE",
  "properties":{
    "__start__":3,
    "aboveSize":{"testSplitIntegration_collection":[
        "{\"core_node10\":{\n    \"leader\":\"true\",\n    \"SEARCHER.searcher.maxDoc\":12,\n    \"SEARCHER.searcher.deletedDocs\":0,\n    \"INDEX.sizeInBytes\":1,\n    \"__docs__\":12,\n    \"violationType\":\"aboveDocs\",\n    \"node_name\":\"127.0.0.1:10000_solr\",\n    \"base_url\":\"http://127.0.0.1:10000/solr\",\n    \"state\":\"active\",\n    \"type\":\"NRT\",\n    \"SEARCHER.searcher.numDocs\":12,\n    \"__bytes__\":1,\n    \"core\":\"testSplitIntegration_collection_shard1_1_replica1\",\n    \"shard\":\"shard1_1\",\n    \"collection\":\"testSplitIntegration_collection\"}}",
        "{\"core_node3\":{\n    \"core\":\"testSplitIntegration_collection_shard2_replica_n3\",\n    \"leader\":\"true\",\n    \"SEARCHER.searcher.maxDoc\":25,\n    \"SEARCHER.searcher.deletedDocs\":0,\n    \"INDEX.sizeInBytes\":1,\n    \"__docs__\":25,\n    \"violationType\":\"aboveDocs\",\n    \"node_name\":\"127.0.0.1:10000_solr\",\n    \"state\":\"active\",\n    \"type\":\"NRT\",\n    \"SEARCHER.searcher.numDocs\":25,\n    \"__bytes__\":1,\n    \"shard\":\"shard2\",\n    \"collection\":\"testSplitIntegration_collection\"}}",
        "{\"core_node7\":{\n    \"leader\":\"true\",\n    \"SEARCHER.searcher.maxDoc\":13,\n    \"SEARCHER.searcher.deletedDocs\":0,\n    \"INDEX.sizeInBytes\":1,\n    \"__docs__\":13,\n    \"violationType\":\"aboveDocs\",\n    \"node_name\":\"127.0.0.1:10001_solr\",\n    \"base_url\":\"http://127.0.0.1:10001/solr\",\n    \"state\":\"active\",\n    \"type\":\"NRT\",\n    \"SEARCHER.searcher.numDocs\":13,\n    \"__bytes__\":1,\n    \"core\":\"testSplitIntegration_collection_shard1_0_replica0\",\n    \"shard\":\"shard1_0\",\n    \"collection\":\"testSplitIntegration_collection\"}}"]},
    "belowSize":{},
    "_enqueue_time_":1766735264099007,
    "requestedOps":[
      "Op{action=SPLITSHARD, hints={COLL_SHARD=[{\n  \"first\":\"testSplitIntegration_collection\",\n  \"second\":\"shard1_1\"}]}}",
      "Op{action=SPLITSHARD, hints={COLL_SHARD=[{\n  \"first\":\"testSplitIntegration_collection\",\n  \"second\":\"shard2\"}]}}",
      "Op{action=SPLITSHARD, hints={COLL_SHARD=[{\n  \"first\":\"testSplitIntegration_collection\",\n  \"second\":\"shard1_0\"}]}}"]}}, context={properties.operations=[{class=org.apache.solr.client.solrj.request.CollectionAdminRequest$SplitShard, method=GET, params.action=SPLITSHARD, params.collection=testSplitIntegration_collection, params.shard=shard1_1}, {class=org.apache.solr.client.solrj.request.CollectionAdminRequest$SplitShard, method=GET, params.action=SPLITSHARD, params.collection=testSplitIntegration_collection, params.shard=shard2}, {class=org.apache.solr.client.solrj.request.CollectionAdminRequest$SplitShard, method=GET, params.action=SPLITSHARD, params.collection=testSplitIntegration_collection, params.shard=shard1_0}], properties.BEFORE_ACTION=[compute_plan, execute_plan], source=index_size_trigger2, properties.AFTER_ACTION=[compute_plan]}, config={
  "trigger":"index_size_trigger2",
  "stage":[
    "STARTED",
    "ABORTED",
    "SUCCEEDED",
    "FAILED"],
  "afterAction":[
    "compute_plan",
    "execute_plan"],
  "class":"org.apache.solr.cloud.autoscaling.IndexSizeTriggerTest$CapturingTriggerListener",
  "beforeAction":[
    "compute_plan",
    "execute_plan"]}, message='null'}] expected:<6> but was:<10>
        at __randomizedtesting.SeedInfo.seed([4C0C98576AC83F5F:758221174537F6A1]:0)
        at org.junit.Assert.fail(Assert.java:93)
        at org.junit.Assert.failNotEquals(Assert.java:647)
        at org.junit.Assert.assertEquals(Assert.java:128)
        at org.junit.Assert.assertEquals(Assert.java:472)
        at org.apache.solr.cloud.autoscaling.IndexSizeTriggerTest.testSplitIntegration(IndexSizeTriggerTest.java:314)
        at java.base/jdk.internal.reflect.NativeMethodAccessorImpl.invoke0(Native Method)
        at java.base/jdk.internal.reflect.NativeMethodAccessorImpl.invoke(NativeMethodAccessorImpl.java:62)
        at java.base/jdk.internal.reflect.DelegatingMethodAccessorImpl.invoke(DelegatingMethodAccessorImpl.java:43)
        at java.base/java.lang.reflect.Method.invoke(Method.java:564)
        at com.carrotsearch.randomizedtesting.RandomizedRunner.invoke(RandomizedRunner.java:1737)
        at com.carrotsearch.randomizedtesting.RandomizedRunner$8.evaluate(RandomizedRunner.java:934)
        at com.carrotsearch.randomizedtesting.RandomizedRunner$9.evaluate(RandomizedRunner.java:970)
        at com.carrotsearch.randomizedtesting.RandomizedRunner$10.evaluate(RandomizedRunner.java:984)
        at com.carrotsearch.randomizedtesting.rules.SystemPropertiesRestoreRule$1.evaluate(SystemPropertiesRestoreRule.java:57)
        at org.apache.lucene.util.TestRuleSetupTeardownChained$1.evaluate(TestRuleSetupTeardownChained.java:49)
        at org.apache.lucene.util.AbstractBeforeAfterRule$1.evaluate(AbstractBeforeAfterRule.java:45)
        at org.apache.lucene.util.TestRuleThreadAndTestName$1.evaluate(TestRuleThreadAndTestName.java:48)
        at org.apache.lucene.util.TestRuleIgnoreAfterMaxFailures$1.evaluate(TestRuleIgnoreAfterMaxFailures.java:64)
        at org.apache.lucene.util.TestRuleMarkFailure$1.evaluate(TestRuleMarkFailure.java:47)
        at com.carrotsearch.randomizedtesting.rules.StatementAdapter.evaluate(StatementAdapter.java:36)
        at com.carrotsearch.randomizedtesting.ThreadLeakControl$StatementRunner.run(ThreadLeakControl.java:368)
        at com.carrotsearch.randomizedtesting.ThreadLeakControl.forkTimeoutingTask(ThreadLeakControl.java:817)
        at com.carrotsearch.randomizedtesting.ThreadLeakControl$3.evaluate(ThreadLeakControl.java:468)
        at com.carrotsearch.randomizedtesting.RandomizedRunner.runSingleTest(RandomizedRunner.java:943)
        at com.carrotsearch.randomizedtesting.RandomizedRunner$5.evaluate(RandomizedRunner.java:829)
        at com.carrotsearch.randomizedtesting.RandomizedRunner$6.evaluate(RandomizedRunner.java:879)
        at com.carrotsearch.randomizedtesting.RandomizedRunner$7.evaluate(RandomizedRunner.java:890)
        at com.carrotsearch.randomizedtesting.rules.StatementAdapter.evaluate(StatementAdapter.java:36)
        at com.carrotsearch.randomizedtesting.rules.SystemPropertiesRestoreRule$1.evaluate(SystemPropertiesRestoreRule.java:57)
        at org.apache.lucene.util.AbstractBeforeAfterRule$1.evaluate(AbstractBeforeAfterRule.java:45)
        at com.carrotsearch.randomizedtesting.rules.StatementAdapter.evaluate(StatementAdapter.java:36)
        at org.apache.lucene.util.TestRuleStoreClassName$1.evaluate(TestRuleStoreClassName.java:41)
        at com.carrotsearch.randomizedtesting.rules.NoShadowingOrOverridesOnMethodsRule$1.evaluate(NoShadowingOrOverridesOnMethodsRule.java:40)
        at com.carrotsearch.randomizedtesting.rules.NoShadowingOrOverridesOnMethodsRule$1.evaluate(NoShadowingOrOverridesOnMethodsRule.java:40)
        at com.carrotsearch.randomizedtesting.rules.StatementAdapter.evaluate(StatementAdapter.java:36)
        at com.carrotsearch.randomizedtesting.rules.StatementAdapter.evaluate(StatementAdapter.java:36)
        at org.apache.lucene.util.TestRuleAssertionsRequired$1.evaluate(TestRuleAssertionsRequired.java:53)
        at org.apache.lucene.util.TestRuleMarkFailure$1.evaluate(TestRuleMarkFailure.java:47)
        at org.apache.lucene.util.TestRuleIgnoreAfterMaxFailures$1.evaluate(TestRuleIgnoreAfterMaxFailures.java:64)
        at org.apache.lucene.util.TestRuleIgnoreTestSuites$1.evaluate(TestRuleIgnoreTestSuites.java:54)
        at com.carrotsearch.randomizedtesting.rules.StatementAdapter.evaluate(StatementAdapter.java:36)
        at com.carrotsearch.randomizedtesting.ThreadLeakControl$StatementRunner.run(ThreadLeakControl.java:368)
        at java.base/java.lang.Thread.run(Thread.java:844)




Build Log:
[...truncated 1873 lines...]
   [junit4] JVM J0: stderr was not empty, see: /home/jenkins/workspace/Lucene-Solr-master-Linux/lucene/build/core/test/temp/junit4-J0-20180516_193125_09111091391812001689834.syserr
   [junit4] >>> JVM J0 emitted unexpected output (verbatim) ----
   [junit4] Java HotSpot(TM) 64-Bit Server VM warning: Option UseConcMarkSweepGC was deprecated in version 9.0 and will likely be removed in a future release.
   [junit4] <<< JVM J0: EOF ----

[...truncated 3 lines...]
   [junit4] JVM J1: stderr was not empty, see: /home/jenkins/workspace/Lucene-Solr-master-Linux/lucene/build/core/test/temp/junit4-J1-20180516_193125_0903079426810047703944.syserr
   [junit4] >>> JVM J1 emitted unexpected output (verbatim) ----
   [junit4] Java HotSpot(TM) 64-Bit Server VM warning: Option UseConcMarkSweepGC was deprecated in version 9.0 and will likely be removed in a future release.
   [junit4] <<< JVM J1: EOF ----

[...truncated 3 lines...]
   [junit4] JVM J2: stderr was not empty, see: /home/jenkins/workspace/Lucene-Solr-master-Linux/lucene/build/core/test/temp/junit4-J2-20180516_193125_09112915660750591661385.syserr
   [junit4] >>> JVM J2 emitted unexpected output (verbatim) ----
   [junit4] Java HotSpot(TM) 64-Bit Server VM warning: Option UseConcMarkSweepGC was deprecated in version 9.0 and will likely be removed in a future release.
   [junit4] <<< JVM J2: EOF ----

[...truncated 283 lines...]
   [junit4] JVM J1: stderr was not empty, see: /home/jenkins/workspace/Lucene-Solr-master-Linux/lucene/build/test-framework/test/temp/junit4-J1-20180516_194039_33116849533275903983620.syserr
   [junit4] >>> JVM J1 emitted unexpected output (verbatim) ----
   [junit4] Java HotSpot(TM) 64-Bit Server VM warning: Option UseConcMarkSweepGC was deprecated in version 9.0 and will likely be removed in a future release.
   [junit4] <<< JVM J1: EOF ----

[...truncated 6 lines...]
   [junit4] JVM J2: stderr was not empty, see: /home/jenkins/workspace/Lucene-Solr-master-Linux/lucene/build/test-framework/test/temp/junit4-J2-20180516_194039_3312507789834863994876.syserr
   [junit4] >>> JVM J2 emitted unexpected output (verbatim) ----
   [junit4] Java HotSpot(TM) 64-Bit Server VM warning: Option UseConcMarkSweepGC was deprecated in version 9.0 and will likely be removed in a future release.
   [junit4] <<< JVM J2: EOF ----

[...truncated 12 lines...]
   [junit4] JVM J0: stderr was not empty, see: /home/jenkins/workspace/Lucene-Solr-master-Linux/lucene/build/test-framework/test/temp/junit4-J0-20180516_194039_33110531893617820984124.syserr
   [junit4] >>> JVM J0 emitted unexpected output (verbatim) ----
   [junit4] Java HotSpot(TM) 64-Bit Server VM warning: Option UseConcMarkSweepGC was deprecated in version 9.0 and will likely be removed in a future release.
   [junit4] <<< JVM J0: EOF ----

[...truncated 1075 lines...]
   [junit4] JVM J1: stderr was not empty, see: /home/jenkins/workspace/Lucene-Solr-master-Linux/lucene/build/analysis/common/test/temp/junit4-J1-20180516_194210_85216401981910807978106.syserr
   [junit4] >>> JVM J1 emitted unexpected output (verbatim) ----
   [junit4] Java HotSpot(TM) 64-Bit Server VM warning: Option UseConcMarkSweepGC was deprecated in version 9.0 and will likely be removed in a future release.
   [junit4] <<< JVM J1: EOF ----

[...truncated 3 lines...]
   [junit4] JVM J2: stderr was not empty, see: /home/jenkins/workspace/Lucene-Solr-master-Linux/lucene/build/analysis/common/test/temp/junit4-J2-20180516_194210_8579948910909784672723.syserr
   [junit4] >>> JVM J2 emitted unexpected output (verbatim) ----
   [junit4] Java HotSpot(TM) 64-Bit Server VM warning: Option UseConcMarkSweepGC was deprecated in version 9.0 and will likely be removed in a future release.
   [junit4] <<< JVM J2: EOF ----

[...truncated 3 lines...]
   [junit4] JVM J0: stderr was not empty, see: /home/jenkins/workspace/Lucene-Solr-master-Linux/lucene/build/analysis/common/test/temp/junit4-J0-20180516_194210_85213432858430748896272.syserr
   [junit4] >>> JVM J0 emitted unexpected output (verbatim) ----
   [junit4] Java HotSpot(TM) 64-Bit Server VM warning: Option UseConcMarkSweepGC was deprecated in version 9.0 and will likely be removed in a future release.
   [junit4] <<< JVM J0: EOF ----

[...truncated 261 lines...]
   [junit4] JVM J2: stderr was not empty, see: /home/jenkins/workspace/Lucene-Solr-master-Linux/lucene/build/analysis/icu/test/temp/junit4-J2-20180516_194402_38316488948202932556920.syserr
   [junit4] >>> JVM J2 emitted unexpected output (verbatim) ----
   [junit4] Java HotSpot(TM) 64-Bit Server VM warning: Option UseConcMarkSweepGC was deprecated in version 9.0 and will likely be removed in a future release.
   [junit4] <<< JVM J2: EOF ----

   [junit4] JVM J0: stderr was not empty, see: /home/jenkins/workspace/Lucene-Solr-master-Linux/lucene/build/analysis/icu/test/temp/junit4-J0-20180516_194402_3836716868030802925634.syserr
   [junit4] >>> JVM J0 emitted unexpected output (verbatim) ----
   [junit4] Java HotSpot(TM) 64-Bit Server VM warning: Option UseConcMarkSweepGC was deprecated in version 9.0 and will likely be removed in a future release.
   [junit4] <<< JVM J0: EOF ----

   [junit4] JVM J1: stderr was not empty, see: /home/jenkins/workspace/Lucene-Solr-master-Linux/lucene/build/analysis/icu/test/temp/junit4-J1-20180516_194402_38312106472716332139645.syserr
   [junit4] >>> JVM J1 emitted unexpected output (verbatim) ----
   [junit4] Java HotSpot(TM) 64-Bit Server VM warning: Option UseConcMarkSweepGC was deprecated in version 9.0 and will likely be removed in a future release.
   [junit4] <<< JVM J1: EOF ----

[...truncated 248 lines...]
   [junit4] JVM J2: stderr was not empty, see: /home/jenkins/workspace/Lucene-Solr-master-Linux/lucene/build/analysis/kuromoji/test/temp/junit4-J2-20180516_194415_11610432048129902052695.syserr
   [junit4] >>> JVM J2 emitted unexpected output (verbatim) ----
   [junit4] Java HotSpot(TM) 64-Bit Server VM warning: Option UseConcMarkSweepGC was deprecated in version 9.0 and will likely be removed in a future release.
   [junit4] <<< JVM J2: EOF ----

[...truncated 8 lines...]
   [junit4] JVM J0: stderr was not empty, see: /home/jenkins/workspace/Lucene-Solr-master-Linux/lucene/build/analysis/kuromoji/test/temp/junit4-J0-20180516_194415_1163859026286552018668.syserr
   [junit4] >>> JVM J0 emitted unexpected output (verbatim) ----
   [junit4] Java HotSpot(TM) 64-Bit Server VM warning: Option UseConcMarkSweepGC was deprecated in version 9.0 and will likely be removed in a future release.
   [junit4] <<< JVM J0: EOF ----

[...truncated 3 lines...]
   [junit4] JVM J1: stderr was not empty, see: /home/jenkins/workspace/Lucene-Solr-master-Linux/lucene/build/analysis/kuromoji/test/temp/junit4-J1-20180516_194415_11610089242633123531339.syserr
   [junit4] >>> JVM J1 emitted unexpected output (verbatim) ----
   [junit4] Java HotSpot(TM) 64-Bit Server VM warning: Option UseConcMarkSweepGC was deprecated in version 9.0 and will likely be removed in a future release.
   [junit4] <<< JVM J1: EOF ----

[...truncated 162 lines...]
   [junit4] JVM J1: stderr was not empty, see: /home/jenkins/workspace/Lucene-Solr-master-Linux/lucene/build/analysis/morfologik/test/temp/junit4-J1-20180516_194447_2328627939261829992896.syserr
   [junit4] >>> JVM J1 emitted unexpected output (verbatim) ----
   [junit4] Java HotSpot(TM) 64-Bit Server VM warning: Option UseConcMarkSweepGC was deprecated in version 9.0 and will likely be removed in a future release.
   [junit4] <<< JVM J1: EOF ----

[...truncated 3 lines...]
   [junit4] JVM J2: stderr was not empty, see: /home/jenkins/workspace/Lucene-Solr-master-Linux/lucene/build/analysis/morfologik/test/temp/junit4-J2-20180516_194447_2325927808298057835323.syserr
   [junit4] >>> JVM J2 emitted unexpected output (verbatim) ----
   [junit4] Java HotSpot(TM) 64-Bit Server VM warning: Option UseConcMarkSweepGC was deprecated in version 9.0 and will likely be removed in a future release.
   [junit4] <<< JVM J2: EOF ----

[...truncated 3 lines...]
   [junit4] JVM J0: stderr was not empty, see: /home/jenkins/workspace/Lucene-Solr-master-Linux/lucene/build/analysis/morfologik/test/temp/junit4-J0-20180516_194447_2325717626393121814566.syserr
   [junit4] >>> JVM J0 emitted unexpected output (verbatim) ----
   [junit4] Java HotSpot(TM) 64-Bit Server VM warning: Option UseConcMarkSweepGC was deprecated in version 9.0 and will likely be removed in a future release.
   [junit4] <<< JVM J0: EOF ----

[...truncated 204 lines...]
   [junit4] JVM J0: stderr was not empty, see: /home/jenkins/workspace/Lucene-Solr-master-Linux/lucene/build/analysis/nori/test/temp/junit4-J0-20180516_194452_40717014985796116407671.syserr
   [junit4] >>> JVM J0 emitted unexpected output (verbatim) ----
   [junit4] Java HotSpot(TM) 64-Bit Server VM warning: Option UseConcMarkSweepGC was deprecated in version 9.0 and will likely be removed in a future release.
   [junit4] <<< JVM J0: EOF ----

[...truncated 3 lines...]
   [junit4] JVM J2: stderr was not empty, see: /home/jenkins/workspace/Lucene-Solr-master-Linux/lucene/build/analysis/nori/test/temp/junit4-J2-20180516_194452_4077726662343699734233.syserr
   [junit4] >>> JVM J2 emitted unexpected output (verbatim) ----
   [junit4] Java HotSpot(TM) 64-Bit Server VM warning: Option UseConcMarkSweepGC was deprecated in version 9.0 and will likely be removed in a future release.
   [junit4] <<< JVM J2: EOF ----

[...truncated 6 lines...]
   [junit4] JVM J1: stderr was not empty, see: /home/jenkins/workspace/Lucene-Solr-master-Linux/lucene/build/analysis/nori/test/temp/junit4-J1-20180516_194452_4076662855087701838253.syserr
   [junit4] >>> JVM J1 emitted unexpected output (verbatim) ----
   [junit4] Java HotSpot(TM) 64-Bit Server VM warning: Option UseConcMarkSweepGC was deprecated in version 9.0 and will likely be removed in a future release.
   [junit4] <<< JVM J1: EOF ----

[...truncated 171 lines...]
   [junit4] JVM J1: stderr was not empty, see: /home/jenkins/workspace/Lucene-Solr-master-Linux/lucene/build/analysis/opennlp/test/temp/junit4-J1-20180516_194506_7483652043458171065422.syserr
   [junit4] >>> JVM J1 emitted unexpected output (verbatim) ----
   [junit4] Java HotSpot(TM) 64-Bit Server VM warning: Option UseConcMarkSweepGC was deprecated in version 9.0 and will likely be removed in a future release.
   [junit4] <<< JVM J1: EOF ----

[...truncated 3 lines...]
   [junit4] JVM J0: stderr was not empty, see: /home/jenkins/workspace/Lucene-Solr-master-Linux/lucene/build/analysis/opennlp/test/temp/junit4-J0-20180516_194506_7487563636329838403683.syserr
   [junit4] >>> JVM J0 emitted unexpected output (verbatim) ----
   [junit4] Java HotSpot(TM) 64-Bit Server VM warning: Option UseConcMarkSweepGC was deprecated in version 9.0 and will likely be removed in a future release.
   [junit4] <<< JVM J0: EOF ----

   [junit4] JVM J2: stderr was not empty, see: /home/jenkins/workspace/Lucene-Solr-master-Linux/lucene/build/analysis/opennlp/test/temp/junit4-J2-20180516_194506_75315570069988170143980.syserr
   [junit4] >>> JVM J2 emitted unexpected output (verbatim) ----
   [junit4] Java HotSpot(TM) 64-Bit Server VM warning: Option UseConcMarkSweepGC was deprecated in version 9.0 and will likely be removed in a future release.
   [junit4] <<< JVM J2: EOF ----

[...truncated 179 lines...]
   [junit4] JVM J2: stderr was not empty, see: /home/jenkins/workspace/Lucene-Solr-master-Linux/lucene/build/analysis/phonetic/test/temp/junit4-J2-20180516_194509_6203335704963873840769.syserr
   [junit4] >>> JVM J2 emitted unexpected output (verbatim) ----
   [junit4] Java HotSpot(TM) 64-Bit Server VM warning: Option UseConcMarkSweepGC was deprecated in version 9.0 and will likely be removed in a future release.
   [junit4] <<< JVM J2: EOF ----

   [junit4] JVM J1: stderr was not empty, see: /home/jenkins/workspace/Lucene-Solr-master-Linux/lucene/build/analysis/phonetic/test/temp/junit4-J1-20180516_194509_62010495614332281084172.syserr
   [junit4] >>> JVM J1 emitted unexpected output (verbatim) ----
   [junit4] Java HotSpot(TM) 64-Bit Server VM warning: Option UseConcMarkSweepGC was deprecated in version 9.0 and will likely be removed in a future release.
   [junit4] <<< JVM J1: EOF ----

[...truncated 3 lines...]
   [junit4] JVM J0: stderr was not empty, see: /home/jenkins/workspace/Lucene-Solr-master-Linux/lucene/build/analysis/phonetic/test/temp/junit4-J0-20180516_194509_62012545565808616408235.syserr
   [junit4] >>> JVM J0 emitted unexpected output (verbatim) ----
   [junit4] Java HotSpot(TM) 64-Bit Server VM warning: Option UseConcMarkSweepGC was deprecated in version 9.0 and will likely be removed in a future release.
   [junit4] <<< JVM J0: EOF ----

[...truncated 161 lines...]
   [junit4] JVM J1: stderr was not empty, see: /home/jenkins/workspace/Lucene-Solr-master-Linux/lucene/build/analysis/smartcn/test/temp/junit4-J1-20180516_194520_73711727574208885232539.syserr
   [junit4] >>> JVM J1 emitted unexpected output (verbatim) ----
   [junit4] Java HotSpot(TM) 64-Bit Server VM warning: Option UseConcMarkSweepGC was deprecated in version 9.0 and will likely be removed in a future release.
   [junit4] <<< JVM J1: EOF ----

[...truncated 3 lines...]
   [junit4] JVM J0: stderr was not empty, see: /home/jenkins/workspace/Lucene-Solr-master-Linux/lucene/build/analysis/smartcn/test/temp/junit4-J0-20180516_194520_7375343797709022059282.syserr
   [junit4] >>> JVM J0 emitted unexpected output (verbatim) ----
   [junit4] Java HotSpot(TM) 64-Bit Server VM warning: Option UseConcMarkSweepGC was deprecated in version 9.0 and will likely be removed in a future release.
   [junit4] <<< JVM J0: EOF ----

[...truncated 162 lines...]
   [junit4] JVM J1: stderr was not empty, see: /home/jenkins/workspace/Lucene-Solr-master-Linux/lucene/build/analysis/stempel/test/temp/junit4-J1-20180516_194528_58618231505738063175656.syserr
   [junit4] >>> JVM J1 emitted unexpected output (verbatim) ----
   [junit4] Java HotSpot(TM) 64-Bit Server VM warning: Option UseConcMarkSweepGC was deprecated in version 9.0 and will likely be removed in a future release.
   [junit4] <<< JVM J1: EOF ----

[...truncated 3 lines...]
   [junit4] JVM J2: stderr was not empty, see: /home/jenkins/workspace/Lucene-Solr-master-Linux/lucene/build/analysis/stempel/test/temp/junit4-J2-20180516_194528_58610170863707305352750.syserr
   [junit4] >>> JVM J2 emitted unexpected output (verbatim) ----
   [junit4] Java HotSpot(TM) 64-Bit Server VM warning: Option UseConcMarkSweepGC was deprecated in version 9.0 and will likely be removed in a future release.
   [junit4] <<< JVM J2: EOF ----

[...truncated 3 lines...]
   [junit4] JVM J0: stderr was not empty, see: /home/jenkins/workspace/Lucene-Solr-master-Linux/lucene/build/analysis/stempel/test/temp/junit4-J0-20180516_194528_58610019508604648739590.syserr
   [junit4] >>> JVM J0 emitted unexpected output (verbatim) ----
   [junit4] Java HotSpot(TM) 64-Bit Server VM warning: Option UseConcMarkSweepGC was deprecated in version 9.0 and will likely be removed in a future release.
   [junit4] <<< JVM J0: EOF ----

[...truncated 177 lines...]
   [junit4] JVM J0: stderr was not empty, see: /home/jenkins/workspace/Lucene-Solr-master-Linux/lucene/build/analysis/uima/test/temp/junit4-J0-20180516_194531_72111473775111309125143.syserr
   [junit4] >>> JVM J0 emitted unexpected output (verbatim) ----
   [junit4] Java HotSpot(TM) 64-Bit Server VM warning: Option UseConcMarkSweepGC was deprecated in version 9.0 and will likely be removed in a future release.
   [junit4] <<< JVM J0: EOF ----

[...truncated 158 lines...]
   [junit4] JVM J1: stderr was not empty, see: /home/jenkins/workspace/Lucene-Solr-master-Linux/lucene/build/backward-codecs/test/temp/junit4-J1-20180516_194540_08814206444399914723059.syserr
   [junit4] >>> JVM J1 emitted unexpected output (verbatim) ----
   [junit4] Java HotSpot(TM) 64-Bit Server VM warning: Option UseConcMarkSweepGC was deprecated in version 9.0 and will likely be removed in a future release.
   [junit4] <<< JVM J1: EOF ----

   [junit4] JVM J0: stderr was not empty, see: /home/jenkins/workspace/Lucene-Solr-master-Linux/lucene/build/backward-codecs/test/temp/junit4-J0-20180516_194540_0872142097341951667656.syserr
   [junit4] >>> JVM J0 emitted unexpected output (verbatim) ----
   [junit4] Java HotSpot(TM) 64-Bit Server VM warning: Option UseConcMarkSweepGC was deprecated in version 9.0 and will likely be removed in a future release.
   [junit4] <<< JVM J0: EOF ----

[...truncated 19 lines...]
   [junit4] JVM J2: stderr was not empty, see: /home/jenkins/workspace/Lucene-Solr-master-Linux/lucene/build/backward-codecs/test/temp/junit4-J2-20180516_194540_0906728452945789174753.syserr
   [junit4] >>> JVM J2 emitted unexpected output (verbatim) ----
   [junit4] Java HotSpot(TM) 64-Bit Server VM warning: Option UseConcMarkSweepGC was deprecated in version 9.0 and will likely be removed in a future release.
   [junit4] <<< JVM J2: EOF ----

[...truncated 1391 lines...]
   [junit4] JVM J2: stderr was not empty, see: /home/jenkins/workspace/Lucene-Solr-master-Linux/lucene/build/benchmark/test/temp/junit4-J2-20180516_194605_2421775744271861607052.syserr
   [junit4] >>> JVM J2 emitted unexpected output (verbatim) ----
   [junit4] Java HotSpot(TM) 64-Bit Server VM warning: Option UseConcMarkSweepGC was deprecated in version 9.0 and will likely be removed in a future release.
   [junit4] <<< JVM J2: EOF ----

   [junit4] JVM J1: stderr was not empty, see: /home/jenkins/workspace/Lucene-Solr-master-Linux/lucene/build/benchmark/test/temp/junit4-J1-20180516_194605_2394682160501119351122.syserr
   [junit4] >>> JVM J1 emitted unexpected output (verbatim) ----
   [junit4] Java HotSpot(TM) 64-Bit Server VM warning: Option UseConcMarkSweepGC was deprecated in version 9.0 and will likely be removed in a future release.
   [junit4] <<< JVM J1: EOF ----

[...truncated 3 lines...]
   [junit4] JVM J0: stderr was not empty, see: /home/jenkins/workspace/Lucene-Solr-master-Linux/lucene/build/benchmark/test/temp/junit4-J0-20180516_194605_2398470518363311420145.syserr
   [junit4] >>> JVM J0 emitted unexpected output (verbatim) ----
   [junit4] Java HotSpot(TM) 64-Bit Server VM warning: Option UseConcMarkSweepGC was deprecated in version 9.0 and will likely be removed in a future release.
   [junit4] <<< JVM J0: EOF ----

[...truncated 250 lines...]
   [junit4] JVM J2: stderr was not empty, see: /home/jenkins/workspace/Lucene-Solr-master-Linux/lucene/build/classification/test/temp/junit4-J2-20180516_194615_67316789086883269069528.syserr
   [junit4] >>> JVM J2 emitted unexpected output (verbatim) ----
   [junit4] Java HotSpot(TM) 64-Bit Server VM warning: Option UseConcMarkSweepGC was deprecated in version 9.0 and will likely be removed in a future release.
   [junit4] <<< JVM J2: EOF ----

[...truncated 6 lines...]
   [junit4] JVM J1: stderr was not empty, see: /home/jenkins/workspace/Lucene-Solr-master-Linux/lucene/build/classification/test/temp/junit4-J1-20180516_194615_6731078833364629533132.syserr
   [junit4] >>> JVM J1 emitted unexpected output (verbatim) ----
   [junit4] Java HotSpot(TM) 64-Bit Server VM warning: Option UseConcMarkSweepGC was deprecated in version 9.0 and will likely be removed in a future release.
   [junit4] <<< JVM J1: EOF ----

   [junit4] JVM J0: stderr was not empty, see: /home/jenkins/workspace/Lucene-Solr-master-Linux/lucene/build/classification/test/temp/junit4-J0-20180516_194615_66815226189058722105376.syserr
   [junit4] >>> JVM J0 emitted unexpected output (verbatim) ----
   [junit4] Java HotSpot(TM) 64-Bit Server VM warning: Option UseConcMarkSweepGC was deprecated in version 9.0 and will likely be removed in a future release.
   [junit4] <<< JVM J0: EOF ----

[...truncated 250 lines...]
   [junit4] JVM J1: stderr was not empty, see: /home/jenkins/workspace/Lucene-Solr-master-Linux/lucene/build/codecs/test/temp/junit4-J1-20180516_194628_1211484674395886845298.syserr
   [junit4] >>> JVM J1 emitted unexpected output (verbatim) ----
   [junit4] Java HotSpot(TM) 64-Bit Server VM warning: Option UseConcMarkSweepGC was deprecated in version 9.0 and will likely be removed in a future release.
   [junit4] <<< JVM J1: EOF ----

[...truncated 9 lines...]
   [junit4] JVM J2: stderr was not empty, see: /home/jenkins/workspace/Lucene-Solr-master-Linux/lucene/build/codecs/test/temp/junit4-J2-20180516_194628_1213720289603451008790.syserr
   [junit4] >>> JVM J2 emitted unexpected output (verbatim) ----
   [junit4] Java HotSpot(TM) 64-Bit Server VM warning: Option UseConcMarkSweepGC was deprecated in version 9.0 and will likely be removed in a future release.
   [junit4] <<< JVM J2: EOF ----

[...truncated 9 lines...]
   [junit4] JVM J0: stderr was not empty, see: /home/jenkins/workspace/Lucene-Solr-master-Linux/lucene/build/codecs/test/temp/junit4-J0-20180516_194628_1216510568027664925682.syserr
   [junit4] >>> JVM J0 emitted unexpected output (verbatim) ----
   [junit4] Java HotSpot(TM) 64-Bit Server VM warning: Option UseConcMarkSweepGC was deprecated in version 9.0 and will likely be removed in a future release.
   [junit4] <<< JVM J0: EOF ----

[...truncated 231 lines...]
   [junit4] JVM J1: stderr was not empty, see: /home/jenkins/workspace/Lucene-Solr-master-Linux/lucene/build/demo/test/temp/junit4-J1-20180516_194918_57013610031850350540356.syserr
   [junit4] >>> JVM J1 emitted unexpected output (verbatim) ----
   [junit4] Java HotSpot(TM) 64-Bit Server VM warning: Option UseConcMarkSweepGC was deprecated in version 9.0 and will likely be removed in a future release.
   [junit4] <<< JVM J1: EOF ----

[...truncated 3 lines...]
   [junit4] JVM J2: stderr was not empty, see: /home/jenkins/workspace/Lucene-Solr-master-Linux/lucene/build/demo/test/temp/junit4-J2-20180516_194918_5701294806314005002654.syserr
   [junit4] >>> JVM J2 emitted unexpected output (verbatim) ----
   [junit4] Java HotSpot(TM) 64-Bit Server VM warning: Option UseConcMarkSweepGC was deprecated in version 9.0 and will likely be removed in a future release.
   [junit4] <<< JVM J2: EOF ----

   [junit4] JVM J0: stderr was not empty, see: /home/jenkins/workspace/Lucene-Solr-master-Linux/lucene/build/demo/test/temp/junit4-J0-20180516_194918_57010154819621754808339.syserr
   [junit4] >>> JVM J0 emitted unexpected output (verbatim) ----
   [junit4] Java HotSpot(TM) 64-Bit Server VM warning: Option UseConcMarkSweepGC was deprecated in version 9.0 and will likely be removed in a future release.
   [junit4] <<< JVM J0: EOF ----

[...truncated 173 lines...]
   [junit4] JVM J2: stderr was not empty, see: /home/jenkins/workspace/Lucene-Solr-master-Linux/lucene/build/expressions/test/temp/junit4-J2-20180516_194921_5393217258196156088106.syserr
   [junit4] >>> JVM J2 emitted unexpected output (verbatim) ----
   [junit4] Java HotSpot(TM) 64-Bit Server VM warning: Option UseConcMarkSweepGC was deprecated in version 9.0 and will likely be removed in a future release.
   [junit4] <<< JVM J2: EOF ----

[...truncated 3 lines...]
   [junit4] JVM J0: stderr was not empty, see: /home/jenkins/workspace/Lucene-Solr-master-Linux/lucene/build/expressions/test/temp/junit4-J0-20180516_194921_53917820923441188893337.syserr
   [junit4] >>> JVM J0 emitted unexpected output (verbatim) ----
   [junit4] Java HotSpot(TM) 64-Bit Server VM warning: Option UseConcMarkSweepGC was deprecated in version 9.0 and will likely be removed in a future release.
   [junit4] <<< JVM J0: EOF ----

[...truncated 3 lines...]
   [junit4] JVM J1: stderr was not empty, see: /home/jenkins/workspace/Lucene-Solr-master-Linux/lucene/build/expressions/test/temp/junit4-J1-20180516_194921_53917224872981782801893.syserr
   [junit4] >>> JVM J1 emitted unexpected output (verbatim) ----
   [junit4] Java HotSpot(TM) 64-Bit Server VM warning: Option UseConcMarkSweepGC was deprecated in version 9.0 and will likely be removed in a future release.
   [junit4] <<< JVM J1: EOF ----

[...truncated 235 lines...]
   [junit4] JVM J0: stderr was not empty, see: /home/jenkins/workspace/Lucene-Solr-master-Linux/lucene/build/facet/test/temp/junit4-J0-20180516_194928_97113823107964376022200.syserr
   [junit4] >>> JVM J0 emitted unexpected output (verbatim) ----
   [junit4] Java HotSpot(TM) 64-Bit Server VM warning: Option UseConcMarkSweepGC was deprecated in version 9.0 and will likely be removed in a future release.
   [junit4] <<< JVM J0: EOF ----

   [junit4] JVM J2: stderr was not empty, see: /home/jenkins/workspace/Lucene-Solr-master-Linux/lucene/build/facet/test/temp/junit4-J2-20180516_194928_9719036666255410184871.syserr
   [junit4] >>> JVM J2 emitted unexpected output (verbatim) ----
   [junit4] Java HotSpot(TM) 64-Bit Server VM warning: Option UseConcMarkSweepGC was deprecated in version 9.0 and will likely be removed in a future release.
   [junit4] <<< JVM J2: EOF ----

[...truncated 3 lines...]
   [junit4] JVM J1: stderr was not empty, see: /home/jenkins/workspace/Lucene-Solr-master-Linux/lucene/build/facet/test/temp/junit4-J1-20180516_194928_9717540333510344083096.syserr
   [junit4] >>> JVM J1 emitted unexpected output (verbatim) ----
   [junit4] Java HotSpot(TM) 64-Bit Server VM warning: Option UseConcMarkSweepGC was deprecated in version 9.0 and will likely be removed in a future release.
   [junit4] <<< JVM J1: EOF ----

[...truncated 185 lines...]
   [junit4] JVM J0: stderr was not empty, see: /home/jenkins/workspace/Lucene-Solr-master-Linux/lucene/build/grouping/test/temp/junit4-J0-20180516_195012_89415255105405805038662.syserr
   [junit4] >>> JVM J0 emitted unexpected output (verbatim) ----
   [junit4] Java HotSpot(TM) 64-Bit Server VM warning: Option UseConcMarkSweepGC was deprecated in version 9.0 and will likely be removed in a future release.
   [junit4] <<< JVM J0: EOF ----

   [junit4] JVM J2: stderr was not empty, see: /home/jenkins/workspace/Lucene-Solr-master-Linux/lucene/build/grouping/test/temp/junit4-J2-20180516_195012_89414420368489106367187.syserr
   [junit4] >>> JVM J2 emitted unexpected output (verbatim) ----
   [junit4] Java HotSpot(TM) 64-Bit Server VM warning: Option UseConcMarkSweepGC was deprecated in version 9.0 and will likely be removed in a future release.
   [junit4] <<< JVM J2: EOF ----

[...truncated 3 lines...]
   [junit4] JVM J1: stderr was not empty, see: /home/jenkins/workspace/Lucene-Solr-master-Linux/lucene/build/grouping/test/temp/junit4-J1-20180516_195012_89413185437953719892214.syserr
   [junit4] >>> JVM J1 emitted unexpected output (verbatim) ----
   [junit4] Java HotSpot(TM) 64-Bit Server VM warning: Option UseConcMarkSweepGC was deprecated in version 9.0 and will likely be removed in a future release.
   [junit4] <<< JVM J1: EOF ----

[...truncated 258 lines...]
   [junit4] JVM J2: stderr was not empty, see: /home/jenkins/workspace/Lucene-Solr-master-Linux/lucene/build/highlighter/test/temp/junit4-J2-20180516_195024_6285153382306261617468.syserr
   [junit4] >>> JVM J2 emitted unexpected output (verbatim) ----
   [junit4] Java HotSpot(TM) 64-Bit Server VM warning: Option UseConcMarkSweepGC was deprecated in version 9.0 and will likely be removed in a future release.
   [junit4] <<< JVM J2: EOF ----

   [junit4] JVM J1: stderr was not empty, see: /home/jenkins/workspace/Lucene-Solr-master-Linux/lucene/build/highlighter/test/temp/junit4-J1-20180516_195024_6285747506020423876951.syserr
   [junit4] >>> JVM J1 emitted unexpected output (verbatim) ----
   [junit4] Java HotSpot(TM) 64-Bit Server VM warning: Option UseConcMarkSweepGC was deprecated in version 9.0 and will likely be removed in a future release.
   [junit4] <<< JVM J1: EOF ----

[...truncated 3 lines...]
   [junit4] JVM J0: stderr was not empty, see: /home/jenkins/workspace/Lucene-Solr-master-Linux/lucene/build/highlighter/test/temp/junit4-J0-20180516_195024_6286729007660693729537.syserr
   [junit4] >>> JVM J0 emitted unexpected output (verbatim) ----
   [junit4] Java HotSpot(TM) 64-Bit Server VM warning: Option UseConcMarkSweepGC was deprecated in version 9.0 and will likely be removed in a future release.
   [junit4] <<< JVM J0: EOF ----

[...truncated 166 lines...]
   [junit4] JVM J0: stderr was not empty, see: /home/jenkins/workspace/Lucene-Solr-master-Linux/lucene/build/join/test/temp/junit4-J0-20180516_195046_2419958188936386946554.syserr
   [junit4] >>> JVM J0 emitted unexpected output (verbatim) ----
   [junit4] Java HotSpot(TM) 64-Bit Server VM warning: Option UseConcMarkSweepGC was deprecated in version 9.0 and will likely be removed in a future release.
   [junit4] <<< JVM J0: EOF ----

[...truncated 3 lines...]
   [junit4] JVM J2: stderr was not empty, see: /home/jenkins/workspace/Lucene-Solr-master-Linux/lucene/build/join/test/temp/junit4-J2-20180516_195046_25111460679804695850966.syserr
   [junit4] >>> JVM J2 emitted unexpected output (verbatim) ----
   [junit4] Java HotSpot(TM) 64-Bit Server VM warning: Option UseConcMarkSweepGC was deprecated in version 9.0 and will likely be removed in a future release.
   [junit4] <<< JVM J2: EOF ----

[...truncated 3 lines...]
   [junit4] JVM J1: stderr was not empty, see: /home/jenkins/workspace/Lucene-Solr-master-Linux/lucene/build/join/test/temp/junit4-J1-20180516_195046_2416561971915422431497.syserr
   [junit4] >>> JVM J1 emitted unexpected output (verbatim) ----
   [junit4] Java HotSpot(TM) 64-Bit Server VM warning: Option UseConcMarkSweepGC was deprecated in version 9.0 and will likely be removed in a future release.
   [junit4] <<< JVM J1: EOF ----

[...truncated 155 lines...]
   [junit4] JVM J0: stderr was not empty, see: /home/jenkins/workspace/Lucene-Solr-master-Linux/lucene/build/memory/test/temp/junit4-J0-20180516_195106_0534583150861958633826.syserr
   [junit4] >>> JVM J0 emitted unexpected output (verbatim) ----
   [junit4] Java HotSpot(TM) 64-Bit Server VM warning: Option UseConcMarkSweepGC was deprecated in version 9.0 and will likely be removed in a future release.
   [junit4] <<< JVM J0: EOF ----

[...truncated 3 lines...]
   [junit4] JVM J1: stderr was not empty, see: /home/jenkins/workspace/Lucene-Solr-master-Linux/lucene/build/memory/test/temp/junit4-J1-20180516_195106_05315575258738123958540.syserr
   [junit4] >>> JVM J1 emitted unexpected output (verbatim) ----
   [junit4] Java HotSpot(TM) 64-Bit Server VM warning: Option UseConcMarkSweepGC was deprecated in version 9.0 and will likely be removed in a future release.
   [junit4] <<< JVM J1: EOF ----

[...truncated 189 lines...]
   [junit4] JVM J2: stderr was not empty, see: /home/jenkins/workspace/Lucene-Solr-master-Linux/lucene/build/misc/test/temp/junit4-J2-20180516_195121_9215675116131074202632.syserr
   [junit4] >>> JVM J2 emitted unexpected output (verbatim) ----
   [junit4] Java HotSpot(TM) 64-Bit Server VM warning: Option UseConcMarkSweepGC was deprecated in version 9.0 and will likely be removed in a future release.
   [junit4] <<< JVM J2: EOF ----

[...truncated 6 lines...]
   [junit4] JVM J0: stderr was not empty, see: /home/jenkins/workspace/Lucene-Solr-master-Linux/lucene/build/misc/test/temp/junit4-J0-20180516_195121_9216261164327961012757.syserr
   [junit4] >>> JVM J0 emitted unexpected output (verbatim) ----
   [junit4] Java HotSpot(TM) 64-Bit Server VM warning: Option UseConcMarkSweepGC was deprecated in version 9.0 and will likely be removed in a future release.
   [junit4] <<< JVM J0: EOF ----

   [junit4] JVM J1: stderr was not empty, see: /home/jenkins/workspace/Lucene-Solr-master-Linux/lucene/build/misc/test/temp/junit4-J1-20180516_195121_9218671681712617249660.syserr
   [junit4] >>> JVM J1 emitted unexpected output (verbatim) ----
   [junit4] Java HotSpot(TM) 64-Bit Server VM warning: Option UseConcMarkSweepGC was deprecated in version 9.0 and will likely be removed in a future release.
   [junit4] <<< JVM J1: EOF ----

[...truncated 304 lines...]
   [junit4] JVM J0: stderr was not empty, see: /home/jenkins/workspace/Lucene-Solr-master-Linux/lucene/build/queries/test/temp/junit4-J0-20180516_195141_5912611034599623127973.syserr
   [junit4] >>> JVM J0 emitted unexpected output (verbatim) ----
   [junit4] Java HotSpot(TM) 64-Bit Server VM warning: Option UseConcMarkSweepGC was deprecated in version 9.0 and will likely be removed in a future release.
   [junit4] <<< JVM J0: EOF ----

[...truncated 6 lines...]
   [junit4] JVM J2: stderr was not empty, see: /home/jenkins/workspace/Lucene-Solr-master-Linux/lucene/build/queries/test/temp/junit4-J2-20180516_195141_5928781441314320115460.syserr
   [junit4] >>> JVM J2 emitted unexpected output (verbatim) ----
   [junit4] Java HotSpot(TM) 64-Bit Server VM warning: Option UseConcMarkSweepGC was deprecated in version 9.0 and will likely be removed in a future release.
   [junit4] <<< JVM J2: EOF ----

   [junit4] JVM J1: stderr was not empty, see: /home/jenkins/workspace/Lucene-Solr-master-Linux/lucene/build/queries/test/temp/junit4-J1-20180516_195141_5914192798742009188764.syserr
   [junit4] >>> JVM J1 emitted unexpected output (verbatim) ----
   [junit4] Java HotSpot(TM) 64-Bit Server VM warning: Option UseConcMarkSweepGC was deprecated in version 9.0 and will likely be removed in a future release.
   [junit4] <<< JVM J1: EOF ----

[...truncated 229 lines...]
   [junit4] JVM J1: stderr was not empty, see: /home/jenkins/workspace/Lucene-Solr-master-Linux/lucene/build/queryparser/test/temp/junit4-J1-20180516_195148_73811791655307571250490.syserr
   [junit4] >>> JVM J1 emitted unexpected output (verbatim) ----
   [junit4] Java HotSpot(TM) 64-Bit Server VM warning: Option UseConcMarkSweepGC was deprecated in version 9.0 and will likely be removed in a future release.
   [junit4] <<< JVM J1: EOF ----

[...truncated 3 lines...]
   [junit4] JVM J2: stderr was not empty, see: /home/jenkins/workspace/Lucene-Solr-master-Linux/lucene/build/queryparser/test/temp/junit4-J2-20180516_195148_7384505956397805149830.syserr
   [junit4] >>> JVM J2 emitted unexpected output (verbatim) ----
   [junit4] Java HotSpot(TM) 64-Bit Server VM warning: Option UseConcMarkSweepGC was deprecated in version 9.0 and will likely be removed in a future release.
   [junit4] <<< JVM J2: EOF ----

[...truncated 3 lines...]
   [junit4] JVM J0: stderr was not empty, see: /home/jenkins/workspace/Lucene-Solr-master-Linux/lucene/build/queryparser/test/temp/junit4-J0-20180516_195148_7381608597391585329505.syserr
   [junit4] >>> JVM J0 emitted unexpected output (verbatim) ----
   [junit4] Java HotSpot(TM) 64-Bit Server VM warning: Option UseConcMarkSweepGC was deprecated in version 9.0 and will likely be removed in a future release.
   [junit4] <<< JVM J0: EOF ----

[...truncated 212 lines...]
   [junit4] JVM J1: stderr was not empty, see: /home/jenkins/workspace/Lucene-Solr-master-Linux/lucene/build/replicator/test/temp/junit4-J1-20180516_195156_38615137795360111350262.syserr
   [junit4] >>> JVM J1 emitted unexpected output (verbatim) ----
   [junit4] Java HotSpot(TM) 64-Bit Server VM warning: Option UseConcMarkSweepGC was deprecated in version 9.0 and will likely be removed in a future release.
   [junit4] <<< JVM J1: EOF ----

[...truncated 3 lines...]
   [junit4] JVM J0: stderr was not empty, see: /home/jenkins/workspace/Lucene-Solr-master-Linux/lucene/build/replicator/test/temp/junit4-J0-20180516_195156_38616894678852110514156.syserr
   [junit4] >>> JVM J0 emitted unexpected output (verbatim) ----
   [junit4] Java HotSpot(TM) 64-Bit Server VM warning: Option UseConcMarkSweepGC was deprecated in version 9.0

[...truncated too long message...]

tderr was not empty, see: /home/jenkins/workspace/Lucene-Solr-master-Linux/solr/build/contrib/solr-dataimporthandler/test/temp/junit4-J1-20180516_204437_89913974161993127063114.syserr
   [junit4] >>> JVM J1 emitted unexpected output (verbatim) ----
   [junit4] Java HotSpot(TM) 64-Bit Server VM warning: Option UseConcMarkSweepGC was deprecated in version 9.0 and will likely be removed in a future release.
   [junit4] <<< JVM J1: EOF ----

[...truncated 567 lines...]
   [junit4] JVM J0: stderr was not empty, see: /home/jenkins/workspace/Lucene-Solr-master-Linux/solr/build/contrib/solr-cell/test/temp/junit4-J0-20180516_204458_2241559575381724265613.syserr
   [junit4] >>> JVM J0 emitted unexpected output (verbatim) ----
   [junit4] Java HotSpot(TM) 64-Bit Server VM warning: Option UseConcMarkSweepGC was deprecated in version 9.0 and will likely be removed in a future release.
   [junit4] <<< JVM J0: EOF ----

[...truncated 3 lines...]
   [junit4] JVM J2: stderr was not empty, see: /home/jenkins/workspace/Lucene-Solr-master-Linux/solr/build/contrib/solr-cell/test/temp/junit4-J2-20180516_204458_22414975483675159633081.syserr
   [junit4] >>> JVM J2 emitted unexpected output (verbatim) ----
   [junit4] Java HotSpot(TM) 64-Bit Server VM warning: Option UseConcMarkSweepGC was deprecated in version 9.0 and will likely be removed in a future release.
   [junit4] <<< JVM J2: EOF ----

[...truncated 3 lines...]
   [junit4] JVM J1: stderr was not empty, see: /home/jenkins/workspace/Lucene-Solr-master-Linux/solr/build/contrib/solr-cell/test/temp/junit4-J1-20180516_204458_22411196468065597216994.syserr
   [junit4] >>> JVM J1 emitted unexpected output (verbatim) ----
   [junit4] Java HotSpot(TM) 64-Bit Server VM warning: Option UseConcMarkSweepGC was deprecated in version 9.0 and will likely be removed in a future release.
   [junit4] <<< JVM J1: EOF ----

[...truncated 570 lines...]
   [junit4] JVM J1: stderr was not empty, see: /home/jenkins/workspace/Lucene-Solr-master-Linux/solr/build/contrib/solr-langid/test/temp/junit4-J1-20180516_204510_8897384211062772824810.syserr
   [junit4] >>> JVM J1 emitted unexpected output (verbatim) ----
   [junit4] Java HotSpot(TM) 64-Bit Server VM warning: Option UseConcMarkSweepGC was deprecated in version 9.0 and will likely be removed in a future release.
   [junit4] <<< JVM J1: EOF ----

[...truncated 6 lines...]
   [junit4] JVM J0: stderr was not empty, see: /home/jenkins/workspace/Lucene-Solr-master-Linux/solr/build/contrib/solr-langid/test/temp/junit4-J0-20180516_204510_8891270229374322050394.syserr
   [junit4] >>> JVM J0 emitted unexpected output (verbatim) ----
   [junit4] Java HotSpot(TM) 64-Bit Server VM warning: Option UseConcMarkSweepGC was deprecated in version 9.0 and will likely be removed in a future release.
   [junit4] <<< JVM J0: EOF ----

   [junit4] JVM J2: stderr was not empty, see: /home/jenkins/workspace/Lucene-Solr-master-Linux/solr/build/contrib/solr-langid/test/temp/junit4-J2-20180516_204510_88910823573928131372067.syserr
   [junit4] >>> JVM J2 emitted unexpected output (verbatim) ----
   [junit4] Java HotSpot(TM) 64-Bit Server VM warning: Option UseConcMarkSweepGC was deprecated in version 9.0 and will likely be removed in a future release.
   [junit4] <<< JVM J2: EOF ----

[...truncated 673 lines...]
   [junit4] JVM J0: stderr was not empty, see: /home/jenkins/workspace/Lucene-Solr-master-Linux/solr/build/contrib/solr-ltr/test/temp/junit4-J0-20180516_204520_7398248466342289205373.syserr
   [junit4] >>> JVM J0 emitted unexpected output (verbatim) ----
   [junit4] Java HotSpot(TM) 64-Bit Server VM warning: Option UseConcMarkSweepGC was deprecated in version 9.0 and will likely be removed in a future release.
   [junit4] <<< JVM J0: EOF ----

   [junit4] JVM J2: stderr was not empty, see: /home/jenkins/workspace/Lucene-Solr-master-Linux/solr/build/contrib/solr-ltr/test/temp/junit4-J2-20180516_204520_73915827367422604901955.syserr
   [junit4] >>> JVM J2 emitted unexpected output (verbatim) ----
   [junit4] Java HotSpot(TM) 64-Bit Server VM warning: Option UseConcMarkSweepGC was deprecated in version 9.0 and will likely be removed in a future release.
   [junit4] <<< JVM J2: EOF ----

[...truncated 3 lines...]
   [junit4] JVM J1: stderr was not empty, see: /home/jenkins/workspace/Lucene-Solr-master-Linux/solr/build/contrib/solr-ltr/test/temp/junit4-J1-20180516_204520_7399320486534465921425.syserr
   [junit4] >>> JVM J1 emitted unexpected output (verbatim) ----
   [junit4] Java HotSpot(TM) 64-Bit Server VM warning: Option UseConcMarkSweepGC was deprecated in version 9.0 and will likely be removed in a future release.
   [junit4] <<< JVM J1: EOF ----

[...truncated 567 lines...]
   [junit4] JVM J0: stderr was not empty, see: /home/jenkins/workspace/Lucene-Solr-master-Linux/solr/build/contrib/solr-prometheus-exporter/test/temp/junit4-J0-20180516_204555_57211284617708922795144.syserr
   [junit4] >>> JVM J0 emitted unexpected output (verbatim) ----
   [junit4] Java HotSpot(TM) 64-Bit Server VM warning: Option UseConcMarkSweepGC was deprecated in version 9.0 and will likely be removed in a future release.
   [junit4] <<< JVM J0: EOF ----

[...truncated 3 lines...]
   [junit4] JVM J1: stderr was not empty, see: /home/jenkins/workspace/Lucene-Solr-master-Linux/solr/build/contrib/solr-prometheus-exporter/test/temp/junit4-J1-20180516_204555_57215128566792850762642.syserr
   [junit4] >>> JVM J1 emitted unexpected output (verbatim) ----
   [junit4] Java HotSpot(TM) 64-Bit Server VM warning: Option UseConcMarkSweepGC was deprecated in version 9.0 and will likely be removed in a future release.
   [junit4] <<< JVM J1: EOF ----

[...truncated 606 lines...]
   [junit4] JVM J1: stderr was not empty, see: /home/jenkins/workspace/Lucene-Solr-master-Linux/solr/build/contrib/solr-uima/test/temp/junit4-J1-20180516_204615_69913647427964307984151.syserr
   [junit4] >>> JVM J1 emitted unexpected output (verbatim) ----
   [junit4] Java HotSpot(TM) 64-Bit Server VM warning: Option UseConcMarkSweepGC was deprecated in version 9.0 and will likely be removed in a future release.
   [junit4] <<< JVM J1: EOF ----

[...truncated 3 lines...]
   [junit4] JVM J0: stderr was not empty, see: /home/jenkins/workspace/Lucene-Solr-master-Linux/solr/build/contrib/solr-uima/test/temp/junit4-J0-20180516_204615_69911821132924077411457.syserr
   [junit4] >>> JVM J0 emitted unexpected output (verbatim) ----
   [junit4] Java HotSpot(TM) 64-Bit Server VM warning: Option UseConcMarkSweepGC was deprecated in version 9.0 and will likely be removed in a future release.
   [junit4] <<< JVM J0: EOF ----

[...truncated 557 lines...]
   [junit4] JVM J0: stderr was not empty, see: /home/jenkins/workspace/Lucene-Solr-master-Linux/solr/build/contrib/solr-velocity/test/temp/junit4-J0-20180516_204628_3077119255709110838244.syserr
   [junit4] >>> JVM J0 emitted unexpected output (verbatim) ----
   [junit4] Java HotSpot(TM) 64-Bit Server VM warning: Option UseConcMarkSweepGC was deprecated in version 9.0 and will likely be removed in a future release.
   [junit4] <<< JVM J0: EOF ----

[...truncated 34280 lines...]
[repro] Jenkins log URL: https://jenkins.thetaphi.de/job/Lucene-Solr-master-Linux/22022/consoleText

[repro] Revision: 0c3628920afdc27bbaf1c057bf6519319ea78e51

[repro] Ant options: "-Dargs=-XX:-UseCompressedOops -XX:+UseConcMarkSweepGC"
[repro] Repro line:  ant test  -Dtestcase=IndexSizeTriggerTest -Dtests.method=testTrigger -Dtests.seed=4C0C98576AC83F5F -Dtests.multiplier=3 -Dtests.slow=true -Dtests.locale=kn-IN -Dtests.timezone=IET -Dtests.asserts=true -Dtests.file.encoding=US-ASCII

[repro] Repro line:  ant test  -Dtestcase=IndexSizeTriggerTest -Dtests.method=testSplitIntegration -Dtests.seed=4C0C98576AC83F5F -Dtests.multiplier=3 -Dtests.slow=true -Dtests.locale=kn-IN -Dtests.timezone=IET -Dtests.asserts=true -Dtests.file.encoding=US-ASCII

[repro] ant clean

[...truncated 6 lines...]
[repro] Test suites by module:
[repro]    solr/core
[repro]       IndexSizeTriggerTest
[repro] ant compile-test

[...truncated 3303 lines...]
[repro] ant test-nocompile -Dtests.dups=5 -Dtests.maxfailures=5 -Dtests.class="*.IndexSizeTriggerTest" -Dtests.showOutput=onerror "-Dargs=-XX:-UseCompressedOops -XX:+UseConcMarkSweepGC" -Dtests.seed=4C0C98576AC83F5F -Dtests.multiplier=3 -Dtests.slow=true -Dtests.locale=kn-IN -Dtests.timezone=IET -Dtests.asserts=true -Dtests.file.encoding=US-ASCII

[...truncated 54 lines...]
   [junit4] JVM J2: stderr was not empty, see: /home/jenkins/workspace/Lucene-Solr-master-Linux/solr/build/solr-core/test/temp/junit4-J2-20180516_204922_43614817373404257428316.syserr
   [junit4] >>> JVM J2 emitted unexpected output (verbatim) ----
   [junit4] Java HotSpot(TM) 64-Bit Server VM warning: Option UseConcMarkSweepGC was deprecated in version 9.0 and will likely be removed in a future release.
   [junit4] <<< JVM J2: EOF ----

[...truncated 7 lines...]
   [junit4] JVM J1: stderr was not empty, see: /home/jenkins/workspace/Lucene-Solr-master-Linux/solr/build/solr-core/test/temp/junit4-J1-20180516_204922_4363375680456224429884.syserr
   [junit4] >>> JVM J1 emitted unexpected output (verbatim) ----
   [junit4] Java HotSpot(TM) 64-Bit Server VM warning: Option UseConcMarkSweepGC was deprecated in version 9.0 and will likely be removed in a future release.
   [junit4] <<< JVM J1: EOF ----

[...truncated 7 lines...]
   [junit4] JVM J0: stderr was not empty, see: /home/jenkins/workspace/Lucene-Solr-master-Linux/solr/build/solr-core/test/temp/junit4-J0-20180516_204922_43610827930222463595841.syserr
   [junit4] >>> JVM J0 emitted unexpected output (verbatim) ----
   [junit4] Java HotSpot(TM) 64-Bit Server VM warning: Option UseConcMarkSweepGC was deprecated in version 9.0 and will likely be removed in a future release.
   [junit4] <<< JVM J0: EOF ----

[...truncated 23 lines...]
[repro] Failures:
[repro]   0/5 failed: org.apache.solr.cloud.autoscaling.IndexSizeTriggerTest
[repro] Exiting with code 0

[...truncated 40 lines...]


---------------------------------------------------------------------
To unsubscribe, e-mail: [hidden email]
For additional commands, e-mail: [hidden email]
Reply | Threaded
Open this post in threaded view
|

[JENKINS-EA] Lucene-Solr-master-Linux (64bit/jdk-11-ea+5) - Build # 22023 - Still Unstable!

Policeman Jenkins Server-2
Build: https://jenkins.thetaphi.de/job/Lucene-Solr-master-Linux/22023/
Java: 64bit/jdk-11-ea+5 -XX:+UseCompressedOops -XX:+UseG1GC

1 tests failed.
FAILED:  org.apache.solr.cloud.autoscaling.SearchRateTriggerTest.testTrigger

Error Message:
expected:<1> but was:<2>

Stack Trace:
java.lang.AssertionError: expected:<1> but was:<2>
        at __randomizedtesting.SeedInfo.seed([ACE70F29547CDD7B:CF2C39ABCDB3AE56]:0)
        at org.junit.Assert.fail(Assert.java:93)
        at org.junit.Assert.failNotEquals(Assert.java:647)
        at org.junit.Assert.assertEquals(Assert.java:128)
        at org.junit.Assert.assertEquals(Assert.java:472)
        at org.junit.Assert.assertEquals(Assert.java:456)
        at org.apache.solr.cloud.autoscaling.SearchRateTriggerTest.testTrigger(SearchRateTriggerTest.java:133)
        at java.base/jdk.internal.reflect.NativeMethodAccessorImpl.invoke0(Native Method)
        at java.base/jdk.internal.reflect.NativeMethodAccessorImpl.invoke(NativeMethodAccessorImpl.java:62)
        at java.base/jdk.internal.reflect.DelegatingMethodAccessorImpl.invoke(DelegatingMethodAccessorImpl.java:43)
        at java.base/java.lang.reflect.Method.invoke(Method.java:564)
        at com.carrotsearch.randomizedtesting.RandomizedRunner.invoke(RandomizedRunner.java:1737)
        at com.carrotsearch.randomizedtesting.RandomizedRunner$8.evaluate(RandomizedRunner.java:934)
        at com.carrotsearch.randomizedtesting.RandomizedRunner$9.evaluate(RandomizedRunner.java:970)
        at com.carrotsearch.randomizedtesting.RandomizedRunner$10.evaluate(RandomizedRunner.java:984)
        at com.carrotsearch.randomizedtesting.rules.SystemPropertiesRestoreRule$1.evaluate(SystemPropertiesRestoreRule.java:57)
        at org.apache.lucene.util.TestRuleSetupTeardownChained$1.evaluate(TestRuleSetupTeardownChained.java:49)
        at org.apache.lucene.util.AbstractBeforeAfterRule$1.evaluate(AbstractBeforeAfterRule.java:45)
        at org.apache.lucene.util.TestRuleThreadAndTestName$1.evaluate(TestRuleThreadAndTestName.java:48)
        at org.apache.lucene.util.TestRuleIgnoreAfterMaxFailures$1.evaluate(TestRuleIgnoreAfterMaxFailures.java:64)
        at org.apache.lucene.util.TestRuleMarkFailure$1.evaluate(TestRuleMarkFailure.java:47)
        at com.carrotsearch.randomizedtesting.rules.StatementAdapter.evaluate(StatementAdapter.java:36)
        at com.carrotsearch.randomizedtesting.ThreadLeakControl$StatementRunner.run(ThreadLeakControl.java:368)
        at com.carrotsearch.randomizedtesting.ThreadLeakControl.forkTimeoutingTask(ThreadLeakControl.java:817)
        at com.carrotsearch.randomizedtesting.ThreadLeakControl$3.evaluate(ThreadLeakControl.java:468)
        at com.carrotsearch.randomizedtesting.RandomizedRunner.runSingleTest(RandomizedRunner.java:943)
        at com.carrotsearch.randomizedtesting.RandomizedRunner$5.evaluate(RandomizedRunner.java:829)
        at com.carrotsearch.randomizedtesting.RandomizedRunner$6.evaluate(RandomizedRunner.java:879)
        at com.carrotsearch.randomizedtesting.RandomizedRunner$7.evaluate(RandomizedRunner.java:890)
        at com.carrotsearch.randomizedtesting.rules.StatementAdapter.evaluate(StatementAdapter.java:36)
        at com.carrotsearch.randomizedtesting.rules.SystemPropertiesRestoreRule$1.evaluate(SystemPropertiesRestoreRule.java:57)
        at org.apache.lucene.util.AbstractBeforeAfterRule$1.evaluate(AbstractBeforeAfterRule.java:45)
        at com.carrotsearch.randomizedtesting.rules.StatementAdapter.evaluate(StatementAdapter.java:36)
        at org.apache.lucene.util.TestRuleStoreClassName$1.evaluate(TestRuleStoreClassName.java:41)
        at com.carrotsearch.randomizedtesting.rules.NoShadowingOrOverridesOnMethodsRule$1.evaluate(NoShadowingOrOverridesOnMethodsRule.java:40)
        at com.carrotsearch.randomizedtesting.rules.NoShadowingOrOverridesOnMethodsRule$1.evaluate(NoShadowingOrOverridesOnMethodsRule.java:40)
        at com.carrotsearch.randomizedtesting.rules.StatementAdapter.evaluate(StatementAdapter.java:36)
        at com.carrotsearch.randomizedtesting.rules.StatementAdapter.evaluate(StatementAdapter.java:36)
        at org.apache.lucene.util.TestRuleAssertionsRequired$1.evaluate(TestRuleAssertionsRequired.java:53)
        at org.apache.lucene.util.TestRuleMarkFailure$1.evaluate(TestRuleMarkFailure.java:47)
        at org.apache.lucene.util.TestRuleIgnoreAfterMaxFailures$1.evaluate(TestRuleIgnoreAfterMaxFailures.java:64)
        at org.apache.lucene.util.TestRuleIgnoreTestSuites$1.evaluate(TestRuleIgnoreTestSuites.java:54)
        at com.carrotsearch.randomizedtesting.rules.StatementAdapter.evaluate(StatementAdapter.java:36)
        at com.carrotsearch.randomizedtesting.ThreadLeakControl$StatementRunner.run(ThreadLeakControl.java:368)
        at java.base/java.lang.Thread.run(Thread.java:841)




Build Log:
[...truncated 13255 lines...]
   [junit4] Suite: org.apache.solr.cloud.autoscaling.SearchRateTriggerTest
   [junit4]   2> 543888 INFO  (SUITE-SearchRateTriggerTest-seed#[ACE70F29547CDD7B]-worker) [    ] o.a.s.SolrTestCaseJ4 SecureRandom sanity checks: test.solr.allowed.securerandom=null & java.security.egd=file:/dev/./urandom
   [junit4]   2> Creating dataDir: /home/jenkins/workspace/Lucene-Solr-master-Linux/solr/build/solr-core/test/J0/temp/solr.cloud.autoscaling.SearchRateTriggerTest_ACE70F29547CDD7B-001/init-core-data-001
   [junit4]   2> 543889 WARN  (SUITE-SearchRateTriggerTest-seed#[ACE70F29547CDD7B]-worker) [    ] o.a.s.SolrTestCaseJ4 startTrackingSearchers: numOpens=15 numCloses=15
   [junit4]   2> 543889 INFO  (SUITE-SearchRateTriggerTest-seed#[ACE70F29547CDD7B]-worker) [    ] o.a.s.SolrTestCaseJ4 Using PointFields (NUMERIC_POINTS_SYSPROP=true) w/NUMERIC_DOCVALUES_SYSPROP=false
   [junit4]   2> 543889 INFO  (SUITE-SearchRateTriggerTest-seed#[ACE70F29547CDD7B]-worker) [    ] o.a.s.SolrTestCaseJ4 Randomized ssl (true) and clientAuth (true) via: @org.apache.solr.util.RandomizeSSL(reason="", ssl=0.0/0.0, value=0.0/0.0, clientAuth=0.0/0.0)
   [junit4]   2> 543890 INFO  (SUITE-SearchRateTriggerTest-seed#[ACE70F29547CDD7B]-worker) [    ] o.a.s.c.MiniSolrCloudCluster Starting cluster of 4 servers in /home/jenkins/workspace/Lucene-Solr-master-Linux/solr/build/solr-core/test/J0/temp/solr.cloud.autoscaling.SearchRateTriggerTest_ACE70F29547CDD7B-001/tempDir-001
   [junit4]   2> 543890 INFO  (SUITE-SearchRateTriggerTest-seed#[ACE70F29547CDD7B]-worker) [    ] o.a.s.c.ZkTestServer STARTING ZK TEST SERVER
   [junit4]   2> 543893 INFO  (Thread-1914) [    ] o.a.s.c.ZkTestServer client port:0.0.0.0/0.0.0.0:0
   [junit4]   2> 543893 INFO  (Thread-1914) [    ] o.a.s.c.ZkTestServer Starting server
   [junit4]   2> 543894 ERROR (Thread-1914) [    ] o.a.z.s.ZooKeeperServer ZKShutdownHandler is not registered, so ZooKeeper server won't take any action on ERROR or SHUTDOWN server state changes
   [junit4]   2> 543993 INFO  (SUITE-SearchRateTriggerTest-seed#[ACE70F29547CDD7B]-worker) [    ] o.a.s.c.ZkTestServer start zk server on port:32877
   [junit4]   2> 543994 INFO  (zkConnectionManagerCallback-1628-thread-1) [    ] o.a.s.c.c.ConnectionManager zkClient has connected
   [junit4]   2> 543998 INFO  (jetty-launcher-1625-thread-1) [    ] o.e.j.s.Server jetty-9.4.10.v20180503; built: 2018-05-03T15:56:21.710Z; git: daa59876e6f384329b122929e70a80934569428c; jvm 11-ea+5
   [junit4]   2> 543998 INFO  (jetty-launcher-1625-thread-2) [    ] o.e.j.s.Server jetty-9.4.10.v20180503; built: 2018-05-03T15:56:21.710Z; git: daa59876e6f384329b122929e70a80934569428c; jvm 11-ea+5
   [junit4]   2> 543998 INFO  (jetty-launcher-1625-thread-4) [    ] o.e.j.s.Server jetty-9.4.10.v20180503; built: 2018-05-03T15:56:21.710Z; git: daa59876e6f384329b122929e70a80934569428c; jvm 11-ea+5
   [junit4]   2> 543998 INFO  (jetty-launcher-1625-thread-3) [    ] o.e.j.s.Server jetty-9.4.10.v20180503; built: 2018-05-03T15:56:21.710Z; git: daa59876e6f384329b122929e70a80934569428c; jvm 11-ea+5
   [junit4]   2> 543999 INFO  (jetty-launcher-1625-thread-4) [    ] o.e.j.s.session DefaultSessionIdManager workerName=node0
   [junit4]   2> 543999 INFO  (jetty-launcher-1625-thread-3) [    ] o.e.j.s.session DefaultSessionIdManager workerName=node0
   [junit4]   2> 543999 INFO  (jetty-launcher-1625-thread-4) [    ] o.e.j.s.session No SessionScavenger set, using defaults
   [junit4]   2> 543999 INFO  (jetty-launcher-1625-thread-3) [    ] o.e.j.s.session No SessionScavenger set, using defaults
   [junit4]   2> 543999 INFO  (jetty-launcher-1625-thread-4) [    ] o.e.j.s.session node0 Scavenging every 660000ms
   [junit4]   2> 543999 INFO  (jetty-launcher-1625-thread-3) [    ] o.e.j.s.session node0 Scavenging every 660000ms
   [junit4]   2> 543999 INFO  (jetty-launcher-1625-thread-1) [    ] o.e.j.s.session DefaultSessionIdManager workerName=node0
   [junit4]   2> 543999 INFO  (jetty-launcher-1625-thread-1) [    ] o.e.j.s.session No SessionScavenger set, using defaults
   [junit4]   2> 543999 INFO  (jetty-launcher-1625-thread-1) [    ] o.e.j.s.session node0 Scavenging every 660000ms
   [junit4]   2> 543999 INFO  (jetty-launcher-1625-thread-3) [    ] o.e.j.s.h.ContextHandler Started o.e.j.s.ServletContextHandler@5c40be20{/solr,null,AVAILABLE}
   [junit4]   2> 543999 INFO  (jetty-launcher-1625-thread-4) [    ] o.e.j.s.h.ContextHandler Started o.e.j.s.ServletContextHandler@7bce33f2{/solr,null,AVAILABLE}
   [junit4]   2> 543999 INFO  (jetty-launcher-1625-thread-2) [    ] o.e.j.s.session DefaultSessionIdManager workerName=node0
   [junit4]   2> 543999 INFO  (jetty-launcher-1625-thread-2) [    ] o.e.j.s.session No SessionScavenger set, using defaults
   [junit4]   2> 543999 INFO  (jetty-launcher-1625-thread-2) [    ] o.e.j.s.session node0 Scavenging every 660000ms
   [junit4]   2> 543999 INFO  (jetty-launcher-1625-thread-1) [    ] o.e.j.s.h.ContextHandler Started o.e.j.s.ServletContextHandler@4c7c565{/solr,null,AVAILABLE}
   [junit4]   2> 544000 INFO  (jetty-launcher-1625-thread-2) [    ] o.e.j.s.h.ContextHandler Started o.e.j.s.ServletContextHandler@6a7d89bc{/solr,null,AVAILABLE}
   [junit4]   2> 544000 INFO  (jetty-launcher-1625-thread-1) [    ] o.e.j.s.AbstractConnector Started ServerConnector@11a96587{SSL,[ssl, http/1.1]}{127.0.0.1:34329}
   [junit4]   2> 544000 INFO  (jetty-launcher-1625-thread-2) [    ] o.e.j.s.AbstractConnector Started ServerConnector@d4c9167{SSL,[ssl, http/1.1]}{127.0.0.1:39003}
   [junit4]   2> 544000 INFO  (jetty-launcher-1625-thread-3) [    ] o.e.j.s.AbstractConnector Started ServerConnector@3fee9216{SSL,[ssl, http/1.1]}{127.0.0.1:43983}
   [junit4]   2> 544000 INFO  (jetty-launcher-1625-thread-1) [    ] o.e.j.s.Server Started @544024ms
   [junit4]   2> 544000 INFO  (jetty-launcher-1625-thread-2) [    ] o.e.j.s.Server Started @544024ms
   [junit4]   2> 544000 INFO  (jetty-launcher-1625-thread-3) [    ] o.e.j.s.Server Started @544024ms
   [junit4]   2> 544000 INFO  (jetty-launcher-1625-thread-3) [    ] o.a.s.c.s.e.JettySolrRunner Jetty properties: {hostContext=/solr, hostPort=43983}
   [junit4]   2> 544000 INFO  (jetty-launcher-1625-thread-2) [    ] o.a.s.c.s.e.JettySolrRunner Jetty properties: {hostContext=/solr, hostPort=39003}
   [junit4]   2> 544000 INFO  (jetty-launcher-1625-thread-1) [    ] o.a.s.c.s.e.JettySolrRunner Jetty properties: {hostContext=/solr, hostPort=34329}
   [junit4]   2> 544000 INFO  (jetty-launcher-1625-thread-4) [    ] o.e.j.s.AbstractConnector Started ServerConnector@6bff7396{SSL,[ssl, http/1.1]}{127.0.0.1:46619}
   [junit4]   2> 544000 INFO  (jetty-launcher-1625-thread-4) [    ] o.e.j.s.Server Started @544024ms
   [junit4]   2> 544000 INFO  (jetty-launcher-1625-thread-4) [    ] o.a.s.c.s.e.JettySolrRunner Jetty properties: {hostContext=/solr, hostPort=46619}
   [junit4]   2> 544000 ERROR (jetty-launcher-1625-thread-3) [    ] o.a.s.u.StartupLoggingUtils Missing Java Option solr.log.dir. Logging may be missing or incomplete.
   [junit4]   2> 544000 ERROR (jetty-launcher-1625-thread-2) [    ] o.a.s.u.StartupLoggingUtils Missing Java Option solr.log.dir. Logging may be missing or incomplete.
   [junit4]   2> 544000 INFO  (jetty-launcher-1625-thread-3) [    ] o.a.s.s.SolrDispatchFilter Using logger factory org.apache.logging.slf4j.Log4jLoggerFactory
   [junit4]   2> 544000 INFO  (jetty-launcher-1625-thread-2) [    ] o.a.s.s.SolrDispatchFilter Using logger factory org.apache.logging.slf4j.Log4jLoggerFactory
   [junit4]   2> 544000 ERROR (jetty-launcher-1625-thread-1) [    ] o.a.s.u.StartupLoggingUtils Missing Java Option solr.log.dir. Logging may be missing or incomplete.
   [junit4]   2> 544001 INFO  (jetty-launcher-1625-thread-3) [    ] o.a.s.s.SolrDispatchFilter  ___      _       Welcome to Apache Solr? version 8.0.0
   [junit4]   2> 544001 INFO  (jetty-launcher-1625-thread-2) [    ] o.a.s.s.SolrDispatchFilter  ___      _       Welcome to Apache Solr? version 8.0.0
   [junit4]   2> 544001 INFO  (jetty-launcher-1625-thread-1) [    ] o.a.s.s.SolrDispatchFilter Using logger factory org.apache.logging.slf4j.Log4jLoggerFactory
   [junit4]   2> 544001 INFO  (jetty-launcher-1625-thread-3) [    ] o.a.s.s.SolrDispatchFilter / __| ___| |_ _   Starting in cloud mode on port null
   [junit4]   2> 544001 ERROR (jetty-launcher-1625-thread-4) [    ] o.a.s.u.StartupLoggingUtils Missing Java Option solr.log.dir. Logging may be missing or incomplete.
   [junit4]   2> 544001 INFO  (jetty-launcher-1625-thread-3) [    ] o.a.s.s.SolrDispatchFilter \__ \/ _ \ | '_|  Install dir: null
   [junit4]   2> 544001 INFO  (jetty-launcher-1625-thread-4) [    ] o.a.s.s.SolrDispatchFilter Using logger factory org.apache.logging.slf4j.Log4jLoggerFactory
   [junit4]   2> 544001 INFO  (jetty-launcher-1625-thread-2) [    ] o.a.s.s.SolrDispatchFilter / __| ___| |_ _   Starting in cloud mode on port null
   [junit4]   2> 544001 INFO  (jetty-launcher-1625-thread-3) [    ] o.a.s.s.SolrDispatchFilter |___/\___/_|_|    Start time: 2018-05-16T23:06:09.214084Z
   [junit4]   2> 544001 INFO  (jetty-launcher-1625-thread-1) [    ] o.a.s.s.SolrDispatchFilter  ___      _       Welcome to Apache Solr? version 8.0.0
   [junit4]   2> 544001 INFO  (jetty-launcher-1625-thread-4) [    ] o.a.s.s.SolrDispatchFilter  ___      _       Welcome to Apache Solr? version 8.0.0
   [junit4]   2> 544001 INFO  (jetty-launcher-1625-thread-1) [    ] o.a.s.s.SolrDispatchFilter / __| ___| |_ _   Starting in cloud mode on port null
   [junit4]   2> 544001 INFO  (jetty-launcher-1625-thread-4) [    ] o.a.s.s.SolrDispatchFilter / __| ___| |_ _   Starting in cloud mode on port null
   [junit4]   2> 544001 INFO  (jetty-launcher-1625-thread-1) [    ] o.a.s.s.SolrDispatchFilter \__ \/ _ \ | '_|  Install dir: null
   [junit4]   2> 544001 INFO  (jetty-launcher-1625-thread-4) [    ] o.a.s.s.SolrDispatchFilter \__ \/ _ \ | '_|  Install dir: null
   [junit4]   2> 544001 INFO  (jetty-launcher-1625-thread-1) [    ] o.a.s.s.SolrDispatchFilter |___/\___/_|_|    Start time: 2018-05-16T23:06:09.214204Z
   [junit4]   2> 544001 INFO  (jetty-launcher-1625-thread-4) [    ] o.a.s.s.SolrDispatchFilter |___/\___/_|_|    Start time: 2018-05-16T23:06:09.214214Z
   [junit4]   2> 544001 INFO  (jetty-launcher-1625-thread-2) [    ] o.a.s.s.SolrDispatchFilter \__ \/ _ \ | '_|  Install dir: null
   [junit4]   2> 544001 INFO  (jetty-launcher-1625-thread-2) [    ] o.a.s.s.SolrDispatchFilter |___/\___/_|_|    Start time: 2018-05-16T23:06:09.214479Z
   [junit4]   2> 544002 INFO  (zkConnectionManagerCallback-1630-thread-1) [    ] o.a.s.c.c.ConnectionManager zkClient has connected
   [junit4]   2> 544002 INFO  (zkConnectionManagerCallback-1634-thread-1) [    ] o.a.s.c.c.ConnectionManager zkClient has connected
   [junit4]   2> 544002 INFO  (zkConnectionManagerCallback-1633-thread-1) [    ] o.a.s.c.c.ConnectionManager zkClient has connected
   [junit4]   2> 544002 INFO  (zkConnectionManagerCallback-1636-thread-1) [    ] o.a.s.c.c.ConnectionManager zkClient has connected
   [junit4]   2> 544002 INFO  (jetty-launcher-1625-thread-3) [    ] o.a.s.s.SolrDispatchFilter solr.xml found in ZooKeeper. Loading...
   [junit4]   2> 544003 INFO  (jetty-launcher-1625-thread-1) [    ] o.a.s.s.SolrDispatchFilter solr.xml found in ZooKeeper. Loading...
   [junit4]   2> 544003 INFO  (jetty-launcher-1625-thread-4) [    ] o.a.s.s.SolrDispatchFilter solr.xml found in ZooKeeper. Loading...
   [junit4]   2> 544003 INFO  (jetty-launcher-1625-thread-2) [    ] o.a.s.s.SolrDispatchFilter solr.xml found in ZooKeeper. Loading...
   [junit4]   2> 544024 INFO  (jetty-launcher-1625-thread-4) [    ] o.a.s.c.ZkContainer Zookeeper client=127.0.0.1:32877/solr
   [junit4]   2> 544025 INFO  (jetty-launcher-1625-thread-2) [    ] o.a.s.c.ZkContainer Zookeeper client=127.0.0.1:32877/solr
   [junit4]   2> 544025 INFO  (zkConnectionManagerCallback-1643-thread-1) [    ] o.a.s.c.c.ConnectionManager zkClient has connected
   [junit4]   2> 544026 INFO  (jetty-launcher-1625-thread-3) [    ] o.a.s.c.ZkContainer Zookeeper client=127.0.0.1:32877/solr
   [junit4]   2> 544026 INFO  (jetty-launcher-1625-thread-1) [    ] o.a.s.c.ZkContainer Zookeeper client=127.0.0.1:32877/solr
   [junit4]   2> 544035 INFO  (zkConnectionManagerCallback-1648-thread-1) [    ] o.a.s.c.c.ConnectionManager zkClient has connected
   [junit4]   2> 544036 INFO  (zkConnectionManagerCallback-1651-thread-1) [    ] o.a.s.c.c.ConnectionManager zkClient has connected
   [junit4]   2> 544039 INFO  (zkConnectionManagerCallback-1652-thread-1) [    ] o.a.s.c.c.ConnectionManager zkClient has connected
   [junit4]   2> 544043 INFO  (zkConnectionManagerCallback-1654-thread-1) [    ] o.a.s.c.c.ConnectionManager zkClient has connected
   [junit4]   2> 544059 INFO  (zkConnectionManagerCallback-1658-thread-1) [    ] o.a.s.c.c.ConnectionManager zkClient has connected
   [junit4]   2> 544063 INFO  (jetty-launcher-1625-thread-3) [n:127.0.0.1:43983_solr    ] o.a.s.c.Overseer Overseer (id=null) closing
   [junit4]   2> 544063 INFO  (jetty-launcher-1625-thread-3) [n:127.0.0.1:43983_solr    ] o.a.s.c.OverseerElectionContext I am going to be the leader 127.0.0.1:43983_solr
   [junit4]   2> 544064 INFO  (jetty-launcher-1625-thread-3) [n:127.0.0.1:43983_solr    ] o.a.s.c.Overseer Overseer (id=72174114558640138-127.0.0.1:43983_solr-n_0000000000) starting
   [junit4]   2> 544067 INFO  (zkConnectionManagerCallback-1656-thread-1) [    ] o.a.s.c.c.ConnectionManager zkClient has connected
   [junit4]   2> 544071 INFO  (jetty-launcher-1625-thread-1) [n:127.0.0.1:34329_solr    ] o.a.s.c.Overseer Overseer (id=null) closing
   [junit4]   2> 544071 INFO  (jetty-launcher-1625-thread-1) [n:127.0.0.1:34329_solr    ] o.a.s.c.ZkController Register node as live in ZooKeeper:/live_nodes/127.0.0.1:34329_solr
   [junit4]   2> 544083 INFO  (zkConnectionManagerCallback-1662-thread-1) [    ] o.a.s.c.c.ConnectionManager zkClient has connected
   [junit4]   2> 544083 INFO  (jetty-launcher-1625-thread-4) [n:127.0.0.1:46619_solr    ] o.a.s.c.c.ZkStateReader Updated live nodes from ZooKeeper... (0) -> (1)
   [junit4]   2> 544084 INFO  (jetty-launcher-1625-thread-4) [n:127.0.0.1:46619_solr    ] o.a.s.c.Overseer Overseer (id=null) closing
   [junit4]   2> 544085 INFO  (jetty-launcher-1625-thread-4) [n:127.0.0.1:46619_solr    ] o.a.s.c.TransientSolrCoreCacheDefault Allocating transient cache for 2147483647 transient cores
   [junit4]   2> 544085 INFO  (jetty-launcher-1625-thread-4) [n:127.0.0.1:46619_solr    ] o.a.s.c.ZkController Register node as live in ZooKeeper:/live_nodes/127.0.0.1:46619_solr
   [junit4]   2> 544086 INFO  (jetty-launcher-1625-thread-2) [n:127.0.0.1:39003_solr    ] o.a.s.c.c.ZkStateReader Updated live nodes from ZooKeeper... (0) -> (2)
   [junit4]   2> 544087 INFO  (jetty-launcher-1625-thread-2) [n:127.0.0.1:39003_solr    ] o.a.s.c.Overseer Overseer (id=null) closing
   [junit4]   2> 544088 INFO  (jetty-launcher-1625-thread-2) [n:127.0.0.1:39003_solr    ] o.a.s.c.TransientSolrCoreCacheDefault Allocating transient cache for 2147483647 transient cores
   [junit4]   2> 544088 INFO  (jetty-launcher-1625-thread-2) [n:127.0.0.1:39003_solr    ] o.a.s.c.ZkController Register node as live in ZooKeeper:/live_nodes/127.0.0.1:39003_solr
   [junit4]   2> 544099 INFO  (zkCallback-1657-thread-1) [    ] o.a.s.c.c.ZkStateReader Updated live nodes from ZooKeeper... (0) -> (3)
   [junit4]   2> 544099 INFO  (zkCallback-1661-thread-1) [    ] o.a.s.c.c.ZkStateReader Updated live nodes from ZooKeeper... (2) -> (3)
   [junit4]   2> 544099 INFO  (zkCallback-1655-thread-1) [    ] o.a.s.c.c.ZkStateReader Updated live nodes from ZooKeeper... (0) -> (2)
   [junit4]   2> 544099 INFO  (zkCallback-1653-thread-1) [    ] o.a.s.c.c.ZkStateReader Updated live nodes from ZooKeeper... (1) -> (3)
   [junit4]   2> 544099 INFO  (zkCallback-1655-thread-2) [    ] o.a.s.c.c.ZkStateReader Updated live nodes from ZooKeeper... (2) -> (3)
   [junit4]   2> 544107 INFO  (zkConnectionManagerCallback-1673-thread-1) [    ] o.a.s.c.c.ConnectionManager zkClient has connected
   [junit4]   2> 544107 INFO  (jetty-launcher-1625-thread-3) [n:127.0.0.1:43983_solr    ] o.a.s.c.c.ZkStateReader Updated live nodes from ZooKeeper... (0) -> (3)
   [junit4]   2> 544108 INFO  (jetty-launcher-1625-thread-3) [n:127.0.0.1:43983_solr    ] o.a.s.c.s.i.ZkClientClusterStateProvider Cluster at 127.0.0.1:32877/solr ready
   [junit4]   2> 544121 INFO  (jetty-launcher-1625-thread-1) [n:127.0.0.1:34329_solr    ] o.a.s.m.r.SolrJmxReporter JMX monitoring for 'solr_34329.solr.node' (registry 'solr.node') enabled at server: com.sun.jmx.mbeanserver.JmxMBeanServer@5cf5d19e
   [junit4]   2> 544128 INFO  (jetty-launcher-1625-thread-3) [n:127.0.0.1:43983_solr    ] o.a.s.c.TransientSolrCoreCacheDefault Allocating transient cache for 2147483647 transient cores
   [junit4]   2> 544128 INFO  (jetty-launcher-1625-thread-3) [n:127.0.0.1:43983_solr    ] o.a.s.c.ZkController Register node as live in ZooKeeper:/live_nodes/127.0.0.1:43983_solr
   [junit4]   2> 544128 INFO  (jetty-launcher-1625-thread-1) [n:127.0.0.1:34329_solr    ] o.a.s.m.r.SolrJmxReporter JMX monitoring for 'solr_34329.solr.jvm' (registry 'solr.jvm') enabled at server: com.sun.jmx.mbeanserver.JmxMBeanServer@5cf5d19e
   [junit4]   2> 544128 INFO  (zkCallback-1657-thread-1) [    ] o.a.s.c.c.ZkStateReader Updated live nodes from ZooKeeper... (3) -> (4)
   [junit4]   2> 544128 INFO  (jetty-launcher-1625-thread-1) [n:127.0.0.1:34329_solr    ] o.a.s.m.r.SolrJmxReporter JMX monitoring for 'solr_34329.solr.jetty' (registry 'solr.jetty') enabled at server: com.sun.jmx.mbeanserver.JmxMBeanServer@5cf5d19e
   [junit4]   2> 544128 INFO  (zkCallback-1653-thread-1) [    ] o.a.s.c.c.ZkStateReader Updated live nodes from ZooKeeper... (3) -> (4)
   [junit4]   2> 544128 INFO  (zkCallback-1655-thread-2) [    ] o.a.s.c.c.ZkStateReader Updated live nodes from ZooKeeper... (3) -> (4)
   [junit4]   2> 544129 INFO  (zkCallback-1661-thread-1) [    ] o.a.s.c.c.ZkStateReader Updated live nodes from ZooKeeper... (3) -> (4)
   [junit4]   2> 544129 INFO  (jetty-launcher-1625-thread-1) [n:127.0.0.1:34329_solr    ] o.a.s.c.CorePropertiesLocator Found 0 core definitions underneath /home/jenkins/workspace/Lucene-Solr-master-Linux/solr/build/solr-core/test/J0/temp/solr.cloud.autoscaling.SearchRateTriggerTest_ACE70F29547CDD7B-001/tempDir-001/node1/.
   [junit4]   2> 544147 INFO  (zkCallback-1672-thread-1) [    ] o.a.s.c.c.ZkStateReader Updated live nodes from ZooKeeper... (3) -> (4)
   [junit4]   2> 544181 INFO  (jetty-launcher-1625-thread-2) [n:127.0.0.1:39003_solr    ] o.a.s.m.r.SolrJmxReporter JMX monitoring for 'solr_39003.solr.node' (registry 'solr.node') enabled at server: com.sun.jmx.mbeanserver.JmxMBeanServer@5cf5d19e
   [junit4]   2> 544183 INFO  (zkConnectionManagerCallback-1678-thread-1) [    ] o.a.s.c.c.ConnectionManager zkClient has connected
   [junit4]   2> 544183 INFO  (jetty-launcher-1625-thread-1) [n:127.0.0.1:34329_solr    ] o.a.s.c.c.ZkStateReader Updated live nodes from ZooKeeper... (0) -> (4)
   [junit4]   2> 544184 INFO  (jetty-launcher-1625-thread-1) [n:127.0.0.1:34329_solr    ] o.a.s.c.s.i.ZkClientClusterStateProvider Cluster at 127.0.0.1:32877/solr ready
   [junit4]   2> 544194 INFO  (jetty-launcher-1625-thread-2) [n:127.0.0.1:39003_solr    ] o.a.s.m.r.SolrJmxReporter JMX monitoring for 'solr_39003.solr.jvm' (registry 'solr.jvm') enabled at server: com.sun.jmx.mbeanserver.JmxMBeanServer@5cf5d19e
   [junit4]   2> 544194 INFO  (jetty-launcher-1625-thread-2) [n:127.0.0.1:39003_solr    ] o.a.s.m.r.SolrJmxReporter JMX monitoring for 'solr_39003.solr.jetty' (registry 'solr.jetty') enabled at server: com.sun.jmx.mbeanserver.JmxMBeanServer@5cf5d19e
   [junit4]   2> 544195 INFO  (jetty-launcher-1625-thread-2) [n:127.0.0.1:39003_solr    ] o.a.s.c.CorePropertiesLocator Found 0 core definitions underneath /home/jenkins/workspace/Lucene-Solr-master-Linux/solr/build/solr-core/test/J0/temp/solr.cloud.autoscaling.SearchRateTriggerTest_ACE70F29547CDD7B-001/tempDir-001/node2/.
   [junit4]   2> 544227 INFO  (zkConnectionManagerCallback-1683-thread-1) [    ] o.a.s.c.c.ConnectionManager zkClient has connected
   [junit4]   2> 544228 INFO  (jetty-launcher-1625-thread-2) [n:127.0.0.1:39003_solr    ] o.a.s.c.c.ZkStateReader Updated live nodes from ZooKeeper... (0) -> (4)
   [junit4]   2> 544228 INFO  (jetty-launcher-1625-thread-2) [n:127.0.0.1:39003_solr    ] o.a.s.c.s.i.ZkClientClusterStateProvider Cluster at 127.0.0.1:32877/solr ready
   [junit4]   2> 544231 INFO  (jetty-launcher-1625-thread-4) [n:127.0.0.1:46619_solr    ] o.a.s.m.r.SolrJmxReporter JMX monitoring for 'solr_46619.solr.node' (registry 'solr.node') enabled at server: com.sun.jmx.mbeanserver.JmxMBeanServer@5cf5d19e
   [junit4]   2> 544237 INFO  (jetty-launcher-1625-thread-4) [n:127.0.0.1:46619_solr    ] o.a.s.m.r.SolrJmxReporter JMX monitoring for 'solr_46619.solr.jvm' (registry 'solr.jvm') enabled at server: com.sun.jmx.mbeanserver.JmxMBeanServer@5cf5d19e
   [junit4]   2> 544237 INFO  (jetty-launcher-1625-thread-4) [n:127.0.0.1:46619_solr    ] o.a.s.m.r.SolrJmxReporter JMX monitoring for 'solr_46619.solr.jetty' (registry 'solr.jetty') enabled at server: com.sun.jmx.mbeanserver.JmxMBeanServer@5cf5d19e
   [junit4]   2> 544238 INFO  (jetty-launcher-1625-thread-4) [n:127.0.0.1:46619_solr    ] o.a.s.c.CorePropertiesLocator Found 0 core definitions underneath /home/jenkins/workspace/Lucene-Solr-master-Linux/solr/build/solr-core/test/J0/temp/solr.cloud.autoscaling.SearchRateTriggerTest_ACE70F29547CDD7B-001/tempDir-001/node4/.
   [junit4]   2> 544247 INFO  (zkConnectionManagerCallback-1688-thread-1) [    ] o.a.s.c.c.ConnectionManager zkClient has connected
   [junit4]   2> 544247 INFO  (jetty-launcher-1625-thread-4) [n:127.0.0.1:46619_solr    ] o.a.s.c.c.ZkStateReader Updated live nodes from ZooKeeper... (0) -> (4)
   [junit4]   2> 544248 INFO  (jetty-launcher-1625-thread-4) [n:127.0.0.1:46619_solr    ] o.a.s.c.s.i.ZkClientClusterStateProvider Cluster at 127.0.0.1:32877/solr ready
   [junit4]   2> 544263 INFO  (jetty-launcher-1625-thread-3) [n:127.0.0.1:43983_solr    ] o.a.s.m.r.SolrJmxReporter JMX monitoring for 'solr_43983.solr.node' (registry 'solr.node') enabled at server: com.sun.jmx.mbeanserver.JmxMBeanServer@5cf5d19e
   [junit4]   2> 544268 INFO  (jetty-launcher-1625-thread-3) [n:127.0.0.1:43983_solr    ] o.a.s.m.r.SolrJmxReporter JMX monitoring for 'solr_43983.solr.jvm' (registry 'solr.jvm') enabled at server: com.sun.jmx.mbeanserver.JmxMBeanServer@5cf5d19e
   [junit4]   2> 544268 INFO  (jetty-launcher-1625-thread-3) [n:127.0.0.1:43983_solr    ] o.a.s.m.r.SolrJmxReporter JMX monitoring for 'solr_43983.solr.jetty' (registry 'solr.jetty') enabled at server: com.sun.jmx.mbeanserver.JmxMBeanServer@5cf5d19e
   [junit4]   2> 544269 INFO  (jetty-launcher-1625-thread-3) [n:127.0.0.1:43983_solr    ] o.a.s.c.CorePropertiesLocator Found 0 core definitions underneath /home/jenkins/workspace/Lucene-Solr-master-Linux/solr/build/solr-core/test/J0/temp/solr.cloud.autoscaling.SearchRateTriggerTest_ACE70F29547CDD7B-001/tempDir-001/node3/.
   [junit4]   2> 544304 INFO  (zkConnectionManagerCallback-1690-thread-1) [    ] o.a.s.c.c.ConnectionManager zkClient has connected
   [junit4]   2> 544307 INFO  (zkConnectionManagerCallback-1695-thread-1) [    ] o.a.s.c.c.ConnectionManager zkClient has connected
   [junit4]   2> 544307 INFO  (SUITE-SearchRateTriggerTest-seed#[ACE70F29547CDD7B]-worker) [    ] o.a.s.c.c.ZkStateReader Updated live nodes from ZooKeeper... (0) -> (4)
   [junit4]   2> 544308 INFO  (SUITE-SearchRateTriggerTest-seed#[ACE70F29547CDD7B]-worker) [    ] o.a.s.c.s.i.ZkClientClusterStateProvider Cluster at 127.0.0.1:32877/solr ready
   [junit4]   2> 544324 INFO  (TEST-SearchRateTriggerTest.testWaitForElapsed-seed#[ACE70F29547CDD7B]) [    ] o.a.s.SolrTestCaseJ4 ###Starting testWaitForElapsed
   [junit4]   2> 544325 INFO  (TEST-SearchRateTriggerTest.testWaitForElapsed-seed#[ACE70F29547CDD7B]) [    ] o.a.s.c.c.ZkStateReader Updated live nodes from ZooKeeper... (0) -> (4)
   [junit4]   2> 544339 INFO  (qtp323510557-6945) [n:127.0.0.1:39003_solr    ] o.a.s.h.a.CollectionsHandler Invoked Collection Action :create with params replicationFactor=2&collection.configName=conf&maxShardsPerNode=1&name=SearchRateTriggerTest-collection1&nrtReplicas=2&action=CREATE&numShards=2&wt=javabin&version=2 and sendToOCPQueue=true
   [junit4]   2> 544340 INFO  (OverseerThreadFactory-2563-thread-1) [    ] o.a.s.c.a.c.CreateCollectionCmd Create collection SearchRateTriggerTest-collection1
   [junit4]   2> 544444 INFO  (OverseerStateUpdate-72174114558640138-127.0.0.1:43983_solr-n_0000000000) [    ] o.a.s.c.o.SliceMutator createReplica() {
   [junit4]   2>   "operation":"ADDREPLICA",
   [junit4]   2>   "collection":"SearchRateTriggerTest-collection1",
   [junit4]   2>   "shard":"shard1",
   [junit4]   2>   "core":"SearchRateTriggerTest-collection1_shard1_replica_n1",
   [junit4]   2>   "state":"down",
   [junit4]   2>   "base_url":"https://127.0.0.1:39003/solr",
   [junit4]   2>   "type":"NRT",
   [junit4]   2>   "waitForFinalState":"false"}
   [junit4]   2> 544445 INFO  (OverseerStateUpdate-72174114558640138-127.0.0.1:43983_solr-n_0000000000) [    ] o.a.s.c.o.SliceMutator createReplica() {
   [junit4]   2>   "operation":"ADDREPLICA",
   [junit4]   2>   "collection":"SearchRateTriggerTest-collection1",
   [junit4]   2>   "shard":"shard1",
   [junit4]   2>   "core":"SearchRateTriggerTest-collection1_shard1_replica_n2",
   [junit4]   2>   "state":"down",
   [junit4]   2>   "base_url":"https://127.0.0.1:43983/solr",
   [junit4]   2>   "type":"NRT",
   [junit4]   2>   "waitForFinalState":"false"}
   [junit4]   2> 544446 INFO  (OverseerStateUpdate-72174114558640138-127.0.0.1:43983_solr-n_0000000000) [    ] o.a.s.c.o.SliceMutator createReplica() {
   [junit4]   2>   "operation":"ADDREPLICA",
   [junit4]   2>   "collection":"SearchRateTriggerTest-collection1",
   [junit4]   2>   "shard":"shard2",
   [junit4]   2>   "core":"SearchRateTriggerTest-collection1_shard2_replica_n4",
   [junit4]   2>   "state":"down",
   [junit4]   2>   "base_url":"https://127.0.0.1:46619/solr",
   [junit4]   2>   "type":"NRT",
   [junit4]   2>   "waitForFinalState":"false"}
   [junit4]   2> 544447 INFO  (OverseerStateUpdate-72174114558640138-127.0.0.1:43983_solr-n_0000000000) [    ] o.a.s.c.o.SliceMutator createReplica() {
   [junit4]   2>   "operation":"ADDREPLICA",
   [junit4]   2>   "collection":"SearchRateTriggerTest-collection1",
   [junit4]   2>   "shard":"shard2",
   [junit4]   2>   "core":"SearchRateTriggerTest-collection1_shard2_replica_n6",
   [junit4]   2>   "state":"down",
   [junit4]   2>   "base_url":"https://127.0.0.1:34329/solr",
   [junit4]   2>   "type":"NRT",
   [junit4]   2>   "waitForFinalState":"false"}
   [junit4]   2> 544654 INFO  (qtp323510557-6925) [n:127.0.0.1:39003_solr    x:SearchRateTriggerTest-collection1_shard1_replica_n1] o.a.s.h.a.CoreAdminOperation core create command qt=/admin/cores&coreNodeName=core_node3&collection.configName=conf&newCollection=true&name=SearchRateTriggerTest-collection1_shard1_replica_n1&action=CREATE&numShards=2&collection=SearchRateTriggerTest-collection1&shard=shard1&wt=javabin&version=2&replicaType=NRT
   [junit4]   2> 544665 INFO  (qtp1516368068-6936) [n:127.0.0.1:46619_solr    x:SearchRateTriggerTest-collection1_shard2_replica_n4] o.a.s.h.a.CoreAdminOperation core create command qt=/admin/cores&coreNodeName=core_node7&collection.configName=conf&newCollection=true&name=SearchRateTriggerTest-collection1_shard2_replica_n4&action=CREATE&numShards=2&collection=SearchRateTriggerTest-collection1&shard=shard2&wt=javabin&version=2&replicaType=NRT
   [junit4]   2> 544665 INFO  (qtp1082039859-6944) [n:127.0.0.1:34329_solr    x:SearchRateTriggerTest-collection1_shard2_replica_n6] o.a.s.h.a.CoreAdminOperation core create command qt=/admin/cores&coreNodeName=core_node8&collection.configName=conf&newCollection=true&name=SearchRateTriggerTest-collection1_shard2_replica_n6&action=CREATE&numShards=2&collection=SearchRateTriggerTest-collection1&shard=shard2&wt=javabin&version=2&replicaType=NRT
   [junit4]   2> 544665 INFO  (qtp1082039859-6944) [n:127.0.0.1:34329_solr    x:SearchRateTriggerTest-collection1_shard2_replica_n6] o.a.s.c.TransientSolrCoreCacheDefault Allocating transient cache for 2147483647 transient cores
   [junit4]   2> 544668 INFO  (qtp1097306309-6939) [n:127.0.0.1:43983_solr    x:SearchRateTriggerTest-collection1_shard1_replica_n2] o.a.s.h.a.CoreAdminOperation core create command qt=/admin/cores&coreNodeName=core_node5&collection.configName=conf&newCollection=true&name=SearchRateTriggerTest-collection1_shard1_replica_n2&action=CREATE&numShards=2&collection=SearchRateTriggerTest-collection1&shard=shard1&wt=javabin&version=2&replicaType=NRT
   [junit4]   2> 545662 INFO  (qtp323510557-6925) [n:127.0.0.1:39003_solr c:SearchRateTriggerTest-collection1 s:shard1 r:core_node3 x:SearchRateTriggerTest-collection1_shard1_replica_n1] o.a.s.c.SolrConfig Using Lucene MatchVersion: 8.0.0
   [junit4]   2> 545665 INFO  (qtp323510557-6925) [n:127.0.0.1:39003_solr c:SearchRateTriggerTest-collection1 s:shard1 r:core_node3 x:SearchRateTriggerTest-collection1_shard1_replica_n1] o.a.s.s.IndexSchema [SearchRateTriggerTest-collection1_shard1_replica_n1] Schema name=minimal
   [junit4]   2> 545665 INFO  (qtp323510557-6925) [n:127.0.0.1:39003_solr c:SearchRateTriggerTest-collection1 s:shard1 r:core_node3 x:SearchRateTriggerTest-collection1_shard1_replica_n1] o.a.s.s.IndexSchema Loaded schema minimal/1.1 with uniqueid field id
   [junit4]   2> 545666 INFO  (qtp323510557-6925) [n:127.0.0.1:39003_solr c:SearchRateTriggerTest-collection1 s:shard1 r:core_node3 x:SearchRateTriggerTest-collection1_shard1_replica_n1] o.a.s.c.CoreContainer Creating SolrCore 'SearchRateTriggerTest-collection1_shard1_replica_n1' using configuration from collection SearchRateTriggerTest-collection1, trusted=true
   [junit4]   2> 545666 INFO  (qtp323510557-6925) [n:127.0.0.1:39003_solr c:SearchRateTriggerTest-collection1 s:shard1 r:core_node3 x:SearchRateTriggerTest-collection1_shard1_replica_n1] o.a.s.m.r.SolrJmxReporter JMX monitoring for 'solr_39003.solr.core.SearchRateTriggerTest-collection1.shard1.replica_n1' (registry 'solr.core.SearchRateTriggerTest-collection1.shard1.replica_n1') enabled at server: com.sun.jmx.mbeanserver.JmxMBeanServer@5cf5d19e
   [junit4]   2> 545666 INFO  (qtp323510557-6925) [n:127.0.0.1:39003_solr c:SearchRateTriggerTest-collection1 s:shard1 r:core_node3 x:SearchRateTriggerTest-collection1_shard1_replica_n1] o.a.s.c.SolrCore solr.RecoveryStrategy.Builder
   [junit4]   2> 545666 INFO  (qtp323510557-6925) [n:127.0.0.1:39003_solr c:SearchRateTriggerTest-collection1 s:shard1 r:core_node3 x:SearchRateTriggerTest-collection1_shard1_replica_n1] o.a.s.c.SolrCore [[SearchRateTriggerTest-collection1_shard1_replica_n1] ] Opening new SolrCore at [/home/jenkins/workspace/Lucene-Solr-master-Linux/solr/build/solr-core/test/J0/temp/solr.cloud.autoscaling.SearchRateTriggerTest_ACE70F29547CDD7B-001/tempDir-001/node2/SearchRateTriggerTest-collection1_shard1_replica_n1], dataDir=[/home/jenkins/workspace/Lucene-Solr-master-Linux/solr/build/solr-core/test/J0/temp/solr.cloud.autoscaling.SearchRateTriggerTest_ACE70F29547CDD7B-001/tempDir-001/node2/./SearchRateTriggerTest-collection1_shard1_replica_n1/data/]
   [junit4]   2> 545675 INFO  (qtp1097306309-6939) [n:127.0.0.1:43983_solr c:SearchRateTriggerTest-collection1 s:shard1 r:core_node5 x:SearchRateTriggerTest-collection1_shard1_replica_n2] o.a.s.c.SolrConfig Using Lucene MatchVersion: 8.0.0
   [junit4]   2> 545675 INFO  (qtp1082039859-6944) [n:127.0.0.1:34329_solr c:SearchRateTriggerTest-collection1 s:shard2 r:core_node8 x:SearchRateTriggerTest-collection1_shard2_replica_n6] o.a.s.c.SolrConfig Using Lucene MatchVersion: 8.0.0
   [junit4]   2> 545688 INFO  (qtp1097306309-6939) [n:127.0.0.1:43983_solr c:SearchRateTriggerTest-collection1 s:shard1 r:core_node5 x:SearchRateTriggerTest-collection1_shard1_replica_n2] o.a.s.s.IndexSchema [SearchRateTriggerTest-collection1_shard1_replica_n2] Schema name=minimal
   [junit4]   2> 545689 INFO  (qtp1082039859-6944) [n:127.0.0.1:34329_solr c:SearchRateTriggerTest-collection1 s:shard2 r:core_node8 x:SearchRateTriggerTest-collection1_shard2_replica_n6] o.a.s.s.IndexSchema [SearchRateTriggerTest-collection1_shard2_replica_n6] Schema name=minimal
   [junit4]   2> 545689 INFO  (qtp1097306309-6939) [n:127.0.0.1:43983_solr c:SearchRateTriggerTest-collection1 s:shard1 r:core_node5 x:SearchRateTriggerTest-collection1_shard1_replica_n2] o.a.s.s.IndexSchema Loaded schema minimal/1.1 with uniqueid field id
   [junit4]   2> 545689 INFO  (qtp1516368068-6936) [n:127.0.0.1:46619_solr c:SearchRateTriggerTest-collection1 s:shard2 r:core_node7 x:SearchRateTriggerTest-collection1_shard2_replica_n4] o.a.s.c.SolrConfig Using Lucene MatchVersion: 8.0.0
   [junit4]   2> 545689 INFO  (qtp1097306309-6939) [n:127.0.0.1:43983_solr c:SearchRateTriggerTest-collection1 s:shard1 r:core_node5 x:SearchRateTriggerTest-collection1_shard1_replica_n2] o.a.s.c.CoreContainer Creating SolrCore 'SearchRateTriggerTest-collection1_shard1_replica_n2' using configuration from collection SearchRateTriggerTest-collection1, trusted=true
   [junit4]   2> 545689 INFO  (qtp1097306309-6939) [n:127.0.0.1:43983_solr c:SearchRateTriggerTest-collection1 s:shard1 r:core_node5 x:SearchRateTriggerTest-collection1_shard1_replica_n2] o.a.s.m.r.SolrJmxReporter JMX monitoring for 'solr_43983.solr.core.SearchRateTriggerTest-collection1.shard1.replica_n2' (registry 'solr.core.SearchRateTriggerTest-collection1.shard1.replica_n2') enabled at server: com.sun.jmx.mbeanserver.JmxMBeanServer@5cf5d19e
   [junit4]   2> 545689 INFO  (qtp1097306309-6939) [n:127.0.0.1:43983_solr c:SearchRateTriggerTest-collection1 s:shard1 r:core_node5 x:SearchRateTriggerTest-collection1_shard1_replica_n2] o.a.s.c.SolrCore solr.RecoveryStrategy.Builder
   [junit4]   2> 545690 INFO  (qtp1097306309-6939) [n:127.0.0.1:43983_solr c:SearchRateTriggerTest-collection1 s:shard1 r:core_node5 x:SearchRateTriggerTest-collection1_shard1_replica_n2] o.a.s.c.SolrCore [[SearchRateTriggerTest-collection1_shard1_replica_n2] ] Opening new SolrCore at [/home/jenkins/workspace/Lucene-Solr-master-Linux/solr/build/solr-core/test/J0/temp/solr.cloud.autoscaling.SearchRateTriggerTest_ACE70F29547CDD7B-001/tempDir-001/node3/SearchRateTriggerTest-collection1_shard1_replica_n2], dataDir=[/home/jenkins/workspace/Lucene-Solr-master-Linux/solr/build/solr-core/test/J0/temp/solr.cloud.autoscaling.SearchRateTriggerTest_ACE70F29547CDD7B-001/tempDir-001/node3/./SearchRateTriggerTest-collection1_shard1_replica_n2/data/]
   [junit4]   2> 545690 INFO  (qtp1082039859-6944) [n:127.0.0.1:34329_solr c:SearchRateTriggerTest-collection1 s:shard2 r:core_node8 x:SearchRateTriggerTest-collection1_shard2_replica_n6] o.a.s.s.IndexSchema Loaded schema minimal/1.1 with uniqueid field id
   [junit4]   2> 545690 INFO  (qtp1082039859-6944) [n:127.0.0.1:34329_solr c:SearchRateTriggerTest-collection1 s:shard2 r:core_node8 x:SearchRateTriggerTest-collection1_shard2_replica_n6] o.a.s.c.CoreContainer Creating SolrCore 'SearchRateTriggerTest-collection1_shard2_replica_n6' using configuration from collection SearchRateTriggerTest-collection1, trusted=true
   [junit4]   2> 545690 INFO  (qtp1082039859-6944) [n:127.0.0.1:34329_solr c:SearchRateTriggerTest-collection1 s:shard2 r:core_node8 x:SearchRateTriggerTest-collection1_shard2_replica_n6] o.a.s.m.r.SolrJmxReporter JMX monitoring for 'solr_34329.solr.core.SearchRateTriggerTest-collection1.shard2.replica_n6' (registry 'solr.core.SearchRateTriggerTest-collection1.shard2.replica_n6') enabled at server: com.sun.jmx.mbeanserver.JmxMBeanServer@5cf5d19e
   [junit4]   2> 545691 INFO  (qtp1082039859-6944) [n:127.0.0.1:34329_solr c:SearchRateTriggerTest-collection1 s:shard2 r:core_node8 x:SearchRateTriggerTest-collection1_shard2_replica_n6] o.a.s.c.SolrCore solr.RecoveryStrategy.Builder
   [junit4]   2> 545691 INFO  (qtp1082039859-6944) [n:127.0.0.1:34329_solr c:SearchRateTriggerTest-collection1 s:shard2 r:core_node8 x:SearchRateTriggerTest-collection1_shard2_replica_n6] o.a.s.c.SolrCore [[SearchRateTriggerTest-collection1_shard2_replica_n6] ] Opening new SolrCore at [/home/jenkins/workspace/Lucene-Solr-master-Linux/solr/build/solr-core/test/J0/temp/solr.cloud.autoscaling.SearchRateTriggerTest_ACE70F29547CDD7B-001/tempDir-001/node1/SearchRateTriggerTest-collection1_shard2_replica_n6], dataDir=[/home/jenkins/workspace/Lucene-Solr-master-Linux/solr/build/solr-core/test/J0/temp/solr.cloud.autoscaling.SearchRateTriggerTest_ACE70F29547CDD7B-001/tempDir-001/node1/./SearchRateTriggerTest-collection1_shard2_replica_n6/data/]
   [junit4]   2> 545693 INFO  (qtp1516368068-6936) [n:127.0.0.1:46619_solr c:SearchRateTriggerTest-collection1 s:shard2 r:core_node7 x:SearchRateTriggerTest-collection1_shard2_replica_n4] o.a.s.s.IndexSchema [SearchRateTriggerTest-collection1_shard2_replica_n4] Schema name=minimal
   [junit4]   2> 545694 INFO  (qtp1516368068-6936) [n:127.0.0.1:46619_solr c:SearchRateTriggerTest-collection1 s:shard2 r:core_node7 x:SearchRateTriggerTest-collection1_shard2_replica_n4] o.a.s.s.IndexSchema Loaded schema minimal/1.1 with uniqueid field id
   [junit4]   2> 545694 INFO  (qtp1516368068-6936) [n:127.0.0.1:46619_solr c:SearchRateTriggerTest-collection1 s:shard2 r:core_node7 x:SearchRateTriggerTest-collection1_shard2_replica_n4] o.a.s.c.CoreContainer Creating SolrCore 'SearchRateTriggerTest-collection1_shard2_replica_n4' using configuration from collection SearchRateTriggerTest-collection1, trusted=true
   [junit4]   2> 545694 INFO  (qtp1516368068-6936) [n:127.0.0.1:46619_solr c:SearchRateTriggerTest-collection1 s:shard2 r:core_node7 x:SearchRateTriggerTest-collection1_shard2_replica_n4] o.a.s.m.r.SolrJmxReporter JMX monitoring for 'solr_46619.solr.core.SearchRateTriggerTest-collection1.shard2.replica_n4' (registry 'solr.core.SearchRateTriggerTest-collection1.shard2.replica_n4') enabled at server: com.sun.jmx.mbeanserver.JmxMBeanServer@5cf5d19e
   [junit4]   2> 545694 INFO  (qtp1516368068-6936) [n:127.0.0.1:46619_solr c:SearchRateTriggerTest-collection1 s:shard2 r:core_node7 x:SearchRateTriggerTest-collection1_shard2_replica_n4] o.a.s.c.SolrCore solr.RecoveryStrategy.Builder
   [junit4]   2> 545694 INFO  (qtp1516368068-6936) [n:127.0.0.1:46619_solr c:SearchRateTriggerTest-collection1 s:shard2 r:core_node7 x:SearchRateTriggerTest-collection1_shard2_replica_n4] o.a.s.c.SolrCore [[SearchRateTriggerTest-collection1_shard2_replica_n4] ] Opening new SolrCore at [/home/jenkins/workspace/Lucene-Solr-master-Linux/solr/build/solr-core/test/J0/temp/solr.cloud.autoscaling.SearchRateTriggerTest_ACE70F29547CDD7B-001/tempDir-001/node4/SearchRateTriggerTest-collection1_shard2_replica_n4], dataDir=[/home/jenkins/workspace/Lucene-Solr-master-Linux/solr/build/solr-core/test/J0/temp/solr.cloud.autoscaling.SearchRateTriggerTest_ACE70F29547CDD7B-001/tempDir-001/node4/./SearchRateTriggerTest-collection1_shard2_replica_n4/data/]
   [junit4]   2> 545716 INFO  (qtp323510557-6925) [n:127.0.0.1:39003_solr c:SearchRateTriggerTest-collection1 s:shard1 r:core_node3 x:SearchRateTriggerTest-collection1_shard1_replica_n1] o.a.s.u.UpdateHandler Using UpdateLog implementation: org.apache.solr.update.UpdateLog
   [junit4]   2> 545716 INFO  (qtp323510557-6925) [n:127.0.0.1:39003_solr c:SearchRateTriggerTest-collection1 s:shard1 r:core_node3 x:SearchRateTriggerTest-collection1_shard1_replica_n1] o.a.s.u.UpdateLog Initializing UpdateLog: dataDir=null defaultSyncLevel=FLUSH numRecordsToKeep=100 maxNumLogsToKeep=10 numVersionBuckets=65536
   [junit4]   2> 545717 INFO  (qtp323510557-6925) [n:127.0.0.1:39003_solr c:SearchRateTriggerTest-collection1 s:shard1 r:core_node3 x:SearchRateTriggerTest-collection1_shard1_replica_n1] o.a.s.u.CommitTracker Hard AutoCommit: disabled
   [junit4]   2> 545717 INFO  (qtp323510557-6925) [n:127.0.0.1:39003_solr c:SearchRateTriggerTest-collection1 s:shard1 r:core_node3 x:SearchRateTriggerTest-collection1_shard1_replica_n1] o.a.s.u.CommitTracker Soft AutoCommit: disabled
   [junit4]   2> 545719 INFO  (qtp323510557-6925) [n:127.0.0.1:39003_solr c:SearchRateTriggerTest-collection1 s:shard1 r:core_node3 x:SearchRateTriggerTest-collection1_shard1_replica_n1] o.a.s.s.SolrIndexSearcher Opening [Searcher@6f96cedd[SearchRateTriggerTest-collection1_shard1_replica_n1] main]
   [junit4]   2> 545720 INFO  (qtp323510557-6925) [n:127.0.0.1:39003_solr c:SearchRateTriggerTest-collection1 s:shard1 r:core_node3 x:SearchRateTriggerTest-collection1_shard1_replica_n1] o.a.s.r.ManagedResourceStorage Configured ZooKeeperStorageIO with znodeBase: /configs/conf
   [junit4]   2> 545720 INFO  (qtp323510557-6925) [n:127.0.0.1:39003_solr c:SearchRateTriggerTest-collection1 s:shard1 r:core_node3 x:SearchRateTriggerTest-collection1_shard1_replica_n1] o.a.s.r.ManagedResourceStorage Loaded null at path _rest_managed.json using ZooKeeperStorageIO:path=/configs/conf
   [junit4]   2> 545721 INFO  (qtp323510557-6925) [n:127.0.0.1:39003_solr c:SearchRateTriggerTest-collection1 s:shard1 r:core_node3 x:SearchRateTriggerTest-collection1_shard1_replica_n1] o.a.s.h.ReplicationHandler Commits will be reserved for 10000ms.
   [junit4]   2> 545721 INFO  (qtp323510557-6925) [n:127.0.0.1:39003_solr c:SearchRateTriggerTest-collection1 s:shard1 r:core_node3 x:SearchRateTriggerTest-collection1_shard1_replica_n1] o.a.s.u.UpdateLog Could not find max version in index or recent updates, using new clock 1600663816434089984
   [junit4]   2> 545723 INFO  (searcherExecutor-2571-thread-1-processing-n:127.0.0.1:39003_solr x:SearchRateTriggerTest-collection1_shard1_replica_n1 c:SearchRateTriggerTest-collection1 s:shard1 r:core_node3) [n:127.0.0.1:39003_solr c:SearchRateTriggerTest-collection1 s:shard1 r:core_node3 x:SearchRateTriggerTest-collection1_shard1_replica_n1] o.a.s.c.SolrCore [SearchRateTriggerTest-collection1_shard1_replica_n1] Registered new searcher Searcher@6f96cedd[SearchRateTriggerTest-collection1_shard1_replica_n1] main{ExitableDirectoryReader(UninvertingDirectoryReader())}
   [junit4]   2> 545725 INFO  (qtp323510557-6925) [n:127.0.0.1:39003_solr c:SearchRateTriggerTest-collection1 s:shard1 r:core_node3 x:SearchRateTriggerTest-collection1_shard1_replica_n1] o.a.s.c.ZkShardTerms Successful update of terms at /collections/SearchRateTriggerTest-collection1/terms/shard1 to Terms{values={core_node3=0}, version=0}
   [junit4]   2> 545728 INFO  (qtp323510557-6925) [n:127.0.0.1:39003_solr c:SearchRateTriggerTest-collection1 s:shard1 r:core_node3 x:SearchRateTriggerTest-collection1_shard1_replica_n1] o.a.s.c.ShardLeaderElectionContext Waiting until we see more replicas up for shard shard1: total=2 found=1 timeoutin=9999ms
   [junit4]   2> 545743 INFO  (qtp1082039859-6944) [n:127.0.0.1:34329_solr c:SearchRateTriggerTest-collection1 s:shard2 r:core_node8 x:SearchRateTriggerTest-collection1_shard2_replica_n6] o.a.s.u.UpdateHandler Using UpdateLog implementation: org.apache.solr.update.UpdateLog
   [junit4]   2> 545743 INFO  (qtp1082039859-6944) [n:127.0.0.1:34329_solr c:SearchRateTriggerTest-collection1 s:shard2 r:core_node8 x:SearchRateTriggerTest-collection1_shard2_replica_n6] o.a.s.u.UpdateLog Initializing UpdateLog: dataDir=null defaultSyncLevel=FLUSH numRecordsToKeep=100 maxNumLogsToKeep=10 numVersionBuckets=65536
   [junit4]   2> 545744 INFO  (qtp1082039859-6944) [n:127.0.0.1:34329_solr c:SearchRateTriggerTest-collection1 s:shard2 r:core_node8 x:SearchRateTriggerTest-collection1_shard2_replica_n6] o.a.s.u.CommitTracker Hard AutoCommit: disabled
   [junit4]   2> 545744 INFO  (qtp1082039859-6944) [n:127.0.0.1:34329_solr c:SearchRateTriggerTest-collection1 s:shard2 r:core_node8 x:SearchRateTriggerTest-collection1_shard2_replica_n6] o.a.s.u.CommitTracker Soft AutoCommit: disabled
   [junit4]   2> 545745 INFO  (qtp1082039859-6944) [n:127.0.0.1:34329_solr c:SearchRateTriggerTest-collection1 s:shard2 r:core_node8 x:SearchRateTriggerTest-collection1_shard2_replica_n6] o.a.s.s.SolrIndexSearcher Opening [Searcher@51faf9f[SearchRateTriggerTest-collection1_shard2_replica_n6] main]
   [junit4]   2> 545746 INFO  (qtp1082039859-6944) [n:127.0.0.1:34329_solr c:SearchRateTriggerTest-collection1 s:shard2 r:core_node8 x:SearchRateTriggerTest-collection1_shard2_replica_n6] o.a.s.r.ManagedResourceStorage Configured ZooKeeperStorageIO with znodeBase: /configs/conf
   [junit4]   2> 545747 INFO  (qtp1082039859-6944) [n:127.0.0.1:34329_solr c:SearchRateTriggerTest-collection1 s:shard2 r:core_node8 x:SearchRateTriggerTest-collection1_shard2_replica_n6] o.a.s.r.ManagedResourceStorage Loaded null at path _rest_managed.json using ZooKeeperStorageIO:path=/configs/conf
   [junit4]   2> 545747 INFO  (qtp1082039859-6944) [n:127.0.0.1:34329_solr c:SearchRateTriggerTest-collection1 s:shard2 r:core_node8 x:SearchRateTriggerTest-collection1_shard2_replica_n6] o.a.s.h.ReplicationHandler Commits will be reserved for 10000ms.
   [junit4]   2> 545747 INFO  (qtp1082039859-6944) [n:127.0.0.1:34329_solr c:SearchRateTriggerTest-collection1 s:shard2 r:core_node8 x:SearchRateTriggerTest-collection1_shard2_replica_n6] o.a.s.u.UpdateLog Could not find max version in index or recent updates, using new clock 1600663816461352960
   [junit4]   2> 545749 INFO  (searcherExecutor-2573-thread-1-processing-n:127.0.0.1:34329_solr x:SearchRateTriggerTest-collection1_shard2_replica_n6 c:SearchRateTriggerTest-collection1 s:shard2 r:core_node8) [n:127.0.0.1:34329_solr c:SearchRateTriggerTest-collection1 s:shard2 r:core_node8 x:SearchRateTriggerTest-collection1_shard2_replica_n6] o.a.s.c.SolrCore [SearchRateTriggerTest-collection1_shard2_replica_n6] Registered new searcher Searcher@51faf9f[SearchRateTriggerTest-collection1_shard2_replica_n6] main{ExitableDirectoryReader(UninvertingDirectoryReader())}
   [junit4]   2> 545756 INFO  (qtp1082039859-6944) [n:127.0.0.1:34329_solr c:SearchRateTriggerTest-collection1 s:shard2 r:core_node8 x:SearchRateTriggerTest-collection1_shard2_replica_n6] o.a.s.c.ZkShardTerms Successful update of terms at /collections/SearchRateTriggerTest-collection1/terms/shard2 to Terms{values={core_node8=0}, version=0}
   [junit4]   2> 545758 INFO  (qtp1082039859-6944) [n:127.0.0.1:34329_solr c:SearchRateTriggerTest-collection1 s:shard2 r:core_node8 x:SearchRateTriggerTest-collection1_shard2_replica_n6] o.a.s.c.ShardLeaderElectionContext Waiting until we see more replicas up for shard shard2: total=2 found=1 timeoutin=9999ms
   [junit4]   2> 545765 INFO  (qtp1516368068-6936) [n:127.0.0.1:46619_solr c:SearchRateTriggerTest-collection1 s:shard2 r:core_node7 x:SearchRateTriggerTest-collection1_shard2_replica_n4] o.a.s.u.UpdateHandler Using UpdateLog implementation: org.apache.solr.update.UpdateLog
   [junit4]   2> 545765 INFO  (qtp1516368068-6936) [n:127.0.0.1:46619_solr c:SearchRateTriggerTest-collection1 s:shard2 r:core_node7 x:SearchRateTriggerTest-collection1_shard2_replica_n4] o.a.s.u.UpdateLog Initializing UpdateLog: dataDir=null defaultSyncLevel=FLUSH numRecordsToKeep=100 maxNumLogsToKeep=10 numVersionBuckets=65536
   [junit4]   2> 545766 INFO  (qtp1516368068-6936) [n:127.0.0.1:46619_solr c:SearchRateTriggerTest-collection1 s:shard2 r:core_node7 x:SearchRateTriggerTest-collection1_shard2_replica_n4] o.a.s.u.CommitTracker Hard AutoCommit: disabled
   [junit4]   2> 545766 INFO  (qtp1516368068-6936) [n:127.0.0.1:46619_solr c:SearchRateTriggerTest-collection1 s:shard2 r:core_node7 x:SearchRateTriggerTest-collection1_shard2_replica_n4] o.a.s.u.CommitTracker Soft AutoCommit: disabled
   [junit4]   2> 545767 INFO  (qtp1516368068-6936) [n:127.0.0.1:46619_solr c:SearchRateTriggerTest-collection1 s:shard2 r:core_node7 x:SearchRateTriggerTest-collection1_shard2_replica_n4] o.a.s.s.SolrIndexSearcher Opening [Searcher@7f8d907a[SearchRateTriggerTest-collection1_shard2_replica_n4] main]
   [junit4]   2> 545769 INFO  (qtp1516368068-6936) [n:127.0.0.1:46619_solr c:SearchRateTriggerTest-collection1 s:shard2 r:core_node7 x:SearchRateTriggerTest-collection1_shard2_replica_n4] o.a.s.r.ManagedResourceStorage Configured ZooKeeperStorageIO with znodeBase: /configs/conf
   [junit4]   2> 545769 INFO  (qtp1516368068-6936) [n:127.0.0.1:46619_solr c:SearchRateTriggerTest-collection1 s:shard2 r:core_node7 x:SearchRateTriggerTest-collection1_shard2_replica_n4] o.a.s.r.ManagedResourceStorage Loaded null at path _rest_managed.json using ZooKeeperStorageIO:path=/configs/conf
   [junit4]   2> 545769 INFO  (qtp1516368068-6936) [n:127.0.0.1:46619_solr c:SearchRateTriggerTest-collection1 s:shard2 r:core_node7 x:SearchRateTriggerTest-collection1_shard2_replica_n4] o.a.s.h.ReplicationHandler Commits will be reserved for 10000ms.
   [junit4]   2> 545770 INFO  (searcherExecutor-2574-thread-1-processing-n:127.0.0.1:46619_solr x:SearchRateTriggerTest-collection1_shard2_replica_n4 c:SearchRateTriggerTest-collection1 s:shard2 r:core_node7) [n:127.0.0.1:46619_solr c:SearchRateTriggerTest-collection1 s:shard2 r:core_node7 x:SearchRateTriggerTest-collection1_shard2_replica_n4] o.a.s.c.SolrCore [SearchRateTriggerTest-collection1_shard2_replica_n4] Registered new searcher Searcher@7f8d907a[SearchRateTriggerTest-collection1_shard2_replica_n4] main{ExitableDirectoryReader(UninvertingDirectoryReader())}
   [junit4]   2> 545770 INFO  (qtp1516368068-6936) [n:127.0.0.1:46619_solr c:SearchRateTriggerTest-collection1 s:shard2 r:core_node7 x:SearchRateTriggerTest-collection1_shard2_replica_n4] o.a.s.u.UpdateLog Could not find max version in index or recent updates, using new clock 1600663816485470208
   [junit4]   2> 545774 INFO  (qtp1516368068-6936) [n:127.0.0.1:46619_solr c:SearchRateTriggerTest-collection1 s:shard2 r:core_node7 x:SearchRateTriggerTest-collection1_shard2_replica_n4] o.a.s.c.ZkShardTerms Successful update of terms at /collections/SearchRateTriggerTest-collection1/terms/shard2 to Terms{values={core_node7=0, core_node8=0}, version=1}
   [junit4]   2> 545783 INFO  (qtp1097306309-6939) [n:127.0.0.1:43983_solr c:SearchRateTriggerTest-collection1 s:shard1 r:core_node5 x:SearchRateTriggerTest-collection1_shard1_replica_n2] o.a.s.u.UpdateHandler Using UpdateLog implementation: org.apache.solr.update.UpdateLog
   [junit4]   2> 545783 INFO  (qtp1097306309-6939) [n:127.0.0.1:43983_solr c:SearchRateTriggerTest-collection1 s:shard1 r:core_node5 x:SearchRateTriggerTest-collection1_shard1_replica_n2] o.a.s.u.UpdateLog Initializing UpdateLog: dataDir=null defaultSyncLevel=FLUSH numRecordsToKeep=100 maxNumLogsToKeep=10 numVersionBuckets=65536
   [junit4]   2> 545812 INFO  (qtp1097306309-6939) [n:127.0.0.1:43983_solr c:SearchRateTriggerTest-collection1 s:shard1 r:core_node5 x:SearchRateTriggerTest-collection1_shard1_replica_n2] o.a.s.u.CommitTracker Hard AutoCommit: disabled
   [junit4]   2> 545813 INFO  (qtp1097306309-6939) [n:127.0.0.1:43983_solr c:SearchRateTriggerTest-collection1 s:shard1 r:core_node5 x:SearchRateTriggerTest-collection1_shard1_replica_n2] o.a.s.u.CommitTracker Soft AutoCommit: disabled
   [junit4]   2> 545814 INFO  (qtp1097306309-6939) [n:127.0.0.1:43983_solr c:SearchRateTriggerTest-collection1 s:shard1 r:core_node5 x:SearchRateTriggerTest-collection1_shard1_replica_n2] o.a.s.s.SolrIndexSearcher Opening [Searcher@5f6a9106[SearchRateTriggerTest-collection1_shard1_replica_n2] main]
   [junit4]   2> 545815 INFO  (qtp1097306309-6939) [n:127.0.0.1:43983_solr c:SearchRateTriggerTest-collection1 s:shard1 r:core_node5 x:SearchRateTriggerTest-collection1_shard1_replica_n2] o.a.s.r.ManagedResourceStorage Configured ZooKeeperStorageIO with znodeBase: /configs/conf
   [junit4]   2> 545815 INFO  (qtp1097306309-6939) [n:127.0.0.1:43983_solr c:SearchRateTriggerTest-collection1 s:shard1 r:core_node5 x:SearchRateTriggerTest-collection1_shard1_replica_n2] o.a.s.r.ManagedResourceStorage Loaded null at path _rest_managed.json using ZooKeeperStorageIO:path=/configs/conf
   [junit4]   2> 545815 INFO  (qtp1097306309-6939) [n:127.0.0.1:43983_solr c:SearchRateTriggerTest-collection1 s:shard1 r:core_node5 x:SearchRateTriggerTest-collection1_shard1_replica_n2] o.a.s.h.ReplicationHandler Commits will be reserved for 10000ms.
   [junit4]   2> 545816 INFO  (searcherExecutor-2572-thread-1-processing-n:127.0.0.1:43983_solr x:SearchRateTriggerTest-collection1_shard1_replica_n2 c:SearchRateTriggerTest-collection1 s:shard1 r:core_node5) [n:127.0.0.1:43983_solr c:SearchRateTriggerTest-collection1 s:shard1 r:core_node5 x:SearchRateTriggerTest-collection1_shard1_replica_n2] o.a.s.c.SolrCore [SearchRateTriggerTest-collection1_shard1_replica_n2] Registered new searcher Searcher@5f6a9106[SearchRateTriggerTest-collection1_shard1_replica_n2] main{ExitableDirectoryReader(UninvertingDirectoryReader())}
   [junit4]   2> 545816 INFO  (qtp1097306309-6939) [n:127.0.0.1:43983_solr c:SearchRateTriggerTest-collection1 s:shard1 r:core_node5 x:SearchRateTriggerTest-collection1_shard1_replica_n2] o.a.s.u.UpdateLog Could not find max version in index or recent updates, using new clock 1600663816533704704
   [junit4]   2> 545819 INFO  (qtp1097306309-6939) [n:127.0.0.1:43983_solr c:SearchRateTriggerTest-collection1 s:shard1 r:core_node5 x:SearchRateTriggerTest-collection1_shard1_replica_n2] o.a.s.c.ZkShardTerms Successful update of terms at /collections/SearchRateTriggerTest-collection1/terms/shard1 to Terms{values={core_node3=0, core_node5=0}, version=1}
   [junit4]   2> 546228 INFO  (qtp323510557-6925) [n:127.0.0.1:39003_solr c:SearchRateTriggerTest-collection1 s:shard1 r:core_node3 x:SearchRateTriggerTest-collection1_shard1_replica_n1] o.a.s.c.ShardLeaderElectionContext Enough replicas found to continue.
   [junit4]   2> 546229 INFO  (qtp323510557-6925) [n:127.0.0.1:39003_solr c:SearchRateTriggerTest-collection1 s:shard1 r:core_node3 x:SearchRateTriggerTest-collection1_shard1_replica_n1] o.a.s.c.ShardLeaderElectionContext I may be the new leader - try and sync
   [junit4]   2> 546229 INFO  (qtp323510557-6925) [n:127.0.0.1:39003_solr c:SearchRateTriggerTest-collection1 s:shard1 r:core_node3 x:SearchRateTriggerTest-collection1_shard1_replica_n1] o.a.s.c.SyncStrategy Sync replicas to https://127.0.0.1:39003/solr/SearchRateTriggerTest-collection1_shard1_replica_n1/
   [junit4]   2> 546229 INFO  (qtp323510557-6925) [n:127.0.0.1:39003_solr c:SearchRateTriggerTest-collection1 s:shard1 r:core_node3 x:SearchRateTriggerTest-collection1_shard1_replica_n1] o.a.s.u.PeerSync PeerSync: core=SearchRateTriggerTest-collection1_shard1_replica_n1 url=https://127.0.0.1:39003/solr START replicas=[https://127.0.0.1:43983/solr/SearchRateTriggerTest-collection1_shard1_replica_n2/] nUpdates=100
   [junit4]   2> 546233 INFO  (qtp1097306309-6941) [n:127.0.0.1:43983_solr c:SearchRateTriggerTest-collection1 s:shard1 r:core_node5 x:SearchRateTriggerTest-collection1_shard1_replica_n2] o.a.s.c.S.Request [SearchRateTriggerTest-collection1_shard1_replica_n2]  webapp=/solr path=/get params={distrib=false&qt=/get&fingerprint=false&getVersions=100&wt=javabin&version=2} status=0 QTime=0
   [junit4]   2> 546259 INFO  (qtp1082039859-6944) [n:127.0.0.1:34329_solr c:SearchRateTriggerTest-collection1 s:shard2 r:core_node8 x:SearchRateTriggerTest-collection1_shard2_replica_n6] o.a.s.c.ShardLeaderElectionContext Enough replicas found to continue.
   [junit4]   2> 546259 INFO  (qtp1082039859-6944) [n:127.0.0.1:34329_solr c:SearchRateTriggerTest-collection1 s:shard2 r:core_node8 x:SearchRateTriggerTest-collection1_shard2_replica_n6] o.a.s.c.ShardLeaderElectionContext I may be the new leader - try and sync
   [junit4]   2> 546259 INFO  (qtp1082039859-6944) [n:127.0.0.1:34329_solr c:SearchRateTriggerTest-collection1 s:shard2 r:core_node8 x:SearchRateTriggerTest-collection1_shard2_replica_n6] o.a.s.c.SyncStrategy Sync replicas to https://127.0.0.1:34329/solr/SearchRateTriggerTest-collection1_shard2_replica_n6/
   [junit4]   2> 546259 INFO  (qtp1082039859-6944) [n:127.0.0.1:34329_solr c:SearchRateTriggerTest-collection1 s:shard2 r:core_node8 x:SearchRateTriggerTest-collection1_shard2_replica_n6] o.a.s.u.PeerSync PeerSync: core=SearchRateTriggerTest-collection1_shard2_replica_n6 url=https://127.0.0.1:34329/solr START replicas=[https://127.0.0.1:46619/solr/SearchRateTriggerTest-collection1_shard2_replica_n4/] nUpdates=100
   [junit4]   2> 546263 INFO  (qtp1516368068-6942) [n:127.0.0.1:46619_solr c:SearchRateTriggerTest-collection1 s:shard2 r:core_node7 x:SearchRateTriggerTest-collection1_shard2_replica_n4] o.a.s.c.S.Request [SearchRateTriggerTest-collection1_shard2_replica_n4]  webapp=/solr path=/get params={distrib=false&qt=/get&fingerprint=false&getVersions=100&wt=javabin&version=2} status=0 QTime=0
   [junit4]   2> 546529 INFO  (qtp323510557-6925) [n:127.0.0.1:39003_solr c:SearchRateTriggerTest-collection1 s:shard1 r:core_node3 x:SearchRateTriggerTest-collection1_shard1_replica_n1] o.a.s.u.PeerSync PeerSync: core=SearchRateTriggerTest-collection1_shard1_replica_n1 url=https://127.0.0.1:39003/solr DONE.  We have no versions.  sync failed.
   [junit4]   2> 546529 INFO  (qtp323510557-6925) [n:127.0.0.1:39003_solr c:SearchRateTriggerTest-collection1 s:shard1 r:core_node3 x:SearchRateTriggerTest-collection1_shard1_replica_n1] o.a.s.c.SyncStrategy Leader's attempt to sync with shard failed, moving to the next candidate
   [junit4]   2> 546529 INFO  (qtp323510557-6925) [n:127.0.0.1:39003_solr c:SearchRateTriggerTest-collection1 s:shard1 r:core_node3 x:SearchRateTriggerTest-collection1_shard1_replica_n1] o.a.s.c.ShardLeaderElectionContext We failed sync, but we have no versions - we can't sync in that case - we were active before, so become leader anyway
   [junit4]   2> 546529 INFO  (qtp323510557-6925) [n:127.0.0.1:39003_solr c:SearchRateTriggerTest-collection1 s:shard1 r:core_node3 x:SearchRateTriggerTest-collection1_shard1_replica_n1] o.a.s.c.ShardLeaderElectionContext Found all replicas participating in election, clear LIR
   [junit4]   2> 546531 INFO  (qtp323510557-6925) [n:127.0.0.1:39003_solr c:SearchRateTriggerTest-collection1 s:shard1 r:core_node3 x:SearchRateTriggerTest-collection1_shard1_replica_n1] o.a.s.c.ShardLeaderElectionContext I am the new leader: https://127.0.0.1:39003/solr/SearchRateTriggerTest-collection1_shard1_replica_n1/ shard1
   [junit4]   2> 546560 INFO  (qtp1082039859-6944) [n:127.0.0.1:34329_solr c:SearchRateTriggerTest-collection1 s:shard2 r:core_node8 x:SearchRateTriggerTest-collection1_shard2_replica_n6] o.a.s.u.PeerSync PeerSync: core=SearchRateTriggerTest-collection1_shard2_replica_n6 url=https://127.0.0.1:34329/solr DONE.  We have no versions.  sync failed.
   [junit4]   2> 546560 INFO  (qtp1082039859-6944) [n:127.0.0.1:34329_solr c:SearchRateTriggerTest-collection1 s:shard2 r:core_node8 x:SearchRateTriggerTest-collection1_shard2_replica_n6] o.a.s.c.SyncStrategy Leader's attempt to sync with shard failed, moving to the next candidate
   [junit4]   2> 546560 INFO  (qtp1082039859-6944) [n:127.0.0.1:34329_solr c:SearchRateTriggerTest-collection1 s:shard2 r:core_node8 x:SearchRateTriggerTest-collection1_shard2_replica_n6] o.a.s.c.ShardLeaderElectionContext We failed sync, but we have no versions - we can't sync in that case - we were active before, so become leader anyway
   [junit4]   2> 546560 INFO  (qtp1082039859-6944) [n:127.0.0.1:34329_solr c:SearchRateTriggerTest-collection1 s:shard2 r:core_node8 x:SearchRateTriggerTest-collection1_shard2_replica_n6] o.a.s.c.ShardLeaderElectionContext Found all replicas participating in election, clear LIR
   [junit4]   2> 546562 INFO  (qtp1082039859-6944) [n:127.0.0.1:34329_solr c:SearchRateTriggerTest-collection1 s:shard2 r:core_node8 x:SearchRateTriggerTest-collection1_shard2_replica_n6] o.a.s.c.ShardLeaderElectionContext I am the new leader: https://127.0.0.1:34329/solr/SearchRateTriggerTest-collection1_shard2_replica_n6/ shard2
   [junit4]   2> 546663 INFO  (qtp1082039859-6944) [n:127.0.0.1:34329_solr c:SearchRateTriggerTest-collection1 s:shard2 r:core_node8 x:SearchRateTriggerTest-collection1_shard2_replica_n6] o.a.s.c.ZkController I am the leader, no recovery necessary
   [junit4]   2> 546683 INFO  (qtp323510557-6925) [n:127.0.0.1:39003_solr c:SearchRateTriggerTest-collection1 s:shard1 r:core_node3 x:SearchRateTriggerTest-collection1_shard1_replica_n1] o.a.s.c.ZkController I am the leader, no recovery necessary
   [junit4]   2> 546689 INFO  (qtp323510557-6925) [n:127.0.0.1:39003_solr c:SearchRateTriggerTest-collection1 s:shard1 r:core_node3 x:SearchRateTriggerTest-collection1_shard1_replica_n1] o.a.s.s.HttpSolrCall [admin] webapp=null path=/admin/cores params={qt=/admin/cores&coreNodeName=core_node3&collection.configName=conf&newCollection=true&name=SearchRateTriggerTest-collection1_shard1_replica_n1&action=CREATE&numShards=2&collection=SearchRateTriggerTest-collection1&shard=shard1&wt=javabin&version=2&replicaType=NRT} status=0 QTime=2034
   [junit4]   2> 546689 INFO  (qtp1082039859-6944) [n:127.0.0.1:34329_solr c:SearchRateTriggerTest-collection1 s:shard2 r:core_node8 x:SearchRateTriggerTest-collection1_shard2_replica_n6] o.a.s.s.HttpSolrCall [admin] webapp=null path=/admin/cores params={qt=/admin/cores&coreNodeName=core_node8&collection.configName=conf&newCollection=true&name=SearchRateTriggerTest-collection1_shard2_replica_n6&action=CREATE&numShards=2&collection=SearchRateTriggerTest-collection1&shard=shard2&wt=javabin&version=2&replicaType=NRT} status=0 QTime=2023
   [junit4]   2> 546776 INFO  (qtp1516368068-6936) [n:127.0.0.1:46619_solr c:SearchRateTriggerTest-collection1 s:shard2 r:core_node7 x:SearchRateTriggerTest-collection1_shard2_replica_n4] o.a.s.s.HttpSolrCall [admin] webapp=null path=/admin/cores params={qt=/admin/cores&coreNodeName=core_node7&collection.configName=conf&newCollection=true&name=SearchRateTriggerTest-collection1_shard2_replica_n4&action=CREATE&numShards=2&collection=SearchRateTriggerTest-collection1&shard=shard2&wt=javabin&version=2&replicaType=NRT} status=0 QTime=2111
   [junit4]   2> 546821 INFO  (qtp1097306309-6939) [n:127.0.0.1:43983_solr c:SearchRateTriggerTest-collection1 s:shard1 r:core_node5 x:SearchRateTriggerTest-collection1_shard1_replica_n2] o.a.s.s.HttpSolrCall [admin] webapp=null path=/admin/cores params={qt=/admin/cores&coreNodeName=core_node5&collection.configName=conf&newCollection=true&name=SearchRateTriggerTest-collection1_shard1_replica_n2&action=CREATE&numShards=2&collection=SearchRateTriggerTest-collection1&shard=shard1&wt=javabin&version=2&replicaType=NRT} status=0 QTime=2153
   [junit4]   2> 546824 INFO  (qtp323510557-6945) [n:127.0.0.1:39003_solr    ] o.a.s.h.a.CollectionsHandler Wait for new collection to be active for at most 30 seconds. Check all shard replicas
   [junit4]   2> 546921 INFO  (zkCallback-1655-thread-2) [    ] o.a.s.c.c.ZkStateReader A cluster state change: [WatchedEvent state:SyncConnected type:NodeDataChanged path:/collections/SearchRateTriggerTest-collection1/state.json] for collection [SearchRateTriggerTest-collection1] has occurred - updating... (live nodes size: [4])
   [junit4]   2> 546921 INFO  (zkCallback-1653-thread-1) [    ] o.a.s.c.c.ZkStateReader A cluster state change: [WatchedEvent state:SyncConnected type:NodeDataChanged path:/collections/SearchRateTriggerTest-collection1/state.json] for collection [SearchRateTriggerTest-collection1] has occurred - updating... (live nodes size: [4])
   [junit4]   2> 546921 INFO  (zkCallback-1661-thread-1) [    ] o.a.s.c.c.ZkStateReader A cluster state change: [WatchedEvent state:SyncConnected type:NodeDataChanged path:/collections/SearchRateTriggerTest-collection1/state.json] for collection [SearchRateTriggerTest-collection1] has occurred - updating... (live nodes size: [4])
   [junit4]   2> 546922 INFO  (zkCallback-1657-thread-1) [    ] o.a.s.c.c.ZkStateReader A cluster state change: [WatchedEvent state:SyncConnected type:NodeDataChanged path:/collections/SearchRateTriggerTest-collection1/state.json] for collection [SearchRateTriggerTest-collection1] has occurred - updating... (live nodes size: [4])
   [junit4]   2> 547824 INFO  (qtp323510557-6945) [n:127.0.0.1:39003_solr    ] o.a.s.s.HttpSolrCall [admin] webapp=null path=/admin/collections params={replicationFactor=2&collection.configName=conf&maxShardsPerNode=1&name=SearchRateTriggerTest-collection1&nrtReplicas=2&action=CREATE&numShards=2&wt=javabin&version=2} status=0 QTime=3484
   [junit4]   2> 547833 INFO  (qtp323510557-6949) [n:127.0.0.1:39003_solr    ] o.a.s.s.HttpSolrCall [admin] webapp=null path=/admin/metrics params={wt=javabin&version=2&key=solr.core.SearchRateTriggerTest-collection1.shard1.replica_n1:QUERY./select.requestTimes:1minRate} status=0 QTime=0
   [junit4]   2> 547837 INFO  (qtp1082039859-6944) [n:127.0.0.1:34329_solr    ] o.a.s.s.HttpSolrCall [admin] webapp=null path=/admin/metrics params={wt=javabin&version=2&key=solr.core.SearchRateTriggerTest-collection1.shard2.replica_n6:QUERY./select.requestTimes:1minRate} status=0 QTime=0
   [junit4]   2> 547839 INFO  (qtp1097306309-6939) [n:127.0.0.1:43983_solr    ] o.a.s.s.HttpSolrCall [admin] webapp=null path=/admin/metrics params={wt=javabin&version=2&key=solr.core.SearchRateTriggerTest-collection1.shard1.replica_n2:QUERY./select.requestTimes:1minRate} status=0 QTime=0
   [junit4]   2> 547842 INFO  (qtp1516368068-6936) [n:127.0.0.1:46619_solr    ] o.a.s.s.HttpSolrCall [admin] webapp=null path=/admin/metrics params={wt=javabin&version=2&key=solr.core.SearchRateTriggerTest-collection1.shard2.replica_n4:QUERY./select.requestTimes:1minRate} status=0 QTime=0
   [junit4]   2> 547852 INFO  (qtp323510557-6945) [n:127.0.0.1:39003_solr    ] o.a.s.s.HttpSolrCall [admin] webapp=null path=/admin/metrics params={wt=javabin&version=2&key=solr.core.SearchRateTriggerTest-collection1.shard1.replica_n1:QUERY./select.requestTimes:1minRate} status=0 QTime=0
   [junit4]   2> 547854 INFO  (qtp1082039859-6950) [n:127.0.0.1:34329_solr    ] o.a.s.s.HttpSolrCall [admin] webapp=null path=/admin/metrics params={wt=javabin&version=2&key=solr.core.SearchRateTriggerTest-collection1.shard2.replica_n6:QUERY./select.requestTimes:1minRate} status=0 QTime=0
   [junit4]   2> 547855 INFO  (qtp1097306309-6941) [n:127.0.0.1:43983_solr    ] o.a.s.s.HttpSolrCall [admin] webapp=null path=/admin/metrics params={wt=javabin&version=2&key=solr.core.SearchRateTriggerTest-collection1.shard1.replica_n2:QUERY./select.requestTimes:1minRate} status=0 QTime=0
   [junit4]   2> 547856 INFO  (qtp1516368068-6942) [n:127.0.0.1:46619_solr    ] o.a.s.s.HttpSolrCall [admin] webapp=null path=/admin/metrics params={wt=javabin&version=2&key=solr.core.SearchRateTriggerTest-collection1.shard2.replica_n4:QUERY./select.requestTimes:1minRate} status=0 QTime=0
   [junit4]   2> 548344 INFO  (OverseerCollectionConfigSetProcessor-72174114558640138-127.0.0.1:43983_solr-n_0000000000) [    ] o.a.s.c.OverseerTaskQueue Response ZK path: /overseer/collection-queue-work/qnr-0000000000 doesn't exist.  Requestor may have disconnected from ZooKeeper
   [junit4]   2> 548857 INFO  (qtp323510557-6945) [n:127.0.0.1:39003_solr    ] o.a.s.s.HttpSolrCall [admin] webapp=null path=/admin/metrics params={wt=javabin&version=2&key=solr.core.SearchRateTriggerTest-collection1.shard1.replica_n1:QUERY./select.requestTimes:1minRate} status=0 QTime=0
   [junit4]   2> 548859 INFO  (qtp1082039859-6944) [n:127.0.0.1:34329_solr    ] o.a.s.s.HttpSolrCall [admin] webapp=null path=/admin/metrics params={wt=javabin&version=2&key=solr.core.SearchRateTriggerTest-collection1.shard2.replica_n6:QUERY./select.requestTimes:1minRate} status=0 QTime=0
   [junit4]   2> 548860 INFO  (qtp1097306309-6939) [n:127.0.0.1:43983_solr    ] o.a.s.s.HttpSolrCall [admin] webapp=null path=/admin/metrics params={wt=javabin&version=2&key=solr.core.SearchRateTriggerTest-collection1.shard1.replica_n2:QUERY./select.requestTimes:1minRate} status=0 QTime=0
   [junit4]   2> 548861 INFO  (qtp1516368068-6936) [n:127.0.0.1:46619_solr    ] o.a.s.s.HttpSolrCall [admin] webapp=null path=/admin/metrics params={wt=javabin&version=2&key=solr.core.SearchRateTriggerTest-collection1.shard2.replica_n4:QUERY./select.requestTimes:1minRate} status=0 QTime=0
   [junit4]   2> 549862 INFO  (qtp323510557-6949) [n:127.0.0.1:39003_solr    ] o.a.s.s.HttpSolrCall [admin] webapp=null path=/admin/metrics params={wt=javabin&version=2&key=solr.core.SearchRateTriggerTest-collection1.shard1.replica_n1:QUERY./select.requestTimes:1minRate} status=0 QTime=0
   [junit4]   2> 549863 INFO  (qtp1082039859-6950) [n:127.0.0.1:34329_solr    ] o.a.s.s.HttpSolrCall [admin] webapp=null path=/admin/metrics params={wt=javabin&version=2&key=solr.core.SearchRateTriggerTest-collection1.shard2.replica_n6:QUERY./select.requestTimes:1minRate} status=0 QTime=0
   [junit4]   2> 549864 INFO  (qtp1097306309-6941) [n:127.0.0.1:43983_solr    ] o.a.s.s.HttpSolrCall [admin] webapp=null path=/admin/metrics params={wt=javabin&version=2&key=solr.core.SearchRateTriggerTest-collection1.shard1.replica_n2:QUERY./select.requestTimes:1minRate} status=0 QTime=0
   [junit4]   2> 549865 INFO  (qtp1516368068-6942) [n:127.0.0.1:46619_solr    ] o.a.s.s.HttpSolrCall [admin] webapp=null path=/admin/metrics params={wt=javabin&version=2&key=solr.core.SearchRateTriggerTest-collection1.shard2.replica_n4:QUERY./select.requestTimes:1minRate} status=0 QTime=0
   [junit4]   2> 550867 INFO  (qtp323510557-6945) [n:127.0.0.1:39003_solr    ] o.a.s.s.HttpSolrCall [admin] webapp=null path=/admin/metrics params={wt=javabin&version=2&key=solr.core.SearchRateTriggerTest-collection1.shard1.replica_n1:QUERY./select.requestTimes:1minRate} status=0 QTime=0
   [junit4]   2> 550868 INFO  (qtp1082039859-6944) [n:127.0.0.1:34329_solr    ] o.a.s.s.HttpSolrCall [admin] webapp=null path=/admin/metrics params={wt=javabin&version=2&key=solr.core.SearchRateTriggerTest-collection1.shard2.replica_n6:QUERY./select.requestTimes:1minRate} status=0 QTime=0
   [junit4]   2> 550869 INFO  (qtp1097306309-6941) [n:127.0.0.1:43983_solr    ] o.a.s.s.HttpSolrCall [admin] webapp=null path=/admin/metrics params={wt=javabin&version=2&key=solr.core.SearchRateTriggerTest-collection1.shard1.replica_n2:QUERY./select.requestTimes:1minRate} status=0 QTime=0
   [junit4]   2> 550870 INFO  (qtp1516368068-6942) [n:127.0.0.1:46619_solr    ] o.a.s.s.HttpSolrCall [admin] webapp=null path=/admin/metrics params={wt=javabin&version=2&key=solr.core.SearchRateTriggerTest-collection1.shard2.replica_n4:QUERY./select.requestTimes:1minRate} status=0 QTime=0
   [junit4]   2> 551872 INFO  (qtp323510557-6949) [n:127.0.0.1:39003_solr    ] o.a.s.s.HttpSolrCall [admin] webapp=null path=/admin/metrics params={wt=javabin&version=2&key=solr.core.SearchRateTriggerTest-collection1.shard1.replica_n1:QUERY./select.requestTimes:1minRate} status=0 QTime=0
   [junit4]   2> 551873 INFO  (qtp1082039859-6950) [n:127.0.0.1:34329_solr    ] o.a.s.s.HttpSolrCall [admin] webapp=null path=/admin/metrics params={wt=javabin&version=2&key=solr.core.SearchRateTriggerTest-collection1.shard2.replica_n6:QUERY./select.requestTimes:1minRate} status=0 QTime=0
   [junit4]   2> 551874 INFO  (qtp1097306309-6939) [n:127.0.0.1:43983_solr    ] o.a.s.s.HttpSolrCall [admin] webapp=null path=/admin/metrics params={wt=javabin&version=2&key=solr.core.SearchRateTriggerTest-collection1.shard1.replica_n2:QUERY./select.requestTimes:1minRate} status=0 QTime=0
   [junit4]   2> 551875 INFO  (qtp1516368068-6936) [n:127.0.0.1:46619_solr    ] o.a.s.s.HttpSolrCall [admin] webapp=null path=/admin/metrics params={wt=javabin&version=2&key=solr.core.SearchRateTriggerTest-collection1.shard2.replica_n4:QUERY./select.requestTimes:1minRate} status=0 QTime=0
   [junit4]   2> 552876 INFO  (qtp323510557-6945) [n:127.0.0.1:39003_solr    ] o.a.s.s.HttpSolrCall [admin] webapp=null path=/admin/metrics params={wt=javabin&version=2&key=solr.core.SearchRateTriggerTest-collection1.shard1.replica_n1:QUERY./select.requestTimes:1minRate} status=0 QTime=0
   [junit4]   2> 552878 INFO  (qtp1082039859-6944) [n:127.0.0.1:34329_solr    ] o.a.s.s.HttpSolrCall [admin] webapp=null path=/admin/metrics params={wt=javabin&version=2&key=solr.core.SearchRateTriggerTest-collection1.shard2.replica_n6:QUERY./select.requestTimes:1minRate} status=0 QTime=0
   [junit4]   2> 552879 INFO  (qtp1097306309-6941) [n:127.0.0.1:43983_solr    ] o.a.s.s.HttpSolrCall [admin] webapp=null path=/admin/metrics params={wt=javabin&version=2&key=solr.core.SearchRateTriggerTest-collection1.shard1.replica_n2:QUERY./select.requestTimes:1minRate} status=0 QTime=0
   [junit4]   2> 552881 INFO  (qtp1516368068-6942) [n:127.0.0.1:46619_solr    ] o.a.s.s.HttpSolrCall [admin] webapp=null path=/admin/metrics params={wt=javabin&version=2&key=solr.core.SearchRateTriggerTest-collection1.shard2.replica_n4:QUERY./select.requestTimes:1minRate} status=0 QTime=0
   [junit4]   2> 553882 INFO  (qtp323510557-6945) [n:127.0.0.1:39003_solr    ] o.a.s.s.HttpSolrCall [admin] webapp=null path=/admin/metrics params={wt=javabin&version=2&key=solr.core.SearchRateTriggerTest-collection1.shard1.replica_n1:QUERY./select.requestTimes:1minRate} status=0 QTime=0
   [junit4]   2> 553884 INFO  (qtp1082039859-6944) [n:127.0.0.1:34329_solr    ] o.a.s.s.HttpSolrCall [admin] webapp=null path=/admin/metrics params={wt=javabin&version=2&key=solr.core.SearchRateTriggerTest-collection1.shard2.replica_n6:QUERY./select.requestTimes:1minRate} status=0 QTime=0
   [junit4]   2> 553885 INFO  (qtp1097306309-6941) [n:127.0.0.1:43983_solr    ] o.a.s.s.HttpSolrCall [admin] webapp=null path=/admin/metrics params={wt=javabin&version=2&key=solr.core.SearchRateTriggerTest-collection1.shard1.replica_n2:QUERY./select.requestTimes:1minRate} status=0 QTime=0
   [junit4]   2> 553886 INFO  (qtp1516368068-6936) [n:127.0.0.1:46619_solr    ] o.a.s.s.HttpSolrCall [admin] webapp=null path=/admin/metrics params={wt=javabin&version=2&key=solr.core.SearchRateTriggerTest-collection1.shard2.replica_n4:QUERY./select.requestTimes:1minRate} status=0 QTime=0
   [junit4]   2> 554887 INFO  (qtp323510557-6949) [n:127.0.0.1:39003_solr    ] o.a.s.s.HttpSolrCall [admin] webapp=null path=/admin/metrics params={wt=javabin&version=2&key=solr.core.SearchRateTriggerTest-collection1.shard1.replica_n1:QUERY./select.requestTimes:1minRate} status=0 QTime=0
   [junit4]   2> 554888 INFO  (qtp1082039859-6950) [n:127.0.0.1:34329_solr    ] o.a.s.s.HttpSolrCall [admin] webapp=null path=/admin/metrics params={wt=javabin&version=2&key=solr.core.SearchRateTriggerTest-collection1.shard2.replica_n6:QUERY./select.requestTimes:1minRate} status=0 QTime=0
   [junit4]   2> 554889 INFO  (qtp1097306309-6939) [n:127.0.0.1:43983_solr    ] o.a.s.s.HttpSolrCall [admin] webapp=null path=/admin/metrics params={wt=javabin&version=2&key=solr.core.SearchRateTriggerTest-collection1.shard1.replica_n2:QUERY./select.requestTimes:1minRate} status=0 QTime=0
   [junit4]   2> 554890 INFO  (qtp1516368068-6942) [n:127.0.0.1:46619_solr    ] o.a.s.s.HttpSolrCall [admin] webapp=null path=/admin/metrics params={wt=javabin&version=2&key=solr.core.SearchRateTriggerTest-collection1.shard2.replica_n4:QUERY./select.requestTimes:1minRate} status=0 QTime=0
   [junit4]   2> 555900 INFO  (qtp323510557-6945) [n:127.0.0.1:39003_solr    ] o.a.s.s.HttpSolrCall [admin] webapp=null path=/admin/metrics params={wt=javabin&version=2&key=solr.core.SearchRateTriggerTest-collection1.shard1.replica_n1:QUERY./select.requestTimes:1minRate} status=0 QTime=0
   [junit4]   2> 555901 INFO  (qtp1082039859-6944) [n:127.0.0.1:34329_solr    ] o.a.s.s.HttpSolrCall [admin] webapp=null path=/admin/metrics params={wt=javabin&version=2&key=solr.core.SearchRateTriggerTest-collection1.shard2.replica_n6:QUERY./select.requestTimes:1minRate} status=0 QTime=0
   [junit4]   2> 555902 INFO  (qtp1097306309-6941) [n:127.0.0.1:43983_solr    ] o.a.s.s.HttpSolrCall [admin] webapp=null path=/admin/metrics params={wt=javabin&version=2&key=solr.core.SearchRateTriggerTest-collection1.shard1.replica_n2:QUERY./select.requestTimes:1minRate} status=0 QTime=0
   [junit4]   2> 555903 INFO  (qtp1516368068-6936) [n:127.0.0.1:46619_solr    ] o.a.s.s.HttpSolrCall [admin] webapp=null path=/admin/metrics params={wt=javabin&version=2&key=solr.core.SearchRateTriggerTest-collection1.shard2.replica_n4:QUERY./select.requestTimes:1minRate} status=0 QTime=0
   [junit4]   2> 556905 INFO  (qtp323510557-6949) [n:127.0.0.1:39003_solr    ] o.a.s.s.HttpSolrCall [admin] webapp=null path=/admin/metrics params={wt=javabin&version=2&key=solr.core.SearchRateTriggerTest-collection1.shard1.replica_n1:QUERY./select.requestTimes:1minRate} status=0 QTime=0
   [junit4]   2> 556906 INFO  (qtp1082039859-6950) [n:127.0.0.1:34329_solr    ] o.a.s.s.HttpSolrCall [admin] webapp=null path=/admin/metrics params={wt=javabin&version=2&key=solr.core.SearchRateTriggerTest-collection1.shard2.replica_n6:QUERY./select.requestTimes:1minRate} status=0 QTime=0
   [junit4]   2> 556907 INFO  (qtp1097306309-6939) [n:127.0.0.1:43983_solr    ] o.a.s.s.HttpSolrCall [admin] webapp=null path=/admin/metrics params={wt=javabin&version=2&key=solr.core.SearchRateTriggerTest-collection1.shard1.replica_n2:QUERY./select.requestTimes:1minRate} status=0 QTime=0
   [junit4]   2> 556907 INFO  (qtp1516368068-6942) [n:127.0.0.1:46619_solr    ] o.a.s.s.HttpSolrCall [admin] webapp=null path=/admin/metrics params={wt=javabin&version=2&key=solr.core.SearchRateTriggerTest-collection1.shard2.replica_n4:QUERY./select.requestTimes:1minRate} status=0 QTime=0
   [junit4]   2> 556909 INFO  (qtp323510557-6945) [n:127.0.0.1:39003_solr    ] o.a.s.s.HttpSolrCall [admin] webapp=null path=/admin/metrics params={wt=javabin&version=2&key=solr.core.SearchRateTriggerTest-collection1.shard1.replica_n1:QUERY./select.requestTimes:1minRate} status=0 QTime=0
   [junit4]   2> 556910 INFO  (qtp1082039859-6944) [n:127.0.0.1:34329_solr    ] o.a.s.s.HttpSolrCall [admin] webapp=null path=/admin/metrics params={wt=javabin&version=2&key=solr.core.SearchRateTriggerTest-collection1.shard2.replica_n6:QUERY./select.requestTimes:1minRate} status=0 QTime=0
   [junit4]   2> 556910 INFO  (qtp1097306309-6941) [n:127.0.0.1:43983_solr    ] o.a.s.s.HttpSolrCall [admin] webapp=null path=/admin/metrics params={wt=javabin&version=2&key=solr.core.SearchRateTriggerTest-collection1.shard1.replica_n2:QUERY./select.requestTimes:1minRate} status=0 QTime=0
   [junit4]   2> 556911 INFO  (qtp1516368068-6936) [n:127.0.0.1:46619_solr    ] o.a.s.s.HttpSolrCall [admin] webapp=null path=/admin/metrics params={wt=javabin&version=2&key=solr.core.SearchRateTriggerTest-collection1.shard2.replica_n4:QUERY./select.requestTimes:1minRate} status=0 QTime=0
   [junit4]   2> 557912 INFO  (qtp323510557-6949) [n:127.0.0.1:39003_solr    ] o.a.s.s.HttpSolrCall [admin] webapp=null path=/admin/metrics params={wt=javabin&version=2&key=solr.core.SearchRateTriggerTest-collection1.shard1.replica_n1:QUERY./select.requestTimes:1minRate} status=0 QTime=0
   [junit4]   2> 557913 INFO  (qtp1082039859-6950) [n:127.0.0.1:34329_solr    ] o.a.s.s.HttpSolrCall [admin] webapp=null path=/admin/metrics params={wt=javabin&version=2&key=solr.core.SearchRateTriggerTest-collection1.shard2.replica_n6:QUERY./select.requestTimes:1minRate} status=0 QTime=0
   [junit4]   2> 557914 INFO  (qtp1097306309-6939) [n:127.0.0.1:43983_solr    ] o.a.s.s.HttpSolrCall [admin] webapp=null path=/admin/metrics params={wt=javabin&version=2&key=solr.core.SearchRateTriggerTest-collection1.shard1.replica_n2:QUERY./select.requestTimes:1minRate} status=0 QTime=0
   [junit4]   2> 557915 INFO  (qtp1516368068-6942) [n:127.0.0.1:46619_solr    ] o.a.s.s.HttpSolrCall [admin] webapp=null path=/admin/metrics params={wt=javabin&version=2&key=solr.core.SearchRateTriggerTest-collection1.shard2.replica_n4:QUERY./select.requestTimes:1minRate} status=0 QTime=0
   [junit4]   2> 558917 INFO  (qtp323510557-6945) [n:127.0.0.1:39003_solr    ] o.a.s.s.HttpSolrCall [admin] webapp=null path=/admin/metrics params={wt=javabin&version=2&key=solr.core.SearchRateTriggerTest-collection1.shard1.replica_n1:QUERY./select.requestTimes:1minRate} status=0 QTime=0
   [junit4]   2> 558918 INFO  (qtp1082039859-6944) [n:127.0.0.1:34329_solr    ] o.a.s.s.HttpSolrCall [admin] webapp=null path=/admin/metrics params={wt=javabin&version=2&key=solr.core.SearchRateTriggerTest-collection1.shard2.replica_n6:QUERY./select.requestTimes:1minRate} status=0 QTime=0
   [junit4]   2> 558919 INFO  (qtp1097306309-6941) [n:127.0.0.1:43983_solr    ] o.a.s.s.HttpSolrCall [admin] webapp=null path=/admin/metrics params={wt=javabin&version=2&key=solr.core.SearchRateTriggerTest-collection1.shard1.replica_n2:QUERY./select.requestTimes:1minRate} status=0 QTime=0
   [junit4]   2> 558920 INFO  (qtp1516368068-6936) [n:127.0.0.1:46619_solr    ] o.a.s.s.HttpSolrCall [admin] webapp=null path=/admin/metrics params={wt=javabin&version=2&key=solr.core.SearchRateTriggerTest-collection1.shard2.replica_n4:QUERY./select.requestTimes:1minRate} status=0 QTime=0
   [junit4]   2> 563922 INFO  (qtp323510557-6949) [n:127.0.0.1:39003_solr    ] o.a.s.s.HttpSolrCall [admin] webapp=null path=/admin/metrics params={wt=javabin&version=2&key=solr.core.SearchRateTriggerTest-collection1.shard1.replica_n1:QUERY./select.requestTimes:1minRate} status=0 QTime=0
   [junit4]   2> 563925 INFO  (qtp1082039859-6950) [n:127.0.0.1:34329_solr    ] o.a.s.s.HttpSolrCall [admin] webapp=null path=/admin/metrics params={wt=javabin&version=2&key=solr.core.SearchRateTriggerTest-collection1.shard2.replica_n6:QUERY./select.requestTimes:1minRate} status=0 QTime=0
   [junit4]   2> 563927 INFO  (qtp1097306309-6939) [n:127.0.0.1:43983_solr    ] o.a.s.s.HttpSolrCall [admin] webapp=null path=/admin/metrics params={wt=javabin&version=2&key=solr.core.SearchRateTriggerTest-collection1.shard1.replica_n2:QUERY./select.requestTimes:1minRate} status=0 QTime=0
   [junit4]   2> 563929 INFO  (qtp1516368068-6942) [n:127.0.0.1:46619_solr    ] o.a.s.s.HttpSolrCall [admin] webapp=null path=/admin/metrics params={wt=javabin&version=2&key=solr.core.SearchRateTriggerTest-collection1.shard2.replica_n4:QUERY./select.requestTimes:1minRate} status=0 QTime=0
   [junit4]   2> 563931 INFO  (TEST-SearchRateTriggerTest.testWaitForElapsed-seed#[ACE70F29547CDD7B]) [    ] o.a.s.SolrTestCaseJ4 ###Ending testWaitForElapsed
   [junit4]   2> 563954 INFO  (TEST-SearchRateTriggerTest.testTrigger-seed#[ACE70F29547CDD7B]) [    ] o.a.s.SolrTestCaseJ4 ###Starting testTrigger
   [junit4]   2> 563954 INFO  (TEST-SearchRateTriggerTest.testTrigger-seed#[ACE70F29547CDD7B]) [    ] o.a.s.c.c.ZkStateReader Updated live nodes from ZooKeeper... (0) -> (4)
   [junit4]   2> 563955 INFO  (qtp323510557-6945) [n:127.0.0.1:39003_solr    ] o.a.s.h.a.CollectionsHandler Invoked Collection Action :delete with params name=SearchRateTriggerTest-collection1&action=DELETE&wt=javabin&version=2 and sendToOCPQueue=true
   [junit4]   2> 563956 INFO  (OverseerThreadFactory-2563-thread-2) [    ] o.a.s.c.a.c.OverseerCollectionMessageHandler Executing Collection Cmd=action=UNLOAD&deleteInstanceDir=true&deleteDataDir=true, asyncId=null
   [junit4]   2> 563959 INFO  (qtp1516368068-6938) [n:127.0.0.1:46619_solr    x:SearchRateTriggerTest-collection1_shard2_replica_n4] o.a.s.m.SolrMetricManager Closing metric reporters for registry=solr.core.SearchRateTriggerTest-collection1.shard2.replica_n4, tag=null
   [junit4]   2> 563959 INFO  (qtp1097306309-6935) [n:127.0.0.1:43983_solr    x:SearchRateTriggerTest-collection1_shard1_replica_n2] o.a.s.m.SolrMetricManager Closing metric reporters for registry=solr.core.SearchRateTriggerTest-collection1.shard1.replica_n2, tag=null
   [junit4]   2> 563959 INFO  (qtp1516368068-6938) [n:127.0.0.1:46619_solr    x:SearchRateTriggerTest-collection1_shard2_replica_n4] o.a.s.m.r.SolrJmxReporter Closing reporter [org.apache.solr.metrics.reporters.SolrJmxReporter@5cf073b3: rootName = solr_46619, domain = solr.core.SearchRateTriggerTest-collection1.shard2.replica_n4, service url = null, agent id = null] for registry solr.core.SearchRateTriggerTest-collection1.shard2.replica_n4 / com.codahale.metrics.MetricRegistry@5c41cecd
   [junit4]   2> 563959 INFO  (qtp323510557-7061) [n:127.0.0.1:39003_solr    x:SearchRateTriggerTest-collection1_shard1_replica_n1] o.a.s.m.SolrMetricManager Closing metric reporters for registry=solr.core.SearchRateTriggerTest-collection1.shard1.replica_n1, tag=null
   [junit4]   2> 563959 INFO  (qtp1097306309-6935) [n:127.0.0.1:43983_solr    x:SearchRateTriggerTest-collection1_shard1_replica_n2] o.a.s.m.r.SolrJmxReporter Closing reporter [org.apache.solr.metrics.reporters.SolrJmxReporter@45ea4a4a: rootName = solr_43983, domain = solr.core.SearchRateTriggerTest-collection1.shard1.replica_n2, service url = null, agent id = null] for registry solr.core.SearchRateTriggerTest-collection1.shard1.replica_n2 / com.codahale.metrics.MetricRegistry@5aa1f4b4
   [junit4]   2> 563959 INFO  (qtp323510557-7061) [n:127.0.0.1:39003_solr    x:SearchRateTriggerTest-collection1_shard1_replica_n1] o.a.s.m.r.SolrJmxReporter Closing reporter [org.apache.solr.metrics.reporters.SolrJmxReporter@7d491a27: rootName = solr_39003, domain = solr.core.SearchRateTriggerTest-collection1.shard1.replica_n1, service url = null, agent id = null] for registry solr.core.SearchRateTriggerTest-collection1.shard1.replica_n1 / com.codahale.metrics.MetricRegistry@16263465
   [junit4]   2> 563959 INFO  (qtp1082039859-6948) [n:127.0.0.1:34329_solr    x:SearchRateTriggerTest-collection1_shard2_replica_n6] o.a.s.m.SolrMetricManager Closing metric reporters for regist

[...truncated too long message...]

4]   2> 587038 INFO  (zkCallback-1672-thread-1) [    ] o.a.s.c.c.ZkStateReader Updated live nodes from ZooKeeper... (2) -> (1)
   [junit4]   2> 587038 INFO  (zkCallback-1657-thread-2) [    ] o.a.s.c.c.ZkStateReader Updated live nodes from ZooKeeper... (2) -> (1)
   [junit4]   2> 587038 INFO  (zkCallback-1682-thread-1) [    ] o.a.s.c.c.ZkStateReader Updated live nodes from ZooKeeper... (2) -> (1)
   [junit4]   2> 587038 INFO  (zkCallback-1655-thread-2) [    ] o.a.s.c.c.ZkStateReader Updated live nodes from ZooKeeper... (2) -> (1)
   [junit4]   2> 587038 INFO  (zkCallback-1653-thread-1) [    ] o.a.s.c.c.ZkStateReader Updated live nodes from ZooKeeper... (2) -> (1)
   [junit4]   2> 587042 INFO  (jetty-closer-1626-thread-2) [    ] o.a.s.m.SolrMetricManager Closing metric reporters for registry=solr.cluster, tag=null
   [junit4]   2> 587043 INFO  (zkCallback-1661-thread-2) [    ] o.a.s.c.c.ZkStateReader Updated live nodes from ZooKeeper... (2) -> (1)
   [junit4]   2> 587046 INFO  (jetty-closer-1626-thread-4) [    ] o.a.s.c.ZkController Remove node as live in ZooKeeper:/live_nodes/127.0.0.1:43983_solr
   [junit4]   2> 587047 INFO  (jetty-closer-1626-thread-1) [    ] o.e.j.s.h.ContextHandler Stopped o.e.j.s.ServletContextHandler@4c7c565{/solr,null,UNAVAILABLE}
   [junit4]   2> 587047 INFO  (jetty-closer-1626-thread-1) [    ] o.e.j.s.session node0 Stopped scavenging
   [junit4]   2> 587048 INFO  (zkCallback-1653-thread-2) [    ] o.a.s.c.c.ZkStateReader Updated live nodes from ZooKeeper... (1) -> (0)
   [junit4]   2> 587048 INFO  (zkCallback-1672-thread-1) [    ] o.a.s.c.c.ZkStateReader Updated live nodes from ZooKeeper... (1) -> (0)
   [junit4]   2> 587048 INFO  (zkCallback-1657-thread-2) [    ] o.a.s.c.c.ZkStateReader Updated live nodes from ZooKeeper... (1) -> (0)
   [junit4]   2> 587048 INFO  (jetty-closer-1626-thread-4) [    ] o.a.s.m.SolrMetricManager Closing metric reporters for registry=solr.cluster, tag=null
   [junit4]   2> 587048 INFO  (zkCallback-1661-thread-2) [    ] o.a.s.c.c.ZkStateReader Updated live nodes from ZooKeeper... (1) -> (0)
   [junit4]   2> 587050 INFO  (jetty-closer-1626-thread-3) [    ] o.e.j.s.h.ContextHandler Stopped o.e.j.s.ServletContextHandler@7bce33f2{/solr,null,UNAVAILABLE}
   [junit4]   2> 587051 INFO  (jetty-closer-1626-thread-4) [    ] o.a.s.c.Overseer Overseer (id=72174114558640138-127.0.0.1:43983_solr-n_0000000000) closing
   [junit4]   2> 587052 INFO  (OverseerStateUpdate-72174114558640138-127.0.0.1:43983_solr-n_0000000000) [    ] o.a.s.c.Overseer Overseer Loop exiting : 127.0.0.1:43983_solr
   [junit4]   2> 587052 WARN  (OverseerAutoScalingTriggerThread-72174114558640138-127.0.0.1:43983_solr-n_0000000000) [    ] o.a.s.c.a.OverseerTriggerThread OverseerTriggerThread woken up but we are closed, exiting.
   [junit4]   2> 587052 INFO  (jetty-closer-1626-thread-3) [    ] o.e.j.s.session node0 Stopped scavenging
   [junit4]   2> 587061 INFO  (zkCallback-1661-thread-2) [    ] o.a.s.c.OverseerElectionContext I am going to be the leader 127.0.0.1:39003_solr
   [junit4]   2> 587061 INFO  (jetty-closer-1626-thread-4) [    ] o.e.j.s.h.ContextHandler Stopped o.e.j.s.ServletContextHandler@5c40be20{/solr,null,UNAVAILABLE}
   [junit4]   2> 587062 INFO  (jetty-closer-1626-thread-4) [    ] o.e.j.s.session node0 Stopped scavenging
   [junit4]   2> 588551 WARN  (zkCallback-1682-thread-1) [    ] o.a.s.c.c.ZkStateReader ZooKeeper watch triggered, but Solr cannot talk to ZK: [KeeperErrorCode = Session expired for /live_nodes]
   [junit4]   2> 588552 INFO  (jetty-closer-1626-thread-2) [    ] o.e.j.s.h.ContextHandler Stopped o.e.j.s.ServletContextHandler@6a7d89bc{/solr,null,UNAVAILABLE}
   [junit4]   2> 588552 INFO  (jetty-closer-1626-thread-2) [    ] o.e.j.s.session node0 Stopped scavenging
   [junit4]   2> 588553 ERROR (SUITE-SearchRateTriggerTest-seed#[ACE70F29547CDD7B]-worker) [    ] o.a.z.s.ZooKeeperServer ZKShutdownHandler is not registered, so ZooKeeper server won't take any action on ERROR or SHUTDOWN server state changes
   [junit4]   2> 588553 INFO  (SUITE-SearchRateTriggerTest-seed#[ACE70F29547CDD7B]-worker) [    ] o.a.s.c.ZkTestServer connecting to 127.0.0.1:32877 32877
   [junit4]   2> 589412 INFO  (Thread-1914) [    ] o.a.s.c.ZkTestServer connecting to 127.0.0.1:32877 32877
   [junit4]   2> 589412 WARN  (Thread-1914) [    ] o.a.s.c.ZkTestServer Watch limit violations:
   [junit4]   2> Maximum concurrent create/delete watches above limit:
   [junit4]   2>
   [junit4]   2> 15 /solr/collections/SearchRateTriggerTest-collection1/terms/shard1
   [junit4]   2> 15 /solr/collections/SearchRateTriggerTest-collection1/terms/shard2
   [junit4]   2> 12 /solr/aliases.json
   [junit4]   2> 8 /solr/configs/conf
   [junit4]   2> 8 /solr/collections/SearchRateTriggerTest-collection2/terms/shard2
   [junit4]   2> 8 /solr/collections/SearchRateTriggerTest-collection2/terms/shard1
   [junit4]   2> 4 /solr/security.json
   [junit4]   2>
   [junit4]   2> Maximum concurrent data watches above limit:
   [junit4]   2>
   [junit4]   2> 12 /solr/clusterprops.json
   [junit4]   2> 12 /solr/clusterstate.json
   [junit4]   2> 8 /solr/collections/SearchRateTriggerTest-collection1/state.json
   [junit4]   2> 4 /solr/collections/SearchRateTriggerTest-collection2/state.json
   [junit4]   2> 3 /solr/overseer_elect/election/72174114558640138-127.0.0.1:43983_solr-n_0000000000
   [junit4]   2>
   [junit4]   2> Maximum concurrent children watches above limit:
   [junit4]   2>
   [junit4]   2> 25 /solr/collections
   [junit4]   2> 12 /solr/live_nodes
   [junit4]   2>
   [junit4]   2> NOTE: leaving temporary files on disk at: /home/jenkins/workspace/Lucene-Solr-master-Linux/solr/build/solr-core/test/J0/temp/solr.cloud.autoscaling.SearchRateTriggerTest_ACE70F29547CDD7B-001
   [junit4]   2> NOTE: test params are: codec=Asserting(Lucene70): {}, docValues:{}, maxPointsInLeafNode=566, maxMBSortInHeap=5.010675437339685, sim=Asserting(org.apache.lucene.search.similarities.AssertingSimilarity@1d0b98b2), locale=en-VC, timezone=Europe/Belgrade
   [junit4]   2> NOTE: Linux 4.13.0-39-generic amd64/Oracle Corporation 11-ea (64-bit)/cpus=8,threads=1,free=124229656,total=375390208
   [junit4]   2> NOTE: All tests run in this JVM: [SchemaApiFailureTest, TestTrieFacet, TestDistributedSearch, XmlUpdateRequestHandlerTest, OpenCloseCoreStressTest, TestCloudNestedDocsSort, TestImplicitCoreProperties, CloneFieldUpdateProcessorFactoryTest, SynonymTokenizerTest, TestSolrFieldCacheBean, TestCloudRecovery, TestUnifiedSolrHighlighter, ScheduledTriggerIntegrationTest, TestComponentsName, DocValuesNotIndexedTest, PeerSyncReplicationTest, HLLSerializationTest, LeaderFailureAfterFreshStartTest, SolrIndexConfigTest, TestBlendedInfixSuggestions, DistanceUnitsTest, TestManagedSchemaAPI, BasicAuthStandaloneTest, TestBulkSchemaConcurrent, TestSort, DocumentAnalysisRequestHandlerTest, TriggerCooldownIntegrationTest, DistribJoinFromCollectionTest, EnumFieldTest, RegexBytesRefFilterTest, TestCustomStream, TestCrossCoreJoin, TestNumericTokenStream, TestJoin, BlobRepositoryCloudTest, TestHdfsCloudBackupRestore, SmileWriterTest, CreateRoutedAliasTest, MetricTriggerIntegrationTest, SolrSlf4jReporterTest, TestPayloadScoreQParserPlugin, TestSchemaNameResource, SolrRequestParserTest, TestCollationFieldDocValues, TestTestInjection, TestSchemaVersionResource, MetricsConfigTest, SecurityConfHandlerTest, TestBinaryField, InfoHandlerTest, TestIntervalFaceting, ExitableDirectoryReaderTest, NodeAddedTriggerTest, TestManagedStopFilterFactory, BadCopyFieldTest, TestReloadDeadlock, TestQuerySenderNoQuery, CollectionStateFormat2Test, TestExecutePlanAction, OverseerRolesTest, TestReplicationHandlerBackup, DistributedFacetPivotLongTailTest, CustomCollectionTest, CdcrReplicationHandlerTest, MoveReplicaHDFSTest, DistributedTermsComponentTest, TestHashQParserPlugin, TestRawTransformer, TestPKIAuthenticationPlugin, TestMaxScoreQueryParser, OutputWriterTest, TestPseudoReturnFields, SolrGraphiteReporterTest, HdfsSyncSliceTest, TestLockTree, BinaryUpdateRequestHandlerTest, HighlighterConfigTest, SolrPluginUtilsTest, RequestHandlersTest, IgnoreLargeDocumentProcessorFactoryTest, TestLegacyFieldReuse, AssignTest, TestNRTOpen, SolrIndexMetricsTest, TestDocSet, TestHighFrequencyDictionaryFactory, TestHashPartitioner, TestStressLucene, TestPHPSerializedResponseWriter, StatsComponentTest, OpenExchangeRatesOrgProviderTest, TestLMDirichletSimilarityFactory, SolrIndexSplitterTest, TestConfig, BitVectorTest, TestExactStatsCache, HdfsChaosMonkeyNothingIsSafeTest, TestCloudJSONFacetJoinDomain, TestWriterPerf, TestSolrConfigHandlerConcurrent, UUIDFieldTest, SearchRateTriggerTest]
   [junit4] Completed [251/806 (1!)] on J0 in 45.54s, 3 tests, 1 failure <<< FAILURES!

[...truncated 45695 lines...]
[repro] Jenkins log URL: https://jenkins.thetaphi.de/job/Lucene-Solr-master-Linux/22023/consoleText

[repro] Revision: 0c3628920afdc27bbaf1c057bf6519319ea78e51

[repro] Ant options: "-Dargs=-XX:+UseCompressedOops -XX:+UseG1GC"
[repro] Repro line:  ant test  -Dtestcase=SearchRateTriggerTest -Dtests.method=testTrigger -Dtests.seed=ACE70F29547CDD7B -Dtests.multiplier=3 -Dtests.slow=true -Dtests.locale=en-VC -Dtests.timezone=Europe/Belgrade -Dtests.asserts=true -Dtests.file.encoding=US-ASCII

[repro] ant clean

[...truncated 6 lines...]
[repro] Test suites by module:
[repro]    solr/core
[repro]       SearchRateTriggerTest
[repro] ant compile-test

[...truncated 3303 lines...]
[repro] ant test-nocompile -Dtests.dups=5 -Dtests.maxfailures=5 -Dtests.class="*.SearchRateTriggerTest" -Dtests.showOutput=onerror "-Dargs=-XX:+UseCompressedOops -XX:+UseG1GC" -Dtests.seed=ACE70F29547CDD7B -Dtests.multiplier=3 -Dtests.slow=true -Dtests.locale=en-VC -Dtests.timezone=Europe/Belgrade -Dtests.asserts=true -Dtests.file.encoding=US-ASCII

[...truncated 86 lines...]
[repro] Failures:
[repro]   0/5 failed: org.apache.solr.cloud.autoscaling.SearchRateTriggerTest
[repro] Exiting with code 0

[...truncated 40 lines...]


---------------------------------------------------------------------
To unsubscribe, e-mail: [hidden email]
For additional commands, e-mail: [hidden email]