[JENKINS] Lucene-Solr-master-Linux (64bit/jdk1.8.0_144) - Build # 20464 - Unstable!

Previous Topic Next Topic
 
classic Classic list List threaded Threaded
2 messages Options
Reply | Threaded
Open this post in threaded view
|

[JENKINS] Lucene-Solr-master-Linux (64bit/jdk1.8.0_144) - Build # 20464 - Unstable!

Policeman Jenkins Server-2
Build: https://jenkins.thetaphi.de/job/Lucene-Solr-master-Linux/20464/
Java: 64bit/jdk1.8.0_144 -XX:-UseCompressedOops -XX:+UseConcMarkSweepGC

1 tests failed.
FAILED:  junit.framework.TestSuite.org.apache.solr.cloud.TestSolrCloudWithSecureImpersonation

Error Message:
2 threads leaked from SUITE scope at org.apache.solr.cloud.TestSolrCloudWithSecureImpersonation:     1) Thread[id=21006, name=jetty-launcher-4391-thread-2-EventThread, state=TIMED_WAITING, group=TGRP-TestSolrCloudWithSecureImpersonation]         at sun.misc.Unsafe.park(Native Method)         at java.util.concurrent.locks.LockSupport.parkNanos(LockSupport.java:215)         at java.util.concurrent.locks.AbstractQueuedSynchronizer.doAcquireSharedNanos(AbstractQueuedSynchronizer.java:1037)         at java.util.concurrent.locks.AbstractQueuedSynchronizer.tryAcquireSharedNanos(AbstractQueuedSynchronizer.java:1328)         at java.util.concurrent.CountDownLatch.await(CountDownLatch.java:277)         at org.apache.curator.CuratorZookeeperClient.internalBlockUntilConnectedOrTimedOut(CuratorZookeeperClient.java:323)         at org.apache.curator.RetryLoop.callWithRetry(RetryLoop.java:105)         at org.apache.curator.framework.imps.GetDataBuilderImpl.pathInForeground(GetDataBuilderImpl.java:288)         at org.apache.curator.framework.imps.GetDataBuilderImpl.forPath(GetDataBuilderImpl.java:279)         at org.apache.curator.framework.imps.GetDataBuilderImpl.forPath(GetDataBuilderImpl.java:41)         at org.apache.curator.framework.recipes.shared.SharedValue.readValue(SharedValue.java:244)         at org.apache.curator.framework.recipes.shared.SharedValue.access$100(SharedValue.java:44)         at org.apache.curator.framework.recipes.shared.SharedValue$1.process(SharedValue.java:61)         at org.apache.curator.framework.imps.NamespaceWatcher.process(NamespaceWatcher.java:67)         at org.apache.zookeeper.ClientCnxn$EventThread.processEvent(ClientCnxn.java:530)         at org.apache.zookeeper.ClientCnxn$EventThread.run(ClientCnxn.java:505)    2) Thread[id=21010, name=jetty-launcher-4391-thread-1-EventThread, state=TIMED_WAITING, group=TGRP-TestSolrCloudWithSecureImpersonation]         at sun.misc.Unsafe.park(Native Method)         at java.util.concurrent.locks.LockSupport.parkNanos(LockSupport.java:215)         at java.util.concurrent.locks.AbstractQueuedSynchronizer.doAcquireSharedNanos(AbstractQueuedSynchronizer.java:1037)         at java.util.concurrent.locks.AbstractQueuedSynchronizer.tryAcquireSharedNanos(AbstractQueuedSynchronizer.java:1328)         at java.util.concurrent.CountDownLatch.await(CountDownLatch.java:277)         at org.apache.curator.CuratorZookeeperClient.internalBlockUntilConnectedOrTimedOut(CuratorZookeeperClient.java:323)         at org.apache.curator.RetryLoop.callWithRetry(RetryLoop.java:105)         at org.apache.curator.framework.imps.GetDataBuilderImpl.pathInForeground(GetDataBuilderImpl.java:288)         at org.apache.curator.framework.imps.GetDataBuilderImpl.forPath(GetDataBuilderImpl.java:279)         at org.apache.curator.framework.imps.GetDataBuilderImpl.forPath(GetDataBuilderImpl.java:41)         at org.apache.curator.framework.recipes.shared.SharedValue.readValue(SharedValue.java:244)         at org.apache.curator.framework.recipes.shared.SharedValue.access$100(SharedValue.java:44)         at org.apache.curator.framework.recipes.shared.SharedValue$1.process(SharedValue.java:61)         at org.apache.curator.framework.imps.NamespaceWatcher.process(NamespaceWatcher.java:67)         at org.apache.zookeeper.ClientCnxn$EventThread.processEvent(ClientCnxn.java:530)         at org.apache.zookeeper.ClientCnxn$EventThread.run(ClientCnxn.java:505)

Stack Trace:
com.carrotsearch.randomizedtesting.ThreadLeakError: 2 threads leaked from SUITE scope at org.apache.solr.cloud.TestSolrCloudWithSecureImpersonation:
   1) Thread[id=21006, name=jetty-launcher-4391-thread-2-EventThread, state=TIMED_WAITING, group=TGRP-TestSolrCloudWithSecureImpersonation]
        at sun.misc.Unsafe.park(Native Method)
        at java.util.concurrent.locks.LockSupport.parkNanos(LockSupport.java:215)
        at java.util.concurrent.locks.AbstractQueuedSynchronizer.doAcquireSharedNanos(AbstractQueuedSynchronizer.java:1037)
        at java.util.concurrent.locks.AbstractQueuedSynchronizer.tryAcquireSharedNanos(AbstractQueuedSynchronizer.java:1328)
        at java.util.concurrent.CountDownLatch.await(CountDownLatch.java:277)
        at org.apache.curator.CuratorZookeeperClient.internalBlockUntilConnectedOrTimedOut(CuratorZookeeperClient.java:323)
        at org.apache.curator.RetryLoop.callWithRetry(RetryLoop.java:105)
        at org.apache.curator.framework.imps.GetDataBuilderImpl.pathInForeground(GetDataBuilderImpl.java:288)
        at org.apache.curator.framework.imps.GetDataBuilderImpl.forPath(GetDataBuilderImpl.java:279)
        at org.apache.curator.framework.imps.GetDataBuilderImpl.forPath(GetDataBuilderImpl.java:41)
        at org.apache.curator.framework.recipes.shared.SharedValue.readValue(SharedValue.java:244)
        at org.apache.curator.framework.recipes.shared.SharedValue.access$100(SharedValue.java:44)
        at org.apache.curator.framework.recipes.shared.SharedValue$1.process(SharedValue.java:61)
        at org.apache.curator.framework.imps.NamespaceWatcher.process(NamespaceWatcher.java:67)
        at org.apache.zookeeper.ClientCnxn$EventThread.processEvent(ClientCnxn.java:530)
        at org.apache.zookeeper.ClientCnxn$EventThread.run(ClientCnxn.java:505)
   2) Thread[id=21010, name=jetty-launcher-4391-thread-1-EventThread, state=TIMED_WAITING, group=TGRP-TestSolrCloudWithSecureImpersonation]
        at sun.misc.Unsafe.park(Native Method)
        at java.util.concurrent.locks.LockSupport.parkNanos(LockSupport.java:215)
        at java.util.concurrent.locks.AbstractQueuedSynchronizer.doAcquireSharedNanos(AbstractQueuedSynchronizer.java:1037)
        at java.util.concurrent.locks.AbstractQueuedSynchronizer.tryAcquireSharedNanos(AbstractQueuedSynchronizer.java:1328)
        at java.util.concurrent.CountDownLatch.await(CountDownLatch.java:277)
        at org.apache.curator.CuratorZookeeperClient.internalBlockUntilConnectedOrTimedOut(CuratorZookeeperClient.java:323)
        at org.apache.curator.RetryLoop.callWithRetry(RetryLoop.java:105)
        at org.apache.curator.framework.imps.GetDataBuilderImpl.pathInForeground(GetDataBuilderImpl.java:288)
        at org.apache.curator.framework.imps.GetDataBuilderImpl.forPath(GetDataBuilderImpl.java:279)
        at org.apache.curator.framework.imps.GetDataBuilderImpl.forPath(GetDataBuilderImpl.java:41)
        at org.apache.curator.framework.recipes.shared.SharedValue.readValue(SharedValue.java:244)
        at org.apache.curator.framework.recipes.shared.SharedValue.access$100(SharedValue.java:44)
        at org.apache.curator.framework.recipes.shared.SharedValue$1.process(SharedValue.java:61)
        at org.apache.curator.framework.imps.NamespaceWatcher.process(NamespaceWatcher.java:67)
        at org.apache.zookeeper.ClientCnxn$EventThread.processEvent(ClientCnxn.java:530)
        at org.apache.zookeeper.ClientCnxn$EventThread.run(ClientCnxn.java:505)
        at __randomizedtesting.SeedInfo.seed([5E4B56366EC81903]:0)




Build Log:
[...truncated 13004 lines...]
   [junit4] Suite: org.apache.solr.cloud.TestSolrCloudWithSecureImpersonation
   [junit4]   2> Creating dataDir: /home/jenkins/workspace/Lucene-Solr-master-Linux/solr/build/solr-core/test/J1/temp/solr.cloud.TestSolrCloudWithSecureImpersonation_5E4B56366EC81903-001/init-core-data-001
   [junit4]   2> 2286485 INFO  (SUITE-TestSolrCloudWithSecureImpersonation-seed#[5E4B56366EC81903]-worker) [    ] o.a.s.SolrTestCaseJ4 Using PointFields (NUMERIC_POINTS_SYSPROP=true) w/NUMERIC_DOCVALUES_SYSPROP=true
   [junit4]   2> 2286487 INFO  (SUITE-TestSolrCloudWithSecureImpersonation-seed#[5E4B56366EC81903]-worker) [    ] o.a.s.SolrTestCaseJ4 Randomized ssl (false) and clientAuth (false) via: @org.apache.solr.util.RandomizeSSL(reason=, value=NaN, ssl=NaN, clientAuth=NaN)
   [junit4]   2> 2286487 INFO  (SUITE-TestSolrCloudWithSecureImpersonation-seed#[5E4B56366EC81903]-worker) [    ] o.a.s.SolrTestCaseJ4 SecureRandom sanity checks: test.solr.allowed.securerandom=null & java.security.egd=file:/dev/./urandom
   [junit4]   2> 2286512 INFO  (SUITE-TestSolrCloudWithSecureImpersonation-seed#[5E4B56366EC81903]-worker) [    ] o.a.s.c.MiniSolrCloudCluster Starting cluster of 2 servers in /home/jenkins/workspace/Lucene-Solr-master-Linux/solr/build/solr-core/test/J1/temp/solr.cloud.TestSolrCloudWithSecureImpersonation_5E4B56366EC81903-001/tempDir-001
   [junit4]   2> 2286512 INFO  (SUITE-TestSolrCloudWithSecureImpersonation-seed#[5E4B56366EC81903]-worker) [    ] o.a.s.c.ZkTestServer STARTING ZK TEST SERVER
   [junit4]   2> 2286513 INFO  (Thread-4407) [    ] o.a.s.c.ZkTestServer client port:0.0.0.0/0.0.0.0:0
   [junit4]   2> 2286513 INFO  (Thread-4407) [    ] o.a.s.c.ZkTestServer Starting server
   [junit4]   2> 2286515 ERROR (Thread-4407) [    ] o.a.z.s.ZooKeeperServer ZKShutdownHandler is not registered, so ZooKeeper server won't take any action on ERROR or SHUTDOWN server state changes
   [junit4]   2> 2286613 INFO  (SUITE-TestSolrCloudWithSecureImpersonation-seed#[5E4B56366EC81903]-worker) [    ] o.a.s.c.ZkTestServer start zk server on port:33715
   [junit4]   2> 2286616 INFO  (jetty-launcher-4391-thread-1) [    ] o.e.j.s.Server jetty-9.3.20.v20170531
   [junit4]   2> 2286616 INFO  (jetty-launcher-4391-thread-2) [    ] o.e.j.s.Server jetty-9.3.20.v20170531
   [junit4]   2> 2286617 INFO  (jetty-launcher-4391-thread-1) [    ] o.e.j.s.h.ContextHandler Started o.e.j.s.ServletContextHandler@15b1d4ee{/solr,null,AVAILABLE}
   [junit4]   2> 2286617 INFO  (jetty-launcher-4391-thread-2) [    ] o.e.j.s.h.ContextHandler Started o.e.j.s.ServletContextHandler@4db368c9{/solr,null,AVAILABLE}
   [junit4]   2> 2286617 INFO  (jetty-launcher-4391-thread-1) [    ] o.e.j.s.AbstractConnector Started ServerConnector@4da1732c{HTTP/1.1,[http/1.1]}{127.0.0.1:37879}
   [junit4]   2> 2286617 INFO  (jetty-launcher-4391-thread-2) [    ] o.e.j.s.AbstractConnector Started ServerConnector@78c4c954{HTTP/1.1,[http/1.1]}{127.0.0.1:33729}
   [junit4]   2> 2286617 INFO  (jetty-launcher-4391-thread-1) [    ] o.e.j.s.Server Started @2287978ms
   [junit4]   2> 2286618 INFO  (jetty-launcher-4391-thread-1) [    ] o.a.s.c.s.e.JettySolrRunner Jetty properties: {hostContext=/solr, hostPort=37879}
   [junit4]   2> 2286618 ERROR (jetty-launcher-4391-thread-1) [    ] o.a.s.u.StartupLoggingUtils Missing Java Option solr.log.dir. Logging may be missing or incomplete.
   [junit4]   2> 2286618 INFO  (jetty-launcher-4391-thread-1) [    ] o.a.s.s.SolrDispatchFilter  ___      _       Welcome to Apache Solr™ version 8.0.0
   [junit4]   2> 2286618 INFO  (jetty-launcher-4391-thread-1) [    ] o.a.s.s.SolrDispatchFilter / __| ___| |_ _   Starting in cloud mode on port null
   [junit4]   2> 2286618 INFO  (jetty-launcher-4391-thread-1) [    ] o.a.s.s.SolrDispatchFilter \__ \/ _ \ | '_|  Install dir: null, Default config dir: null
   [junit4]   2> 2286619 INFO  (jetty-launcher-4391-thread-1) [    ] o.a.s.s.SolrDispatchFilter |___/\___/_|_|    Start time: 2017-09-13T14:28:35.845Z
   [junit4]   2> 2286617 INFO  (jetty-launcher-4391-thread-2) [    ] o.e.j.s.Server Started @2287978ms
   [junit4]   2> 2286619 INFO  (jetty-launcher-4391-thread-2) [    ] o.a.s.c.s.e.JettySolrRunner Jetty properties: {hostContext=/solr, hostPort=33729}
   [junit4]   2> 2286619 ERROR (jetty-launcher-4391-thread-2) [    ] o.a.s.u.StartupLoggingUtils Missing Java Option solr.log.dir. Logging may be missing or incomplete.
   [junit4]   2> 2286619 INFO  (jetty-launcher-4391-thread-2) [    ] o.a.s.s.SolrDispatchFilter  ___      _       Welcome to Apache Solr™ version 8.0.0
   [junit4]   2> 2286619 INFO  (jetty-launcher-4391-thread-2) [    ] o.a.s.s.SolrDispatchFilter / __| ___| |_ _   Starting in cloud mode on port null
   [junit4]   2> 2286620 INFO  (jetty-launcher-4391-thread-2) [    ] o.a.s.s.SolrDispatchFilter \__ \/ _ \ | '_|  Install dir: null, Default config dir: null
   [junit4]   2> 2286620 INFO  (jetty-launcher-4391-thread-2) [    ] o.a.s.s.SolrDispatchFilter |___/\___/_|_|    Start time: 2017-09-13T14:28:35.846Z
   [junit4]   2> 2286621 INFO  (jetty-launcher-4391-thread-1) [    ] o.a.s.s.SolrDispatchFilter solr.xml found in ZooKeeper. Loading...
   [junit4]   2> 2286627 INFO  (jetty-launcher-4391-thread-2) [    ] o.a.s.s.SolrDispatchFilter solr.xml found in ZooKeeper. Loading...
   [junit4]   2> 2286627 INFO  (jetty-launcher-4391-thread-1) [    ] o.a.s.c.ZkContainer Zookeeper client=127.0.0.1:33715/solr
   [junit4]   2> 2286633 INFO  (jetty-launcher-4391-thread-2) [    ] o.a.s.c.ZkContainer Zookeeper client=127.0.0.1:33715/solr
   [junit4]   2> 2286671 INFO  (jetty-launcher-4391-thread-1) [n:127.0.0.1:37879_solr    ] o.a.s.c.Overseer Overseer (id=null) closing
   [junit4]   2> 2286671 INFO  (jetty-launcher-4391-thread-2) [n:127.0.0.1:33729_solr    ] o.a.s.c.Overseer Overseer (id=null) closing
   [junit4]   2> 2286672 INFO  (jetty-launcher-4391-thread-1) [n:127.0.0.1:37879_solr    ] o.a.s.c.OverseerElectionContext I am going to be the leader 127.0.0.1:37879_solr
   [junit4]   2> 2286672 INFO  (jetty-launcher-4391-thread-2) [n:127.0.0.1:33729_solr    ] o.a.s.c.ZkController Register node as live in ZooKeeper:/live_nodes/127.0.0.1:33729_solr
   [junit4]   2> 2286673 INFO  (jetty-launcher-4391-thread-1) [n:127.0.0.1:37879_solr    ] o.a.s.c.Overseer Overseer (id=98652187245936645-127.0.0.1:37879_solr-n_0000000000) starting
   [junit4]   2> 2286675 INFO  (zkCallback-4403-thread-1-processing-n:127.0.0.1:33729_solr) [n:127.0.0.1:33729_solr    ] o.a.s.c.c.ZkStateReader Updated live nodes from ZooKeeper... (0) -> (1)
   [junit4]   2> 2286675 INFO  (zkCallback-4402-thread-1-processing-n:127.0.0.1:37879_solr) [n:127.0.0.1:37879_solr    ] o.a.s.c.c.ZkStateReader Updated live nodes from ZooKeeper... (0) -> (1)
   [junit4]   2> 2286679 INFO  (jetty-launcher-4391-thread-1) [n:127.0.0.1:37879_solr    ] o.a.s.c.ZkController Register node as live in ZooKeeper:/live_nodes/127.0.0.1:37879_solr
   [junit4]   2> 2286680 INFO  (zkCallback-4402-thread-1-processing-n:127.0.0.1:37879_solr) [n:127.0.0.1:37879_solr    ] o.a.s.c.c.ZkStateReader Updated live nodes from ZooKeeper... (1) -> (2)
   [junit4]   2> 2286691 INFO  (zkCallback-4403-thread-1-processing-n:127.0.0.1:33729_solr) [n:127.0.0.1:33729_solr    ] o.a.s.c.c.ZkStateReader Updated live nodes from ZooKeeper... (1) -> (2)
   [junit4]   2> 2286723 INFO  (jetty-launcher-4391-thread-2) [n:127.0.0.1:33729_solr    ] o.a.s.c.CoreContainer Initializing authentication plugin: org.apache.solr.security.HttpParamDelegationTokenPlugin
   [junit4]   2> 2286723 WARN  (jetty-launcher-4391-thread-2) [n:127.0.0.1:33729_solr    ] o.a.s.c.s.i.Krb5HttpClientBuilder org.apache.solr.client.solrj.impl.Krb5HttpClientBuilder is configured without specifying system property 'java.security.auth.login.config'
   [junit4]   2> 2286723 INFO  (jetty-launcher-4391-thread-2) [n:127.0.0.1:33729_solr    ] o.a.s.s.KerberosPlugin Params: {solr.kerberos.impersonator.user.noGroups.hosts=*, solr.kerberos.impersonator.user.bogusGroup.groups=__some_bogus_group, token.valid=30, cookie.domain=127.0.0.1, solr.kerberos.impersonator.user.anyHostAnyUser.groups=*, solr.kerberos.impersonator.user.bogusGroup.hosts=*, solr.kerberos.impersonator.user.anyHostAnyUser.hosts=*, token.validity=36000, solr.kerberos.impersonator.user.noHosts.groups=*, type=kerberos, solr.kerberos.impersonator.user.localHostAnyGroup.groups=*, delegation-token.token-kind=solr-dt, solr.kerberos.impersonator.user.wrongHost.hosts=1.1.1.1.1.1, cookie.path=/, zk-dt-secret-manager.znodeWorkingPath=solr/security/zkdtsm, solr.kerberos.impersonator.user.localHostAnyGroup.hosts=localhost.localdomain,localhost,127.0.0.1, signer.secret.provider.zookeeper.path=/token, solr.kerberos.impersonator.user.anyHostUsersGroup.groups=jenkins, zk-dt-secret-manager.enable=true, solr.kerberos.impersonator.user.wrongHost.groups=*, kerberos.name.rules=DEFAULT, signer.secret.provider=zookeeper, solr.kerberos.impersonator.user.anyHostUsersGroup.hosts=*}
   [junit4]   2> 2286724 INFO  (jetty-launcher-4391-thread-2) [n:127.0.0.1:33729_solr    ] o.a.c.f.i.CuratorFrameworkImpl Starting
   [junit4]   2> 2286726 INFO  (jetty-launcher-4391-thread-2-EventThread) [n:127.0.0.1:33729_solr    ] o.a.c.f.s.ConnectionStateManager State change: CONNECTED
   [junit4]   2> 2286730 INFO  (jetty-launcher-4391-thread-1) [n:127.0.0.1:37879_solr    ] o.a.s.c.CoreContainer Initializing authentication plugin: org.apache.solr.security.HttpParamDelegationTokenPlugin
   [junit4]   2> 2286730 WARN  (jetty-launcher-4391-thread-1) [n:127.0.0.1:37879_solr    ] o.a.s.c.s.i.Krb5HttpClientBuilder org.apache.solr.client.solrj.impl.Krb5HttpClientBuilder is configured without specifying system property 'java.security.auth.login.config'
   [junit4]   2> 2286731 INFO  (jetty-launcher-4391-thread-1) [n:127.0.0.1:37879_solr    ] o.a.s.s.KerberosPlugin Params: {solr.kerberos.impersonator.user.noGroups.hosts=*, solr.kerberos.impersonator.user.bogusGroup.groups=__some_bogus_group, token.valid=30, cookie.domain=127.0.0.1, solr.kerberos.impersonator.user.anyHostAnyUser.groups=*, solr.kerberos.impersonator.user.bogusGroup.hosts=*, solr.kerberos.impersonator.user.anyHostAnyUser.hosts=*, token.validity=36000, solr.kerberos.impersonator.user.noHosts.groups=*, type=kerberos, solr.kerberos.impersonator.user.localHostAnyGroup.groups=*, delegation-token.token-kind=solr-dt, solr.kerberos.impersonator.user.wrongHost.hosts=1.1.1.1.1.1, cookie.path=/, zk-dt-secret-manager.znodeWorkingPath=solr/security/zkdtsm, solr.kerberos.impersonator.user.localHostAnyGroup.hosts=localhost.localdomain,localhost,127.0.0.1, signer.secret.provider.zookeeper.path=/token, solr.kerberos.impersonator.user.anyHostUsersGroup.groups=jenkins, zk-dt-secret-manager.enable=true, solr.kerberos.impersonator.user.wrongHost.groups=*, kerberos.name.rules=DEFAULT, signer.secret.provider=zookeeper, solr.kerberos.impersonator.user.anyHostUsersGroup.hosts=*}
   [junit4]   2> 2286731 INFO  (jetty-launcher-4391-thread-1) [n:127.0.0.1:37879_solr    ] o.a.c.f.i.CuratorFrameworkImpl Starting
   [junit4]   2> 2286732 INFO  (jetty-launcher-4391-thread-1-EventThread) [n:127.0.0.1:37879_solr    ] o.a.c.f.s.ConnectionStateManager State change: CONNECTED
   [junit4]   2> 2287741 WARN  (jetty-launcher-4391-thread-2) [n:127.0.0.1:33729_solr    ] o.a.s.c.s.i.Krb5HttpClientBuilder org.apache.solr.client.solrj.impl.Krb5HttpClientBuilder is configured without specifying system property 'java.security.auth.login.config'
   [junit4]   2> 2287765 WARN  (jetty-launcher-4391-thread-1) [n:127.0.0.1:37879_solr    ] o.a.s.c.s.i.Krb5HttpClientBuilder org.apache.solr.client.solrj.impl.Krb5HttpClientBuilder is configured without specifying system property 'java.security.auth.login.config'
   [junit4]   2> 2287774 INFO  (jetty-launcher-4391-thread-2) [n:127.0.0.1:33729_solr    ] o.a.s.m.r.SolrJmxReporter JMX monitoring for 'solr_33729.solr.node' (registry 'solr.node') enabled at server: com.sun.jmx.mbeanserver.JmxMBeanServer@279bbd09
   [junit4]   2> 2287781 INFO  (jetty-launcher-4391-thread-2) [n:127.0.0.1:33729_solr    ] o.a.s.m.r.SolrJmxReporter JMX monitoring for 'solr_33729.solr.jvm' (registry 'solr.jvm') enabled at server: com.sun.jmx.mbeanserver.JmxMBeanServer@279bbd09
   [junit4]   2> 2287781 INFO  (jetty-launcher-4391-thread-2) [n:127.0.0.1:33729_solr    ] o.a.s.m.r.SolrJmxReporter JMX monitoring for 'solr_33729.solr.jetty' (registry 'solr.jetty') enabled at server: com.sun.jmx.mbeanserver.JmxMBeanServer@279bbd09
   [junit4]   2> 2287781 INFO  (jetty-launcher-4391-thread-2) [n:127.0.0.1:33729_solr    ] o.a.s.c.CorePropertiesLocator Found 0 core definitions underneath /home/jenkins/workspace/Lucene-Solr-master-Linux/solr/build/solr-core/test/J1/temp/solr.cloud.TestSolrCloudWithSecureImpersonation_5E4B56366EC81903-001/tempDir-001/node2/.
   [junit4]   2> 2287791 INFO  (jetty-launcher-4391-thread-1) [n:127.0.0.1:37879_solr    ] o.a.s.m.r.SolrJmxReporter JMX monitoring for 'solr_37879.solr.node' (registry 'solr.node') enabled at server: com.sun.jmx.mbeanserver.JmxMBeanServer@279bbd09
   [junit4]   2> 2287796 INFO  (jetty-launcher-4391-thread-1) [n:127.0.0.1:37879_solr    ] o.a.s.m.r.SolrJmxReporter JMX monitoring for 'solr_37879.solr.jvm' (registry 'solr.jvm') enabled at server: com.sun.jmx.mbeanserver.JmxMBeanServer@279bbd09
   [junit4]   2> 2287796 INFO  (jetty-launcher-4391-thread-1) [n:127.0.0.1:37879_solr    ] o.a.s.m.r.SolrJmxReporter JMX monitoring for 'solr_37879.solr.jetty' (registry 'solr.jetty') enabled at server: com.sun.jmx.mbeanserver.JmxMBeanServer@279bbd09
   [junit4]   2> 2287797 INFO  (jetty-launcher-4391-thread-1) [n:127.0.0.1:37879_solr    ] o.a.s.c.CorePropertiesLocator Found 0 core definitions underneath /home/jenkins/workspace/Lucene-Solr-master-Linux/solr/build/solr-core/test/J1/temp/solr.cloud.TestSolrCloudWithSecureImpersonation_5E4B56366EC81903-001/tempDir-001/node1/.
   [junit4]   2> 2287819 INFO  (TEST-TestSolrCloudWithSecureImpersonation.testProxyNoConfigGroups-seed#[5E4B56366EC81903]) [    ] o.a.s.SolrTestCaseJ4 ###Starting testProxyNoConfigGroups
   [junit4]   2> 2287825 INFO  (TEST-TestSolrCloudWithSecureImpersonation.testProxyNoConfigGroups-seed#[5E4B56366EC81903]) [    ] o.a.s.SolrTestCaseJ4 ###Ending testProxyNoConfigGroups
   [junit4]   2> 2287835 INFO  (TEST-TestSolrCloudWithSecureImpersonation.testProxyUnknownRemote-seed#[5E4B56366EC81903]) [    ] o.a.s.SolrTestCaseJ4 ###Starting testProxyUnknownRemote
   [junit4]   2> 2288048 INFO  (TEST-TestSolrCloudWithSecureImpersonation.testProxyUnknownRemote-seed#[5E4B56366EC81903]) [    ] o.a.s.SolrTestCaseJ4 ###Ending testProxyUnknownRemote
   [junit4]   2> 2288058 INFO  (TEST-TestSolrCloudWithSecureImpersonation.testProxyInvalidGroup-seed#[5E4B56366EC81903]) [    ] o.a.s.SolrTestCaseJ4 ###Starting testProxyInvalidGroup
   [junit4]   2> 2288069 WARN  (qtp1262718235-20977) [    ] o.a.h.s.ShellBasedUnixGroupsMapping got exception trying to get groups for user bar: id: ‘bar’: no such user
   [junit4]   2> id: ‘bar’: no such user
   [junit4]   2>
   [junit4]   2> 2288070 INFO  (TEST-TestSolrCloudWithSecureImpersonation.testProxyInvalidGroup-seed#[5E4B56366EC81903]) [    ] o.a.s.SolrTestCaseJ4 ###Ending testProxyInvalidGroup
   [junit4]   2> 2288081 INFO  (TEST-TestSolrCloudWithSecureImpersonation.testProxyWrongHost-seed#[5E4B56366EC81903]) [    ] o.a.s.SolrTestCaseJ4 ###Starting testProxyWrongHost
   [junit4]   2> 2303095 WARN  (jetty-launcher-4391-thread-2-SendThread(127.0.0.1:33715)) [n:127.0.0.1:33729_solr    ] o.a.z.ClientCnxn Client session timed out, have not heard from server in 15313ms for sessionid 0x15e7ba4411c0006
   [junit4]   2> 2303095 WARN  (jetty-launcher-4391-thread-1-SendThread(127.0.0.1:33715)) [n:127.0.0.1:37879_solr    ] o.a.z.ClientCnxn Client session timed out, have not heard from server in 15320ms for sessionid 0x15e7ba4411c0008
   [junit4]   2> 2303095 WARN  (NIOServerCxn.Factory:0.0.0.0/0.0.0.0:0) [    ] o.a.z.s.NIOServerCnxn caught end of stream exception
   [junit4]   2> EndOfStreamException: Unable to read additional data from client sessionid 0x15e7ba4411c0006, likely client has closed socket
   [junit4]   2> at org.apache.zookeeper.server.NIOServerCnxn.doIO(NIOServerCnxn.java:239)
   [junit4]   2> at org.apache.zookeeper.server.NIOServerCnxnFactory.run(NIOServerCnxnFactory.java:203)
   [junit4]   2> at java.lang.Thread.run(Thread.java:748)
   [junit4]   2> 2303095 WARN  (NIOServerCxn.Factory:0.0.0.0/0.0.0.0:0) [    ] o.a.z.s.NIOServerCnxn caught end of stream exception
   [junit4]   2> EndOfStreamException: Unable to read additional data from client sessionid 0x15e7ba4411c0008, likely client has closed socket
   [junit4]   2> at org.apache.zookeeper.server.NIOServerCnxn.doIO(NIOServerCnxn.java:239)
   [junit4]   2> at org.apache.zookeeper.server.NIOServerCnxnFactory.run(NIOServerCnxnFactory.java:203)
   [junit4]   2> at java.lang.Thread.run(Thread.java:748)
   [junit4]   2> 2303096 WARN  (jetty-launcher-4391-thread-2-SendThread(127.0.0.1:33715)) [n:127.0.0.1:33729_solr    ] o.a.z.ClientCnxn Client session timed out, have not heard from server in 15321ms for sessionid 0x15e7ba4411c0007
   [junit4]   2> 2303096 WARN  (jetty-launcher-4391-thread-1-SendThread(127.0.0.1:33715)) [n:127.0.0.1:37879_solr    ] o.a.z.ClientCnxn Client session timed out, have not heard from server in 15299ms for sessionid 0x15e7ba4411c0005
   [junit4]   2> 2303096 WARN  (NIOServerCxn.Factory:0.0.0.0/0.0.0.0:0) [    ] o.a.z.s.NIOServerCnxn caught end of stream exception
   [junit4]   2> EndOfStreamException: Unable to read additional data from client sessionid 0x15e7ba4411c0007, likely client has closed socket
   [junit4]   2> at org.apache.zookeeper.server.NIOServerCnxn.doIO(NIOServerCnxn.java:239)
   [junit4]   2> at org.apache.zookeeper.server.NIOServerCnxnFactory.run(NIOServerCnxnFactory.java:203)
   [junit4]   2> at java.lang.Thread.run(Thread.java:748)
   [junit4]   2> 2303096 WARN  (NIOServerCxn.Factory:0.0.0.0/0.0.0.0:0) [    ] o.a.z.s.NIOServerCnxn caught end of stream exception
   [junit4]   2> EndOfStreamException: Unable to read additional data from client sessionid 0x15e7ba4411c0005, likely client has closed socket
   [junit4]   2> at org.apache.zookeeper.server.NIOServerCnxn.doIO(NIOServerCnxn.java:239)
   [junit4]   2> at org.apache.zookeeper.server.NIOServerCnxnFactory.run(NIOServerCnxnFactory.java:203)
   [junit4]   2> at java.lang.Thread.run(Thread.java:748)
   [junit4]   2> 2303097 INFO  (TEST-TestSolrCloudWithSecureImpersonation.testProxyWrongHost-seed#[5E4B56366EC81903]) [    ] o.a.s.SolrTestCaseJ4 ###Ending testProxyWrongHost
   [junit4]   2> 2303107 INFO  (TEST-TestSolrCloudWithSecureImpersonation.testProxyValidateHost-seed#[5E4B56366EC81903]) [    ] o.a.s.SolrTestCaseJ4 ###Starting testProxyValidateHost
   [junit4]   2> 2303108 INFO  (qtp1262718235-20974) [n:127.0.0.1:33729_solr    ] o.a.s.h.a.CollectionsHandler Invoked Collection Action :list with params doAs=bar&action=LIST&wt=javabin&version=2 and sendToOCPQueue=true
   [junit4]   2> 2303108 INFO  (qtp1262718235-20974) [n:127.0.0.1:33729_solr    ] o.a.s.s.HttpSolrCall [admin] webapp=null path=/admin/collections params={doAs=bar&action=LIST&wt=javabin&version=2} status=0 QTime=0
   [junit4]   2> 2303108 INFO  (TEST-TestSolrCloudWithSecureImpersonation.testProxyValidateHost-seed#[5E4B56366EC81903]) [    ] o.a.s.SolrTestCaseJ4 ###Ending testProxyValidateHost
   [junit4]   2> 2303121 INFO  (TEST-TestSolrCloudWithSecureImpersonation.testProxyValidateAnyHostAnyUser-seed#[5E4B56366EC81903]) [    ] o.a.s.SolrTestCaseJ4 ###Starting testProxyValidateAnyHostAnyUser
   [junit4]   2> 2303122 INFO  (qtp1262718235-20976) [n:127.0.0.1:33729_solr    ] o.a.s.h.a.CollectionsHandler Invoked Collection Action :list with params doAs=bar&action=LIST&wt=javabin&version=2 and sendToOCPQueue=true
   [junit4]   2> 2303122 INFO  (qtp1262718235-20976) [n:127.0.0.1:33729_solr    ] o.a.s.s.HttpSolrCall [admin] webapp=null path=/admin/collections params={doAs=bar&action=LIST&wt=javabin&version=2} status=0 QTime=0
   [junit4]   2> 2303122 INFO  (TEST-TestSolrCloudWithSecureImpersonation.testProxyValidateAnyHostAnyUser-seed#[5E4B56366EC81903]) [    ] o.a.s.SolrTestCaseJ4 ###Ending testProxyValidateAnyHostAnyUser
   [junit4]   2> 2303149 INFO  (TEST-TestSolrCloudWithSecureImpersonation.testForwarding-seed#[5E4B56366EC81903]) [    ] o.a.s.SolrTestCaseJ4 ###Starting testForwarding
   [junit4]   2> 2303197 WARN  (zkCallback-4403-thread-1-processing-n:127.0.0.1:33729_solr) [n:127.0.0.1:33729_solr    ] o.a.s.c.c.ConnectionManager Watcher org.apache.solr.common.cloud.ConnectionManager@2a41293f name: ZooKeeperConnection Watcher:127.0.0.1:33715/solr got event WatchedEvent state:Disconnected type:None path:null path: null type: None
   [junit4]   2> 2303197 WARN  (zkCallback-4403-thread-1-processing-n:127.0.0.1:33729_solr) [n:127.0.0.1:33729_solr    ] o.a.s.c.c.ConnectionManager zkClient has disconnected
   [junit4]   2> 2303197 WARN  (zkCallback-4402-thread-3-processing-n:127.0.0.1:37879_solr) [n:127.0.0.1:37879_solr    ] o.a.s.c.c.ConnectionManager Watcher org.apache.solr.common.cloud.ConnectionManager@2f248498 name: ZooKeeperConnection Watcher:127.0.0.1:33715/solr got event WatchedEvent state:Disconnected type:None path:null path: null type: None
   [junit4]   2> 2303197 WARN  (zkCallback-4402-thread-3-processing-n:127.0.0.1:37879_solr) [n:127.0.0.1:37879_solr    ] o.a.s.c.c.ConnectionManager zkClient has disconnected
   [junit4]   2> 2303338 INFO  (TEST-TestSolrCloudWithSecureImpersonation.testForwarding-seed#[5E4B56366EC81903]) [    ] o.a.s.c.c.ZkStateReader Updated live nodes from ZooKeeper... (0) -> (2)
   [junit4]   2> 2303338 INFO  (TEST-TestSolrCloudWithSecureImpersonation.testForwarding-seed#[5E4B56366EC81903]) [    ] o.a.s.c.s.i.ZkClientClusterStateProvider Cluster at 127.0.0.1:33715/solr ready
   [junit4]   2> 2303339 INFO  (qtp1262718235-20962) [n:127.0.0.1:33729_solr    ] o.a.s.h.a.CollectionsHandler Invoked Collection Action :create with params pullReplicas=0&replicationFactor=1&collection.configName=conf1&maxShardsPerNode=1&name=forwardingCollection&nrtReplicas=1&action=CREATE&numShards=1&tlogReplicas=0&wt=javabin&version=2 and sendToOCPQueue=true
   [junit4]   2> 2304811 INFO  (jetty-launcher-4391-thread-2-EventThread) [n:127.0.0.1:33729_solr    ] o.a.c.f.s.ConnectionStateManager State change: SUSPENDED
   [junit4]   2> 2305059 INFO  (jetty-launcher-4391-thread-1-EventThread) [n:127.0.0.1:37879_solr    ] o.a.c.f.s.ConnectionStateManager State change: SUSPENDED
   [junit4]   2> 2305147 INFO  (OverseerThreadFactory-7714-thread-1-processing-n:127.0.0.1:37879_solr) [n:127.0.0.1:37879_solr    ] o.a.s.c.CreateCollectionCmd Create collection forwardingCollection
   [junit4]   2> 2305263 INFO  (OverseerStateUpdate-98652187245936645-127.0.0.1:37879_solr-n_0000000000) [n:127.0.0.1:37879_solr    ] o.a.s.c.o.SliceMutator createReplica() {
   [junit4]   2>   "operation":"ADDREPLICA",
   [junit4]   2>   "collection":"forwardingCollection",
   [junit4]   2>   "shard":"shard1",
   [junit4]   2>   "core":"forwardingCollection_shard1_replica_n1",
   [junit4]   2>   "state":"down",
   [junit4]   2>   "base_url":"http://127.0.0.1:33729/solr",
   [junit4]   2>   "type":"NRT"}
   [junit4]   2> 2305471 INFO  (qtp1262718235-20966) [n:127.0.0.1:33729_solr    ] o.a.s.h.a.CoreAdminOperation core create command qt=/admin/cores&coreNodeName=core_node2&collection.configName=conf1&newCollection=true&name=forwardingCollection_shard1_replica_n1&action=CREATE&numShards=1&collection=forwardingCollection&shard=shard1&wt=javabin&version=2&replicaType=NRT
   [junit4]   2> 2305472 INFO  (qtp1262718235-20966) [n:127.0.0.1:33729_solr    ] o.a.s.c.TransientSolrCoreCacheDefault Allocating transient cache for 2147483647 transient cores
   [junit4]   2> 2305638 INFO  (zkCallback-4403-thread-6-processing-n:127.0.0.1:33729_solr) [n:127.0.0.1:33729_solr    ] o.a.s.c.c.ZkStateReader A cluster state change: [WatchedEvent state:SyncConnected type:NodeDataChanged path:/collections/forwardingCollection/state.json] for collection [forwardingCollection] has occurred - updating... (live nodes size: [2])
   [junit4]   2> 2305639 INFO  (zkCallback-4403-thread-4-processing-n:127.0.0.1:33729_solr) [n:127.0.0.1:33729_solr    ] o.a.s.c.c.ZkStateReader A cluster state change: [WatchedEvent state:SyncConnected type:NodeDataChanged path:/collections/forwardingCollection/state.json] for collection [forwardingCollection] has occurred - updating... (live nodes size: [2])
   [junit4]   2> 2306501 INFO  (qtp1262718235-20966) [n:127.0.0.1:33729_solr c:forwardingCollection s:shard1 r:core_node2 x:forwardingCollection_shard1_replica_n1] o.a.s.c.SolrConfig Using Lucene MatchVersion: 8.0.0
   [junit4]   2> 2306517 INFO  (qtp1262718235-20966) [n:127.0.0.1:33729_solr c:forwardingCollection s:shard1 r:core_node2 x:forwardingCollection_shard1_replica_n1] o.a.s.s.IndexSchema [forwardingCollection_shard1_replica_n1] Schema name=test
   [junit4]   2> 2306619 INFO  (qtp1262718235-20966) [n:127.0.0.1:33729_solr c:forwardingCollection s:shard1 r:core_node2 x:forwardingCollection_shard1_replica_n1] o.a.s.s.IndexSchema Loaded schema test/1.0 with uniqueid field id
   [junit4]   2> 2306639 INFO  (qtp1262718235-20966) [n:127.0.0.1:33729_solr c:forwardingCollection s:shard1 r:core_node2 x:forwardingCollection_shard1_replica_n1] o.a.s.c.CoreContainer Creating SolrCore 'forwardingCollection_shard1_replica_n1' using configuration from collection forwardingCollection, trusted=true
   [junit4]   2> 2306640 INFO  (qtp1262718235-20966) [n:127.0.0.1:33729_solr c:forwardingCollection s:shard1 r:core_node2 x:forwardingCollection_shard1_replica_n1] o.a.s.m.r.SolrJmxReporter JMX monitoring for 'solr_33729.solr.core.forwardingCollection.shard1.replica_n1' (registry 'solr.core.forwardingCollection.shard1.replica_n1') enabled at server: com.sun.jmx.mbeanserver.JmxMBeanServer@279bbd09
   [junit4]   2> 2306640 INFO  (qtp1262718235-20966) [n:127.0.0.1:33729_solr c:forwardingCollection s:shard1 r:core_node2 x:forwardingCollection_shard1_replica_n1] o.a.s.c.SolrCore solr.RecoveryStrategy.Builder
   [junit4]   2> 2306640 INFO  (qtp1262718235-20966) [n:127.0.0.1:33729_solr c:forwardingCollection s:shard1 r:core_node2 x:forwardingCollection_shard1_replica_n1] o.a.s.c.SolrCore [[forwardingCollection_shard1_replica_n1] ] Opening new SolrCore at [/home/jenkins/workspace/Lucene-Solr-master-Linux/solr/build/solr-core/test/J1/temp/solr.cloud.TestSolrCloudWithSecureImpersonation_5E4B56366EC81903-001/tempDir-001/node2/forwardingCollection_shard1_replica_n1], dataDir=[/home/jenkins/workspace/Lucene-Solr-master-Linux/solr/build/solr-core/test/J1/temp/solr.cloud.TestSolrCloudWithSecureImpersonation_5E4B56366EC81903-001/tempDir-001/node2/./forwardingCollection_shard1_replica_n1/data/]
   [junit4]   2> 2306643 INFO  (qtp1262718235-20966) [n:127.0.0.1:33729_solr c:forwardingCollection s:shard1 r:core_node2 x:forwardingCollection_shard1_replica_n1] o.a.s.u.RandomMergePolicy RandomMergePolicy wrapping class org.apache.lucene.index.TieredMergePolicy: [TieredMergePolicy: maxMergeAtOnce=19, maxMergeAtOnceExplicit=27, maxMergedSegmentMB=66.8828125, floorSegmentMB=0.2529296875, forceMergeDeletesPctAllowed=24.189226829929446, segmentsPerTier=33.0, maxCFSSegmentSizeMB=8.796093022207999E12, noCFSRatio=0.18080771364561044
   [junit4]   2> 2306729 INFO  (qtp1262718235-20966) [n:127.0.0.1:33729_solr c:forwardingCollection s:shard1 r:core_node2 x:forwardingCollection_shard1_replica_n1] o.a.s.u.UpdateHandler Using UpdateLog implementation: org.apache.solr.update.UpdateLog
   [junit4]   2> 2306729 INFO  (qtp1262718235-20966) [n:127.0.0.1:33729_solr c:forwardingCollection s:shard1 r:core_node2 x:forwardingCollection_shard1_replica_n1] o.a.s.u.UpdateLog Initializing UpdateLog: dataDir= defaultSyncLevel=FLUSH numRecordsToKeep=100 maxNumLogsToKeep=10 numVersionBuckets=65536
   [junit4]   2> 2306730 INFO  (qtp1262718235-20966) [n:127.0.0.1:33729_solr c:forwardingCollection s:shard1 r:core_node2 x:forwardingCollection_shard1_replica_n1] o.a.s.u.CommitTracker Hard AutoCommit: disabled
   [junit4]   2> 2306730 INFO  (qtp1262718235-20966) [n:127.0.0.1:33729_solr c:forwardingCollection s:shard1 r:core_node2 x:forwardingCollection_shard1_replica_n1] o.a.s.u.CommitTracker Soft AutoCommit: disabled
   [junit4]   2> 2306732 INFO  (qtp1262718235-20966) [n:127.0.0.1:33729_solr c:forwardingCollection s:shard1 r:core_node2 x:forwardingCollection_shard1_replica_n1] o.a.s.u.RandomMergePolicy RandomMergePolicy wrapping class org.apache.lucene.index.TieredMergePolicy: [TieredMergePolicy: maxMergeAtOnce=31, maxMergeAtOnceExplicit=39, maxMergedSegmentMB=29.9150390625, floorSegmentMB=0.8701171875, forceMergeDeletesPctAllowed=9.724504342279044, segmentsPerTier=26.0, maxCFSSegmentSizeMB=8.796093022207999E12, noCFSRatio=1.0
   [junit4]   2> 2306732 INFO  (qtp1262718235-20966) [n:127.0.0.1:33729_solr c:forwardingCollection s:shard1 r:core_node2 x:forwardingCollection_shard1_replica_n1] o.a.s.s.SolrIndexSearcher Opening [Searcher@3ea094b2[forwardingCollection_shard1_replica_n1] main]
   [junit4]   2> 2306749 INFO  (qtp1262718235-20966) [n:127.0.0.1:33729_solr c:forwardingCollection s:shard1 r:core_node2 x:forwardingCollection_shard1_replica_n1] o.a.s.h.c.SpellCheckComponent Initializing spell checkers
   [junit4]   2> 2306775 INFO  (qtp1262718235-20966) [n:127.0.0.1:33729_solr c:forwardingCollection s:shard1 r:core_node2 x:forwardingCollection_shard1_replica_n1] o.a.s.s.DirectSolrSpellChecker init: {name=direct,classname=DirectSolrSpellChecker,field=lowerfilt,minQueryLength=3}
   [junit4]   2> 2306891 INFO  (qtp1262718235-20966) [n:127.0.0.1:33729_solr c:forwardingCollection s:shard1 r:core_node2 x:forwardingCollection_shard1_replica_n1] o.a.s.h.ReplicationHandler Commits will be reserved for  10000
   [junit4]   2> 2306891 INFO  (searcherExecutor-7719-thread-1-processing-n:127.0.0.1:33729_solr x:forwardingCollection_shard1_replica_n1 s:shard1 c:forwardingCollection r:core_node2) [n:127.0.0.1:33729_solr c:forwardingCollection s:shard1 r:core_node2 x:forwardingCollection_shard1_replica_n1] o.a.s.h.c.SpellCheckComponent Loading spell index for spellchecker: default
   [junit4]   2> 2306891 INFO  (qtp1262718235-20966) [n:127.0.0.1:33729_solr c:forwardingCollection s:shard1 r:core_node2 x:forwardingCollection_shard1_replica_n1] o.a.s.u.UpdateLog Could not find max version in index or recent updates, using new clock 1578435017301819392
   [junit4]   2> 2306892 INFO  (searcherExecutor-7719-thread-1-processing-n:127.0.0.1:33729_solr x:forwardingCollection_shard1_replica_n1 s:shard1 c:forwardingCollection r:core_node2) [n:127.0.0.1:33729_solr c:forwardingCollection s:shard1 r:core_node2 x:forwardingCollection_shard1_replica_n1] o.a.s.h.c.SpellCheckComponent Loading spell index for spellchecker: direct
   [junit4]   2> 2306892 INFO  (searcherExecutor-7719-thread-1-processing-n:127.0.0.1:33729_solr x:forwardingCollection_shard1_replica_n1 s:shard1 c:forwardingCollection r:core_node2) [n:127.0.0.1:33729_solr c:forwardingCollection s:shard1 r:core_node2 x:forwardingCollection_shard1_replica_n1] o.a.s.h.c.SpellCheckComponent Loading spell index for spellchecker: wordbreak
   [junit4]   2> 2306892 INFO  (searcherExecutor-7719-thread-1-processing-n:127.0.0.1:33729_solr x:forwardingCollection_shard1_replica_n1 s:shard1 c:forwardingCollection r:core_node2) [n:127.0.0.1:33729_solr c:forwardingCollection s:shard1 r:core_node2 x:forwardingCollection_shard1_replica_n1] o.a.s.h.c.SpellCheckComponent Loading spell index for spellchecker: multipleFields
   [junit4]   2> 2306892 INFO  (searcherExecutor-7719-thread-1-processing-n:127.0.0.1:33729_solr x:forwardingCollection_shard1_replica_n1 s:shard1 c:forwardingCollection r:core_node2) [n:127.0.0.1:33729_solr c:forwardingCollection s:shard1 r:core_node2 x:forwardingCollection_shard1_replica_n1] o.a.s.h.c.SpellCheckComponent Loading spell index for spellchecker: jarowinkler
   [junit4]   2> 2306893 INFO  (searcherExecutor-7719-thread-1-processing-n:127.0.0.1:33729_solr x:forwardingCollection_shard1_replica_n1 s:shard1 c:forwardingCollection r:core_node2) [n:127.0.0.1:33729_solr c:forwardingCollection s:shard1 r:core_node2 x:forwardingCollection_shard1_replica_n1] o.a.s.h.c.SpellCheckComponent Loading spell index for spellchecker: external
   [junit4]   2> 2306893 INFO  (searcherExecutor-7719-thread-1-processing-n:127.0.0.1:33729_solr x:forwardingCollection_shard1_replica_n1 s:shard1 c:forwardingCollection r:core_node2) [n:127.0.0.1:33729_solr c:forwardingCollection s:shard1 r:core_node2 x:forwardingCollection_shard1_replica_n1] o.a.s.h.c.SpellCheckComponent Loading spell index for spellchecker: freq
   [junit4]   2> 2306893 INFO  (searcherExecutor-7719-thread-1-processing-n:127.0.0.1:33729_solr x:forwardingCollection_shard1_replica_n1 s:shard1 c:forwardingCollection r:core_node2) [n:127.0.0.1:33729_solr c:forwardingCollection s:shard1 r:core_node2 x:forwardingCollection_shard1_replica_n1] o.a.s.h.c.SpellCheckComponent Loading spell index for spellchecker: fqcn
   [junit4]   2> 2306893 INFO  (searcherExecutor-7719-thread-1-processing-n:127.0.0.1:33729_solr x:forwardingCollection_shard1_replica_n1 s:shard1 c:forwardingCollection r:core_node2) [n:127.0.0.1:33729_solr c:forwardingCollection s:shard1 r:core_node2 x:forwardingCollection_shard1_replica_n1] o.a.s.h.c.SpellCheckComponent Loading spell index for spellchecker: perDict
   [junit4]   2> 2306894 INFO  (searcherExecutor-7719-thread-1-processing-n:127.0.0.1:33729_solr x:forwardingCollection_shard1_replica_n1 s:shard1 c:forwardingCollection r:core_node2) [n:127.0.0.1:33729_solr c:forwardingCollection s:shard1 r:core_node2 x:forwardingCollection_shard1_replica_n1] o.a.s.c.SolrCore [forwardingCollection_shard1_replica_n1] Registered new searcher Searcher@3ea094b2[forwardingCollection_shard1_replica_n1] main{ExitableDirectoryReader(UninvertingDirectoryReader())}
   [junit4]   2> 2306896 INFO  (qtp1262718235-20966) [n:127.0.0.1:33729_solr c:forwardingCollection s:shard1 r:core_node2 x:forwardingCollection_shard1_replica_n1] o.a.s.c.ShardLeaderElectionContext Enough replicas found to continue.
   [junit4]   2> 2306896 INFO  (qtp1262718235-20966) [n:127.0.0.1:33729_solr c:forwardingCollection s:shard1 r:core_node2 x:forwardingCollection_shard1_replica_n1] o.a.s.c.ShardLeaderElectionContext I may be the new leader - try and sync
   [junit4]   2> 2306896 INFO  (qtp1262718235-20966) [n:127.0.0.1:33729_solr c:forwardingCollection s:shard1 r:core_node2 x:forwardingCollection_shard1_replica_n1] o.a.s.c.SyncStrategy Sync replicas to http://127.0.0.1:33729/solr/forwardingCollection_shard1_replica_n1/
   [junit4]   2> 2306896 INFO  (qtp1262718235-20966) [n:127.0.0.1:33729_solr c:forwardingCollection s:shard1 r:core_node2 x:forwardingCollection_shard1_replica_n1] o.a.s.c.SyncStrategy Sync Success - now sync replicas to me
   [junit4]   2> 2306897 INFO  (qtp1262718235-20966) [n:127.0.0.1:33729_solr c:forwardingCollection s:shard1 r:core_node2 x:forwardingCollection_shard1_replica_n1] o.a.s.c.SyncStrategy http://127.0.0.1:33729/solr/forwardingCollection_shard1_replica_n1/ has no replicas
   [junit4]   2> 2306897 INFO  (qtp1262718235-20966) [n:127.0.0.1:33729_solr c:forwardingCollection s:shard1 r:core_node2 x:forwardingCollection_shard1_replica_n1] o.a.s.c.ShardLeaderElectionContext Found all replicas participating in election, clear LIR
   [junit4]   2> 2306905 INFO  (qtp1262718235-20966) [n:127.0.0.1:33729_solr c:forwardingCollection s:shard1 r:core_node2 x:forwardingCollection_shard1_replica_n1] o.a.s.c.ShardLeaderElectionContext I am the new leader: http://127.0.0.1:33729/solr/forwardingCollection_shard1_replica_n1/ shard1
   [junit4]   2> 2307006 INFO  (zkCallback-4403-thread-6-processing-n:127.0.0.1:33729_solr) [n:127.0.0.1:33729_solr    ] o.a.s.c.c.ZkStateReader A cluster state change: [WatchedEvent state:SyncConnected type:NodeDataChanged path:/collections/forwardingCollection/state.json] for collection [forwardingCollection] has occurred - updating... (live nodes size: [2])
   [junit4]   2> 2307007 INFO  (zkCallback-4403-thread-4-processing-n:127.0.0.1:33729_solr) [n:127.0.0.1:33729_solr    ] o.a.s.c.c.ZkStateReader A cluster state change: [WatchedEvent state:SyncConnected type:NodeDataChanged path:/collections/forwardingCollection/state.json] for collection [forwardingCollection] has occurred - updating... (live nodes size: [2])
   [junit4]   2> 2307056 INFO  (qtp1262718235-20966) [n:127.0.0.1:33729_solr c:forwardingCollection s:shard1 r:core_node2 x:forwardingCollection_shard1_replica_n1] o.a.s.c.ZkController I am the leader, no recovery necessary
   [junit4]   2> 2307056 INFO  (qtp1262718235-20966) [n:127.0.0.1:33729_solr c:forwardingCollection s:shard1 r:core_node2 x:forwardingCollection_shard1_replica_n1] o.a.s.s.HttpSolrCall [admin] webapp=null path=/admin/cores params={qt=/admin/cores&coreNodeName=core_node2&collection.configName=conf1&newCollection=true&name=forwardingCollection_shard1_replica_n1&action=CREATE&numShards=1&collection=forwardingCollection&shard=shard1&wt=javabin&version=2&replicaType=NRT} status=0 QTime=1585
   [junit4]   2> 2307083 INFO  (qtp1262718235-20962) [n:127.0.0.1:33729_solr    ] o.a.s.h.a.CollectionsHandler Wait for new collection to be active for at most 30 seconds. Check all shard replicas
   [junit4]   2> 2307159 INFO  (OverseerCollectionConfigSetProcessor-98652187245936645-127.0.0.1:37879_solr-n_0000000000) [n:127.0.0.1:37879_solr    ] o.a.s.c.OverseerTaskQueue Response ZK path: /overseer/collection-queue-work/qnr-0000000000 doesn't exist.  Requestor may have disconnected from ZooKeeper
   [junit4]   2> 2307162 INFO  (zkCallback-4403-thread-6-processing-n:127.0.0.1:33729_solr) [n:127.0.0.1:33729_solr    ] o.a.s.c.c.ZkStateReader A cluster state change: [WatchedEvent state:SyncConnected type:NodeDataChanged path:/collections/forwardingCollection/state.json] for collection [forwardingCollection] has occurred - updating... (live nodes size: [2])
   [junit4]   2> 2307163 INFO  (zkCallback-4403-thread-4-processing-n:127.0.0.1:33729_solr) [n:127.0.0.1:33729_solr    ] o.a.s.c.c.ZkStateReader A cluster state change: [WatchedEvent state:SyncConnected type:NodeDataChanged path:/collections/forwardingCollection/state.json] for collection [forwardingCollection] has occurred - updating... (live nodes size: [2])
   [junit4]   2> 2308083 INFO  (qtp1262718235-20962) [n:127.0.0.1:33729_solr    ] o.a.s.s.HttpSolrCall [admin] webapp=null path=/admin/collections params={pullReplicas=0&replicationFactor=1&collection.configName=conf1&maxShardsPerNode=1&name=forwardingCollection&nrtReplicas=1&action=CREATE&numShards=1&tlogReplicas=0&wt=javabin&version=2} status=0 QTime=4744
   [junit4]   2> 2308083 INFO  (TEST-TestSolrCloudWithSecureImpersonation.testForwarding-seed#[5E4B56366EC81903]) [    ] o.a.s.c.AbstractDistribZkTestBase Wait for recoveries to finish - collection: forwardingCollection failOnTimeout:true timeout (sec):100
   [junit4]   2> 2308087 INFO  (TEST-TestSolrCloudWithSecureImpersonation.testForwarding-seed#[5E4B56366EC81903]) [    ] o.a.s.c.AbstractDistribZkTestBase Recoveries finished - collection: forwardingCollection
   [junit4]   2> 2308092 INFO  (qtp1262718235-20964) [n:127.0.0.1:33729_solr c:forwardingCollection s:shard1 r:core_node2 x:forwardingCollection_shard1_replica_n1] o.a.s.c.S.Request [forwardingCollection_shard1_replica_n1]  webapp=/solr path=/select params={q=*:*&wt=javabin&version=2} hits=0 status=0 QTime=0
   [junit4]   2> 2308115 INFO  (qtp2109008620-20970) [n:127.0.0.1:37879_solr    ] o.a.s.c.TransientSolrCoreCacheDefault Allocating transient cache for 2147483647 transient cores
   [junit4]   2> 2308120 INFO  (qtp1262718235-20974) [n:127.0.0.1:33729_solr c:forwardingCollection s:shard1 r:core_node2 x:forwardingCollection_shard1_replica_n1] o.a.s.c.S.Request [forwardingCollection_shard1_replica_n1]  webapp=/solr path=/select params={q=*:*&wt=javabin&version=2} hits=0 status=0 QTime=0
   [junit4]   2> 2308121 INFO  (TEST-TestSolrCloudWithSecureImpersonation.testForwarding-seed#[5E4B56366EC81903]) [    ] o.a.s.SolrTestCaseJ4 ###Ending testForwarding
   [junit4]   2> 2308199 INFO  (TEST-TestSolrCloudWithSecureImpersonation.testProxyNoConfigHosts-seed#[5E4B56366EC81903]) [    ] o.a.s.SolrTestCaseJ4 ###Starting testProxyNoConfigHosts
   [junit4]   2> 2308204 INFO  (TEST-TestSolrCloudWithSecureImpersonation.testProxyNoConfigHosts-seed#[5E4B56366EC81903]) [    ] o.a.s.SolrTestCaseJ4 ###Ending testProxyNoConfigHosts
   [junit4]   2> 2308279 INFO  (TEST-TestSolrCloudWithSecureImpersonation.testProxyNullProxyUser-seed#[5E4B56366EC81903]) [    ] o.a.s.SolrTestCaseJ4 ###Starting testProxyNullProxyUser
   [junit4]   2> 2308280 INFO  (qtp1262718235-20966) [n:127.0.0.1:33729_solr c:forwardingCollection s:shard1 r:core_node2 x:forwardingCollection_shard1_replica_n1] o.a.s.s.SolrDispatchFilter Error authenticating
   [junit4]   2> java.lang.IllegalArgumentException: userName is NULL, empty or contains a '&'
   [junit4]   2> at org.apache.hadoop.security.authentication.util.AuthToken.checkForIllegalArgument(AuthToken.java:87)
   [junit4]   2> at org.apache.hadoop.security.authentication.util.AuthToken.<init>(AuthToken.java:70)
   [junit4]   2> at org.apache.hadoop.security.authentication.server.AuthenticationToken.<init>(AuthenticationToken.java:58)
   [junit4]   2> at org.apache.solr.security.HttpParamDelegationTokenPlugin$HttpParamDelegationTokenAuthenticationHandler$HttpParamAuthenticationHandler.authenticate(HttpParamDelegationTokenPlugin.java:213)
   [junit4]   2> at org.apache.hadoop.security.token.delegation.web.DelegationTokenAuthenticationHandler.authenticate(DelegationTokenAuthenticationHandler.java:348)
   [junit4]   2> at org.apache.solr.security.RequestContinuesRecorderAuthenticationHandler.authenticate(RequestContinuesRecorderAuthenticationHandler.java:69)
   [junit4]   2> at org.apache.hadoop.security.authentication.server.AuthenticationFilter.doFilter(AuthenticationFilter.java:518)
   [junit4]   2> at org.apache.solr.security.DelegationTokenKerberosFilter.doFilter(DelegationTokenKerberosFilter.java:134)
   [junit4]   2> at org.apache.solr.security.HttpParamDelegationTokenPlugin$HttpParamToRequestFilter.doFilter(HttpParamDelegationTokenPlugin.java:245)
   [junit4]   2> at org.apache.solr.security.KerberosPlugin.doAuthenticate(KerberosPlugin.java:243)
   [junit4]   2> at org.apache.solr.servlet.SolrDispatchFilter.authenticateRequest(SolrDispatchFilter.java:451)
   [junit4]   2> at org.apache.solr.servlet.SolrDispatchFilter.doFilter(SolrDispatchFilter.java:347)
   [junit4]   2> at org.apache.solr.servlet.SolrDispatchFilter.doFilter(SolrDispatchFilter.java:326)
   [junit4]   2> at org.eclipse.jetty.servlet.ServletHandler$CachedChain.doFilter(ServletHandler.java:1759)
   [junit4]   2> at org.apache.solr.client.solrj.embedded.JettySolrRunner$DebugFilter.doFilter(JettySolrRunner.java:139)
   [junit4]   2> at org.eclipse.jetty.servlet.ServletHandler$CachedChain.doFilter(ServletHandler.java:1759)
   [junit4]   2> at org.eclipse.jetty.servlet.ServletHandler.doHandle(ServletHandler.java:582)
   [junit4]   2> at org.eclipse.jetty.server.session.SessionHandler.doHandle(SessionHandler.java:224)
   [junit4]   2> at org.eclipse.jetty.server.handler.ContextHandler.doHandle(ContextHandler.java:1180)
   [junit4]   2> at org.eclipse.jetty.servlet.ServletHandler.doScope(ServletHandler.java:512)
   [junit4]   2> at org.eclipse.jetty.server.session.SessionHandler.doScope(SessionHandler.java:185)
   [junit4]   2> at org.eclipse.jetty.server.handler.ContextHandler.doScope(ContextHandler.java:1112)
   [junit4]   2> at org.eclipse.jetty.server.handler.ScopedHandler.handle(ScopedHandler.java:141)
   [junit4]   2> at org.eclipse.jetty.server.handler.gzip.GzipHandler.handle(GzipHandler.java:493)
   [junit4]   2> at org.eclipse.jetty.server.handler.HandlerWrapper.handle(HandlerWrapper.java:134)
   [junit4]   2> at org.eclipse.jetty.server.Server.handle(Server.java:534)
   [junit4]   2> at org.eclipse.jetty.server.HttpChannel.handle(HttpChannel.java:320)
   [junit4]   2> at org.eclipse.jetty.server.HttpConnection.onFillable(HttpConnection.java:251)
   [junit4]   2> at org.eclipse.jetty.io.AbstractConnection$ReadCallback.succeeded(AbstractConnection.java:283)
   [junit4]   2> at org.eclipse.jetty.io.FillInterest.fillable(FillInterest.java:108)
   [junit4]   2> at org.eclipse.jetty.io.SelectChannelEndPoint$2.run(SelectChannelEndPoint.java:93)
   [junit4]   2> at org.eclipse.jetty.util.thread.strategy.ExecuteProduceConsume.executeProduceConsume(ExecuteProduceConsume.java:303)
   [junit4]   2> at org.eclipse.jetty.util.thread.strategy.ExecuteProduceConsume.produceConsume(ExecuteProduceConsume.java:148)
   [junit4]   2> at org.eclipse.jetty.util.thread.strategy.ExecuteProduceConsume.run(ExecuteProduceConsume.java:136)
   [junit4]   2> at org.eclipse.jetty.util.thread.QueuedThreadPool.runJob(QueuedThreadPool.java:671)
   [junit4]   2> at org.eclipse.jetty.util.thread.QueuedThreadPool$2.run(QueuedThreadPool.java:589)
   [junit4]   2> at java.lang.Thread.run(Thread.java:748)
   [junit4]   2> 2308280 WARN  (qtp1262718235-20966) [n:127.0.0.1:33729_solr c:forwardingCollection s:shard1 r:core_node2 x:forwardingCollection_shard1_replica_n1] o.e.j.s.ServletHandler /solr/admin/collections
   [junit4]   2> org.apache.solr.common.SolrException: Error during request authentication,
   [junit4]   2> at org.apache.solr.servlet.SolrDispatchFilter.authenticateRequest(SolrDispatchFilter.java:457)
   [junit4]   2> at org.apache.solr.servlet.SolrDispatchFilter.doFilter(SolrDispatchFilter.java:347)
   [junit4]   2> at org.apache.solr.servlet.SolrDispatchFilter.doFilter(SolrDispatchFilter.java:326)
   [junit4]   2> at org.eclipse.jetty.servlet.ServletHandler$CachedChain.doFilter(ServletHandler.java:1759)
   [junit4]   2> at org.apache.solr.client.solrj.embedded.JettySolrRunner$DebugFilter.doFilter(JettySolrRunner.java:139)
   [junit4]   2> at org.eclipse.jetty.servlet.ServletHandler$CachedChain.doFilter(ServletHandler.java:1759)
   [junit4]   2> at org.eclipse.jetty.servlet.ServletHandler.doHandle(ServletHandler.java:582)
   [junit4]   2> at org.eclipse.jetty.server.session.SessionHandler.doHandle(SessionHandler.java:224)
   [junit4]   2> at org.eclipse.jetty.server.handler.ContextHandler.doHandle(ContextHandler.java:1180)
   [junit4]   2> at org.eclipse.jetty.servlet.ServletHandler.doScope(ServletHandler.java:512)
   [junit4]   2> at org.eclipse.jetty.server.session.SessionHandler.doScope(SessionHandler.java:185)
   [junit4]   2> at org.eclipse.jetty.server.handler.ContextHandler.doScope(ContextHandler.java:1112)
   [junit4]   2> at org.eclipse.jetty.server.handler.ScopedHandler.handle(ScopedHandler.java:141)
   [junit4]   2> at org.eclipse.jetty.server.handler.gzip.GzipHandler.handle(GzipHandler.java:493)
   [junit4]   2> at org.eclipse.jetty.server.handler.HandlerWrapper.handle(HandlerWrapper.java:134)
   [junit4]   2> at org.eclipse.jetty.server.Server.handle(Server.java:534)
   [junit4]   2> at org.eclipse.jetty.server.HttpChannel.handle(HttpChannel.java:320)
   [junit4]   2> at org.eclipse.jetty.server.HttpConnection.onFillable(HttpConnection.java:251)
   [junit4]   2> at org.eclipse.jetty.io.AbstractConnection$ReadCallback.succeeded(AbstractConnection.java:283)
   [junit4]   2> at org.eclipse.jetty.io.FillInterest.fillable(FillInterest.java:108)
   [junit4]   2> at org.eclipse.jetty.io.SelectChannelEndPoint$2.run(SelectChannelEndPoint.java:93)
   [junit4]   2> at org.eclipse.jetty.util.thread.strategy.ExecuteProduceConsume.executeProduceConsume(ExecuteProduceConsume.java:303)
   [junit4]   2> at org.eclipse.jetty.util.thread.strategy.ExecuteProduceConsume.produceConsume(ExecuteProduceConsume.java:148)
   [junit4]   2> at org.eclipse.jetty.util.thread.strategy.ExecuteProduceConsume.run(ExecuteProduceConsume.java:136)
   [junit4]   2> at org.eclipse.jetty.util.thread.QueuedThreadPool.runJob(QueuedThreadPool.java:671)
   [junit4]   2> at org.eclipse.jetty.util.thread.QueuedThreadPool$2.run(QueuedThreadPool.java:589)
   [junit4]   2> at java.lang.Thread.run(Thread.java:748)
   [junit4]   2> Caused by: java.lang.IllegalArgumentException: userName is NULL, empty or contains a '&'
   [junit4]   2> at org.apache.hadoop.security.authentication.util.AuthToken.checkForIllegalArgument(AuthToken.java:87)
   [junit4]   2> at org.apache.hadoop.security.authentication.util.AuthToken.<init>(AuthToken.java:70)
   [junit4]   2> at org.apache.hadoop.security.authentication.server.AuthenticationToken.<init>(AuthenticationToken.java:58)
   [junit4]   2> at org.apache.solr.security.HttpParamDelegationTokenPlugin$HttpParamDelegationTokenAuthenticationHandler$HttpParamAuthenticationHandler.authenticate(HttpParamDelegationTokenPlugin.java:213)
   [junit4]   2> at org.apache.hadoop.security.token.delegation.web.DelegationTokenAuthenticationHandler.authenticate(DelegationTokenAuthenticationHandler.java:348)
   [junit4]   2> at org.apache.solr.security.RequestContinuesRecorderAuthenticationHandler.authenticate(RequestContinuesRecorderAuthenticationHandler.java:69)
   [junit4]   2> at org.apache.hadoop.security.authentication.server.AuthenticationFilter.doFilter(AuthenticationFilter.java:518)
   [junit4]   2> at org.apache.solr.security.DelegationTokenKerberosFilter.doFilter(DelegationTokenKerberosFilter.java:134)
   [junit4]   2> at org.apache.solr.security.HttpParamDelegationTokenPlugin$HttpParamToRequestFilter.doFilter(HttpParamDelegationTokenPlugin.java:245)
   [junit4]   2> at org.apache.solr.security.KerberosPlugin.doAuthenticate(KerberosPlugin.java:243)
   [junit4]   2> at org.apache.solr.servlet.SolrDispatchFilter.authenticateRequest(SolrDispatchFilter.java:451)
   [junit4]   2> ... 26 more
   [junit4]   2> 2308285 INFO  (TEST-TestSolrCloudWithSecureImpersonation.testProxyNullProxyUser-seed#[5E4B56366EC81903]) [    ] o.a.s.SolrTestCaseJ4 ###Ending testProxyNullProxyUser
   [junit4]   2> 2308381 INFO  (TEST-TestSolrCloudWithSecureImpersonation.testProxyValidateGroup-seed#[5E4B56366EC81903]) [    ] o.a.s.SolrTestCaseJ4 ###Starting testProxyValidateGroup
   [junit4]   2> 2308424 INFO  (qtp1262718235-20974) [n:127.0.0.1:33729_solr    ] o.a.s.h.a.CollectionsHandler Invoked Collection Action :list with params doAs=jenkins&action=LIST&wt=javabin&version=2 and sendToOCPQueue=true
   [junit4]   2> 2308424 INFO  (qtp1262718235-20974) [n:127.0.0.1:33729_solr    ] o.a.s.s.HttpSolrCall [admin] webapp=null path=/admin/collections params={doAs=jenkins&action=LIST&wt=javabin&version=2} status=0 QTime=0
   [junit4]   2> 2308424 INFO  (TEST-TestSolrCloudWithSecureImpersonation.testProxyValidateGroup-seed#[5E4B56366EC81903]) [    ] o.a.s.SolrTestCaseJ4 ###Ending testProxyValidateGroup
   [junit4]   2> 2308475 INFO  (TEST-TestSolrCloudWithSecureImpersonation.testProxyInvalidRemote-seed#[5E4B56366EC81903]) [    ] o.a.s.SolrTestCaseJ4 ###Starting testProxyInvalidRemote
   [junit4]   2> 2308483 INFO  (TEST-TestSolrCloudWithSecureImpersonation.testProxyInvalidRemote-seed#[5E4B56366EC81903]) [    ] o.a.s.SolrTestCaseJ4 ###Ending testProxyInvalidRemote
   [junit4]   2> 2308594 INFO  (TEST-TestSolrCloudWithSecureImpersonation.testProxyInvalidProxyUser-seed#[5E4B56366EC81903]) [    ] o.a.s.SolrTestCaseJ4 ###Starting testProxyInvalidProxyUser
   [junit4]   2> 2308599 INFO  (TEST-TestSolrCloudWithSecureImpersonation.testProxyInvalidProxyUser-seed#[5E4B56366EC81903]) [    ] o.a.s.SolrTestCaseJ4 ###Ending testProxyInvalidProxyUser
   [junit4]   2> 2308601 INFO  (jetty-closer-4392-thread-2) [    ] o.e.j.s.AbstractConnector Stopped ServerConnector@4da1732c{HTTP/1.1,[http/1.1]}{127.0.0.1:0}
   [junit4]   2> 2308602 INFO  (jetty-closer-4392-thread-2) [    ] o.a.s.c.CoreContainer Shutting down CoreContainer instance=105320160
   [junit4]   2> 2308602 INFO  (jetty-closer-4392-thread-2) [    ] o.a.s.m.SolrMetricManager Closing metric reporters for registry=solr.node, tag=null
   [junit4]   2> 2308602 INFO  (jetty-closer-4392-thread-2) [    ] o.a.s.m.r.SolrJmxReporter Closing reporter [org.apache.solr.metrics.reporters.SolrJmxReporter@3b853a4b: rootName = solr_37879, domain = solr.node, service url = null, agent id = null] for registry solr.node / com.codahale.metrics.MetricRegistry@7a843d44
   [junit4]   2> 2308608 INFO  (jetty-closer-4392-thread-2) [    ] o.a.s.m.SolrMetricManager Closing metric reporters for registry=solr.jvm, tag=null
   [junit4]   2> 2308608 INFO  (jetty-closer-4392-thread-2) [    ] o.a.s.m.r.SolrJmxReporter Closing reporter [org.apache.solr.metrics.reporters.SolrJmxReporter@5c6fd52c: rootName = solr_37879, domain = solr.jvm, service url = null, agent id = null] for registry solr.jvm / com.codahale.metrics.MetricRegistry@37ad02aa
   [junit4]   2> 2308612 INFO  (jetty-closer-4392-thread-1) [    ] o.e.j.s.AbstractConnector Stopped ServerConnector@78c4c954{HTTP/1.1,[http/1.1]}{127.0.0.1:0}
   [junit4]   2> 2308612 INFO  (jetty-closer-4392-thread-2) [    ] o.a.s.m.SolrMetricManager Closing metric reporters for registry=solr.jetty, tag=null
   [junit4]   2> 2308613 INFO  (jetty-closer-4392-thread-1) [    ] o.a.s.c.CoreContainer Shutting down CoreContainer instance=556320951
   [junit4]   2> 2308613 INFO  (jetty-closer-4392-thread-1) [    ] o.a.s.m.SolrMetricManager Closing metric reporters for registry=solr.node, tag=null
   [junit4]   2> 2308613 INFO  (jetty-closer-4392-thread-1) [    ] o.a.s.m.r.SolrJmxReporter Closing reporter [org.apache.solr.metrics.reporters.SolrJmxReporter@3c74850b: rootName = solr_33729, domain = solr.node, service url = null, agent id = null] for registry solr.node / com.codahale.metrics.MetricRegistry@70e03027
   [junit4]   2> 2308615 INFO  (jetty-closer-4392-thread-2) [    ] o.a.s.m.r.SolrJmxReporter Closing reporter [org.apache.solr.metrics.reporters.SolrJmxReporter@2cca2887: rootName = solr_37879, domain = solr.jetty, service url = null, agent id = null] for registry solr.jetty / com.codahale.metrics.MetricRegistry@2ec6d815
   [junit4]   2> 2308616 INFO  (jetty-closer-4392-thread-2) [    ] o.a.s.m.SolrMetricManager Closing metric reporters for registry=solr.cluster, tag=null
   [junit4]   2> 2308620 INFO  (jetty-closer-4392-thread-1) [    ] o.a.s.m.SolrMetricManager Closing metric reporters for registry=solr.jvm, tag=null
   [junit4]   2> 2308620 INFO  (jetty-closer-4392-thread-1) [    ] o.a.s.m.r.SolrJmxReporter Closing reporter [org.apache.solr.metrics.reporters.SolrJmxReporter@67b1e36a: rootName = solr_33729, domain = solr.jvm, service url = null, agent id = null] for registry solr.jvm / com.codahale.metrics.MetricRegistry@37ad02aa
   [junit4]   2> 2308623 INFO  (jetty-closer-4392-thread-1) [    ] o.a.s.m.SolrMetricManager Closing metric reporters for registry=solr.jetty, tag=null
   [junit4]   2> 2308623 INFO  (jetty-closer-4392-thread-1) [    ] o.a.s.m.r.SolrJmxReporter Closing reporter [org.apache.solr.metrics.reporters.SolrJmxReporter@15464e48: rootName = solr_33729, domain = solr.jetty, service url = null, agent id = null] for registry solr.jetty / com.codahale.metrics.MetricRegistry@2ec6d815
   [junit4]   2> 2308625 INFO  (jetty-closer-4392-thread-1) [    ] o.a.s.m.SolrMetricManager Closing metric reporters for registry=solr.cluster, tag=null
   [junit4]   2> 2308626 INFO  (jetty-closer-4392-thread-2) [    ] o.a.s.c.Overseer Overseer (id=98652187245936645-127.0.0.1:37879_solr-n_0000000000) closing
   [junit4]   2> 2308626 INFO  (OverseerStateUpdate-98652187245936645-127.0.0.1:37879_solr-n_0000000000) [n:127.0.0.1:37879_solr    ] o.a.s.c.Overseer Overseer Loop exiting : 127.0.0.1:37879_solr
   [junit4]   2> 2308626 INFO  (coreCloseExecutor-7725-thread-1) [n:127.0.0.1:33729_solr c:forwardingCollection s:shard1 r:core_node2 x:forwardingCollection_shard1_replica_n1] o.a.s.c.SolrCore [forwardingCollection_shard1_replica_n1]  CLOSING SolrCore org.apache.solr.core.SolrCore@6a52bf8c
   [junit4]   2> 2308626 INFO  (coreCloseExecutor-7725-thread-1) [n:127.0.0.1:33729_solr c:forwardingCollection s:shard1 r:core_node2 x:forwardingCollection_shard1_replica_n1] o.a.s.m.SolrMetricManager Closing metric reporters for registry=solr.core.forwardingCollection.shard1.replica_n1, tag=1783807884
   [junit4]   2> 2308627 INFO  (coreCloseExecutor-7725-thread-1) [n:127.0.0.1:33729_solr c:forwardingCollection s:shard1 r:core_node2 x:forwardingCollection_shard1_replica_n1] o.a.s.m.r.SolrJmxReporter Closing reporter [org.apache.solr.metrics.reporters.SolrJmxReporter@5a2ad6b8: rootName = solr_33729, domain = solr.core.forwardingCollection.shard1.replica_n1, service url = null, agent id = null] for registry solr.core.forwardingCollection.shard1.replica_n1 / com.codahale.metrics.MetricRegistry@5a64acd8
   [junit4]   2> 2308635 WARN  (zkCallback-4402-thread-6-processing-n:127.0.0.1:37879_solr) [n:127.0.0.1:37879_solr    ] o.a.s.c.c.ZkStateReader ZooKeeper watch triggered, but Solr cannot talk to ZK: [KeeperErrorCode = Session expired for /live_nodes]
   [junit4]   2> 2308635 INFO  (zkCallback-4403-thread-6-processing-n:127.0.0.1:33729_solr) [n:127.0.0.1:33729_solr    ] o.a.s.c.OverseerElectionContext I am going to be the leader 127.0.0.1:33729_solr
   [junit4]   2> 2308635 INFO  (zkCallback-4403-thread-4-processing-n:127.0.0.1:33729_solr) [n:127.0.0.1:33729_solr    ] o.a.s.c.c.ZkStateReader Updated live nodes from ZooKeeper... (2) -> (1)
   [junit4]   2> 2308635 ERROR (Thread[Thread-4426,5,TGRP-TestSolrCloudWithSecureImpersonation]) [n:127.0.0.1:37879_solr    ] o.a.h.s.t.d.AbstractDelegationTokenSecretManager ExpiredTokenRemover received java.lang.InterruptedException: sleep interrupted
   [junit4]   2> 2308638 INFO  (jetty-closer-4392-thread-2) [    ] o.e.j.s.h.ContextHandler Stopped o.e.j.s.ServletContextHandler@15b1d4ee{/solr,null,UNAVAILABLE}
   [junit4]   2> 2308639 INFO  (coreCloseExecutor-7725-thread-1) [n:127.0.0.1:33729_solr c:forwardingCollection s:shard1 r:core_node2 x:forwardingCollection_shard1_replica_n1] o.a.s.m.SolrMetricManager Closing metric reporters for registry=solr.collection.forwardingCollection.shard1.leader, tag=1783807884
   [junit4]   2> 2308641 WARN  (zkCallback-4403-thread-6-processing-n:127.0.0.1:33729_solr) [n:127.0.0.1:33729_solr    ] o.a.s.c.c.ZkStateReader ZooKeeper watch triggered, but Solr cannot talk to ZK: [KeeperErrorCode = Session expired for /live_nodes]
   [junit4]   2> 2308641 ERROR (Thread[Thread-4424,5,TGRP-TestSolrCloudWithSecureImpersonation]) [n:127.0.0.1:33729_solr    ] o.a.h.s.t.d.AbstractDelegationTokenSecretManager ExpiredTokenRemover received java.lang.InterruptedException: sleep interrupted
   [junit4]   2> 2308643 INFO  (jetty-closer-4392-thread-1) [    ] o.e.j.s.h.ContextHandler Stopped o.e.j.s.ServletContextHandler@4db368c9{/solr,null,UNAVAILABLE}
   [junit4]   2> 2308644 ERROR (SUITE-TestSolrCloudWithSecureImpersonation-seed#[5E4B56366EC81903]-worker) [    ] o.a.z.s.ZooKeeperServer ZKShutdownHandler is not registered, so ZooKeeper server won't take any action on ERROR or SHUTDOWN server state changes
   [junit4]   2> 2308644 INFO  (SUITE-TestSolrCloudWithSecureImpersonation-seed#[5E4B56366EC81903]-worker) [    ] o.a.s.c.ZkTestServer connecting to 127.0.0.1:33715 33715
   [junit4]   2> 2308764 INFO  (Thread-4407) [    ] o.a.s.c.ZkTestServer connecting to 127.0.0.1:33715 33715
   [junit4]   2> 2308766 WARN  (Thread-4407) [    ] o.a.s.c.ZkTestServer Watch limit violations:
   [junit4]   2> Maximum concurrent create/delete watches above limit:
   [junit4]   2>
   [junit4]   2> 3 /solr/aliases.json
   [junit4]   2> 3 /solr/clusterprops.json
   [junit4]   2> 2 /solr/security.json
   [junit4]   2>
   [junit4]   2> Maximum concurrent data watches above limit:
   [junit4]   2>
   [junit4]   2> 5 /solr/collections/forwardingCollection/state.json
   [junit4]   2> 3 /solr/security/zkdtsm/ZKDTSMRoot/ZKDTSMKeyIdRoot
   [junit4]   2> 3 /solr/clusterstate.json
   [junit4]   2> 3 /solr/security/zkdtsm/ZKDTSMRoot/ZKDTSMSeqNumRoot
   [junit4]   2> 2 /solr/security/zkdtsm/ZKDTSMRoot/ZKDTSMMasterKeyRoot/DK_1
   [junit4]   2> 2 /solr/security/zkdtsm/ZKDTSMRoot/ZKDTSMMasterKeyRoot/DK_3
   [junit4]   2> 2 /solr/security/zkdtsm/ZKDTSMRoot/ZKDTSMMasterKeyRoot/DK_2
   [junit4]   2> 2 /solr/security/zkdtsm/ZKDTSMRoot/ZKDTSMMasterKeyRoot/DK_4
   [junit4]   2>
   [junit4]   2> Maximum concurrent children watches above limit:
   [junit4]   2>
   [junit4]   2> 3 /solr/live_nodes
   [junit4]   2> 3 /solr/collections
   [junit4]   2> 3 /solr/security/zkdtsm/ZKDTSMRoot/ZKDTSMMasterKeyRoot
   [junit4]   2> 3 /solr/security/zkdtsm/ZKDTSMRoot/ZKDTSMTokensRoot
   [junit4]   2>
   [junit4]   2> 2308782 INFO  (SUITE-TestSolrCloudWithSecureImpersonation-seed#[5E4B56366EC81903]-worker) [    ] o.a.s.SolrTestCaseJ4 ------------------------------------------------------- Done waiting for tracked resources to be released
   [junit4]   2> Sep 13, 2017 2:28:58 PM com.carrotsearch.randomizedtesting.ThreadLeakControl checkThreadLeaks
   [junit4]   2> WARNING: Will linger awaiting termination of 2 leaked thread(s).
   [junit4]   2> Sep 13, 2017 2:29:18 PM com.carrotsearch.randomizedtesting.ThreadLeakControl checkThreadLeaks
   [junit4]   2> SEVERE: 2 threads leaked from SUITE scope at org.apache.solr.cloud.TestSolrCloudWithSecureImpersonation:
   [junit4]   2>    1) Thread[id=21006, name=jetty-launcher-4391-thread-2-EventThread, state=TIMED_WAITING, group=TGRP-TestSolrCloudWithSecureImpersonation]
   [junit4]   2>         at sun.misc.Unsafe.park(Native Method)
   [junit4]   2>         at java.util.concurrent.locks.LockSupport.parkNanos(LockSupport.java:215)
   [junit4]   2>         at java.util.concurrent.locks.AbstractQueuedSynchronizer.doAcquireSharedNanos(AbstractQueuedSynchronizer.java:1037)
   [junit4]   2>         at java.util.concurrent.locks.AbstractQueuedSynchronizer.tryAcquireSharedNanos(AbstractQueuedSynchronizer.java:1328)
   [junit4]   2>         at java.util.concurrent.CountDownLatch.await(CountDownLatch.java:277)
   [junit4]   2>         at org.apache.curator.CuratorZookeeperClient.internalBlockUntilConnectedOrTimedOut(CuratorZookeeperClient.java:323)
   [junit4]   2>         at org.apache.curator.RetryLoop.callWithRetry(RetryLoop.java:105)
   [junit4]   2>         at org.apache.curator.framework.imps.GetDataBuilderImpl.pathInForeground(GetDataBuilderImpl.java:288)
   [junit4]   2>         at org.apache.curator.framework.imps.GetDataBuilderImpl.forPath(GetDataBuilderImpl.java:279)
   [junit4]   2>         at org.apache.curator.framework.imps.GetDataBuilderImpl.forPath(GetDataBuilderImpl.java:41)
   [junit4]   2>         at org.apache.curator.framework.recipes.shared.SharedValue.readValue(SharedValue.java:244)
   [junit4]   2>         at org.apache.curator.framework.recipes.shared.SharedValue.access$100(SharedValue.java:44)
   [junit4]   2>         at org.apache.curator.framework.recipes.shared.SharedValue$1.process(SharedValue.java:61)
   [junit4]   2>         at org.apache.curator.framework.imps.NamespaceWatcher.process(NamespaceWatcher.java:67)
   [junit4]   2>         at org.apache.zookeeper.ClientCnxn$EventThread.processEvent(ClientCnxn.java:530)
   [junit4]   2>         at org.apache.zookeeper.ClientCnxn$EventThread.run(ClientCnxn.java:505)
   [junit4]   2>    2) Thread[id=21010, name=jetty-launcher-4391-thread-1-EventThread, state=TIMED_WAITING, group=TGRP-TestSolrCloudWithSecureImpersonation]
   [junit4]   2>         at sun.misc.Unsafe.park(Native Method)
   [junit4]   2>         at java.util.concurrent.locks.LockSupport.parkNanos(LockSupport.java:215)
   [junit4]   2>         at java.util.concurrent.locks.AbstractQueuedSynchronizer.doAcquireSharedNanos(AbstractQueuedSynchronizer.java:1037)
   [junit4]   2>         at java.util.concurrent.locks.AbstractQueuedSynchronizer.tryAcquireSharedNanos(AbstractQueuedSynchronizer.java:1328)
   [junit4]   2>         at java.util.concurrent.CountDownLatch.await(CountDownLatch.java:277)
   [junit4]   2>         at org.apache.curator.CuratorZookeeperClient.internalBlockUntilConnectedOrTimedOut(CuratorZookeeperClient.java:323)
   [junit4]   2>         at org.apache.curator.RetryLoop.callWithRetry(RetryLoop.java:105)
   [junit4]   2>         at org.apache.curator.framework.imps.GetDataBuilderImpl.pathInForeground(GetDataBuilderImpl.java:288)
   [junit4]   2>         at org.apache.curator.framework.imps.GetDataBuilderImpl.forPath(GetDataBuilderImpl.java:279)
   [junit4]   2>         at org.apache.curator.framework.imps.GetDataBuilderImpl.forPath(GetDataBuilderImpl.java:41)
   [junit4]   2>         at org.apache.curator.framework.recipes.shared.SharedValue.readValue(SharedValue.java:244)
   [junit4]   2>         at org.apache.curator.framework.recipes.shared.SharedValue.access$100(SharedValue.java:44)
   [junit4]   2>         at org.apache.curator.framework.recipes.shared.SharedValue$1.process(SharedValue.java:61)
   [junit4]   2>         at org.apache.curator.framework.imps.NamespaceWatcher.process(NamespaceWatcher.java:67)
   [junit4]   2>         at org.apache.zookeeper.ClientCnxn$EventThread.processEvent(ClientCnxn.java:530)
   [junit4]   2>         at org.apache.zookeeper.ClientCnxn$EventThread.run(ClientCnxn.java:505)
   [junit4]   2> Sep 13, 2017 2:29:18 PM com.carrotsearch.randomizedtesting.ThreadLeakControl tryToInterruptAll
   [junit4]   2> INFO: Starting to interrupt leaked threads:
   [junit4]   2>    1) Thread[id=21006, name=jetty-launcher-4391-thread-2-EventThread, state=TIMED_WAITING, group=TGRP-TestSolrCloudWithSecureImpersonation]
   [junit4]   2>    2) Thread[id=21010, name=jetty-launcher-4391-thread-1-EventThread, state=TIMED_WAITING, group=TGRP-TestSolrCloudWithSecureImpersonation]
   [junit4]   2> 2328920 ERROR (jetty-launcher-4391-thread-2-EventThread) [n:127.0.0.1:33729_solr    ] o.a.c.f.i.CuratorFrameworkImpl Watcher exception
   [junit4]   2> java.lang.InterruptedException
   [junit4]   2> at java.util.concurrent.locks.AbstractQueuedSynchronizer.doAcquireSharedNanos(AbstractQueuedSynchronizer.java:1039)
   [junit4]   2> at java.util.concurrent.locks.AbstractQueuedSynchronizer.tryAcquireSharedNanos(AbstractQueuedSynchronizer.java:1328)
   [junit4]   2> at java.util.concurrent.CountDownLatch.await(CountDownLatch.java:277)
   [junit4]   2> at org.apache.curator.CuratorZookeeperClient.internalBlockUntilConnectedOrTimedOut(CuratorZookeeperClient.java:323)
   [junit4]   2> at org.apache.curator.RetryLoop.callWithRetry(RetryLoop.java:105)
   [junit4]   2> at org.apache.curator.framework.imps.GetDataBuilderImpl.pathInForeground(GetDataBuilderImpl.java:288)
   [junit4]   2> at org.apache.curator.framework.imps.GetDataBuilderImpl.forPath(GetDataBuilderImpl.java:279)
   [junit4]   2> at org.apache.curator.framework.imps.GetDataBuilderImpl.forPath(GetDataBuilderImpl.java:41)
   [junit4]   2> at org.apache.curator.framework.recipes.shared.SharedValue.readValue(SharedValue.java:244)
   [junit4]   2> at org.apache.curator.framework.recipes.shared.SharedValue.access$100(SharedValue.java:44)
   [junit4]   2> at org.apache.curator.framework.recipes.shared.SharedValue$1.process(SharedValue.java:61)
   [junit4]   2> at org.apache.curator.framework.imps.NamespaceWatcher.process(NamespaceWatcher.java:67)
   [junit4]   2> at org.apache.zookeeper.ClientCnxn$EventThread.processEvent(ClientCnxn.java:530)
   [junit4]   2> at org.apache.zookeeper.ClientCnxn$EventThread.run(ClientCnxn.java:505)
   [junit4]   2> 2328920 ERROR (jetty-launcher-4391-thread-1-EventThread) [n:127.0.0.1:37879_solr    ] o.a.c.f.i.CuratorFrameworkImpl Watcher exception
   [junit4]   2> java.lang.InterruptedException
   [junit4]   2> at java.util.concurrent.locks.AbstractQueuedSynchronizer.doAcquireSharedNanos(AbstractQueuedSynchronizer.java:1039)
   [junit4]   2> at java.util.concurrent.locks.AbstractQueuedSynchronizer.tryAcquireSharedNanos(AbstractQueuedSynchronizer.java:1328)
   [junit4]   2> at java.util.concurrent.CountDownLatch.await(CountDownLatch.java:277)
   [junit4]   2> at org.apache.curator.CuratorZookeeperClient.internalBlockUntilConnectedOrTimedOut(CuratorZookeeperClient.java:323)
   [junit4]   2> at org.apache.curator.RetryLoop.callWithRetry(RetryLoop.java:105)
   [junit4]   2> at org.apache.curator.framework.imps.GetDataBuilderImpl.pathInForeground(GetDataBuilderImpl.java:288)
   [junit4]   2> at org.apache.curator.framework.imps.GetDataBuilderImpl.forPath(GetDataBuilderImpl.java:279)
   [junit4]   2> at org.apache.curator.framework.imps.GetDataBuilderImpl.forPath(GetDataBuilderImpl.java:41)
   [junit4]   2> at org.apache.curator.framework.recipes.shared.SharedValue.readValue(SharedValue.java:244)
   [junit4]   2> at org.apache.curator.framework.recipes.shared.SharedValue.access$100(SharedValue.java:44)
   [junit4]   2> at org.apache.curator.framework.recipes.shared.SharedValue$1.process(SharedValue.java:61)
   [junit4]   2> at org.apache.curator.framework.imps.NamespaceWatcher.process(NamespaceWatcher.java:67)
   [junit4]   2> at org.apache.zookeeper.ClientCnxn$EventThread.processEvent(ClientCnxn.java:530)
   [junit4]   2> at org.apache.zookeeper.ClientCnxn$EventThread.run(ClientCnxn.java:505)
   [junit4]   2> Sep 13, 2017 2:29:18 PM com.carrotsearch.randomizedtesting.ThreadLeakControl tryToInterruptAll
   [junit4]   2> INFO: All leaked threads terminated.
   [junit4]   2> NOTE: test params are: codec=Asserting(Lucene70): {}, docValues:{}, maxPointsInLeafNode=968, maxMBSortInHeap=6.030866633918592, sim=RandomSimilarity(queryNorm=true): {}, locale=de-CH, timezone=America/Grenada
   [junit4]   2> NOTE: Linux 4.10.0-33-generic amd64/Oracle Corporation 1.8.0_144 (64-bit)/cpus=8,threads=1,free=112784744,total=518979584
   [junit4]   2> NOTE: All tests run in this JVM: [IgnoreCommitOptimizeUpdateProcessorFactoryTest, TestEmbeddedSolrServerConstructors, SOLR749Test, SubstringBytesRefFilterTest, ZkSolrClientTest, TestSolrConfigHandlerConcurrent, TestJsonFacetRefinement, MissingSegmentRecoveryTest, TestValueSourceCache, TestRandomRequestDistribution, UpdateRequestProcessorFactoryTest, AssignBackwardCompatibilityTest, ClassificationUpdateProcessorTest, ChaosMonkeyNothingIsSafeWithPullReplicasTest, GraphQueryTest, IndexSchemaTest, TestUpdate, PrimUtilsTest, SliceStateTest, AnalysisAfterCoreReloadTest, TestSubQueryTransformerDistrib, TestElisionMultitermQuery, TestDocBasedVersionConstraints, MetricUtilsTest, ConnectionManagerTest, TestHashQParserPlugin, TestHalfAndHalfDocValues, TestGraphMLResponseWriter, HdfsLockFactoryTest, TestQueryTypes, AnalyticsMergeStrategyTest, DistributedTermsComponentTest, TestRestManager, StatelessScriptUpdateProcessorFactoryTest, TestManagedStopFilterFactory, DirectSolrConnectionTest, TestBlobHandler, TestTrieFacet, SaslZkACLProviderTest, HdfsBasicDistributedZk2Test, TestSchemalessBufferedUpdates, ConvertedLegacyTest, TestCustomStream, TestSQLHandler, DistributedFacetPivotWhiteBoxTest, AtomicUpdatesTest, ConnectionReuseTest, AlternateDirectoryTest, SolrCmdDistributorTest, TestInPlaceUpdatesDistrib, DirectSolrSpellCheckerTest, ZkCLITest, LukeRequestHandlerTest, CurrencyFieldTypeTest, TestOrdValues, CdcrReplicationHandlerTest, TestSchemaVersionResource, DocValuesMultiTest, TestExactSharedStatsCache, LoggingHandlerTest, BasicFunctionalityTest, TestStreamBody, TestComplexPhraseLeadingWildcard, LargeFieldTest, ClusterStateUpdateTest, TestBackupRepositoryFactory, JsonLoaderTest, MetricsConfigTest, HdfsSyncSliceTest, TestDynamicFieldCollectionResource, TestSolrCloudWithHadoopAuthPlugin, SpatialFilterTest, LeaderElectionContextKeyTest, TestConfigSetsAPIZkFailure, BadCopyFieldTest, ImplicitSnitchTest, TestSearchPerf, TestMaxScoreQueryParser, ZkFailoverTest, TestConfigsApi, TestAnalyzeInfixSuggestions, StatsReloadRaceTest, RestartWhileUpdatingTest, DistributedIntervalFacetingTest, TestSegmentSorting, TestSystemIdResolver, V2StandaloneTest, DeleteReplicaTest, DistribCursorPagingTest, MoveReplicaTest, PropertiesRequestHandlerTest, TestReplicationHandlerBackup, SystemInfoHandlerTest, SolrSlf4jReporterTest, SuggesterTSTTest, EnumFieldTest, TestReloadDeadlock, TestCloudSearcherWarming, TestRTGBase, TestSha256AuthenticationProvider, TestFiltering, ResourceLoaderTest, ZkControllerTest, TestManagedSchemaThreadSafety, TestMiniSolrCloudClusterSSL, TestDFISimilarityFactory, DOMUtilTest, MoreLikeThisHandlerTest, TestCustomDocTransformer, DistributedQueueTest, TestExpandComponent, TestSolrFieldCacheBean, CoreMergeIndexesAdminHandlerTest, SampleTest, TestSimpleTrackingShardHandler, CoreAdminHandlerTest, TestCursorMarkWithoutUniqueKey, TestSolrConfigHandler, TestSolrCoreSnapshots, DistributedSuggestComponentTest, SortSpecParsingTest, CollectionsAPIDistributedZkTest, OpenCloseCoreStressTest, LeaderElectionIntegrationTest, BasicZkTest, TestReplicationHandler, TestDistributedGrouping, TestFaceting, TestHashPartitioner, TestReload, TestStressVersions, TestCoreContainer, SpellCheckComponentTest, QueryElevationComponentTest, TestBadConfig, TestIndexSearcher, HighlighterTest, SoftAutoCommitTest, QueryParsingTest, TestAnalyzedSuggestions, BinaryUpdateRequestHandlerTest, TestPartialUpdateDeduplication, TestPHPSerializedResponseWriter, CSVRequestHandlerTest, SearchHandlerTest, TestLFUCache, TestSolrJ, TestUtils, TestCrossCoreJoin, TestEmbeddedSolrServerSchemaAPI, AsyncCallRequestStatusResponseTest, CdcrReplicationDistributedZkTest, CdcrVersionReplicationTest, ChaosMonkeySafeLeaderWithPullReplicasTest, ConfigSetsAPITest, CustomCollectionTest, DistribJoinFromCollectionTest, ForceLeaderTest, LeaderFailoverAfterPartitionTest, MigrateRouteKeyTest, MoveReplicaHDFSUlogDirTest, NodeMutatorTest, OutOfBoxZkACLAndCredentialsProvidersTest, OverseerModifyCollectionTest, OverseerTaskQueueTest, PeerSyncReplicationTest, SharedFSAutoReplicaFailoverUtilsTest, SolrCloudExampleTest, TestAuthenticationFramework, TestCloudDeleteByQuery, TestCloudPivotFacet, TestClusterProperties, TestCollectionsAPIViaSolrCloudCluster, TestConfigSetsAPI, TestLeaderElectionZkExpiry, TestLeaderInitiatedRecoveryThread, TestLocalFSCloudBackupRestore, TestPrepRecovery, TestSolrCloudWithDelegationTokens, TestSolrCloudWithSecureImpersonation]
   [junit4]   2> NOTE: reproduce with: ant test  -Dtestcase=TestSolrCloudWithSecureImpersonation -Dtests.seed=5E4B56366EC81903 -Dtests.multiplier=3 -Dtests.slow=true -Dtests.locale=de-CH -Dtests.timezone=America/Grenada -Dtests.asserts=true -Dtests.file.encoding=UTF-8
   [junit4] ERROR   0.00s J1 | TestSolrCloudWithSecureImpersonation (suite) <<<
   [junit4]    > Throwable #1: com.carrotsearch.randomizedtesting.ThreadLeakError: 2 threads leaked from SUITE scope at org.apache.solr.cloud.TestSolrCloudWithSecureImpersonation:
   [junit4]    >    1) Thread[id=21006, name=jetty-launcher-4391-thread-2-EventThread, state=TIMED_WAITING, group=TGRP-TestSolrCloudWithSecureImpersonation]
   [junit4]    >         at sun.misc.Unsafe.park(Native Method)
   [junit4]    >         at java.util.concurrent.locks.LockSupport.parkNanos(LockSupport.java:215)
   [junit4]    >         at java.util.concurrent.locks.AbstractQueuedSynchronizer.doAcquireSharedNanos(AbstractQueuedSynchronizer.java:1037)
   [junit4]    >         at java.util.concurrent.locks.AbstractQueuedSynchronizer.tryAcquireSharedNanos(AbstractQueuedSynchronizer.java:1328)
   [junit4]    >         at java.util.concurrent.CountDownLatch.await(CountDownLatch.java:277)
   [junit4]    >         at org.apache.curator.CuratorZookeeperClient.internalBlockUntilConnectedOrTimedOut(CuratorZookeeperClient.java:323)
   [junit4]    >         at org.apache.curator.RetryLoop.callWithRetry(RetryLoop.java:105)
   [junit4]    >         at org.apache.curator.framework.imps.GetDataBuilderImpl.pathInForeground(GetDataBuilderImpl.java:288)
   [junit4]    >         at org.apache.curator.framework.imps.GetDataBuilderImpl.forPath(GetDataBuilderImpl.java:279)
   [junit4]    >         at org.apache.curator.framework.imps.GetDataBuilderImpl.forPath(GetDataBuilderImpl.java:41)
   [junit4]    >         at org.apache.curator.framework.recipes.shared.SharedValue.readValue(SharedValue.java:244)
   [junit4]    >         at org.apache.curator.framework.recipes.shared.SharedValue.access$100(SharedValue.java:44)
   [junit4]    >         at org.apache.curator.framework.recipes.shared.SharedValue$1.process(SharedValue.java:61)
   [junit4]    >         at org.apache.curator.framework.imps.NamespaceWatcher.process(NamespaceWatcher.java:67)
   [junit4]    >         at org.apache.zookeeper.ClientCnxn$EventThread.processEvent(ClientCnxn.java:530)
   [junit4]    >         at org.apache.zookeeper.ClientCnxn$EventThread.run(ClientCnxn.java:505)
   [junit4]    >    2) Thread[id=21010, name=jetty-launcher-4391-thread-1-EventThread, state=TIMED_WAITING, group=TGRP-TestSolrCloudWithSecureImpersonation]
   [junit4]    >         at sun.misc.Unsafe.park(Native Method)
   [junit4]    >         at java.util.concurrent.locks.LockSupport.parkNanos(LockSupport.java:215)
   [junit4]    >         at java.util.concurrent.locks.AbstractQueuedSynchronizer.doAcquireSharedNanos(AbstractQueuedSynchronizer.java:1037)
   [junit4]    >         at java.util.concurrent.locks.AbstractQueuedSynchronizer.tryAcquireSharedNanos(AbstractQueuedSynchronizer.java:1328)
   [junit4]    >         at java.util.concurrent.CountDownLatch.await(CountDownLatch.java:277)
   [junit4]    >         at org.apache.curator.CuratorZookeeperClient.internalBlockUntilConnectedOrTimedOut(CuratorZookeeperClient.java:323)
   [junit4]    >         at org.apache.curator.RetryLoop.callWithRetry(RetryLoop.java:105)
   [junit4]    >         at org.apache.curator.framework.imps.GetDataBuilderImpl.pathInForeground(GetDataBuilderImpl.java:288)
   [junit4]    >         at org.apache.curator.framework.imps.GetDataBuilderImpl.forPath(GetDataBuilderImpl.java:279)
   [junit4]    >         at org.apache.curator.framework.imps.GetDataBuilderImpl.forPath(GetDataBuilderImpl.java:41)
   [junit4]    >         at org.apache.curator.framework.recipes.shared.SharedValue.readValue(SharedValue.java:244)
   [junit4]    >         at org.apache.curator.framework.recipes.shared.SharedValue.access$100(SharedValue.java:44)
   [junit4]    >         at org.apache.curator.framework.recipes.shared.SharedValue$1.process(SharedValue.java:61)
   [junit4]    >         at org.apache.curator.framework.imps.NamespaceWatcher.process(NamespaceWatcher.java:67)
   [junit4]    >         at org.apache.zookeeper.ClientCnxn$EventThread.processEvent(ClientCnxn.java:530)
   [junit4]    >         at org.apache.zookeeper.ClientCnxn$EventThread.run(ClientCnxn.java:505)
   [junit4]    > at __randomizedtesting.SeedInfo.seed([5E4B56366EC81903]:0)
   [junit4] Completed [546/732 (1!)] on J1 in 42.45s, 12 tests, 1 error <<< FAILURES!

[...truncated 46750 lines...]


---------------------------------------------------------------------
To unsubscribe, e-mail: [hidden email]
For additional commands, e-mail: [hidden email]
Reply | Threaded
Open this post in threaded view
|

[JENKINS] Lucene-Solr-master-Linux (64bit/jdk1.8.0_144) - Build # 20465 - Still Unstable!

Policeman Jenkins Server-2
Build: https://jenkins.thetaphi.de/job/Lucene-Solr-master-Linux/20465/
Java: 64bit/jdk1.8.0_144 -XX:+UseCompressedOops -XX:+UseG1GC

3 tests failed.
FAILED:  junit.framework.TestSuite.org.apache.solr.core.TestLazyCores

Error Message:
1 thread leaked from SUITE scope at org.apache.solr.core.TestLazyCores:     1) Thread[id=4884, name=searcherExecutor-1838-thread-1, state=WAITING, group=TGRP-TestLazyCores]         at sun.misc.Unsafe.park(Native Method)         at java.util.concurrent.locks.LockSupport.park(LockSupport.java:175)         at java.util.concurrent.locks.AbstractQueuedSynchronizer$ConditionObject.await(AbstractQueuedSynchronizer.java:2039)         at java.util.concurrent.LinkedBlockingQueue.take(LinkedBlockingQueue.java:442)         at java.util.concurrent.ThreadPoolExecutor.getTask(ThreadPoolExecutor.java:1074)         at java.util.concurrent.ThreadPoolExecutor.runWorker(ThreadPoolExecutor.java:1134)         at java.util.concurrent.ThreadPoolExecutor$Worker.run(ThreadPoolExecutor.java:624)         at java.lang.Thread.run(Thread.java:748)

Stack Trace:
com.carrotsearch.randomizedtesting.ThreadLeakError: 1 thread leaked from SUITE scope at org.apache.solr.core.TestLazyCores:
   1) Thread[id=4884, name=searcherExecutor-1838-thread-1, state=WAITING, group=TGRP-TestLazyCores]
        at sun.misc.Unsafe.park(Native Method)
        at java.util.concurrent.locks.LockSupport.park(LockSupport.java:175)
        at java.util.concurrent.locks.AbstractQueuedSynchronizer$ConditionObject.await(AbstractQueuedSynchronizer.java:2039)
        at java.util.concurrent.LinkedBlockingQueue.take(LinkedBlockingQueue.java:442)
        at java.util.concurrent.ThreadPoolExecutor.getTask(ThreadPoolExecutor.java:1074)
        at java.util.concurrent.ThreadPoolExecutor.runWorker(ThreadPoolExecutor.java:1134)
        at java.util.concurrent.ThreadPoolExecutor$Worker.run(ThreadPoolExecutor.java:624)
        at java.lang.Thread.run(Thread.java:748)
        at __randomizedtesting.SeedInfo.seed([611DA031B11D8261]:0)


FAILED:  junit.framework.TestSuite.org.apache.solr.core.TestLazyCores

Error Message:
There are still zombie threads that couldn't be terminated:    1) Thread[id=4884, name=searcherExecutor-1838-thread-1, state=WAITING, group=TGRP-TestLazyCores]         at sun.misc.Unsafe.park(Native Method)         at java.util.concurrent.locks.LockSupport.park(LockSupport.java:175)         at java.util.concurrent.locks.AbstractQueuedSynchronizer$ConditionObject.await(AbstractQueuedSynchronizer.java:2039)         at java.util.concurrent.LinkedBlockingQueue.take(LinkedBlockingQueue.java:442)         at java.util.concurrent.ThreadPoolExecutor.getTask(ThreadPoolExecutor.java:1074)         at java.util.concurrent.ThreadPoolExecutor.runWorker(ThreadPoolExecutor.java:1134)         at java.util.concurrent.ThreadPoolExecutor$Worker.run(ThreadPoolExecutor.java:624)         at java.lang.Thread.run(Thread.java:748)

Stack Trace:
com.carrotsearch.randomizedtesting.ThreadLeakError: There are still zombie threads that couldn't be terminated:
   1) Thread[id=4884, name=searcherExecutor-1838-thread-1, state=WAITING, group=TGRP-TestLazyCores]
        at sun.misc.Unsafe.park(Native Method)
        at java.util.concurrent.locks.LockSupport.park(LockSupport.java:175)
        at java.util.concurrent.locks.AbstractQueuedSynchronizer$ConditionObject.await(AbstractQueuedSynchronizer.java:2039)
        at java.util.concurrent.LinkedBlockingQueue.take(LinkedBlockingQueue.java:442)
        at java.util.concurrent.ThreadPoolExecutor.getTask(ThreadPoolExecutor.java:1074)
        at java.util.concurrent.ThreadPoolExecutor.runWorker(ThreadPoolExecutor.java:1134)
        at java.util.concurrent.ThreadPoolExecutor$Worker.run(ThreadPoolExecutor.java:624)
        at java.lang.Thread.run(Thread.java:748)
        at __randomizedtesting.SeedInfo.seed([611DA031B11D8261]:0)


FAILED:  org.apache.solr.core.TestLazyCores.testNoCommit

Error Message:
Exception during query

Stack Trace:
java.lang.RuntimeException: Exception during query
        at __randomizedtesting.SeedInfo.seed([611DA031B11D8261:BE7D01E07A3AE1C4]:0)
        at org.apache.solr.SolrTestCaseJ4.assertQ(SolrTestCaseJ4.java:884)
        at org.apache.solr.core.TestLazyCores.check10(TestLazyCores.java:847)
        at org.apache.solr.core.TestLazyCores.testNoCommit(TestLazyCores.java:829)
        at sun.reflect.NativeMethodAccessorImpl.invoke0(Native Method)
        at sun.reflect.NativeMethodAccessorImpl.invoke(NativeMethodAccessorImpl.java:62)
        at sun.reflect.DelegatingMethodAccessorImpl.invoke(DelegatingMethodAccessorImpl.java:43)
        at java.lang.reflect.Method.invoke(Method.java:498)
        at com.carrotsearch.randomizedtesting.RandomizedRunner.invoke(RandomizedRunner.java:1737)
        at com.carrotsearch.randomizedtesting.RandomizedRunner$8.evaluate(RandomizedRunner.java:934)
        at com.carrotsearch.randomizedtesting.RandomizedRunner$9.evaluate(RandomizedRunner.java:970)
        at com.carrotsearch.randomizedtesting.RandomizedRunner$10.evaluate(RandomizedRunner.java:984)
        at com.carrotsearch.randomizedtesting.rules.SystemPropertiesRestoreRule$1.evaluate(SystemPropertiesRestoreRule.java:57)
        at org.apache.lucene.util.TestRuleSetupTeardownChained$1.evaluate(TestRuleSetupTeardownChained.java:49)
        at org.apache.lucene.util.AbstractBeforeAfterRule$1.evaluate(AbstractBeforeAfterRule.java:45)
        at org.apache.lucene.util.TestRuleThreadAndTestName$1.evaluate(TestRuleThreadAndTestName.java:48)
        at org.apache.lucene.util.TestRuleIgnoreAfterMaxFailures$1.evaluate(TestRuleIgnoreAfterMaxFailures.java:64)
        at org.apache.lucene.util.TestRuleMarkFailure$1.evaluate(TestRuleMarkFailure.java:47)
        at com.carrotsearch.randomizedtesting.rules.StatementAdapter.evaluate(StatementAdapter.java:36)
        at com.carrotsearch.randomizedtesting.ThreadLeakControl$StatementRunner.run(ThreadLeakControl.java:368)
        at com.carrotsearch.randomizedtesting.ThreadLeakControl.forkTimeoutingTask(ThreadLeakControl.java:817)
        at com.carrotsearch.randomizedtesting.ThreadLeakControl$3.evaluate(ThreadLeakControl.java:468)
        at com.carrotsearch.randomizedtesting.RandomizedRunner.runSingleTest(RandomizedRunner.java:943)
        at com.carrotsearch.randomizedtesting.RandomizedRunner$5.evaluate(RandomizedRunner.java:829)
        at com.carrotsearch.randomizedtesting.RandomizedRunner$6.evaluate(RandomizedRunner.java:879)
        at com.carrotsearch.randomizedtesting.RandomizedRunner$7.evaluate(RandomizedRunner.java:890)
        at com.carrotsearch.randomizedtesting.rules.StatementAdapter.evaluate(StatementAdapter.java:36)
        at com.carrotsearch.randomizedtesting.rules.SystemPropertiesRestoreRule$1.evaluate(SystemPropertiesRestoreRule.java:57)
        at org.apache.lucene.util.AbstractBeforeAfterRule$1.evaluate(AbstractBeforeAfterRule.java:45)
        at com.carrotsearch.randomizedtesting.rules.StatementAdapter.evaluate(StatementAdapter.java:36)
        at org.apache.lucene.util.TestRuleStoreClassName$1.evaluate(TestRuleStoreClassName.java:41)
        at com.carrotsearch.randomizedtesting.rules.NoShadowingOrOverridesOnMethodsRule$1.evaluate(NoShadowingOrOverridesOnMethodsRule.java:40)
        at com.carrotsearch.randomizedtesting.rules.NoShadowingOrOverridesOnMethodsRule$1.evaluate(NoShadowingOrOverridesOnMethodsRule.java:40)
        at com.carrotsearch.randomizedtesting.rules.StatementAdapter.evaluate(StatementAdapter.java:36)
        at com.carrotsearch.randomizedtesting.rules.StatementAdapter.evaluate(StatementAdapter.java:36)
        at com.carrotsearch.randomizedtesting.rules.StatementAdapter.evaluate(StatementAdapter.java:36)
        at org.apache.lucene.util.TestRuleAssertionsRequired$1.evaluate(TestRuleAssertionsRequired.java:53)
        at org.apache.lucene.util.TestRuleMarkFailure$1.evaluate(TestRuleMarkFailure.java:47)
        at org.apache.lucene.util.TestRuleIgnoreAfterMaxFailures$1.evaluate(TestRuleIgnoreAfterMaxFailures.java:64)
        at org.apache.lucene.util.TestRuleIgnoreTestSuites$1.evaluate(TestRuleIgnoreTestSuites.java:54)
        at com.carrotsearch.randomizedtesting.rules.StatementAdapter.evaluate(StatementAdapter.java:36)
        at com.carrotsearch.randomizedtesting.ThreadLeakControl$StatementRunner.run(ThreadLeakControl.java:368)
        at java.lang.Thread.run(Thread.java:748)
Caused by: java.lang.RuntimeException: REQUEST FAILED: xpath=//result[@numFound='10']
        xml response was: <?xml version="1.0" encoding="UTF-8"?>
<response>
<lst name="responseHeader"><int name="status">0</int><int name="QTime">0</int><lst name="params"><str name="q">*:*</str></lst></lst><result name="response" numFound="0" start="0"></result>
</response>

        request was:q=*:*
        at org.apache.solr.SolrTestCaseJ4.assertQ(SolrTestCaseJ4.java:877)
        ... 41 more




Build Log:
[...truncated 11891 lines...]
   [junit4] Suite: org.apache.solr.core.TestLazyCores
   [junit4]   2> Creating dataDir: /home/jenkins/workspace/Lucene-Solr-master-Linux/solr/build/solr-core/test/J0/temp/solr.core.TestLazyCores_611DA031B11D8261-001/init-core-data-001
   [junit4]   2> 578973 WARN  (SUITE-TestLazyCores-seed#[611DA031B11D8261]-worker) [    ] o.a.s.SolrTestCaseJ4 startTrackingSearchers: numOpens=26 numCloses=26
   [junit4]   2> 578973 INFO  (SUITE-TestLazyCores-seed#[611DA031B11D8261]-worker) [    ] o.a.s.SolrTestCaseJ4 Using PointFields (NUMERIC_POINTS_SYSPROP=true) w/NUMERIC_DOCVALUES_SYSPROP=false
   [junit4]   2> 578974 INFO  (SUITE-TestLazyCores-seed#[611DA031B11D8261]-worker) [    ] o.a.s.SolrTestCaseJ4 Randomized ssl (true) and clientAuth (true) via: @org.apache.solr.util.RandomizeSSL(reason=, ssl=NaN, value=NaN, clientAuth=NaN)
   [junit4]   2> 578975 INFO  (SUITE-TestLazyCores-seed#[611DA031B11D8261]-worker) [    ] o.a.s.SolrTestCaseJ4 SecureRandom sanity checks: test.solr.allowed.securerandom=null & java.security.egd=file:/dev/./urandom
   [junit4]   2> 578975 INFO  (TEST-TestLazyCores.testCachingLimit-seed#[611DA031B11D8261]) [    ] o.a.s.SolrTestCaseJ4 ###Starting testCachingLimit
   [junit4]   2> 578982 INFO  (TEST-TestLazyCores.testCachingLimit-seed#[611DA031B11D8261]) [    ] o.a.s.c.SolrXmlConfig Loading container configuration from /home/jenkins/workspace/Lucene-Solr-master-Linux/solr/build/solr-core/test/J0/temp/solr.core.TestLazyCores_611DA031B11D8261-001/tempDir-001/solr.xml
   [junit4]   2> 578984 INFO  (TEST-TestLazyCores.testCachingLimit-seed#[611DA031B11D8261]) [    ] o.a.s.c.SolrXmlConfig MBean server found: com.sun.jmx.mbeanserver.JmxMBeanServer@6eff5a75, but no JMX reporters were configured - adding default JMX reporter.
   [junit4]   2> 579036 INFO  (TEST-TestLazyCores.testCachingLimit-seed#[611DA031B11D8261]) [    ] o.a.s.m.r.SolrJmxReporter JMX monitoring for 'solr.node' (registry 'solr.node') enabled at server: com.sun.jmx.mbeanserver.JmxMBeanServer@6eff5a75
   [junit4]   2> 579044 INFO  (TEST-TestLazyCores.testCachingLimit-seed#[611DA031B11D8261]) [    ] o.a.s.m.r.SolrJmxReporter JMX monitoring for 'solr.jvm' (registry 'solr.jvm') enabled at server: com.sun.jmx.mbeanserver.JmxMBeanServer@6eff5a75
   [junit4]   2> 579044 INFO  (TEST-TestLazyCores.testCachingLimit-seed#[611DA031B11D8261]) [    ] o.a.s.m.r.SolrJmxReporter JMX monitoring for 'solr.jetty' (registry 'solr.jetty') enabled at server: com.sun.jmx.mbeanserver.JmxMBeanServer@6eff5a75
   [junit4]   2> 579047 INFO  (TEST-TestLazyCores.testCachingLimit-seed#[611DA031B11D8261]) [    ] o.a.s.c.TransientSolrCoreCacheDefault Allocating transient cache for 4 transient cores
   [junit4]   2> 579063 INFO  (coreLoadExecutor-1646-thread-3) [    x:collection5] o.a.s.c.SolrConfig Using Lucene MatchVersion: 8.0.0
   [junit4]   2> 579067 INFO  (coreLoadExecutor-1646-thread-2) [    x:collection2] o.a.s.c.SolrConfig Using Lucene MatchVersion: 8.0.0
   [junit4]   2> 579068 INFO  (coreLoadExecutor-1646-thread-1) [    x:collection1] o.a.s.c.SolrConfig Using Lucene MatchVersion: 8.0.0
   [junit4]   2> 579284 INFO  (coreLoadExecutor-1646-thread-3) [    x:collection5] o.a.s.s.IndexSchema [collection5] Schema name=tiny
   [junit4]   2> 579284 INFO  (coreLoadExecutor-1646-thread-2) [    x:collection2] o.a.s.s.IndexSchema [collection2] Schema name=tiny
   [junit4]   2> 579286 INFO  (coreLoadExecutor-1646-thread-3) [    x:collection5] o.a.s.s.IndexSchema Loaded schema tiny/1.1 with uniqueid field id
   [junit4]   2> 579286 INFO  (coreLoadExecutor-1646-thread-3) [    x:collection5] o.a.s.c.CoreContainer Creating SolrCore 'collection5' using configuration from instancedir /home/jenkins/workspace/Lucene-Solr-master-Linux/solr/build/solr-core/test/J0/temp/solr.core.TestLazyCores_611DA031B11D8261-001/tempDir-001/./collection5, trusted=true
   [junit4]   2> 579286 INFO  (coreLoadExecutor-1646-thread-3) [    x:collection5] o.a.s.m.r.SolrJmxReporter JMX monitoring for 'solr.core.collection5' (registry 'solr.core.collection5') enabled at server: com.sun.jmx.mbeanserver.JmxMBeanServer@6eff5a75
   [junit4]   2> 579286 INFO  (coreLoadExecutor-1646-thread-3) [    x:collection5] o.a.s.c.SolrCore solr.RecoveryStrategy.Builder
   [junit4]   2> 579286 INFO  (coreLoadExecutor-1646-thread-3) [    x:collection5] o.a.s.c.SolrCore [[collection5] ] Opening new SolrCore at [/home/jenkins/workspace/Lucene-Solr-master-Linux/solr/build/solr-core/test/J0/temp/solr.core.TestLazyCores_611DA031B11D8261-001/tempDir-001/collection5], dataDir=[/home/jenkins/workspace/Lucene-Solr-master-Linux/solr/build/solr-core/test/J0/temp/solr.core.TestLazyCores_611DA031B11D8261-001/tempDir-001/./collection5/data/]
   [junit4]   2> 579289 INFO  (coreLoadExecutor-1646-thread-3) [    x:collection5] o.a.s.u.RandomMergePolicy RandomMergePolicy wrapping class org.apache.lucene.index.LogDocMergePolicy: [LogDocMergePolicy: minMergeSize=1000, mergeFactor=39, maxMergeSize=9223372036854775807, maxMergeSizeForForcedMerge=9223372036854775807, calibrateSizeByDeletes=false, maxMergeDocs=2147483647, maxCFSSegmentSizeMB=8.796093022207999E12, noCFSRatio=1.0]
   [junit4]   2> 579290 INFO  (coreLoadExecutor-1646-thread-1) [    x:collection1] o.a.s.s.IndexSchema [collection1] Schema name=tiny
   [junit4]   2> 579291 INFO  (coreLoadExecutor-1646-thread-1) [    x:collection1] o.a.s.s.IndexSchema Loaded schema tiny/1.1 with uniqueid field id
   [junit4]   2> 579291 INFO  (coreLoadExecutor-1646-thread-1) [    x:collection1] o.a.s.c.CoreContainer Creating SolrCore 'collection1' using configuration from instancedir /home/jenkins/workspace/Lucene-Solr-master-Linux/solr/build/solr-core/test/J0/temp/solr.core.TestLazyCores_611DA031B11D8261-001/tempDir-001/./collection1, trusted=true
   [junit4]   2> 579292 INFO  (coreLoadExecutor-1646-thread-1) [    x:collection1] o.a.s.m.r.SolrJmxReporter JMX monitoring for 'solr.core.collection1' (registry 'solr.core.collection1') enabled at server: com.sun.jmx.mbeanserver.JmxMBeanServer@6eff5a75
   [junit4]   2> 579292 INFO  (coreLoadExecutor-1646-thread-1) [    x:collection1] o.a.s.c.SolrCore solr.RecoveryStrategy.Builder
   [junit4]   2> 579292 INFO  (coreLoadExecutor-1646-thread-1) [    x:collection1] o.a.s.c.SolrCore [[collection1] ] Opening new SolrCore at [/home/jenkins/workspace/Lucene-Solr-master-Linux/solr/build/solr-core/test/J0/temp/solr.core.TestLazyCores_611DA031B11D8261-001/tempDir-001/collection1], dataDir=[/home/jenkins/workspace/Lucene-Solr-master-Linux/solr/build/solr-core/test/J0/temp/solr.core.TestLazyCores_611DA031B11D8261-001/tempDir-001/./collection1/data/]
   [junit4]   2> 579294 INFO  (coreLoadExecutor-1646-thread-2) [    x:collection2] o.a.s.s.IndexSchema Loaded schema tiny/1.1 with uniqueid field id
   [junit4]   2> 579294 INFO  (coreLoadExecutor-1646-thread-2) [    x:collection2] o.a.s.c.CoreContainer Creating SolrCore 'collection2' using configuration from instancedir /home/jenkins/workspace/Lucene-Solr-master-Linux/solr/build/solr-core/test/J0/temp/solr.core.TestLazyCores_611DA031B11D8261-001/tempDir-001/./collection2, trusted=true
   [junit4]   2> 579294 INFO  (coreLoadExecutor-1646-thread-2) [    x:collection2] o.a.s.m.r.SolrJmxReporter JMX monitoring for 'solr.core.collection2' (registry 'solr.core.collection2') enabled at server: com.sun.jmx.mbeanserver.JmxMBeanServer@6eff5a75
   [junit4]   2> 579294 INFO  (coreLoadExecutor-1646-thread-2) [    x:collection2] o.a.s.c.SolrCore solr.RecoveryStrategy.Builder
   [junit4]   2> 579294 INFO  (coreLoadExecutor-1646-thread-2) [    x:collection2] o.a.s.c.SolrCore [[collection2] ] Opening new SolrCore at [/home/jenkins/workspace/Lucene-Solr-master-Linux/solr/build/solr-core/test/J0/temp/solr.core.TestLazyCores_611DA031B11D8261-001/tempDir-001/collection2], dataDir=[/home/jenkins/workspace/Lucene-Solr-master-Linux/solr/build/solr-core/test/J0/temp/solr.core.TestLazyCores_611DA031B11D8261-001/tempDir-001/./collection2/data/]
   [junit4]   2> 579296 INFO  (coreLoadExecutor-1646-thread-2) [    x:collection2] o.a.s.u.RandomMergePolicy RandomMergePolicy wrapping class org.apache.lucene.index.LogDocMergePolicy: [LogDocMergePolicy: minMergeSize=1000, mergeFactor=39, maxMergeSize=9223372036854775807, maxMergeSizeForForcedMerge=9223372036854775807, calibrateSizeByDeletes=false, maxMergeDocs=2147483647, maxCFSSegmentSizeMB=8.796093022207999E12, noCFSRatio=1.0]
   [junit4]   2> 579298 INFO  (coreLoadExecutor-1646-thread-1) [    x:collection1] o.a.s.u.RandomMergePolicy RandomMergePolicy wrapping class org.apache.lucene.index.LogDocMergePolicy: [LogDocMergePolicy: minMergeSize=1000, mergeFactor=39, maxMergeSize=9223372036854775807, maxMergeSizeForForcedMerge=9223372036854775807, calibrateSizeByDeletes=false, maxMergeDocs=2147483647, maxCFSSegmentSizeMB=8.796093022207999E12, noCFSRatio=1.0]
   [junit4]   2> 579340 INFO  (coreLoadExecutor-1646-thread-3) [    x:collection5] o.a.s.u.CommitTracker Hard AutoCommit: disabled
   [junit4]   2> 579340 INFO  (coreLoadExecutor-1646-thread-3) [    x:collection5] o.a.s.u.CommitTracker Soft AutoCommit: disabled
   [junit4]   2> 579342 INFO  (coreLoadExecutor-1646-thread-3) [    x:collection5] o.a.s.u.RandomMergePolicy RandomMergePolicy wrapping class org.apache.lucene.index.AlcoholicMergePolicy: [AlcoholicMergePolicy: minMergeSize=0, mergeFactor=10, maxMergeSize=998726326, maxMergeSizeForForcedMerge=9223372036854775807, calibrateSizeByDeletes=true, maxMergeDocs=2147483647, maxCFSSegmentSizeMB=8.796093022207999E12, noCFSRatio=0.1]
   [junit4]   2> 579342 INFO  (coreLoadExecutor-1646-thread-3) [    x:collection5] o.a.s.s.SolrIndexSearcher Opening [Searcher@6a730d6e[collection5] main]
   [junit4]   2> 579342 INFO  (coreLoadExecutor-1646-thread-3) [    x:collection5] o.a.s.r.ManagedResourceStorage File-based storage initialized to use dir: /home/jenkins/workspace/Lucene-Solr-master-Linux/solr/build/solr-core/test/J0/temp/solr.core.TestLazyCores_611DA031B11D8261-001/tempDir-001/collection5/conf
   [junit4]   2> 579343 INFO  (coreLoadExecutor-1646-thread-3) [    x:collection5] o.a.s.h.ReplicationHandler Commits will be reserved for  10000
   [junit4]   2> 579345 INFO  (searcherExecutor-1647-thread-1-processing-x:collection5) [    x:collection5] o.a.s.c.SolrCore [collection5] Registered new searcher Searcher@6a730d6e[collection5] main{ExitableDirectoryReader(UninvertingDirectoryReader())}
   [junit4]   2> 579351 INFO  (coreLoadExecutor-1646-thread-1) [    x:collection1] o.a.s.u.CommitTracker Hard AutoCommit: disabled
   [junit4]   2> 579351 INFO  (coreLoadExecutor-1646-thread-1) [    x:collection1] o.a.s.u.CommitTracker Soft AutoCommit: disabled
   [junit4]   2> 579352 INFO  (coreLoadExecutor-1646-thread-1) [    x:collection1] o.a.s.u.RandomMergePolicy RandomMergePolicy wrapping class org.apache.lucene.index.AlcoholicMergePolicy: [AlcoholicMergePolicy: minMergeSize=0, mergeFactor=10, maxMergeSize=998726326, maxMergeSizeForForcedMerge=9223372036854775807, calibrateSizeByDeletes=true, maxMergeDocs=2147483647, maxCFSSegmentSizeMB=8.796093022207999E12, noCFSRatio=0.1]
   [junit4]   2> 579352 INFO  (coreLoadExecutor-1646-thread-1) [    x:collection1] o.a.s.s.SolrIndexSearcher Opening [Searcher@7136d625[collection1] main]
   [junit4]   2> 579353 INFO  (coreLoadExecutor-1646-thread-1) [    x:collection1] o.a.s.r.ManagedResourceStorage File-based storage initialized to use dir: /home/jenkins/workspace/Lucene-Solr-master-Linux/solr/build/solr-core/test/J0/temp/solr.core.TestLazyCores_611DA031B11D8261-001/tempDir-001/collection1/conf
   [junit4]   2> 579353 INFO  (coreLoadExecutor-1646-thread-1) [    x:collection1] o.a.s.h.ReplicationHandler Commits will be reserved for  10000
   [junit4]   2> 579354 INFO  (searcherExecutor-1648-thread-1-processing-x:collection1) [    x:collection1] o.a.s.c.SolrCore [collection1] Registered new searcher Searcher@7136d625[collection1] main{ExitableDirectoryReader(UninvertingDirectoryReader())}
   [junit4]   2> 579361 INFO  (coreLoadExecutor-1646-thread-2) [    x:collection2] o.a.s.u.CommitTracker Hard AutoCommit: disabled
   [junit4]   2> 579361 INFO  (coreLoadExecutor-1646-thread-2) [    x:collection2] o.a.s.u.CommitTracker Soft AutoCommit: disabled
   [junit4]   2> 579362 INFO  (coreLoadExecutor-1646-thread-2) [    x:collection2] o.a.s.u.RandomMergePolicy RandomMergePolicy wrapping class org.apache.lucene.index.AlcoholicMergePolicy: [AlcoholicMergePolicy: minMergeSize=0, mergeFactor=10, maxMergeSize=998726326, maxMergeSizeForForcedMerge=9223372036854775807, calibrateSizeByDeletes=true, maxMergeDocs=2147483647, maxCFSSegmentSizeMB=8.796093022207999E12, noCFSRatio=0.1]
   [junit4]   2> 579363 INFO  (coreLoadExecutor-1646-thread-2) [    x:collection2] o.a.s.s.SolrIndexSearcher Opening [Searcher@3d7154f[collection2] main]
   [junit4]   2> 579363 INFO  (coreLoadExecutor-1646-thread-2) [    x:collection2] o.a.s.r.ManagedResourceStorage File-based storage initialized to use dir: /home/jenkins/workspace/Lucene-Solr-master-Linux/solr/build/solr-core/test/J0/temp/solr.core.TestLazyCores_611DA031B11D8261-001/tempDir-001/collection2/conf
   [junit4]   2> 579363 INFO  (coreLoadExecutor-1646-thread-2) [    x:collection2] o.a.s.h.ReplicationHandler Commits will be reserved for  10000
   [junit4]   2> 579364 INFO  (searcherExecutor-1649-thread-1-processing-x:collection2) [    x:collection2] o.a.s.c.SolrCore [collection2] Registered new searcher Searcher@3d7154f[collection2] main{ExitableDirectoryReader(UninvertingDirectoryReader())}
   [junit4]   2> 579374 INFO  (TEST-TestLazyCores.testCachingLimit-seed#[611DA031B11D8261]) [    x:collection3] o.a.s.c.SolrConfig Using Lucene MatchVersion: 8.0.0
   [junit4]   2> 579379 INFO  (TEST-TestLazyCores.testCachingLimit-seed#[611DA031B11D8261]) [    x:collection3] o.a.s.s.IndexSchema [collection3] Schema name=tiny
   [junit4]   2> 579381 INFO  (TEST-TestLazyCores.testCachingLimit-seed#[611DA031B11D8261]) [    x:collection3] o.a.s.s.IndexSchema Loaded schema tiny/1.1 with uniqueid field id
   [junit4]   2> 579381 INFO  (TEST-TestLazyCores.testCachingLimit-seed#[611DA031B11D8261]) [    x:collection3] o.a.s.c.CoreContainer Creating SolrCore 'collection3' using configuration from instancedir /home/jenkins/workspace/Lucene-Solr-master-Linux/solr/build/solr-core/test/J0/temp/solr.core.TestLazyCores_611DA031B11D8261-001/tempDir-001/./collection3, trusted=true
   [junit4]   2> 579382 INFO  (TEST-TestLazyCores.testCachingLimit-seed#[611DA031B11D8261]) [    x:collection3] o.a.s.m.r.SolrJmxReporter JMX monitoring for 'solr.core.collection3' (registry 'solr.core.collection3') enabled at server: com.sun.jmx.mbeanserver.JmxMBeanServer@6eff5a75
   [junit4]   2> 579382 INFO  (TEST-TestLazyCores.testCachingLimit-seed#[611DA031B11D8261]) [    x:collection3] o.a.s.c.SolrCore solr.RecoveryStrategy.Builder
   [junit4]   2> 579382 INFO  (TEST-TestLazyCores.testCachingLimit-seed#[611DA031B11D8261]) [    x:collection3] o.a.s.c.SolrCore [[collection3] ] Opening new SolrCore at [/home/jenkins/workspace/Lucene-Solr-master-Linux/solr/build/solr-core/test/J0/temp/solr.core.TestLazyCores_611DA031B11D8261-001/tempDir-001/collection3], dataDir=[/home/jenkins/workspace/Lucene-Solr-master-Linux/solr/build/solr-core/test/J0/temp/solr.core.TestLazyCores_611DA031B11D8261-001/tempDir-001/./collection3/data/]
   [junit4]   2> 579385 INFO  (TEST-TestLazyCores.testCachingLimit-seed#[611DA031B11D8261]) [    x:collection3] o.a.s.u.RandomMergePolicy RandomMergePolicy wrapping class org.apache.lucene.index.LogByteSizeMergePolicy: [LogByteSizeMergePolicy: minMergeSize=1677721, mergeFactor=47, maxMergeSize=2147483648, maxMergeSizeForForcedMerge=9223372036854775807, calibrateSizeByDeletes=true, maxMergeDocs=2147483647, maxCFSSegmentSizeMB=8.796093022207999E12, noCFSRatio=0.5027739834271999]
   [junit4]   2> 579470 INFO  (TEST-TestLazyCores.testCachingLimit-seed#[611DA031B11D8261]) [    x:collection3] o.a.s.u.CommitTracker Hard AutoCommit: disabled
   [junit4]   2> 579470 INFO  (TEST-TestLazyCores.testCachingLimit-seed#[611DA031B11D8261]) [    x:collection3] o.a.s.u.CommitTracker Soft AutoCommit: disabled
   [junit4]   2> 579471 INFO  (TEST-TestLazyCores.testCachingLimit-seed#[611DA031B11D8261]) [    x:collection3] o.a.s.u.RandomMergePolicy RandomMergePolicy wrapping class org.apache.lucene.index.TieredMergePolicy: [TieredMergePolicy: maxMergeAtOnce=44, maxMergeAtOnceExplicit=11, maxMergedSegmentMB=20.177734375, floorSegmentMB=0.962890625, forceMergeDeletesPctAllowed=1.1091767891838933, segmentsPerTier=14.0, maxCFSSegmentSizeMB=8.796093022207999E12, noCFSRatio=1.0
   [junit4]   2> 579472 INFO  (TEST-TestLazyCores.testCachingLimit-seed#[611DA031B11D8261]) [    x:collection3] o.a.s.s.SolrIndexSearcher Opening [Searcher@6651f0b6[collection3] main]
   [junit4]   2> 579472 INFO  (TEST-TestLazyCores.testCachingLimit-seed#[611DA031B11D8261]) [    x:collection3] o.a.s.r.ManagedResourceStorage File-based storage initialized to use dir: /home/jenkins/workspace/Lucene-Solr-master-Linux/solr/build/solr-core/test/J0/temp/solr.core.TestLazyCores_611DA031B11D8261-001/tempDir-001/collection3/conf
   [junit4]   2> 579473 INFO  (TEST-TestLazyCores.testCachingLimit-seed#[611DA031B11D8261]) [    x:collection3] o.a.s.h.ReplicationHandler Commits will be reserved for  10000
   [junit4]   2> 579477 INFO  (searcherExecutor-1659-thread-1-processing-x:collection3) [    x:collection3] o.a.s.c.SolrCore [collection3] Registered new searcher Searcher@6651f0b6[collection3] main{ExitableDirectoryReader(UninvertingDirectoryReader())}
   [junit4]   2> 579484 INFO  (TEST-TestLazyCores.testCachingLimit-seed#[611DA031B11D8261]) [    x:collection3] o.a.s.c.SolrConfig Using Lucene MatchVersion: 8.0.0
   [junit4]   2> 579649 INFO  (TEST-TestLazyCores.testCachingLimit-seed#[611DA031B11D8261]) [    x:collection3] o.a.s.s.IndexSchema [collection4] Schema name=tiny
   [junit4]   2> 579652 INFO  (TEST-TestLazyCores.testCachingLimit-seed#[611DA031B11D8261]) [    x:collection3] o.a.s.s.IndexSchema Loaded schema tiny/1.1 with uniqueid field id
   [junit4]   2> 579652 INFO  (TEST-TestLazyCores.testCachingLimit-seed#[611DA031B11D8261]) [    x:collection3] o.a.s.c.CoreContainer Creating SolrCore 'collection4' using configuration from instancedir /home/jenkins/workspace/Lucene-Solr-master-Linux/solr/build/solr-core/test/J0/temp/solr.core.TestLazyCores_611DA031B11D8261-001/tempDir-001/./collection4, trusted=true
   [junit4]   2> 579653 INFO  (TEST-TestLazyCores.testCachingLimit-seed#[611DA031B11D8261]) [    x:collection3] o.a.s.m.r.SolrJmxReporter JMX monitoring for 'solr.core.collection4' (registry 'solr.core.collection4') enabled at server: com.sun.jmx.mbeanserver.JmxMBeanServer@6eff5a75
   [junit4]   2> 579653 INFO  (TEST-TestLazyCores.testCachingLimit-seed#[611DA031B11D8261]) [    x:collection3] o.a.s.c.SolrCore solr.RecoveryStrategy.Builder
   [junit4]   2> 579653 INFO  (TEST-TestLazyCores.testCachingLimit-seed#[611DA031B11D8261]) [    x:collection3] o.a.s.c.SolrCore [[collection4] ] Opening new SolrCore at [/home/jenkins/workspace/Lucene-Solr-master-Linux/solr/build/solr-core/test/J0/temp/solr.core.TestLazyCores_611DA031B11D8261-001/tempDir-001/collection4], dataDir=[/home/jenkins/workspace/Lucene-Solr-master-Linux/solr/build/solr-core/test/J0/temp/solr.core.TestLazyCores_611DA031B11D8261-001/tempDir-001/./collection4/data/]
   [junit4]   2> 579656 INFO  (TEST-TestLazyCores.testCachingLimit-seed#[611DA031B11D8261]) [    x:collection3] o.a.s.u.RandomMergePolicy RandomMergePolicy wrapping class org.apache.lucene.index.TieredMergePolicy: [TieredMergePolicy: maxMergeAtOnce=33, maxMergeAtOnceExplicit=22, maxMergedSegmentMB=21.55078125, floorSegmentMB=1.66015625, forceMergeDeletesPctAllowed=26.613942119980184, segmentsPerTier=20.0, maxCFSSegmentSizeMB=8.796093022207999E12, noCFSRatio=1.0
   [junit4]   2> 579713 INFO  (TEST-TestLazyCores.testCachingLimit-seed#[611DA031B11D8261]) [    x:collection3] o.a.s.u.CommitTracker Hard AutoCommit: disabled
   [junit4]   2> 579713 INFO  (TEST-TestLazyCores.testCachingLimit-seed#[611DA031B11D8261]) [    x:collection3] o.a.s.u.CommitTracker Soft AutoCommit: disabled
   [junit4]   2> 579716 INFO  (TEST-TestLazyCores.testCachingLimit-seed#[611DA031B11D8261]) [    x:collection3] o.a.s.u.RandomMergePolicy RandomMergePolicy wrapping class org.apache.lucene.index.AlcoholicMergePolicy: [AlcoholicMergePolicy: minMergeSize=0, mergeFactor=10, maxMergeSize=635077649, maxMergeSizeForForcedMerge=9223372036854775807, calibrateSizeByDeletes=true, maxMergeDocs=2147483647, maxCFSSegmentSizeMB=8.796093022207999E12, noCFSRatio=0.1]
   [junit4]   2> 579717 INFO  (TEST-TestLazyCores.testCachingLimit-seed#[611DA031B11D8261]) [    x:collection3] o.a.s.s.SolrIndexSearcher Opening [Searcher@adab08b[collection4] main]
   [junit4]   2> 579717 INFO  (TEST-TestLazyCores.testCachingLimit-seed#[611DA031B11D8261]) [    x:collection3] o.a.s.r.ManagedResourceStorage File-based storage initialized to use dir: /home/jenkins/workspace/Lucene-Solr-master-Linux/solr/build/solr-core/test/J0/temp/solr.core.TestLazyCores_611DA031B11D8261-001/tempDir-001/collection4/conf
   [junit4]   2> 579718 INFO  (TEST-TestLazyCores.testCachingLimit-seed#[611DA031B11D8261]) [    x:collection3] o.a.s.h.ReplicationHandler Commits will be reserved for  10000
   [junit4]   2> 579719 INFO  (searcherExecutor-1663-thread-1-processing-x:collection3) [    x:collection3] o.a.s.c.SolrCore [collection4] Registered new searcher Searcher@adab08b[collection4] main{ExitableDirectoryReader(UninvertingDirectoryReader())}
   [junit4]   2> 579727 INFO  (TEST-TestLazyCores.testCachingLimit-seed#[611DA031B11D8261]) [    x:collection3] o.a.s.c.SolrConfig Using Lucene MatchVersion: 8.0.0
   [junit4]   2> 579732 INFO  (TEST-TestLazyCores.testCachingLimit-seed#[611DA031B11D8261]) [    x:collection3] o.a.s.s.IndexSchema [collection6] Schema name=tiny
   [junit4]   2> 579734 INFO  (TEST-TestLazyCores.testCachingLimit-seed#[611DA031B11D8261]) [    x:collection3] o.a.s.s.IndexSchema Loaded schema tiny/1.1 with uniqueid field id
   [junit4]   2> 579734 INFO  (TEST-TestLazyCores.testCachingLimit-seed#[611DA031B11D8261]) [    x:collection3] o.a.s.c.CoreContainer Creating SolrCore 'collection6' using configuration from instancedir /home/jenkins/workspace/Lucene-Solr-master-Linux/solr/build/solr-core/test/J0/temp/solr.core.TestLazyCores_611DA031B11D8261-001/tempDir-001/./collection6, trusted=true
   [junit4]   2> 579735 INFO  (TEST-TestLazyCores.testCachingLimit-seed#[611DA031B11D8261]) [    x:collection3] o.a.s.m.r.SolrJmxReporter JMX monitoring for 'solr.core.collection6' (registry 'solr.core.collection6') enabled at server: com.sun.jmx.mbeanserver.JmxMBeanServer@6eff5a75
   [junit4]   2> 579735 INFO  (TEST-TestLazyCores.testCachingLimit-seed#[611DA031B11D8261]) [    x:collection3] o.a.s.c.SolrCore solr.RecoveryStrategy.Builder
   [junit4]   2> 579735 INFO  (TEST-TestLazyCores.testCachingLimit-seed#[611DA031B11D8261]) [    x:collection3] o.a.s.c.SolrCore [[collection6] ] Opening new SolrCore at [/home/jenkins/workspace/Lucene-Solr-master-Linux/solr/build/solr-core/test/J0/temp/solr.core.TestLazyCores_611DA031B11D8261-001/tempDir-001/collection6], dataDir=[/home/jenkins/workspace/Lucene-Solr-master-Linux/solr/build/solr-core/test/J0/temp/solr.core.TestLazyCores_611DA031B11D8261-001/tempDir-001/./collection6/data/]
   [junit4]   2> 579738 INFO  (TEST-TestLazyCores.testCachingLimit-seed#[611DA031B11D8261]) [    x:collection3] o.a.s.u.RandomMergePolicy RandomMergePolicy wrapping class org.apache.lucene.index.TieredMergePolicy: [TieredMergePolicy: maxMergeAtOnce=32, maxMergeAtOnceExplicit=20, maxMergedSegmentMB=73.5224609375, floorSegmentMB=0.298828125, forceMergeDeletesPctAllowed=26.46396608717979, segmentsPerTier=25.0, maxCFSSegmentSizeMB=8.796093022207999E12, noCFSRatio=1.0
   [junit4]   2> 579827 INFO  (TEST-TestLazyCores.testCachingLimit-seed#[611DA031B11D8261]) [    x:collection3] o.a.s.u.CommitTracker Hard AutoCommit: disabled
   [junit4]   2> 579827 INFO  (TEST-TestLazyCores.testCachingLimit-seed#[611DA031B11D8261]) [    x:collection3] o.a.s.u.CommitTracker Soft AutoCommit: disabled
   [junit4]   2> 579828 INFO  (TEST-TestLazyCores.testCachingLimit-seed#[611DA031B11D8261]) [    x:collection3] o.a.s.u.RandomMergePolicy RandomMergePolicy wrapping class org.apache.lucene.index.TieredMergePolicy: [TieredMergePolicy: maxMergeAtOnce=45, maxMergeAtOnceExplicit=23, maxMergedSegmentMB=34.37890625, floorSegmentMB=0.890625, forceMergeDeletesPctAllowed=18.989046942418998, segmentsPerTier=15.0, maxCFSSegmentSizeMB=8.796093022207999E12, noCFSRatio=0.294700376418809
   [junit4]   2> 579829 INFO  (TEST-TestLazyCores.testCachingLimit-seed#[611DA031B11D8261]) [    x:collection3] o.a.s.s.SolrIndexSearcher Opening [Searcher@383ef643[collection6] main]
   [junit4]   2> 579829 INFO  (TEST-TestLazyCores.testCachingLimit-seed#[611DA031B11D8261]) [    x:collection3] o.a.s.r.ManagedResourceStorage File-based storage initialized to use dir: /home/jenkins/workspace/Lucene-Solr-master-Linux/solr/build/solr-core/test/J0/temp/solr.core.TestLazyCores_611DA031B11D8261-001/tempDir-001/collection6/conf
   [junit4]   2> 579830 INFO  (TEST-TestLazyCores.testCachingLimit-seed#[611DA031B11D8261]) [    x:collection3] o.a.s.h.ReplicationHandler Commits will be reserved for  10000
   [junit4]   2> 579830 INFO  (searcherExecutor-1667-thread-1-processing-x:collection3) [    x:collection3] o.a.s.c.SolrCore [collection6] Registered new searcher Searcher@383ef643[collection6] main{ExitableDirectoryReader(UninvertingDirectoryReader())}
   [junit4]   2> 579839 INFO  (TEST-TestLazyCores.testCachingLimit-seed#[611DA031B11D8261]) [    x:collection3] o.a.s.c.SolrConfig Using Lucene MatchVersion: 8.0.0
   [junit4]   2> 579876 INFO  (TEST-TestLazyCores.testCachingLimit-seed#[611DA031B11D8261]) [    x:collection3] o.a.s.s.IndexSchema [collection7] Schema name=tiny
   [junit4]   2> 579914 INFO  (TEST-TestLazyCores.testCachingLimit-seed#[611DA031B11D8261]) [    x:collection3] o.a.s.s.IndexSchema Loaded schema tiny/1.1 with uniqueid field id
   [junit4]   2> 579914 INFO  (TEST-TestLazyCores.testCachingLimit-seed#[611DA031B11D8261]) [    x:collection3] o.a.s.c.CoreContainer Creating SolrCore 'collection7' using configuration from instancedir /home/jenkins/workspace/Lucene-Solr-master-Linux/solr/build/solr-core/test/J0/temp/solr.core.TestLazyCores_611DA031B11D8261-001/tempDir-001/./collection7, trusted=true
   [junit4]   2> 579915 INFO  (TEST-TestLazyCores.testCachingLimit-seed#[611DA031B11D8261]) [    x:collection3] o.a.s.m.r.SolrJmxReporter JMX monitoring for 'solr.core.collection7' (registry 'solr.core.collection7') enabled at server: com.sun.jmx.mbeanserver.JmxMBeanServer@6eff5a75
   [junit4]   2> 579915 INFO  (TEST-TestLazyCores.testCachingLimit-seed#[611DA031B11D8261]) [    x:collection3] o.a.s.c.SolrCore solr.RecoveryStrategy.Builder
   [junit4]   2> 579915 INFO  (TEST-TestLazyCores.testCachingLimit-seed#[611DA031B11D8261]) [    x:collection3] o.a.s.c.SolrCore [[collection7] ] Opening new SolrCore at [/home/jenkins/workspace/Lucene-Solr-master-Linux/solr/build/solr-core/test/J0/temp/solr.core.TestLazyCores_611DA031B11D8261-001/tempDir-001/collection7], dataDir=[/home/jenkins/workspace/Lucene-Solr-master-Linux/solr/build/solr-core/test/J0/temp/solr.core.TestLazyCores_611DA031B11D8261-001/tempDir-001/./collection7/data/]
   [junit4]   2> 579916 INFO  (TEST-TestLazyCores.testCachingLimit-seed#[611DA031B11D8261]) [    x:collection3] o.a.s.u.RandomMergePolicy RandomMergePolicy wrapping class org.apache.lucene.index.TieredMergePolicy: [TieredMergePolicy: maxMergeAtOnce=31, maxMergeAtOnceExplicit=42, maxMergedSegmentMB=3.12890625, floorSegmentMB=1.1103515625, forceMergeDeletesPctAllowed=24.01246211574934, segmentsPerTier=50.0, maxCFSSegmentSizeMB=8.796093022207999E12, noCFSRatio=0.15632279322477088
   [junit4]   2> 580005 INFO  (TEST-TestLazyCores.testCachingLimit-seed#[611DA031B11D8261]) [    x:collection3] o.a.s.u.CommitTracker Hard AutoCommit: disabled
   [junit4]   2> 580005 INFO  (TEST-TestLazyCores.testCachingLimit-seed#[611DA031B11D8261]) [    x:collection3] o.a.s.u.CommitTracker Soft AutoCommit: disabled
   [junit4]   2> 580006 INFO  (TEST-TestLazyCores.testCachingLimit-seed#[611DA031B11D8261]) [    x:collection3] o.a.s.u.RandomMergePolicy RandomMergePolicy wrapping class org.apache.lucene.index.TieredMergePolicy: [TieredMergePolicy: maxMergeAtOnce=44, maxMergeAtOnceExplicit=40, maxMergedSegmentMB=63.3974609375, floorSegmentMB=1.7763671875, forceMergeDeletesPctAllowed=24.126238260420266, segmentsPerTier=43.0, maxCFSSegmentSizeMB=8.796093022207999E12, noCFSRatio=1.0
   [junit4]   2> 580006 INFO  (TEST-TestLazyCores.testCachingLimit-seed#[611DA031B11D8261]) [    x:collection3] o.a.s.s.SolrIndexSearcher Opening [Searcher@26e8d677[collection7] main]
   [junit4]   2> 580007 INFO  (TEST-TestLazyCores.testCachingLimit-seed#[611DA031B11D8261]) [    x:collection3] o.a.s.r.ManagedResourceStorage File-based storage initialized to use dir: /home/jenkins/workspace/Lucene-Solr-master-Linux/solr/build/solr-core/test/J0/temp/solr.core.TestLazyCores_611DA031B11D8261-001/tempDir-001/collection7/conf
   [junit4]   2> 580007 INFO  (TEST-TestLazyCores.testCachingLimit-seed#[611DA031B11D8261]) [    x:collection3] o.a.s.h.ReplicationHandler Commits will be reserved for  10000
   [junit4]   2> 580008 INFO  (searcherExecutor-1671-thread-1-processing-x:collection3) [    x:collection3] o.a.s.c.SolrCore [collection7] Registered new searcher Searcher@26e8d677[collection7] main{ExitableDirectoryReader(UninvertingDirectoryReader())}
   [junit4]   2> 580076 INFO  (TEST-TestLazyCores.testCachingLimit-seed#[611DA031B11D8261]) [    x:collection3] o.a.s.c.SolrConfig Using Lucene MatchVersion: 8.0.0
   [junit4]   2> 580080 INFO  (TEST-TestLazyCores.testCachingLimit-seed#[611DA031B11D8261]) [    x:collection3] o.a.s.s.IndexSchema [collection8] Schema name=tiny
   [junit4]   2> 580111 INFO  (TEST-TestLazyCores.testCachingLimit-seed#[611DA031B11D8261]) [    x:collection3] o.a.s.s.IndexSchema Loaded schema tiny/1.1 with uniqueid field id
   [junit4]   2> 580111 INFO  (TEST-TestLazyCores.testCachingLimit-seed#[611DA031B11D8261]) [    x:collection3] o.a.s.c.CoreContainer Creating SolrCore 'collection8' using configuration from instancedir /home/jenkins/workspace/Lucene-Solr-master-Linux/solr/build/solr-core/test/J0/temp/solr.core.TestLazyCores_611DA031B11D8261-001/tempDir-001/./collection8, trusted=true
   [junit4]   2> 580112 INFO  (TEST-TestLazyCores.testCachingLimit-seed#[611DA031B11D8261]) [    x:collection3] o.a.s.m.r.SolrJmxReporter JMX monitoring for 'solr.core.collection8' (registry 'solr.core.collection8') enabled at server: com.sun.jmx.mbeanserver.JmxMBeanServer@6eff5a75
   [junit4]   2> 580112 INFO  (TEST-TestLazyCores.testCachingLimit-seed#[611DA031B11D8261]) [    x:collection3] o.a.s.c.SolrCore solr.RecoveryStrategy.Builder
   [junit4]   2> 580112 INFO  (TEST-TestLazyCores.testCachingLimit-seed#[611DA031B11D8261]) [    x:collection3] o.a.s.c.SolrCore [[collection8] ] Opening new SolrCore at [/home/jenkins/workspace/Lucene-Solr-master-Linux/solr/build/solr-core/test/J0/temp/solr.core.TestLazyCores_611DA031B11D8261-001/tempDir-001/collection8], dataDir=[/home/jenkins/workspace/Lucene-Solr-master-Linux/solr/build/solr-core/test/J0/temp/solr.core.TestLazyCores_611DA031B11D8261-001/tempDir-001/./collection8/data/]
   [junit4]   2> 580114 INFO  (TEST-TestLazyCores.testCachingLimit-seed#[611DA031B11D8261]) [    x:collection3] o.a.s.u.RandomMergePolicy RandomMergePolicy wrapping class org.apache.lucene.index.TieredMergePolicy: [TieredMergePolicy: maxMergeAtOnce=31, maxMergeAtOnceExplicit=35, maxMergedSegmentMB=38.083984375, floorSegmentMB=0.796875, forceMergeDeletesPctAllowed=23.80581866625838, segmentsPerTier=36.0, maxCFSSegmentSizeMB=8.796093022207999E12, noCFSRatio=0.22186129989439243
   [junit4]   2> 580192 INFO  (TEST-TestLazyCores.testCachingLimit-seed#[611DA031B11D8261]) [    x:collection3] o.a.s.u.CommitTracker Hard AutoCommit: disabled
   [junit4]   2> 580192 INFO  (TEST-TestLazyCores.testCachingLimit-seed#[611DA031B11D8261]) [    x:collection3] o.a.s.u.CommitTracker Soft AutoCommit: disabled
   [junit4]   2> 580193 INFO  (TEST-TestLazyCores.testCachingLimit-seed#[611DA031B11D8261]) [    x:collection3] o.a.s.u.RandomMergePolicy RandomMergePolicy wrapping class org.apache.lucene.index.LogDocMergePolicy: [LogDocMergePolicy: minMergeSize=1000, mergeFactor=27, maxMergeSize=9223372036854775807, maxMergeSizeForForcedMerge=9223372036854775807, calibrateSizeByDeletes=true, maxMergeDocs=2147483647, maxCFSSegmentSizeMB=8.796093022207999E12, noCFSRatio=1.0]
   [junit4]   2> 580194 INFO  (TEST-TestLazyCores.testCachingLimit-seed#[611DA031B11D8261]) [    x:collection3] o.a.s.s.SolrIndexSearcher Opening [Searcher@51df362d[collection8] main]
   [junit4]   2> 580194 INFO  (TEST-TestLazyCores.testCachingLimit-seed#[611DA031B11D8261]) [    x:collection3] o.a.s.r.ManagedResourceStorage File-based storage initialized to use dir: /home/jenkins/workspace/Lucene-Solr-master-Linux/solr/build/solr-core/test/J0/temp/solr.core.TestLazyCores_611DA031B11D8261-001/tempDir-001/collection8/conf
   [junit4]   2> 580195 INFO  (TEST-TestLazyCores.testCachingLimit-seed#[611DA031B11D8261]) [    x:collection3] o.a.s.h.ReplicationHandler Commits will be reserved for  10000
   [junit4]   2> 580196 INFO  (searcherExecutor-1675-thread-1-processing-x:collection3) [    x:collection3] o.a.s.c.SolrCore [collection8] Registered new searcher Searcher@51df362d[collection8] main{ExitableDirectoryReader(UninvertingDirectoryReader())}
   [junit4]   2> 580196 INFO  (TEST-TestLazyCores.testCachingLimit-seed#[611DA031B11D8261]) [    x:collection3] o.a.s.c.TransientSolrCoreCacheDefault Closing transient core [collection3]
   [junit4]   2> 580223 INFO  (TEST-TestLazyCores.testCachingLimit-seed#[611DA031B11D8261]) [    x:collection3] o.a.s.c.SolrConfig Using Lucene MatchVersion: 8.0.0
   [junit4]   2> 580291 INFO  (TEST-TestLazyCores.testCachingLimit-seed#[611DA031B11D8261]) [    x:collection3] o.a.s.s.IndexSchema [collection9] Schema name=tiny
   [junit4]   2> 580293 INFO  (TEST-TestLazyCores.testCachingLimit-seed#[611DA031B11D8261]) [    x:collection3] o.a.s.s.IndexSchema Loaded schema tiny/1.1 with uniqueid field id
   [junit4]   2> 580293 INFO  (TEST-TestLazyCores.testCachingLimit-seed#[611DA031B11D8261]) [    x:collection3] o.a.s.c.CoreContainer Creating SolrCore 'collection9' using configuration from instancedir /home/jenkins/workspace/Lucene-Solr-master-Linux/solr/build/solr-core/test/J0/temp/solr.core.TestLazyCores_611DA031B11D8261-001/tempDir-001/./collection9, trusted=true
   [junit4]   2> 580293 INFO  (TEST-TestLazyCores.testCachingLimit-seed#[611DA031B11D8261]) [    x:collection3] o.a.s.m.r.SolrJmxReporter JMX monitoring for 'solr.core.collection9' (registry 'solr.core.collection9') enabled at server: com.sun.jmx.mbeanserver.JmxMBeanServer@6eff5a75
   [junit4]   2> 580293 INFO  (TEST-TestLazyCores.testCachingLimit-seed#[611DA031B11D8261]) [    x:collection3] o.a.s.c.SolrCore solr.RecoveryStrategy.Builder
   [junit4]   2> 580293 INFO  (TEST-TestLazyCores.testCachingLimit-seed#[611DA031B11D8261]) [    x:collection3] o.a.s.c.SolrCore [[collection9] ] Opening new SolrCore at [/home/jenkins/workspace/Lucene-Solr-master-Linux/solr/build/solr-core/test/J0/temp/solr.core.TestLazyCores_611DA031B11D8261-001/tempDir-001/collection9], dataDir=[/home/jenkins/workspace/Lucene-Solr-master-Linux/solr/build/solr-core/test/J0/temp/solr.core.TestLazyCores_611DA031B11D8261-001/tempDir-001/./collection9/data/]
   [junit4]   2> 580296 INFO  (TEST-TestLazyCores.testCachingLimit-seed#[611DA031B11D8261]) [    x:collection3] o.a.s.u.RandomMergePolicy RandomMergePolicy wrapping class org.apache.lucene.index.TieredMergePolicy: [TieredMergePolicy: maxMergeAtOnce=21, maxMergeAtOnceExplicit=28, maxMergedSegmentMB=28.9130859375, floorSegmentMB=0.9189453125, forceMergeDeletesPctAllowed=26.39436046907004, segmentsPerTier=34.0, maxCFSSegmentSizeMB=8.796093022207999E12, noCFSRatio=1.0
   [junit4]   2> 580354 INFO  (TEST-TestLazyCores.testCachingLimit-seed#[611DA031B11D8261]) [    x:collection3] o.a.s.u.CommitTracker Hard AutoCommit: disabled
   [junit4]   2> 580354 INFO  (TEST-TestLazyCores.testCachingLimit-seed#[611DA031B11D8261]) [    x:collection3] o.a.s.u.CommitTracker Soft AutoCommit: disabled
   [junit4]   2> 580355 INFO  (TEST-TestLazyCores.testCachingLimit-seed#[611DA031B11D8261]) [    x:collection3] o.a.s.u.RandomMergePolicy RandomMergePolicy wrapping class org.apache.lucene.index.AlcoholicMergePolicy: [AlcoholicMergePolicy: minMergeSize=0, mergeFactor=10, maxMergeSize=1132405539, maxMergeSizeForForcedMerge=9223372036854775807, calibrateSizeByDeletes=true, maxMergeDocs=2147483647, maxCFSSegmentSizeMB=8.796093022207999E12, noCFSRatio=0.1]
   [junit4]   2> 580355 INFO  (TEST-TestLazyCores.testCachingLimit-seed#[611DA031B11D8261]) [    x:collection3] o.a.s.s.SolrIndexSearcher Opening [Searcher@79873e6f[collection9] main]
   [junit4]   2> 580355 INFO  (TEST-TestLazyCores.testCachingLimit-seed#[611DA031B11D8261]) [    x:collection3] o.a.s.r.ManagedResourceStorage File-based storage initialized to use dir: /home/jenkins/workspace/Lucene-Solr-master-Linux/solr/build/solr-core/test/J0/temp/solr.core.TestLazyCores_611DA031B11D8261-001/tempDir-001/collection9/conf
   [junit4]   2> 580356 INFO  (TEST-TestLazyCores.testCachingLimit-seed#[611DA031B11D8261]) [    x:collection3] o.a.s.h.ReplicationHandler Commits will be reserved for  10000
   [junit4]   2> 580356 INFO  (TEST-TestLazyCores.testCachingLimit-seed#[611DA031B11D8261]) [    x:collection3] o.a.s.c.TransientSolrCoreCacheDefault Closing transient core [collection2]
   [junit4]   2> 580356 INFO  (TEST-TestLazyCores.testCachingLimit-seed#[611DA031B11D8261]) [    x:collection3] o.a.s.c.SolrCore [collection2]  CLOSING SolrCore org.apache.solr.core.SolrCore@254aa101
   [junit4]   2> 580357 INFO  (TEST-TestLazyCores.testCachingLimit-seed#[611DA031B11D8261]) [    x:collection3] o.a.s.m.SolrMetricManager Closing metric reporters for registry=solr.core.collection2, tag=625647873
   [junit4]   2> 580357 INFO  (searcherExecutor-1679-thread-1-processing-x:collection3) [    x:collection3] o.a.s.c.SolrCore [collection9] Registered new searcher Searcher@79873e6f[collection9] main{ExitableDirectoryReader(UninvertingDirectoryReader())}
   [junit4]   2> 580357 INFO  (TEST-TestLazyCores.testCachingLimit-seed#[611DA031B11D8261]) [    x:collection3] o.a.s.m.r.SolrJmxReporter Closing reporter [org.apache.solr.metrics.reporters.SolrJmxReporter@4d910389: rootName = null, domain = solr.core.collection2, service url = null, agent id = null] for registry solr.core.collection2 / com.codahale.metrics.MetricRegistry@5ca5a6b6
   [junit4]   2> 580365 INFO  (TEST-TestLazyCores.testCachingLimit-seed#[611DA031B11D8261]) [    x:collection3] o.a.s.c.SolrCore [collection3]  CLOSING SolrCore org.apache.solr.core.SolrCore@31ce149a
   [junit4]   2> 580365 INFO  (TEST-TestLazyCores.testCachingLimit-seed#[611DA031B11D8261]) [    x:collection3] o.a.s.m.SolrMetricManager Closing metric reporters for registry=solr.core.collection3, tag=835589274
   [junit4]   2> 580365 INFO  (TEST-TestLazyCores.testCachingLimit-seed#[611DA031B11D8261]) [    x:collection3] o.a.s.m.r.SolrJmxReporter Closing reporter [org.apache.solr.metrics.reporters.SolrJmxReporter@75cc3666: rootName = null, domain = solr.core.collection3, service url = null, agent id = null] for registry solr.core.collection3 / com.codahale.metrics.MetricRegistry@7451468f
   [junit4]   2> 580371 INFO  (TEST-TestLazyCores.testCachingLimit-seed#[611DA031B11D8261]) [    x:collection3] o.a.s.c.CoreContainer Shutting down CoreContainer instance=1779856132
   [junit4]   2> 580372 INFO  (TEST-TestLazyCores.testCachingLimit-seed#[611DA031B11D8261]) [    x:collection3] o.a.s.m.SolrMetricManager Closing metric reporters for registry=solr.node, tag=null
   [junit4]   2> 580372 INFO  (TEST-TestLazyCores.testCachingLimit-seed#[611DA031B11D8261]) [    x:collection3] o.a.s.m.r.SolrJmxReporter Closing reporter [org.apache.solr.metrics.reporters.SolrJmxReporter@73b25e15: rootName = null, domain = solr.node, service url = null, agent id = null] for registry solr.node / com.codahale.metrics.MetricRegistry@174daeb3
   [junit4]   2> 580375 INFO  (TEST-TestLazyCores.testCachingLimit-seed#[611DA031B11D8261]) [    x:collection3] o.a.s.m.SolrMetricManager Closing metric reporters for registry=solr.jvm, tag=null
   [junit4]   2> 580375 INFO  (TEST-TestLazyCores.testCachingLimit-seed#[611DA031B11D8261]) [    x:collection3] o.a.s.m.r.SolrJmxReporter Closing reporter [org.apache.solr.metrics.reporters.SolrJmxReporter@18aae7d0: rootName = null, domain = solr.jvm, service url = null, agent id = null] for registry solr.jvm / com.codahale.metrics.MetricRegistry@5b5e36de
   [junit4]   2> 580377 INFO  (TEST-TestLazyCores.testCachingLimit-seed#[611DA031B11D8261]) [    x:collection3] o.a.s.m.SolrMetricManager Closing metric reporters for registry=solr.jetty, tag=null
   [junit4]   2> 580377 INFO  (TEST-TestLazyCores.testCachingLimit-seed#[611DA031B11D8261]) [    x:collection3] o.a.s.m.r.SolrJmxReporter Closing reporter [org.apache.solr.metrics.reporters.SolrJmxReporter@7862535c: rootName = null, domain = solr.jetty, service url = null, agent id = null] for registry solr.jetty / com.codahale.metrics.MetricRegistry@c6bfcb2
   [junit4]   2> 580377 INFO  (coreCloseExecutor-1683-thread-1-processing-x:collection3) [    x:collection5] o.a.s.c.SolrCore [collection5]  CLOSING SolrCore org.apache.solr.core.SolrCore@2ddc1703
   [junit4]   2> 580377 INFO  (coreCloseExecutor-1683-thread-1-processing-x:collection3) [    x:collection5] o.a.s.m.SolrMetricManager Closing metric reporters for registry=solr.core.collection5, tag=769398531
   [junit4]   2> 580378 INFO  (coreCloseExecutor-1683-thread-1-processing-x:collection3) [    x:collection5] o.a.s.m.r.SolrJmxReporter Closing reporter [org.apache.solr.metrics.reporters.SolrJmxReporter@44b938fe: rootName = null, domain = solr.core.collection5, service url = null, agent id = null] for registry solr.core.collection5 / com.codahale.metrics.MetricRegistry@6c28a135
   [junit4]   2> 580378 INFO  (coreCloseExecutor-1683-thread-2-processing-x:collection3) [    x:collection1] o.a.s.c.SolrCore [collection1]  CLOSING SolrCore org.apache.solr.core.SolrCore@1a25c6bd
   [junit4]   2> 580378 INFO  (coreCloseExecutor-1683-thread-4-processing-x:collection3) [    x:collection6] o.a.s.c.SolrCore [collection6]  CLOSING SolrCore org.apache.solr.core.SolrCore@24d700a
   [junit4]   2> 580378 INFO  (coreCloseExecutor-1683-thread-5-processing-x:collection3) [    x:collection7] o.a.s.c.SolrCore [collection7]  CLOSING SolrCore org.apache.solr.core.SolrCore@54dd6f3
   [junit4]   2> 580378 INFO  (coreCloseExecutor-1683-thread-3-processing-x:collection3) [    x:collection4] o.a.s.c.SolrCore [collection4]  CLOSING SolrCore org.apache.solr.core.SolrCore@42917f39
   [junit4]   2> 580378 INFO  (coreCloseExecutor-1683-thread-6-processing-x:collection3) [    x:collection8] o.a.s.c.SolrCore [collection8]  CLOSING SolrCore org.apache.solr.core.SolrCore@3adccf0f
   [junit4]   2> 580378 INFO  (coreCloseExecutor-1683-thread-7-processing-x:collection3) [    x:collection9] o.a.s.c.SolrCore [collection9]  CLOSING SolrCore org.apache.solr.core.SolrCore@1c0022a5
   [junit4]   2> 580382 INFO  (coreCloseExecutor-1683-thread-2-processing-x:collection3) [    x:collection1] o.a.s.m.SolrMetricManager Closing metric reporters for registry=solr.core.collection1, tag=438683325
   [junit4]   2> 580382 INFO  (coreCloseExecutor-1683-thread-2-processing-x:collection3) [    x:collection1] o.a.s.m.r.SolrJmxReporter Closing reporter [org.apache.solr.metrics.reporters.SolrJmxReporter@7d760e22: rootName = null, domain = solr.core.collection1, service url = null, agent id = null] for registry solr.core.collection1 / com.codahale.metrics.MetricRegistry@66dede4
   [junit4]   2> 580388 INFO  (coreCloseExecutor-1683-thread-4-processing-x:collection3) [    x:collection6] o.a.s.m.SolrMetricManager Closing metric reporters for registry=solr.core.collection6, tag=38629386
   [junit4]   2> 580389 INFO  (coreCloseExecutor-1683-thread-4-processing-x:collection3) [    x:collection6] o.a.s.m.r.SolrJmxReporter Closing reporter [org.apache.solr.metrics.reporters.SolrJmxReporter@4e47c45f: rootName = null, domain = solr.core.collection6, service url = null, agent id = null] for registry solr.core.collection6 / com.codahale.metrics.MetricRegistry@5d311896
   [junit4]   2> 580395 INFO  (coreCloseExecutor-1683-thread-5-processing-x:collection3) [    x:collection7] o.a.s.m.SolrMetricManager Closing metric reporters for registry=solr.core.collection7, tag=88987379
   [junit4]   2> 580395 INFO  (coreCloseExecutor-1683-thread-5-processing-x:collection3) [    x:collection7] o.a.s.m.r.SolrJmxReporter Closing reporter [org.apache.solr.metrics.reporters.SolrJmxReporter@341ad63d: rootName = null, domain = solr.core.collection7, service url = null, agent id = null] for registry solr.core.collection7 / com.codahale.metrics.MetricRegistry@30527f0e
   [junit4]   2> 580400 INFO  (coreCloseExecutor-1683-thread-3-processing-x:collection3) [    x:collection4] o.a.s.m.SolrMetricManager Closing metric reporters for registry=solr.core.collection4, tag=1116831545
   [junit4]   2> 580401 INFO  (coreCloseExecutor-1683-thread-3-processing-x:collection3) [    x:collection4] o.a.s.m.r.SolrJmxReporter Closing reporter [org.apache.solr.metrics.reporters.SolrJmxReporter@1236e872: rootName = null, domain = solr.core.collection4, service url = null, agent id = null] for registry solr.core.collection4 / com.codahale.metrics.MetricRegistry@6a25e8b
   [junit4]   2> 580407 INFO  (coreCloseExecutor-1683-thread-6-processing-x:collection3) [    x:collection8] o.a.s.m.SolrMetricManager Closing metric reporters for registry=solr.core.collection8, tag=987549455
   [junit4]   2> 580407 INFO  (coreCloseExecutor-1683-thread-6-processing-x:collection3) [    x:collection8] o.a.s.m.r.SolrJmxReporter Closing reporter [org.apache.solr.metrics.reporters.SolrJmxReporter@27414574: rootName = null, domain = solr.core.collection8, service url = null, agent id = null] for registry solr.core.collection8 / com.codahale.metrics.MetricRegistry@36cfc11c
   [junit4]   2> 580411 INFO  (coreCloseExecutor-1683-thread-7-processing-x:collection3) [    x:collection9] o.a.s.m.SolrMetricManager Closing metric reporters for registry=solr.core.collection9, tag=469770917
   [junit4]   2> 580411 INFO  (coreCloseExecutor-1683-thread-7-processing-x:collection3) [    x:collection9] o.a.s.m.r.SolrJmxReporter Closing reporter [org.apache.solr.metrics.reporters.SolrJmxReporter@339e9506: rootName = null, domain = solr.core.collection9, service url = null, agent id = null] for registry solr.core.collection9 / com.codahale.metrics.MetricRegistry@2b6a1bb0
   [junit4]   2> 580417 INFO  (TEST-TestLazyCores.testCachingLimit-seed#[611DA031B11D8261]) [    x:collection3] o.a.s.SolrTestCaseJ4 ###Ending testCachingLimit
   [junit4]   2> 580418 INFO  (TEST-TestLazyCores.testCreateTransientFromAdmin-seed#[611DA031B11D8261]) [    x:collection3] o.a.s.SolrTestCaseJ4 ###Starting testCreateTransientFromAdmin
   [junit4]   2> 580425 INFO  (TEST-TestLazyCores.testCreateTransientFromAdmin-seed#[611DA031B11D8261]) [    x:collection3] o.a.s.c.SolrXmlConfig Loading container configuration from /home/jenkins/workspace/Lucene-Solr-master-Linux/solr/build/solr-core/test/J0/temp/solr.core.TestLazyCores_611DA031B11D8261-001/tempDir-002/solr.xml
   [junit4]   2> 580428 INFO  (TEST-TestLazyCores.testCreateTransientFromAdmin-seed#[611DA031B11D8261]) [    x:collection3] o.a.s.c.SolrXmlConfig MBean server found: com.sun.jmx.mbeanserver.JmxMBeanServer@6eff5a75, but no JMX reporters were configured - adding default JMX reporter.
   [junit4]   2> 580450 INFO  (TEST-TestLazyCores.testCreateTransientFromAdmin-seed#[611DA031B11D8261]) [    x:collection3] o.a.s.m.r.SolrJmxReporter JMX monitoring for 'solr.node' (registry 'solr.node') enabled at server: com.sun.jmx.mbeanserver.JmxMBeanServer@6eff5a75
   [junit4]   2> 580456 INFO  (TEST-TestLazyCores.testCreateTransientFromAdmin-seed#[611DA031B11D8261]) [    x:collection3] o.a.s.m.r.SolrJmxReporter JMX monitoring for 'solr.jvm' (registry 'solr.jvm') enabled at server: com.sun.jmx.mbeanserver.JmxMBeanServer@6eff5a75
   [junit4]   2> 580457 INFO  (TEST-TestLazyCores.testCreateTransientFromAdmin-seed#[611DA031B11D8261]) [    x:collection3] o.a.s.m.r.SolrJmxReporter JMX monitoring for 'solr.jetty' (registry 'solr.jetty') enabled at server: com.sun.jmx.mbeanserver.JmxMBeanServer@6eff5a75
   [junit4]   2> 580458 INFO  (TEST-TestLazyCores.testCreateTransientFromAdmin-seed#[611DA031B11D8261]) [    x:collection3] o.a.s.c.TransientSolrCoreCacheDefault Allocating transient cache for 4 transient cores
   [junit4]   2> 580466 INFO  (coreLoadExecutor-1690-thread-1-processing-x:collection3) [    x:collection1] o.a.s.c.SolrConfig Using Lucene MatchVersion: 8.0.0
   [junit4]   2> 580466 INFO  (coreLoadExecutor-1690-thread-2-processing-x:collection3) [    x:collection2] o.a.s.c.SolrConfig Using Lucene MatchVersion: 8.0.0
   [junit4]   2> 580472 INFO  (coreLoadExecutor-1690-thread-2-processing-x:collection3) [    x:collection2] o.a.s.s.IndexSchema [collection2] Schema name=tiny
   [junit4]   2> 580473 INFO  (coreLoadExecutor-1690-thread-1-processing-x:collection3) [    x:collection1] o.a.s.s.IndexSchema [collection1] Schema name=tiny
   [junit4]   2> 580474 INFO  (coreLoadExecutor-1690-thread-2-processing-x:collection3) [    x:collection2] o.a.s.s.IndexSchema Loaded schema tiny/1.1 with uniqueid field id
   [junit4]   2> 580474 INFO  (coreLoadExecutor-1690-thread-3-processing-x:collection3) [    x:collection5] o.a.s.c.SolrConfig Using Lucene MatchVersion: 8.0.0
   [junit4]   2> 580474 INFO  (coreLoadExecutor-1690-thread-2-processing-x:collection3) [    x:collection2] o.a.s.c.CoreContainer Creating SolrCore 'collection2' using configuration from instancedir /home/jenkins/workspace/Lucene-Solr-master-Linux/solr/build/solr-core/test/J0/temp/solr.core.TestLazyCores_611DA031B11D8261-001/tempDir-002/./collection2, trusted=true
   [junit4]   2> 580475 INFO  (coreLoadExecutor-1690-thread-1-processing-x:collection3) [    x:collection1] o.a.s.s.IndexSchema Loaded schema tiny/1.1 with uniqueid field id
   [junit4]   2> 580475 INFO  (coreLoadExecutor-1690-thread-1-processing-x:collection3) [    x:collection1] o.a.s.c.CoreContainer Creating SolrCore 'collection1' using configuration from instancedir /home/jenkins/workspace/Lucene-Solr-master-Linux/solr/build/solr-core/test/J0/temp/solr.core.TestLazyCores_611DA031B11D8261-001/tempDir-002/./collection1, trusted=true
   [junit4]   2> 580475 INFO  (coreLoadExecutor-1690-thread-2-processing-x:collection3) [    x:collection2] o.a.s.m.r.SolrJmxReporter JMX monitoring for 'solr.core.collection2' (registry 'solr.core.collection2') enabled at server: com.sun.jmx.mbeanserver.JmxMBeanServer@6eff5a75
   [junit4]   2> 580475 INFO  (coreLoadExecutor-1690-thread-2-processing-x:collection3) [    x:collection2] o.a.s.c.SolrCore solr.RecoveryStrategy.Builder
   [junit4]   2> 580475 INFO  (coreLoadExecutor-1690-thread-1-processing-x:collection3) [    x:collection1] o.a.s.m.r.SolrJmxReporter JMX monitoring for 'solr.core.collection1' (registry 'solr.core.collection1') enabled at server: com.sun.jmx.mbeanserver.JmxMBeanServer@6eff5a75
   [junit4]   2> 580475 INFO  (coreLoadExecutor-1690-thread-2-processing-x:collection3) [    x:collection2] o.a.s.c.SolrCore [[collection2] ] Opening new SolrCore at [/home/jenkins/workspace/Lucene-Solr-master-Linux/solr/build/solr-core/test/J0/temp/solr.core.TestLazyCores_611DA031B11D8261-001/tempDir-002/collection2], dataDir=[/home/jenkins/workspace/Lucene-Solr-master-Linux/solr/build/solr-core/test/J0/temp/solr.core.TestLazyCores_611DA031B11D8261-001/tempDir-002/./collection2/data/]
   [junit4]   2> 580475 INFO  (coreLoadExecutor-1690-thread-1-processing-x:collection3) [    x:collection1] o.a.s.c.SolrCore solr.RecoveryStrategy.Builder
   [junit4]   2> 580475 INFO  (coreLoadExecutor-1690-thread-1-processing-x:collection3) [    x:collection1] o.a.s.c.SolrCore [[collection1] ] Opening new SolrCore at [/home/jenkins/workspace/Lucene-Solr-master-Linux/solr/build/solr-core/test/J0/temp/solr.core.TestLazyCores_611DA031B11D8261-001/tempDir-002/collection1], dataDir=[/home/jenkins/workspace/Lucene-Solr-master-Linux/solr/build/solr-core/test/J0/temp/solr.core.TestLazyCores_611DA031B11D8261-001/tempDir-002/./collection1/data/]
   [junit4]   2> 580477 INFO  (coreLoadExecutor-1690-thread-1-processing-x:collection3) [    x:collection1] o.a.s.u.RandomMergePolicy RandomMergePolicy wrapping class org.apache.lucene.index.LogDocMergePolicy: [LogDocMergePolicy: minMergeSize=1000, mergeFactor=39, maxMergeSize=9223372036854775807, maxMergeSizeForForcedMerge=9223372036854775807, calibrateSizeByDeletes=false, maxMergeDocs=2147483647, maxCFSSegmentSizeMB=8.796093022207999E12, noCFSRatio=1.0]
   [junit4]   2> 580478 INFO  (coreLoadExecutor-1690-thread-2-processing-x:collection3) [    x:collection2] o.a.s.u.RandomMergePolicy RandomMergePolicy wrapping class org.apache.lucene.index.LogDocMergePolicy: [LogDocMergePolicy: minMergeSize=1000, mergeFactor=39, maxMergeSize=9223372036854775807, maxMergeSizeForForcedMerge=9223372036854775807, calibrateSizeByDeletes=false, maxMergeDocs=2147483647, maxCFSSegmentSizeMB=8.796093022207999E12, noCFSRatio=1.0]
   [junit4]   2> 580480 INFO  (coreLoadExecutor-1690-thread-3-processing-x:collection3) [    x:collection5] o.a.s.s.IndexSchema [collection5] Schema name=tiny
   [junit4]   2> 580481 INFO  (coreLoadExecutor-1690-thread-3-processing-x:collection3) [    x:collection5] o.a.s.s.IndexSchema Loaded schema tiny/1.1 with uniqueid field id
   [junit4]   2> 580481 INFO  (coreLoadExecutor-1690-thread-3-processing-x:collection3) [    x:collection5] o.a.s.c.CoreContainer Creating SolrCore 'collection5' using configuration from instancedir /home/jenkins/workspace/Lucene-Solr-master-Linux/solr/build/solr-core/test/J0/temp/solr.core.TestLazyCores_611DA031B11D8261-001/tempDir-002/./collection5, trusted=true
   [junit4]   2> 580482 INFO  (coreLoadExecutor-1690-thread-3-processing-x:collection3) [    x:collection5] o.a.s.m.r.SolrJmxReporter JMX monitoring for 'solr.core.collection5' (registry 'solr.core.collection5') enabled at server: com.sun.jmx.mbeanserver.JmxMBeanServer@6eff5a75
   [junit4]   2> 580482 INFO  (coreLoadExecutor-1690-thread-3-processing-x:collection3) [    x:collection5] o.a.s.c.SolrCore solr.RecoveryStrategy.Builder
   [junit4]   2> 580482 INFO  (coreLoadExecutor-1690-thread-3-processing-x:collection3) [    x:collection5] o.a.s.c.SolrCore [[collection5] ] Opening new SolrCore at [/home/jenkins/workspace/Lucene-Solr-master-Linux/solr/build/solr-core/test/J0/temp/solr.core.TestLazyCores_611DA031B11D8261-001/tempDir-002/collection5], dataDir=[/home/jenkins/workspace/Lucene-Solr-master-Linux/solr/build/solr-core/test/J0/temp/solr.core.TestLazyCores_611DA031B11D8261-001/tempDir-002/./collection5/data/]
   [junit4]   2> 580486 INFO  (coreLoadExecutor-1690-thread-3-processing-x:collection3) [    x:collection5] o.a.s.u.RandomMergePolicy RandomMergePolicy wrapping class org.apache.lucene.index.LogDocMergePolicy: [LogDocMergePolicy: minMergeSize=1000, mergeFactor=39, maxMergeSize=9223372036854775807, maxMergeSizeForForcedMerge=9223372036854775807, calibrateSizeByDeletes=false, maxMergeDocs=2147483647, maxCFSSegmentSizeMB=8.796093022207999E12, noCFSRatio=1.0]
   [junit4]   2> 580541 INFO  (coreLoadExecutor-1690-thread-3-processing-x:collection3) [    x:collection5] o.a.s.u.CommitTracker Hard AutoCommit: disabled
   [junit4]   2> 580541 INFO  (coreLoadExecutor-1690-thread-2-processing-x:collection3) [    x:collection2] o.a.s.u.CommitTracker Hard AutoCommit: disabled
   [junit4]   2> 580541 INFO  (coreLoadExecutor-1690-thread-3-processing-x:collection3) [    x:collection5] o.a.s.u.CommitTracker Soft AutoCommit: disabled
   [junit4]   2> 580541 INFO  (coreLoadExecutor-1690-thread-2-processing-x:collection3) [    x:collection2] o.a.s.u.CommitTracker Soft AutoCommit: disabled
   [junit4]   2> 580542 INFO  (coreLoadExecutor-1690-thread-3-processing-x:collection3) [    x:collection5] o.a.s.u.RandomMergePolicy RandomMergePolicy wrapping class org.apache.lucene.index.AlcoholicMergePolicy: [AlcoholicMergePolicy: minMergeSize=0, mergeFactor=10, maxMergeSize=998726326, maxMergeSizeForForcedMerge=9223372036854775807, calibrateSizeByDeletes=true, maxMergeDocs=2147483647, maxCFSSegmentSizeMB=8.796093022207999E12, noCFSRatio=0.1]
   [junit4]   2> 580542 INFO  (coreLoadExecutor-1690-thread-2-processing-x:collection3) [    x:collection2] o.a.s.u.RandomMergePolicy RandomMergePolicy wrapping class org.apache.lucene.index.AlcoholicMergePolicy: [AlcoholicMergePolicy: minMergeSize=0, mergeFactor=10, maxMergeSize=998726326, maxMergeSizeForForcedMerge=9223372036854775807, calibrateSizeByDeletes=true, maxMergeDocs=2147483647, maxCFSSegmentSizeMB=8.796093022207999E12, noCFSRatio=0.1]
   [junit4]   2> 580542 INFO  (coreLoadExecutor-1690-thread-2-processing-x:collection3) [    x:collection2] o.a.s.s.SolrIndexSearcher Opening [Searcher@6f69b357[collection2] main]
   [junit4]   2> 580542 INFO  (coreLoadExecutor-1690-thread-3-processing-x:collection3) [    x:collection5] o.a.s.s.SolrIndexSearcher Opening [Searcher@9d39449[collection5] main]
   [junit4]   2> 580542 INFO  (coreLoadExecutor-1690-thread-2-processing-x:collection3) [    x:collection2] o.a.s.r.ManagedResourceStorage File-based storage initialized to use dir: /home/jenkins/workspace/Lucene-Solr-master-Linux/solr/build/solr-core/test/J0/temp/solr.core.TestLazyCores_611DA031B11D8261-001/tempDir-002/collection2/conf
   [junit4]   2> 580542 INFO  (coreLoadExecutor-1690-thread-3-processing-x:collection3) [    x:collection5] o.a.s.r.ManagedResourceStorage File-based storage initialized to use dir: /home/jenkins/workspace/Lucene-Solr-master-Linux/solr/build/solr-core/test/J0/temp/solr.core.TestLazyCores_611DA031B11D8261-001/tempDir-002/collection5/conf
   [junit4]   2> 580543 INFO  (coreLoadExecutor-1690-thread-2-processing-x:collection3) [    x:collection2] o.a.s.h.ReplicationHandler Commits will be reserved for  10000
   [junit4]   2> 580543 INFO  (coreLoadExecutor-1690-thread-3-processing-x:collection3) [    x:collection5] o.a.s.h.ReplicationHandler Commits will be reserved for  10000
   [junit4]   2> 580544 INFO  (searcherExecutor-1693-thread-1-processing-x:collection5) [    x:collection5] o.a.s.c.SolrCore [collection5] Registered new searcher Searcher@9d39449[collection5] main{ExitableDirectoryReader(UninvertingDirectoryReader())}
   [junit4]   2> 580544 INFO  (searcherExecutor-1691-thread-1-processing-x:collection2) [    x:collection2] o.a.s.c.SolrCore [collection2] Registered new searcher Searcher@6f69b357[collection2] main{ExitableDirectoryReader(UninvertingDirectoryReader())}
   [junit4]   2> 580561 INFO  (coreLoadExecutor-1690-thread-1-processing-x:collection3) [    x:collection1] o.a.s.u.CommitTracker Hard AutoCommit: disabled
   [junit4]   2> 580561 INFO  (coreLoadExecutor-1690-thread-1-processing-x:collection3) [    x:collection1] o.a.s.u.CommitTracker Soft AutoCommit: disabled
   [junit4]   2> 580562 INFO  (coreLoadExecutor-1690-thread-1-processing-x:collection3) [    x:collection1] o.a.s.u.RandomMergePolicy RandomMergePolicy wrapping class org.apache.lucene.index.AlcoholicMergePolicy: [AlcoholicMergePolicy: minMergeSize=0, mergeFactor=10, maxMergeSize=998726326, maxMergeSizeForForcedMerge=9223372036854775807, calibrateSizeByDeletes=true, maxMergeDocs=2147483647, maxCFSSegmentSizeMB=8.796093022207999E12, noCFSRatio=0.1]
   [junit4]   2> 580562 INFO  (coreLoadExecutor-1690-thread-1-processing-x:collection3) [    x:collection1] o.a.s.s.SolrIndexSearcher Opening [Searcher@7dda9a79[collection1] main]
   [junit4]   2> 580562 INFO  (coreLoadExecutor-1690-thread-1-processing-x:collection3) [    x:collection1] o.a.s.r.ManagedResourceStorage File-based storage initialized to use dir: /home/jenkins/workspace/Lucene-Solr-master-Linux/solr/build/solr-core/test/J0/temp/solr.core.TestLazyCores_611DA031B11D8261-001/tempDir-002/collection1/conf
   [junit4]   2> 580563 INFO  (coreLoadExecutor-1690-thread-1-processing-x:collection3) [    x:collection1] o.a.s.h.ReplicationHandler Commits will be reserved for  10000
   [junit4]   2> 580564 INFO  (searcherExecutor-1692-thread-1-processing-x:collection1) [    x:collection1] o.a.s.c.SolrCore [collection1] Registered new searcher Searcher@7dda9a79[collection1] main{ExitableDirectoryReader(UninvertingDirectoryReader())}
   [junit4]   2> 580568 INFO  (TEST-TestLazyCores.testCreateTransientFromAdmin-seed#[611DA031B11D8261]) [    x:collection3] o.a.s.h.a.CoreAdminOperation core create command loadOnStartup=true&transient=true&name=core1&action=CREATE&wt=xml
   [junit4]   2> 580595 INFO  (TEST-TestLazyCores.testCreateTransientFromAdmin-seed#[611DA031B11D8261]) [    x:collection3] o.a.s.c.SolrConfig Using Lucene MatchVersion: 8.0.0
   [junit4]   2> 580600 INFO  (TEST-TestLazyCores.testCreateTransientFromAdmin-seed#[611DA031B11D8261]) [    x:collection3] o.a.s.s.IndexSchema [core1] Schema name=tiny
   [junit4]   2> 580602 INFO  (TEST-TestLazyCores.testCreateTransientFromAdmin-seed#[611DA031B11D8261]) [    x:collection3] o.a.s.s.IndexSchema Loaded schema tiny/1.1 with uniqueid field id
   [junit4]   2> 580602 INFO  (TEST-TestLazyCores.testCreateTransientFromAdmin-seed#[611DA031B11D8261]) [    x:collection3] o.a.s.c.CoreContainer Creating SolrCore 'core1' using configuration from instancedir /home/jenkins/workspace/Lucene-Solr-master-Linux/solr/build/solr-core/test/J0/temp/solr.core.TestLazyCores_611DA031B11D8261-001/tempDir-002/./core1, trusted=true
   [junit4]   2> 580603 INFO  (TEST-TestLazyCores.testCreateTransientFromAdmin-seed#[611DA031B11D8261]) [    x:collection3] o.a.s.m.r.SolrJmxReporter JMX monitoring for 'solr.core.core1' (registry 'solr.core.core1') enabled at server: com.sun.jmx.mbeanserver.JmxMBeanServer@6eff5a75
   [junit4]   2> 580603 INFO  (TEST-TestLazyCores.testCreateTransientFromAdmin-seed#[611DA031B11D8261]) [    x:collection3] o.a.s.c.SolrCore solr.RecoveryStrategy.Builder
   [junit4]   2> 580603 INFO  (TEST-TestLazyCores.testCreateTransientFromAdmin-seed#[611DA031B11D8261]) [    x:collection3] o.a.s.c.SolrCore [[core1] ] Opening new SolrCore at [/home/jenkins/workspace/Lucene-Solr-master-Linux/solr/build/solr-core/test/J0/temp/solr.core.TestLazyCores_611DA031B11D8261-001/tempDir-002/core1], dataDir=[/home/jenkins/workspace/Lucene-Solr-master-Linux/solr/build/solr-core/test/J0/temp/solr.core.TestLazyCores_611DA031B11D8261-001/tempDir-002/./core1/data/]
   [junit4]   2> 580606 INFO  (TEST-TestLazyCores.testCreateTransientFromAdmin-seed#[611DA031B11D8261]) [    x:collection3] o.a.s.u.RandomMergePolicy RandomMergePolicy wrapping class org.apache.lucene.index.TieredMergePolicy: [TieredMergePolicy: maxMergeAtOnce=31, maxMergeAtOnceExplicit=23, maxMergedSegmentMB=56.3876953125, floorSegmentMB=0.5205078125, forceMergeDeletesPctAllowed=19.01625431267167, segmentsPerTier=36.0, maxCFSSegmentSizeMB=8.796093022207999E12, noCFSRatio=0.5621139257779014
   [junit4]   2> 580662 INFO  (TEST-TestLazyCores.testCreateTransientFromAdmin-seed#[611DA031B11D8261]) [    x:collection3] o.a.s.u.CommitTracker Hard AutoCommit: disabled
   [junit4]   2> 580662 INFO  (TEST-TestLazyCores.testCreateTransientFromAdmin-seed#[611DA031B11D8261]) [    x:collection3] o.a.s.u.CommitTracker Soft AutoCommit: disabled
   [junit4]   2> 580663 INFO  (TEST-TestLazyCores.testCreateTransientFromAdmin-seed#[611DA031B11D8261]) [    x:collection3] o.a.s.u.RandomMergePolicy RandomMergePolicy wrapping class org.apache.lucene.index.LogByteSizeMergePolicy: [LogByteSizeMergePolicy: minMergeSize=1677721, mergeFactor=30, maxMergeSize=2147483648, maxMergeSizeForForcedMerge=9223372036854775807, calibrateSizeByDeletes=true, maxMergeDocs=2147483647, maxCFSSegmentSizeMB=8.796093022207999E12, noCFSRatio=1.0]
   [junit4]   2> 580664 INFO  (TEST-TestLazyCores.testCreateTransientFromAdmin-seed#[611DA031B11D8261]) [    x:collection3] o.a.s.s.SolrIndexSearcher Opening [Searcher@48de2c63[core1] main]
   [junit4]   2> 580664 INFO  (TEST-TestLazyCores.testCreateTransientFromAdmin-seed#[611DA031B11D8261]) [    x:collection3] o.a.s.r.ManagedResourceStorage File-based storage initialized to use dir: /home/jenkins/workspace/Lucene-Solr-master-Linux/solr/build/solr-core/test/J0/temp/solr.core.TestLazyCores_611DA031B11D8261-001/tempDir-002/core1/conf
   [junit4]   2> 580665 INFO  (TEST-TestLazyCores.testCreateTransientFromAdmin-seed#[611DA031B11D8261]) [    x:collection3] o.a.s.h.ReplicationHandler Commits will be reserved for  10000
   [junit4]   2> 580665 INFO  (TEST-TestLazyCores.testCreateTransientFromAdmin-seed#[611DA031B11D8261]) [    x:collection3] o.a.s.h.a.CoreAdminOperation core create command loadOnStartup=false&transient=true&name=core2&action=CREATE&wt=xml
   [junit4]   2> 580666 INFO  (searcherExecutor-1704-thread-1-processing-x:collection3) [    x:collection3] o.a.s.c.SolrCore [core1] Registered new searcher Searcher@48de2c63[core1] main{ExitableDirectoryReader(UninvertingDirectoryReader())}
   [junit4]   2> 580675 INFO  (TEST-TestLazyCores.testCreateTransientFromAdmin-seed#[611DA031B11D8261]) [    x:collection3] o.a.s.c.SolrConfig Using Lucene MatchVersion: 8.0.0
   [junit4]   2> 580738 INFO  (TEST-TestLazyCores.testCreateTransientFromAdmin-seed#[611DA031B11D8261]) [    x:collection3] o.a.s.s.IndexSchema [core2] Schema name=tiny
   [junit4]   2> 580740 INFO  (TEST-TestLazyCores.testCreateTransientFromAdmin-seed#[611DA031B11D8261]) [    x:collection3] o.a.s.s.IndexSchema Loaded schema tiny/1.1 with uniqueid field id
   [junit4]   2> 580740 INFO  (TEST-TestLazyCores.testCreateTransientFromAdmin-seed#[611DA031B11D8261]) [    x:collection3] o.a.s.c.CoreContainer Creating SolrCore 'core2' using configuration from instancedir /home/jenkins/workspace/Lucene-Solr-master-Linux/solr/build/solr-core/test/J0/temp/solr.core.TestLazyCores_611DA031B11D8261-001/tempDir-002/./core2, trusted=true
   [junit4]   2> 580740 INFO  (TEST-TestLazyCores.testCreateTransientFromAdmin-seed#[611DA031B11D8261]) [    x:collection3] o.a.s.m.r.SolrJmxReporter JMX monitoring for 'solr.core.core2' (registry 'solr.core.core2') enabled at server: com.sun.jmx.mbeanserver.JmxMBeanServer@6eff5a75
   [junit4]   2> 580740 INFO  (TEST-TestLazyCores.testCreateTransientFromAdmin-seed#[611DA031B11D8261]) [    x:collection3] o.a.s.c.SolrCore solr.RecoveryStrategy.Builder
   [junit4]   2> 580740 INFO  (TEST-TestLazyCores.testCreateTransientFromAdmin-seed#[611DA031B11D8261]) [    x:collection3] o.a.s.c.SolrCore [[core2] ] Opening new SolrCore at [/home/jenkins/workspace/Lucene-Solr-master-Linux/solr/build/solr-core/test/J0/temp/solr.core.TestLazyCores_611DA031B11D8261-001/tempDir-002/core2], dataDir=[/home/jenkins/workspace/Lucene-Solr-master-Linux/solr/build/solr-core/test/J0/temp/solr.core.TestLazyCores_611DA031B11D8261-001/tempDir-002/./core2/data/]
   [junit4]   2> 580744 INFO  (TEST-TestLazyCores.testCreateTransientFromAdmin-seed#[611DA031B11D8261]) [    x:collection3] o.a.s.u.RandomMergePolicy RandomMergePolicy wrapping class org.apache.lucene.index.TieredMergePolicy: [TieredMergePolicy: maxMergeAtOnce=21, maxMergeAtOnceExplicit=15, maxMergedSegmentMB=93.142578125, floorSegmentMB=1.6875, forceMergeDeletesPctAllowed=3.7601687749522297, segmentsPerTier=17.0, maxCFSSegmentSizeMB=8.796093022207999E12, noCFSRatio=0.45736097512191665
   [junit4]   2> 580800 INFO  (TEST-TestLazyCores.testCreateTransientFromAdmin-seed#[611DA031B11D8261]) [    x:collection3] o.a.s.u.CommitTracker Hard AutoCommit: disabled
   [junit4]   2> 580800 INFO  (TEST-TestLazyCores.testCreateTransientFromAdmin-seed#[611DA031B11D8261]) [    x:collection3] o.a.s.u.CommitTracker Soft AutoCommit: disabled
   [junit4]   2> 580802 INFO  (TEST-TestLazyCores.testCreateTransientFromAdmin-seed#[611DA031B11D8261]) [    x:collection3] o.a.s.u.RandomMergePolicy RandomMergePolicy wrapping class org.apache.lucene.index.LogByteSizeMergePolicy: [LogByteSizeMergePolicy: minMergeSize=1677721, mergeFactor=14, maxMergeSize=2147483648, maxMergeSizeForForcedMerge=9223372036854775807, calibrateSizeByDeletes=true, maxMergeDocs=2147483647, maxCFSSegmentSizeMB=8.796093022207999E12, noCFSRatio=0.6050903617037307]
   [junit4]   2> 580802 INFO  (TEST-TestLazyCores.testCreateTransientFromAdmin-seed#[611DA031B11D8261]) [    x:collection3] o.a.s.s.SolrIndexSearcher Opening [Searcher@52c0bff7[core2] main]
   [junit4]   2> 580803 INFO  (TEST-TestLazyCores.testCreateTransientFromAdmin-seed#[611DA031B11D8261]) [    x:collection3] o.a.s.r.ManagedResourceStorage File-based storage initialized to use dir: /home/jenkins/workspace/Lucene-Solr-master-Linux/solr/build/solr-core/test/J0/temp/solr.core.TestLazyCores_611DA031B11D8261-001/tempDir-002/core2/conf
   [junit4]   2> 580804 INFO  (TEST-TestLazyCores.testCreateTransientFromAdmin-seed#[611DA031B11D8261]) [    x:collection3] o.a.s.h.ReplicationHandler Commits will be reserved for  10000
   [junit4]   2> 580804 INFO  (searcherExecutor-1709-thread-1-processing-x:collection3) [    x:collection3] o.a.s.c.SolrCore [core2] Registered new searcher Searcher@52c0bff7[core2] main{ExitableDirectoryReader(UninvertingDirectoryReader())}
   [junit4]   2> 580805 INFO  (TEST-TestLazyCores.testCreateTransientFromAdmin-seed#[611DA031B11D8261]) [    x:collection3] o.a.s.h.a.CoreAdminOperation core create command loadOnStartup=true&transient=true&name=core3&action=CREATE&wt=xml
   [junit4]   2> 580814 INFO  (TEST-TestLazyCores.testCreateTransientFromAdmin-seed#[611DA031B11D8261]) [    x:collection3] o.a.s.c.SolrConfig Using Lucene MatchVersion: 8.0.0
   [junit4]   2> 580819 INFO  (TEST-TestLazyCores.testCreateTransientFromAdmin-seed#[611DA031B11D8261]) [    x:collection3] o.a.s.s.IndexSchema [core3] Schema name=tiny
   [junit4]   2> 580821 INFO  (TEST-TestLazyCores.testCreateTransientFromAdmin-seed#[611DA031B11D8261]) [    x:collection3] o.a.s.s.IndexSchema Loaded schema tiny/1.1 with uniqueid field id
   [junit4]   2> 580821 INFO  (TEST-TestLazyCores.testCreateTransientFromAdmin-seed#[611DA031B11D8261]) [    x:collection3] o.a.s.c.CoreContainer Creating SolrCore 'core3' using configuration from instancedir /home/jenkins/workspace/Lucene-Solr-master-Linux/solr/build/solr-core/test/J0/temp/solr.core.TestLazyCores_611DA031B11D8261-001/tempDir-002/./core3, trusted=true
   [junit4]   2> 580822 INFO  (TEST-TestLazyCores.testCreateTransientFromAdmin-seed#[611DA031B11D8261]) [    x:collection3] o.a.s.m.r.SolrJmxReporter JMX monitoring for 'solr.core.core3' (registry 'solr.core.core3') enabled at server: com.sun.jmx.mbeanserver.JmxMBeanServer@6eff5a75
   [junit4]   2> 580822 INFO  (TEST-TestLazyCores.testCreateTransientFromAdmin-seed#[611DA031B11D8261]) [    x:collection3] o.a.s.c.SolrCore solr.RecoveryStrategy.Builder
   [junit4]   2> 580822 INFO  (TEST-TestLazyCores.testCreateTransientFromAdmin-seed#[611DA031B11D8261]) [    x:collection3] o.a.s.c.SolrCore [[core3] ] Opening new SolrCore at [/home/jenkins/workspace/Lucene-Solr-master-Linux/solr/build/solr-core/test/J0/temp/solr.core.TestLazyCores_611DA031B11D8261-001/tempDir-002/core3], dataDir=[/home/jenkins/workspace/Lucene-Solr-master-Linux/solr/build/solr-core/test/J0/temp/solr.core.TestLazyCores_611DA031B11D8261-001/tempDir-002/./core3/data/]
   [junit4]   2> 580825 INFO  (TEST-TestLazyCores.testCreateTransientFromAdmin-seed#[611DA031B11D8261]) [    x:collection3] o.a.s.u.RandomMergePolicy RandomMergePolicy wrapping class org.apache.lucene.index.LogDocMergePolicy: [LogDocMergePolicy: minMergeSize=1000, mergeFactor=43, maxMergeSize=9223372036854775807, maxMergeSizeForForcedMerge=9223372036854775807, calibrateSizeByDeletes=false, maxMergeDocs=2147483647, maxCFSSegmentSizeMB=8.796093022207999E12, noCFSRatio=0.2651093060080182]
   [junit4]   2> 580871 INFO  (TEST-TestLazyCores.testCreateTransientFromAdmin-seed#[611DA031B11D8261]) [    x:collection3] o.a.s.u.CommitTracker Hard AutoCommit: disabled
   [junit4]   2> 580871 INFO  (TEST-TestLazyCores.testCreateTransientFromAdmin-seed#[611DA031B11D8261]) [    x:collection3] o.a.s.u.CommitTracker Soft AutoCommit: disabled
   [junit4]   2> 580872 INFO  (TEST-TestLazyCores.testCreateTransientFromAdmin-seed#[611DA031B11D8261]) [    x:collection3] o.a.s.u.RandomMergePolicy RandomMergePolicy wrapping class org.apache.lucene.index.AlcoholicMergePolicy: [AlcoholicMergePolicy: minMergeSize=0, mergeFactor=10, maxMergeSize=828191315, maxMergeSizeForForcedMerge=9223372036854775807, calibrateSizeByDeletes=true, maxMergeDocs=2147483647, maxCFSSegmentSizeMB=8.796093022207999E12, noCFSRatio=0.1]
   [junit4]   2> 580873 INFO  (TEST-TestLazyCores.testCreateTransientFromAdmin-seed#[611DA031B11D8261]) [    x:collection3] o.a.s.s.SolrIndexSearcher Opening [Searcher@7653b337[core3] main]
   [junit4]   2> 580873 INFO  (TEST-TestLazyCores.testCreateTransientFromAdmin-seed#[611DA031B11D8261]) [    x:collection3] o.a.s.r.ManagedResourceStorage File-based storage initialized to use dir: /home/jenkins/workspace/Lucene-Solr-master-Linux/solr/build/solr-core/test/J0/temp/solr.core.TestLazyCores_611DA031B11D8261-001/tempDir-002/core3/conf
   [junit4]   2> 580874 INFO  (TEST-TestLazyCores.testCreateTransientFromAdmin-seed#[611DA031B11D8261]) [    x:collection3] o.a.s.h.ReplicationHandler Commits will be reserved for  10000
   [junit4]   2> 580874 INFO  (TEST-TestLazyCores.testCreateTransientFromAdmin-seed#[611DA031B11D8261]) [    x:collection3] o.a.s.h.a.CoreAdminOperation core create command loadOnStartup=false&transient=true&name=core4&action=CREATE&wt=xml
   [junit4]   2> 580875 INFO  (searcherExecutor-1714-thread-1-processing-x:collection3) [    x:collection3] o.a.s.c.SolrCore [core3] Registered new searcher Searcher@7653b337[core3] main{ExitableDirectoryReader(UninvertingDirectoryReader())}
   [junit4]   2> 580883 INFO  (TEST-TestLazyCores.testCreateTransientFromAdmin-seed#[611DA031B11D8261]) [    x:collection3] o.a.s.c.SolrConfig Using Lucene MatchVersion: 8.0.0
   [junit4]   2> 580889 INFO  (TEST-TestLazyCores.testCreateTransientFromAdmin-seed#[611DA031B11D8261]) [    x:collection3] o.a.s.s.IndexSchema [core4] Schema name=tiny
   [junit4]   2> 580891 INFO  (TEST-TestLazyCores.testCreateTransientFromAdmin-seed#[611DA031B11D8261]) [    x:collection3] o.a.s.s.IndexSchema Loaded schema tiny/1.1 with uniqueid field id
   [junit4]   2> 580891 INFO  (TEST-TestLazyCores.testCreateTransientFromAdmin-seed#[611DA031B11D8261]) [    x:collection3] o.a.s.c.CoreContainer Creating SolrCore 'core4' using configuration from instancedir /home/jenkins/workspace/Lucene-Solr-master-Linux/solr/build/solr-core/test/J0/temp/solr.core.TestLazyCores_611DA031B11D8261-001/tempDir-002/./core4, trusted=true
   [junit4]   2> 580891 INFO  (TEST-TestLazyCores.testCreateTransientFromAdmin-seed#[611DA031B11D8261]) [    x:collection3] o.a.s.m.r.SolrJmxReporter JMX monitoring for 'solr.core.core4' (registry 'solr.core.core4') enabled at server: com.sun.jmx.mbeanserver.JmxMBeanServer@6eff5a75
   [junit4]   2> 580892 INFO  (TEST-TestLazyCores.testCreateTransientFromAdmin-seed#[611DA031B11D8261]) [    x:collection3] o.a.s.c.SolrCore solr.RecoveryStrategy.Builder
   [junit4]   2> 580892 INFO  (TEST-TestLazyCores.testCreateTransientFromAdmin-seed#[611DA031B11D8261]) [    x:collection3] o.a.s.c.SolrCore [[core4] ] Opening new SolrCore at [/home/jenkins/workspace/Lucene-Solr-master-Linux/solr/build/solr-core/test/J0/temp/solr.core.TestLazyCores_611DA031B11D8261-001/tempDir-002/core4], dataDir=[/home/jenkins/workspace/Lucene-Solr-master-Linux/solr/build/solr-core/test/J0/temp/solr.core.TestLazyCores_611DA031B11D8261-001/tempDir-002/./core4/data/]
   [junit4]   2> 580895 INFO  (TEST-TestLazyCores.testCreateTransientFromAdmin-seed#[611DA031B11D8261]) [    x:collection3] o.a.s.u.RandomMergePolicy RandomMergePolicy wrapping class org.apache.lucene.index.LogByteSizeMergePolicy: [LogByteSizeMergePolicy: minMergeSize=1677721, mergeFactor=28, maxMergeSize=2147483648, maxMergeSizeForForcedMerge=9223372036854775807, calibrateSizeByDeletes=true, maxMergeDocs=2147483647, maxCFSSegmentSizeMB=8.796093022207999E12, noCFSRatio=0.0]
   [junit4]   2> 580948 INFO  (TEST-TestLazyCores.testCreateTransientFromAdmin-seed#[611DA031B11D8261]) [    x:collection3] o.a.s.u.CommitTracker Hard AutoCommit: disabled
   [junit4]   2> 580948 INFO  (TEST-TestLazyCores.testCreateTransientFromAdmin-seed#[611DA031B11D8261]) [    x:collection3] o.a.s.u.CommitTracker Soft AutoCommit: disabled
   [junit4]   2> 580950 INFO  (TEST-TestLazyCores.testCreateTransientFromAdmin-seed#[611DA031B11D8261]) [    x:collection3] o.a.s.u.RandomMergePolicy RandomMergePolicy wrapping class org.apache.lucene.index.LogDocMergePolicy: [LogDocMergePolicy: minMergeSize=1000, mergeFactor=30, maxMergeSize=9223372036854775807, maxMergeSizeForForcedMerge=9223372036854775807, calibrateSizeByDeletes=true, maxMergeDocs=2147483647, maxCFSSegmentSizeMB=8.796093022207999E12, noCFSRatio=0.0]
   [junit4]   2> 580950 INFO  (TEST-TestLazyCores.testCreateTransientFromAdmin-seed#[611DA031B11D8261]) [    x:collection3] o.a.s.s.SolrIndexSearcher Opening [Searcher@26fa3cd5[core4] main]
   [junit4]   2> 580951 INFO  (TEST-TestLazyCores.testCreateTransientFromAdmin-seed#[611DA031B11D8261]) [    x:collection3] o.a.s.r.ManagedResourceStorage File-based storage initialized to use dir: /home/jenkins/workspace/Lucene-Solr-master-Linux/solr/build/solr-core/test/J0/temp/solr.core.TestLazyCores_611DA031B11D8261-001/tempDir-002/core4/conf
   [junit4]   2> 580952 INFO  (TEST-TestLazyCores.testCreateTransientFromAdmin-seed#[611DA031B11D8261]) [    x:collection3] o.a.s.h.ReplicationHandler Commits will be reserved for  10000
   [junit4]   2> 580952 INFO  (TEST-TestLazyCores.testCreateTransientFromAdmin-seed#[611DA031B11D8261]) [    x:collection3] o.a.s.c.TransientSolrCoreCacheDefault Closing transient core [collection2]
   [junit4]   2> 580952 INFO  (Thread-1152) [    x:collection3] o.a.s.c.SolrCore [collection2]  CLOSING SolrCore org.apache.solr.core.SolrCore@24eba463
   [junit4]   2> 580952 INFO  (Thread-1152) [    x:collection3] o.a.s.m.SolrMetricManager Closing metric reporters for registry=solr.core.collection2, tag=619422819
   [junit4]   2> 580952 INFO  (TEST-TestLazyCores.testCreateTransientFromAdmin-seed#[611DA031B11D8261]) [    x:collection3] o.a.s.h.a.CoreAdminOperation core create command loadOnStartup=false&transient=true&name=core5&action=CREATE&wt=xml
   [junit4]   2> 580952 INFO  (Thread-1152) [    x:collection3] o.a.s.m.r.SolrJmxReporter Closing reporter [org.apache.solr.metrics.reporters.SolrJmxReporter@7864c269: rootName = null, domain = solr.core.collection2, service url = null, agent id = null] for registry solr.core.collection2 / com.codahale.metrics.MetricRegistry@7f6bd5ae
   [junit4]   2> 580955 INFO  (searcherExecutor-1719-thread-1-processing-x:collection3) [    x:collection3] o.a.s.c.SolrCore [core4] Registered new searcher Searcher@26fa3cd5[core4] main{ExitableDirectoryReader(UninvertingDirectoryReader())}
   [junit4]   2> 580962 INFO  (TEST-TestLazyCores.testCreateTransientFromAdmin-seed#[611DA031B11D8261]) [    x:collection3] o.a.s.c.SolrConfig Using Lucene MatchVersion: 8.0.0
   [junit4]   2> 580975 INFO  (TEST-TestLazyCores.testCreateTransientFromAdmin-seed#[611DA031B11D8261]) [    x:collection3] o.a.s.s.IndexSchema [core5] Schema name=tiny
   [junit4]   2> 580976 INFO  (TEST-TestLazyCores.testCreateTransientFromAdmin-seed#[611DA031B11D8261]) [    x:collection3] o.a.s.s.IndexSchema Loaded schema tiny/1.1 with uniqueid field id
   [junit4]   2> 580976 INFO  (TEST-TestLazyCores.testCreateTransientFromAdmin-seed#[611DA031B11D8261]) [    x:collection3] o.a.s.c.CoreContainer Creating SolrCore 'core5' using configuration from instancedir /home/jenkins/workspace/Lucene-Solr-master-Linux/solr/build/solr-core/test/J0/temp/solr.core.TestLazyCores_611DA031B11D8261-001/tempDir-002/./core5, trusted=true
   [junit4]   2> 580977 INFO  (TEST-TestLazyCores.testCreateTransientFromAdmin-seed#[611DA031B11D8261]) [    x:collection3] o.a.s.m.r.SolrJmxReporter JMX monitoring for 'solr.core.core5' (registry 'solr.core.core5') enabled at server: com.sun.jmx.mbeanserver.JmxMBeanServer@6eff5a75
   [junit4]   2> 580977 INFO  (TEST-TestLazyCores.testCreateTransientFromAdmin-seed#[611DA031B11D8261]) [    x:collection3] o.a.s.c.SolrCore solr.RecoveryStrategy.Builder
   [junit4]   2> 580977 INFO  (TEST-TestLazyCores.testCreateTransientFromAdmin-seed#[611DA031B11D8261]) [    x:collection3] o.a.s.c.SolrCore [[core5] ] Opening new SolrCore at [/home/jenkins/workspace/Lucene-Solr-master-Linux/solr/build/solr-core/test/J0/temp/solr.core.TestLazyCores_611DA031B11D8261-001/tempDir-002/core5], dataDir=[/home/jenkins/workspace/Lucene-Solr-master-Linux/solr/build/solr-core/test/J0/temp/solr.core.TestLazyCores_611DA031B11D8261-001/tempDir-002/./core5/data/]
   [junit4]   2> 580980 INFO  (TEST-TestLazyCores.testCreateTransientFromAdmin-seed#[611DA031B11D8261]) [    x:collection3] o.a.s.u.RandomMergePolicy RandomMerg

[...truncated too long message...]

metric reporters for registry=solr.core.collection2, tag=339152886
   [junit4]   2> 584750 INFO  (coreCloseExecutor-1967-thread-4-processing-x:collection3) [    x:collection2] o.a.s.m.r.SolrJmxReporter Closing reporter [org.apache.solr.metrics.reporters.SolrJmxReporter@393388fa: rootName = null, domain = solr.core.collection2, service url = null, agent id = null] for registry solr.core.collection2 / com.codahale.metrics.MetricRegistry@eb74dc3
   [junit4]   2> 584756 INFO  (coreCloseExecutor-1967-thread-5-processing-x:collection3) [    x:collection3] o.a.s.m.SolrMetricManager Closing metric reporters for registry=solr.core.collection3, tag=1135674018
   [junit4]   2> 584756 INFO  (coreCloseExecutor-1967-thread-5-processing-x:collection3) [    x:collection3] o.a.s.m.r.SolrJmxReporter Closing reporter [org.apache.solr.metrics.reporters.SolrJmxReporter@4f97480: rootName = null, domain = solr.core.collection3, service url = null, agent id = null] for registry solr.core.collection3 / com.codahale.metrics.MetricRegistry@538e8cd8
   [junit4]   2> 584762 INFO  (coreCloseExecutor-1967-thread-3-processing-x:collection3) [    x:collection4] o.a.s.m.SolrMetricManager Closing metric reporters for registry=solr.core.collection4, tag=592136144
   [junit4]   2> 584762 INFO  (coreCloseExecutor-1967-thread-3-processing-x:collection3) [    x:collection4] o.a.s.m.r.SolrJmxReporter Closing reporter [org.apache.solr.metrics.reporters.SolrJmxReporter@7d11b6a1: rootName = null, domain = solr.core.collection4, service url = null, agent id = null] for registry solr.core.collection4 / com.codahale.metrics.MetricRegistry@7ab04474
   [junit4]   2> 584769 INFO  (TEST-TestLazyCores.testLazyLoad-seed#[611DA031B11D8261]) [    x:collection3] o.a.s.SolrTestCaseJ4 ###Ending testLazyLoad
   [junit4]   2> 584770 INFO  (SUITE-TestLazyCores-seed#[611DA031B11D8261]-worker) [    x:collection3] o.a.s.SolrTestCaseJ4 ###deleteCore
   [junit4]   2> 584770 INFO  (SUITE-TestLazyCores-seed#[611DA031B11D8261]-worker) [    x:collection3] o.a.s.c.CoreContainer Shutting down CoreContainer instance=1255202997
   [junit4]   2> 584770 INFO  (SUITE-TestLazyCores-seed#[611DA031B11D8261]-worker) [    x:collection3] o.a.s.m.SolrMetricManager Closing metric reporters for registry=solr.node, tag=null
   [junit4]   2> 584770 INFO  (SUITE-TestLazyCores-seed#[611DA031B11D8261]-worker) [    x:collection3] o.a.s.m.SolrMetricManager Closing metric reporters for registry=solr.jvm, tag=null
   [junit4]   2> 584770 INFO  (SUITE-TestLazyCores-seed#[611DA031B11D8261]-worker) [    x:collection3] o.a.s.m.SolrMetricManager Closing metric reporters for registry=solr.jetty, tag=null
   [junit4]   2> NOTE: leaving temporary files on disk at: /home/jenkins/workspace/Lucene-Solr-master-Linux/solr/build/solr-core/test/J0/temp/solr.core.TestLazyCores_611DA031B11D8261-001
   [junit4]   2> Sep 13, 2017 6:02:53 PM com.carrotsearch.randomizedtesting.ThreadLeakControl checkThreadLeaks
   [junit4]   2> WARNING: Will linger awaiting termination of 2 leaked thread(s).
   [junit4]   2> Sep 13, 2017 6:03:13 PM com.carrotsearch.randomizedtesting.ThreadLeakControl checkThreadLeaks
   [junit4]   2> SEVERE: 1 thread leaked from SUITE scope at org.apache.solr.core.TestLazyCores:
   [junit4]   2>    1) Thread[id=4884, name=searcherExecutor-1838-thread-1, state=WAITING, group=TGRP-TestLazyCores]
   [junit4]   2>         at sun.misc.Unsafe.park(Native Method)
   [junit4]   2>         at java.util.concurrent.locks.LockSupport.park(LockSupport.java:175)
   [junit4]   2>         at java.util.concurrent.locks.AbstractQueuedSynchronizer$ConditionObject.await(AbstractQueuedSynchronizer.java:2039)
   [junit4]   2>         at java.util.concurrent.LinkedBlockingQueue.take(LinkedBlockingQueue.java:442)
   [junit4]   2>         at java.util.concurrent.ThreadPoolExecutor.getTask(ThreadPoolExecutor.java:1074)
   [junit4]   2>         at java.util.concurrent.ThreadPoolExecutor.runWorker(ThreadPoolExecutor.java:1134)
   [junit4]   2>         at java.util.concurrent.ThreadPoolExecutor$Worker.run(ThreadPoolExecutor.java:624)
   [junit4]   2>         at java.lang.Thread.run(Thread.java:748)
   [junit4]   2> Sep 13, 2017 6:03:13 PM com.carrotsearch.randomizedtesting.ThreadLeakControl tryToInterruptAll
   [junit4]   2> INFO: Starting to interrupt leaked threads:
   [junit4]   2>    1) Thread[id=4884, name=searcherExecutor-1838-thread-1, state=WAITING, group=TGRP-TestLazyCores]
   [junit4]   2> Sep 13, 2017 6:03:16 PM com.carrotsearch.randomizedtesting.ThreadLeakControl tryToInterruptAll
   [junit4]   2> SEVERE: There are still zombie threads that couldn't be terminated:
   [junit4]   2>    1) Thread[id=4884, name=searcherExecutor-1838-thread-1, state=WAITING, group=TGRP-TestLazyCores]
   [junit4]   2>         at sun.misc.Unsafe.park(Native Method)
   [junit4]   2>         at java.util.concurrent.locks.LockSupport.park(LockSupport.java:175)
   [junit4]   2>         at java.util.concurrent.locks.AbstractQueuedSynchronizer$ConditionObject.await(AbstractQueuedSynchronizer.java:2039)
   [junit4]   2>         at java.util.concurrent.LinkedBlockingQueue.take(LinkedBlockingQueue.java:442)
   [junit4]   2>         at java.util.concurrent.ThreadPoolExecutor.getTask(ThreadPoolExecutor.java:1074)
   [junit4]   2>         at java.util.concurrent.ThreadPoolExecutor.runWorker(ThreadPoolExecutor.java:1134)
   [junit4]   2>         at java.util.concurrent.ThreadPoolExecutor$Worker.run(ThreadPoolExecutor.java:624)
   [junit4]   2>         at java.lang.Thread.run(Thread.java:748)
   [junit4]   2> NOTE: test params are: codec=Asserting(Lucene70): {v_t=PostingsFormat(name=Direct), id=PostingsFormat(name=Direct), v_s=PostingsFormat(name=Asserting), v_f=PostingsFormat(name=LuceneFixedGap)}, docValues:{}, maxPointsInLeafNode=228, maxMBSortInHeap=5.248258951860184, sim=RandomSimilarity(queryNorm=false): {}, locale=es-PA, timezone=Etc/GMT+4
   [junit4]   2> NOTE: Linux 4.10.0-33-generic amd64/Oracle Corporation 1.8.0_144 (64-bit)/cpus=8,threads=2,free=388804296,total=536870912
   [junit4]   2> NOTE: All tests run in this JVM: [TestBadConfig, HdfsDirectoryTest, TestBinaryResponseWriter, TestSimpleTextCodec, UUIDFieldTest, TestTolerantUpdateProcessorRandomCloud, TestFastOutputStream, TestConfigSetImmutable, OverseerStatusTest, DistribJoinFromCollectionTest, TestGraphTermsQParserPlugin, TestMacros, MetricsHandlerTest, QueryResultKeyTest, SyncSliceTest, TestMultiWordSynonyms, HdfsNNFailoverTest, BinaryUpdateRequestHandlerTest, DistributedDebugComponentTest, TestGeoJSONResponseWriter, TestRemoteStreaming, TestLegacyField, CursorPagingTest, TestQuerySenderNoQuery, SolrShardReporterTest, TestPayloadCheckQParserPlugin, DeleteNodeTest, TestPolicyCloud, TestImplicitCoreProperties, DocValuesMissingTest, HighlighterConfigTest, TestSolrQueryResponse, TestLuceneMatchVersion, RAMDirectoryFactoryTest, TestFieldTypeResource, TestConfig, SolrIndexConfigTest, HttpPartitionTest, TestDistribIDF, SolrMetricManagerTest, AliasIntegrationTest, TestAuthenticationFramework, TestCollectionAPI, DistributedFacetPivotLargeTest, TestPivotHelperCode, ClassificationUpdateProcessorIntegrationTest, TestJettySolrRunner, RankQueryTest, UpdateParamsTest, TestRandomDVFaceting, TestWordDelimiterFilterFactory, OpenExchangeRatesOrgProviderTest, TestCloudRecovery, TestLazyCores]
   [junit4]   2> NOTE: reproduce with: ant test  -Dtestcase=TestLazyCores -Dtests.seed=611DA031B11D8261 -Dtests.multiplier=3 -Dtests.slow=true -Dtests.locale=es-PA -Dtests.timezone=Etc/GMT+4 -Dtests.asserts=true -Dtests.file.encoding=US-ASCII
   [junit4] ERROR   0.00s J0 | TestLazyCores (suite) <<<
   [junit4]    > Throwable #1: com.carrotsearch.randomizedtesting.ThreadLeakError: 1 thread leaked from SUITE scope at org.apache.solr.core.TestLazyCores:
   [junit4]    >    1) Thread[id=4884, name=searcherExecutor-1838-thread-1, state=WAITING, group=TGRP-TestLazyCores]
   [junit4]    >         at sun.misc.Unsafe.park(Native Method)
   [junit4]    >         at java.util.concurrent.locks.LockSupport.park(LockSupport.java:175)
   [junit4]    >         at java.util.concurrent.locks.AbstractQueuedSynchronizer$ConditionObject.await(AbstractQueuedSynchronizer.java:2039)
   [junit4]    >         at java.util.concurrent.LinkedBlockingQueue.take(LinkedBlockingQueue.java:442)
   [junit4]    >         at java.util.concurrent.ThreadPoolExecutor.getTask(ThreadPoolExecutor.java:1074)
   [junit4]    >         at java.util.concurrent.ThreadPoolExecutor.runWorker(ThreadPoolExecutor.java:1134)
   [junit4]    >         at java.util.concurrent.ThreadPoolExecutor$Worker.run(ThreadPoolExecutor.java:624)
   [junit4]    >         at java.lang.Thread.run(Thread.java:748)
   [junit4]    > at __randomizedtesting.SeedInfo.seed([611DA031B11D8261]:0)Throwable #2: com.carrotsearch.randomizedtesting.ThreadLeakError: There are still zombie threads that couldn't be terminated:
   [junit4]    >    1) Thread[id=4884, name=searcherExecutor-1838-thread-1, state=WAITING, group=TGRP-TestLazyCores]
   [junit4]    >         at sun.misc.Unsafe.park(Native Method)
   [junit4]    >         at java.util.concurrent.locks.LockSupport.park(LockSupport.java:175)
   [junit4]    >         at java.util.concurrent.locks.AbstractQueuedSynchronizer$ConditionObject.await(AbstractQueuedSynchronizer.java:2039)
   [junit4]    >         at java.util.concurrent.LinkedBlockingQueue.take(LinkedBlockingQueue.java:442)
   [junit4]    >         at java.util.concurrent.ThreadPoolExecutor.getTask(ThreadPoolExecutor.java:1074)
   [junit4]    >         at java.util.concurrent.ThreadPoolExecutor.runWorker(ThreadPoolExecutor.java:1134)
   [junit4]    >         at java.util.concurrent.ThreadPoolExecutor$Worker.run(ThreadPoolExecutor.java:624)
   [junit4]    >         at java.lang.Thread.run(Thread.java:748)
   [junit4]    > at __randomizedtesting.SeedInfo.seed([611DA031B11D8261]:0)
   [junit4] Completed [226/732 (1!)] on J0 in 28.88s, 9 tests, 3 errors <<< FAILURES!

[...truncated 47815 lines...]


---------------------------------------------------------------------
To unsubscribe, e-mail: [hidden email]
For additional commands, e-mail: [hidden email]