[JENKINS] Lucene-Solr-master-Linux (64bit/jdk1.8.0_172) - Build # 22436 - Unstable!

Previous Topic Next Topic
 
classic Classic list List threaded Threaded
2 messages Options
Reply | Threaded
Open this post in threaded view
|

[JENKINS] Lucene-Solr-master-Linux (64bit/jdk1.8.0_172) - Build # 22436 - Unstable!

Policeman Jenkins Server-2
Build: https://jenkins.thetaphi.de/job/Lucene-Solr-master-Linux/22436/
Java: 64bit/jdk1.8.0_172 -XX:+UseCompressedOops -XX:+UseParallelGC

8 tests failed.
FAILED:  org.apache.solr.cloud.LeaderTragicEventTest.testOtherReplicasAreNotActive

Error Message:
Jetty Connector is not open: -2

Stack Trace:
java.lang.IllegalStateException: Jetty Connector is not open: -2
        at __randomizedtesting.SeedInfo.seed([ECD1DCA15E778E3B:6965F0D6628837A3]:0)
        at org.apache.solr.client.solrj.embedded.JettySolrRunner.getBaseUrl(JettySolrRunner.java:499)
        at org.apache.solr.cloud.MiniSolrCloudCluster.getReplicaJetty(MiniSolrCloudCluster.java:539)
        at org.apache.solr.cloud.LeaderTragicEventTest.corruptLeader(LeaderTragicEventTest.java:100)
        at org.apache.solr.cloud.LeaderTragicEventTest.testOtherReplicasAreNotActive(LeaderTragicEventTest.java:150)
        at sun.reflect.NativeMethodAccessorImpl.invoke0(Native Method)
        at sun.reflect.NativeMethodAccessorImpl.invoke(NativeMethodAccessorImpl.java:62)
        at sun.reflect.DelegatingMethodAccessorImpl.invoke(DelegatingMethodAccessorImpl.java:43)
        at java.lang.reflect.Method.invoke(Method.java:498)
        at com.carrotsearch.randomizedtesting.RandomizedRunner.invoke(RandomizedRunner.java:1737)
        at com.carrotsearch.randomizedtesting.RandomizedRunner$8.evaluate(RandomizedRunner.java:934)
        at com.carrotsearch.randomizedtesting.RandomizedRunner$9.evaluate(RandomizedRunner.java:970)
        at com.carrotsearch.randomizedtesting.RandomizedRunner$10.evaluate(RandomizedRunner.java:984)
        at com.carrotsearch.randomizedtesting.rules.SystemPropertiesRestoreRule$1.evaluate(SystemPropertiesRestoreRule.java:57)
        at org.apache.lucene.util.TestRuleSetupTeardownChained$1.evaluate(TestRuleSetupTeardownChained.java:49)
        at org.apache.lucene.util.AbstractBeforeAfterRule$1.evaluate(AbstractBeforeAfterRule.java:45)
        at org.apache.lucene.util.TestRuleThreadAndTestName$1.evaluate(TestRuleThreadAndTestName.java:48)
        at org.apache.lucene.util.TestRuleIgnoreAfterMaxFailures$1.evaluate(TestRuleIgnoreAfterMaxFailures.java:64)
        at org.apache.lucene.util.TestRuleMarkFailure$1.evaluate(TestRuleMarkFailure.java:47)
        at com.carrotsearch.randomizedtesting.rules.StatementAdapter.evaluate(StatementAdapter.java:36)
        at com.carrotsearch.randomizedtesting.ThreadLeakControl$StatementRunner.run(ThreadLeakControl.java:368)
        at com.carrotsearch.randomizedtesting.ThreadLeakControl.forkTimeoutingTask(ThreadLeakControl.java:817)
        at com.carrotsearch.randomizedtesting.ThreadLeakControl$3.evaluate(ThreadLeakControl.java:468)
        at com.carrotsearch.randomizedtesting.RandomizedRunner.runSingleTest(RandomizedRunner.java:943)
        at com.carrotsearch.randomizedtesting.RandomizedRunner$5.evaluate(RandomizedRunner.java:829)
        at com.carrotsearch.randomizedtesting.RandomizedRunner$6.evaluate(RandomizedRunner.java:879)
        at com.carrotsearch.randomizedtesting.RandomizedRunner$7.evaluate(RandomizedRunner.java:890)
        at com.carrotsearch.randomizedtesting.rules.StatementAdapter.evaluate(StatementAdapter.java:36)
        at com.carrotsearch.randomizedtesting.rules.SystemPropertiesRestoreRule$1.evaluate(SystemPropertiesRestoreRule.java:57)
        at org.apache.lucene.util.AbstractBeforeAfterRule$1.evaluate(AbstractBeforeAfterRule.java:45)
        at com.carrotsearch.randomizedtesting.rules.StatementAdapter.evaluate(StatementAdapter.java:36)
        at org.apache.lucene.util.TestRuleStoreClassName$1.evaluate(TestRuleStoreClassName.java:41)
        at com.carrotsearch.randomizedtesting.rules.NoShadowingOrOverridesOnMethodsRule$1.evaluate(NoShadowingOrOverridesOnMethodsRule.java:40)
        at com.carrotsearch.randomizedtesting.rules.NoShadowingOrOverridesOnMethodsRule$1.evaluate(NoShadowingOrOverridesOnMethodsRule.java:40)
        at com.carrotsearch.randomizedtesting.rules.StatementAdapter.evaluate(StatementAdapter.java:36)
        at com.carrotsearch.randomizedtesting.rules.StatementAdapter.evaluate(StatementAdapter.java:36)
        at com.carrotsearch.randomizedtesting.rules.StatementAdapter.evaluate(StatementAdapter.java:36)
        at org.apache.lucene.util.TestRuleAssertionsRequired$1.evaluate(TestRuleAssertionsRequired.java:53)
        at org.apache.lucene.util.TestRuleMarkFailure$1.evaluate(TestRuleMarkFailure.java:47)
        at org.apache.lucene.util.TestRuleIgnoreAfterMaxFailures$1.evaluate(TestRuleIgnoreAfterMaxFailures.java:64)
        at org.apache.lucene.util.TestRuleIgnoreTestSuites$1.evaluate(TestRuleIgnoreTestSuites.java:54)
        at com.carrotsearch.randomizedtesting.rules.StatementAdapter.evaluate(StatementAdapter.java:36)
        at com.carrotsearch.randomizedtesting.ThreadLeakControl$StatementRunner.run(ThreadLeakControl.java:368)
        at java.lang.Thread.run(Thread.java:748)


FAILED:  org.apache.solr.cloud.LeaderTragicEventTest.test

Error Message:
Error from server at http://127.0.0.1:33089/solr: collection already exists: collection1

Stack Trace:
org.apache.solr.client.solrj.impl.HttpSolrClient$RemoteSolrException: Error from server at http://127.0.0.1:33089/solr: collection already exists: collection1
        at __randomizedtesting.SeedInfo.seed([ECD1DCA15E778E3B:6485E37BF08BE3C3]:0)
        at org.apache.solr.client.solrj.impl.HttpSolrClient.executeMethod(HttpSolrClient.java:643)
        at org.apache.solr.client.solrj.impl.HttpSolrClient.request(HttpSolrClient.java:255)
        at org.apache.solr.client.solrj.impl.HttpSolrClient.request(HttpSolrClient.java:244)
        at org.apache.solr.client.solrj.impl.LBHttpSolrClient.doRequest(LBHttpSolrClient.java:483)
        at org.apache.solr.client.solrj.impl.LBHttpSolrClient.request(LBHttpSolrClient.java:413)
        at org.apache.solr.client.solrj.impl.CloudSolrClient.sendRequest(CloudSolrClient.java:1106)
        at org.apache.solr.client.solrj.impl.CloudSolrClient.requestWithRetryOnStaleState(CloudSolrClient.java:886)
        at org.apache.solr.client.solrj.impl.CloudSolrClient.request(CloudSolrClient.java:819)
        at org.apache.solr.client.solrj.SolrRequest.process(SolrRequest.java:194)
        at org.apache.solr.client.solrj.SolrRequest.process(SolrRequest.java:211)
        at org.apache.solr.cloud.LeaderTragicEventTest.test(LeaderTragicEventTest.java:70)
        at sun.reflect.NativeMethodAccessorImpl.invoke0(Native Method)
        at sun.reflect.NativeMethodAccessorImpl.invoke(NativeMethodAccessorImpl.java:62)
        at sun.reflect.DelegatingMethodAccessorImpl.invoke(DelegatingMethodAccessorImpl.java:43)
        at java.lang.reflect.Method.invoke(Method.java:498)
        at com.carrotsearch.randomizedtesting.RandomizedRunner.invoke(RandomizedRunner.java:1737)
        at com.carrotsearch.randomizedtesting.RandomizedRunner$8.evaluate(RandomizedRunner.java:934)
        at com.carrotsearch.randomizedtesting.RandomizedRunner$9.evaluate(RandomizedRunner.java:970)
        at com.carrotsearch.randomizedtesting.RandomizedRunner$10.evaluate(RandomizedRunner.java:984)
        at com.carrotsearch.randomizedtesting.rules.SystemPropertiesRestoreRule$1.evaluate(SystemPropertiesRestoreRule.java:57)
        at org.apache.lucene.util.TestRuleSetupTeardownChained$1.evaluate(TestRuleSetupTeardownChained.java:49)
        at org.apache.lucene.util.AbstractBeforeAfterRule$1.evaluate(AbstractBeforeAfterRule.java:45)
        at org.apache.lucene.util.TestRuleThreadAndTestName$1.evaluate(TestRuleThreadAndTestName.java:48)
        at org.apache.lucene.util.TestRuleIgnoreAfterMaxFailures$1.evaluate(TestRuleIgnoreAfterMaxFailures.java:64)
        at org.apache.lucene.util.TestRuleMarkFailure$1.evaluate(TestRuleMarkFailure.java:47)
        at com.carrotsearch.randomizedtesting.rules.StatementAdapter.evaluate(StatementAdapter.java:36)
        at com.carrotsearch.randomizedtesting.ThreadLeakControl$StatementRunner.run(ThreadLeakControl.java:368)
        at com.carrotsearch.randomizedtesting.ThreadLeakControl.forkTimeoutingTask(ThreadLeakControl.java:817)
        at com.carrotsearch.randomizedtesting.ThreadLeakControl$3.evaluate(ThreadLeakControl.java:468)
        at com.carrotsearch.randomizedtesting.RandomizedRunner.runSingleTest(RandomizedRunner.java:943)
        at com.carrotsearch.randomizedtesting.RandomizedRunner$5.evaluate(RandomizedRunner.java:829)
        at com.carrotsearch.randomizedtesting.RandomizedRunner$6.evaluate(RandomizedRunner.java:879)
        at com.carrotsearch.randomizedtesting.RandomizedRunner$7.evaluate(RandomizedRunner.java:890)
        at com.carrotsearch.randomizedtesting.rules.StatementAdapter.evaluate(StatementAdapter.java:36)
        at com.carrotsearch.randomizedtesting.rules.SystemPropertiesRestoreRule$1.evaluate(SystemPropertiesRestoreRule.java:57)
        at org.apache.lucene.util.AbstractBeforeAfterRule$1.evaluate(AbstractBeforeAfterRule.java:45)
        at com.carrotsearch.randomizedtesting.rules.StatementAdapter.evaluate(StatementAdapter.java:36)
        at org.apache.lucene.util.TestRuleStoreClassName$1.evaluate(TestRuleStoreClassName.java:41)
        at com.carrotsearch.randomizedtesting.rules.NoShadowingOrOverridesOnMethodsRule$1.evaluate(NoShadowingOrOverridesOnMethodsRule.java:40)
        at com.carrotsearch.randomizedtesting.rules.NoShadowingOrOverridesOnMethodsRule$1.evaluate(NoShadowingOrOverridesOnMethodsRule.java:40)
        at com.carrotsearch.randomizedtesting.rules.StatementAdapter.evaluate(StatementAdapter.java:36)
        at com.carrotsearch.randomizedtesting.rules.StatementAdapter.evaluate(StatementAdapter.java:36)
        at com.carrotsearch.randomizedtesting.rules.StatementAdapter.evaluate(StatementAdapter.java:36)
        at org.apache.lucene.util.TestRuleAssertionsRequired$1.evaluate(TestRuleAssertionsRequired.java:53)
        at org.apache.lucene.util.TestRuleMarkFailure$1.evaluate(TestRuleMarkFailure.java:47)
        at org.apache.lucene.util.TestRuleIgnoreAfterMaxFailures$1.evaluate(TestRuleIgnoreAfterMaxFailures.java:64)
        at org.apache.lucene.util.TestRuleIgnoreTestSuites$1.evaluate(TestRuleIgnoreTestSuites.java:54)
        at com.carrotsearch.randomizedtesting.rules.StatementAdapter.evaluate(StatementAdapter.java:36)
        at com.carrotsearch.randomizedtesting.ThreadLeakControl$StatementRunner.run(ThreadLeakControl.java:368)
        at java.lang.Thread.run(Thread.java:748)


FAILED:  org.apache.solr.cloud.LeaderTragicEventTest.testOtherReplicasAreNotActive

Error Message:
Jetty Connector is not open: -2

Stack Trace:
java.lang.IllegalStateException: Jetty Connector is not open: -2
        at __randomizedtesting.SeedInfo.seed([ECD1DCA15E778E3B:6965F0D6628837A3]:0)
        at org.apache.solr.client.solrj.embedded.JettySolrRunner.getBaseUrl(JettySolrRunner.java:499)
        at org.apache.solr.cloud.MiniSolrCloudCluster.getReplicaJetty(MiniSolrCloudCluster.java:539)
        at org.apache.solr.cloud.LeaderTragicEventTest.corruptLeader(LeaderTragicEventTest.java:100)
        at org.apache.solr.cloud.LeaderTragicEventTest.testOtherReplicasAreNotActive(LeaderTragicEventTest.java:150)
        at sun.reflect.NativeMethodAccessorImpl.invoke0(Native Method)
        at sun.reflect.NativeMethodAccessorImpl.invoke(NativeMethodAccessorImpl.java:62)
        at sun.reflect.DelegatingMethodAccessorImpl.invoke(DelegatingMethodAccessorImpl.java:43)
        at java.lang.reflect.Method.invoke(Method.java:498)
        at com.carrotsearch.randomizedtesting.RandomizedRunner.invoke(RandomizedRunner.java:1737)
        at com.carrotsearch.randomizedtesting.RandomizedRunner$8.evaluate(RandomizedRunner.java:934)
        at com.carrotsearch.randomizedtesting.RandomizedRunner$9.evaluate(RandomizedRunner.java:970)
        at com.carrotsearch.randomizedtesting.RandomizedRunner$10.evaluate(RandomizedRunner.java:984)
        at com.carrotsearch.randomizedtesting.rules.SystemPropertiesRestoreRule$1.evaluate(SystemPropertiesRestoreRule.java:57)
        at org.apache.lucene.util.TestRuleSetupTeardownChained$1.evaluate(TestRuleSetupTeardownChained.java:49)
        at org.apache.lucene.util.AbstractBeforeAfterRule$1.evaluate(AbstractBeforeAfterRule.java:45)
        at org.apache.lucene.util.TestRuleThreadAndTestName$1.evaluate(TestRuleThreadAndTestName.java:48)
        at org.apache.lucene.util.TestRuleIgnoreAfterMaxFailures$1.evaluate(TestRuleIgnoreAfterMaxFailures.java:64)
        at org.apache.lucene.util.TestRuleMarkFailure$1.evaluate(TestRuleMarkFailure.java:47)
        at com.carrotsearch.randomizedtesting.rules.StatementAdapter.evaluate(StatementAdapter.java:36)
        at com.carrotsearch.randomizedtesting.ThreadLeakControl$StatementRunner.run(ThreadLeakControl.java:368)
        at com.carrotsearch.randomizedtesting.ThreadLeakControl.forkTimeoutingTask(ThreadLeakControl.java:817)
        at com.carrotsearch.randomizedtesting.ThreadLeakControl$3.evaluate(ThreadLeakControl.java:468)
        at com.carrotsearch.randomizedtesting.RandomizedRunner.runSingleTest(RandomizedRunner.java:943)
        at com.carrotsearch.randomizedtesting.RandomizedRunner$5.evaluate(RandomizedRunner.java:829)
        at com.carrotsearch.randomizedtesting.RandomizedRunner$6.evaluate(RandomizedRunner.java:879)
        at com.carrotsearch.randomizedtesting.RandomizedRunner$7.evaluate(RandomizedRunner.java:890)
        at com.carrotsearch.randomizedtesting.rules.StatementAdapter.evaluate(StatementAdapter.java:36)
        at com.carrotsearch.randomizedtesting.rules.SystemPropertiesRestoreRule$1.evaluate(SystemPropertiesRestoreRule.java:57)
        at org.apache.lucene.util.AbstractBeforeAfterRule$1.evaluate(AbstractBeforeAfterRule.java:45)
        at com.carrotsearch.randomizedtesting.rules.StatementAdapter.evaluate(StatementAdapter.java:36)
        at org.apache.lucene.util.TestRuleStoreClassName$1.evaluate(TestRuleStoreClassName.java:41)
        at com.carrotsearch.randomizedtesting.rules.NoShadowingOrOverridesOnMethodsRule$1.evaluate(NoShadowingOrOverridesOnMethodsRule.java:40)
        at com.carrotsearch.randomizedtesting.rules.NoShadowingOrOverridesOnMethodsRule$1.evaluate(NoShadowingOrOverridesOnMethodsRule.java:40)
        at com.carrotsearch.randomizedtesting.rules.StatementAdapter.evaluate(StatementAdapter.java:36)
        at com.carrotsearch.randomizedtesting.rules.StatementAdapter.evaluate(StatementAdapter.java:36)
        at com.carrotsearch.randomizedtesting.rules.StatementAdapter.evaluate(StatementAdapter.java:36)
        at org.apache.lucene.util.TestRuleAssertionsRequired$1.evaluate(TestRuleAssertionsRequired.java:53)
        at org.apache.lucene.util.TestRuleMarkFailure$1.evaluate(TestRuleMarkFailure.java:47)
        at org.apache.lucene.util.TestRuleIgnoreAfterMaxFailures$1.evaluate(TestRuleIgnoreAfterMaxFailures.java:64)
        at org.apache.lucene.util.TestRuleIgnoreTestSuites$1.evaluate(TestRuleIgnoreTestSuites.java:54)
        at com.carrotsearch.randomizedtesting.rules.StatementAdapter.evaluate(StatementAdapter.java:36)
        at com.carrotsearch.randomizedtesting.ThreadLeakControl$StatementRunner.run(ThreadLeakControl.java:368)
        at java.lang.Thread.run(Thread.java:748)


FAILED:  org.apache.solr.cloud.LeaderTragicEventTest.test

Error Message:
Error from server at http://127.0.0.1:45265/solr: collection already exists: collection1

Stack Trace:
org.apache.solr.client.solrj.impl.HttpSolrClient$RemoteSolrException: Error from server at http://127.0.0.1:45265/solr: collection already exists: collection1
        at __randomizedtesting.SeedInfo.seed([ECD1DCA15E778E3B:6485E37BF08BE3C3]:0)
        at org.apache.solr.client.solrj.impl.HttpSolrClient.executeMethod(HttpSolrClient.java:643)
        at org.apache.solr.client.solrj.impl.HttpSolrClient.request(HttpSolrClient.java:255)
        at org.apache.solr.client.solrj.impl.HttpSolrClient.request(HttpSolrClient.java:244)
        at org.apache.solr.client.solrj.impl.LBHttpSolrClient.doRequest(LBHttpSolrClient.java:483)
        at org.apache.solr.client.solrj.impl.LBHttpSolrClient.request(LBHttpSolrClient.java:413)
        at org.apache.solr.client.solrj.impl.CloudSolrClient.sendRequest(CloudSolrClient.java:1106)
        at org.apache.solr.client.solrj.impl.CloudSolrClient.requestWithRetryOnStaleState(CloudSolrClient.java:886)
        at org.apache.solr.client.solrj.impl.CloudSolrClient.request(CloudSolrClient.java:819)
        at org.apache.solr.client.solrj.SolrRequest.process(SolrRequest.java:194)
        at org.apache.solr.client.solrj.SolrRequest.process(SolrRequest.java:211)
        at org.apache.solr.cloud.LeaderTragicEventTest.test(LeaderTragicEventTest.java:70)
        at sun.reflect.NativeMethodAccessorImpl.invoke0(Native Method)
        at sun.reflect.NativeMethodAccessorImpl.invoke(NativeMethodAccessorImpl.java:62)
        at sun.reflect.DelegatingMethodAccessorImpl.invoke(DelegatingMethodAccessorImpl.java:43)
        at java.lang.reflect.Method.invoke(Method.java:498)
        at com.carrotsearch.randomizedtesting.RandomizedRunner.invoke(RandomizedRunner.java:1737)
        at com.carrotsearch.randomizedtesting.RandomizedRunner$8.evaluate(RandomizedRunner.java:934)
        at com.carrotsearch.randomizedtesting.RandomizedRunner$9.evaluate(RandomizedRunner.java:970)
        at com.carrotsearch.randomizedtesting.RandomizedRunner$10.evaluate(RandomizedRunner.java:984)
        at com.carrotsearch.randomizedtesting.rules.SystemPropertiesRestoreRule$1.evaluate(SystemPropertiesRestoreRule.java:57)
        at org.apache.lucene.util.TestRuleSetupTeardownChained$1.evaluate(TestRuleSetupTeardownChained.java:49)
        at org.apache.lucene.util.AbstractBeforeAfterRule$1.evaluate(AbstractBeforeAfterRule.java:45)
        at org.apache.lucene.util.TestRuleThreadAndTestName$1.evaluate(TestRuleThreadAndTestName.java:48)
        at org.apache.lucene.util.TestRuleIgnoreAfterMaxFailures$1.evaluate(TestRuleIgnoreAfterMaxFailures.java:64)
        at org.apache.lucene.util.TestRuleMarkFailure$1.evaluate(TestRuleMarkFailure.java:47)
        at com.carrotsearch.randomizedtesting.rules.StatementAdapter.evaluate(StatementAdapter.java:36)
        at com.carrotsearch.randomizedtesting.ThreadLeakControl$StatementRunner.run(ThreadLeakControl.java:368)
        at com.carrotsearch.randomizedtesting.ThreadLeakControl.forkTimeoutingTask(ThreadLeakControl.java:817)
        at com.carrotsearch.randomizedtesting.ThreadLeakControl$3.evaluate(ThreadLeakControl.java:468)
        at com.carrotsearch.randomizedtesting.RandomizedRunner.runSingleTest(RandomizedRunner.java:943)
        at com.carrotsearch.randomizedtesting.RandomizedRunner$5.evaluate(RandomizedRunner.java:829)
        at com.carrotsearch.randomizedtesting.RandomizedRunner$6.evaluate(RandomizedRunner.java:879)
        at com.carrotsearch.randomizedtesting.RandomizedRunner$7.evaluate(RandomizedRunner.java:890)
        at com.carrotsearch.randomizedtesting.rules.StatementAdapter.evaluate(StatementAdapter.java:36)
        at com.carrotsearch.randomizedtesting.rules.SystemPropertiesRestoreRule$1.evaluate(SystemPropertiesRestoreRule.java:57)
        at org.apache.lucene.util.AbstractBeforeAfterRule$1.evaluate(AbstractBeforeAfterRule.java:45)
        at com.carrotsearch.randomizedtesting.rules.StatementAdapter.evaluate(StatementAdapter.java:36)
        at org.apache.lucene.util.TestRuleStoreClassName$1.evaluate(TestRuleStoreClassName.java:41)
        at com.carrotsearch.randomizedtesting.rules.NoShadowingOrOverridesOnMethodsRule$1.evaluate(NoShadowingOrOverridesOnMethodsRule.java:40)
        at com.carrotsearch.randomizedtesting.rules.NoShadowingOrOverridesOnMethodsRule$1.evaluate(NoShadowingOrOverridesOnMethodsRule.java:40)
        at com.carrotsearch.randomizedtesting.rules.StatementAdapter.evaluate(StatementAdapter.java:36)
        at com.carrotsearch.randomizedtesting.rules.StatementAdapter.evaluate(StatementAdapter.java:36)
        at com.carrotsearch.randomizedtesting.rules.StatementAdapter.evaluate(StatementAdapter.java:36)
        at org.apache.lucene.util.TestRuleAssertionsRequired$1.evaluate(TestRuleAssertionsRequired.java:53)
        at org.apache.lucene.util.TestRuleMarkFailure$1.evaluate(TestRuleMarkFailure.java:47)
        at org.apache.lucene.util.TestRuleIgnoreAfterMaxFailures$1.evaluate(TestRuleIgnoreAfterMaxFailures.java:64)
        at org.apache.lucene.util.TestRuleIgnoreTestSuites$1.evaluate(TestRuleIgnoreTestSuites.java:54)
        at com.carrotsearch.randomizedtesting.rules.StatementAdapter.evaluate(StatementAdapter.java:36)
        at com.carrotsearch.randomizedtesting.ThreadLeakControl$StatementRunner.run(ThreadLeakControl.java:368)
        at java.lang.Thread.run(Thread.java:748)


FAILED:  org.apache.solr.cloud.LeaderTragicEventTest.testOtherReplicasAreNotActive

Error Message:
Jetty Connector is not open: -2

Stack Trace:
java.lang.IllegalStateException: Jetty Connector is not open: -2
        at __randomizedtesting.SeedInfo.seed([ECD1DCA15E778E3B:6965F0D6628837A3]:0)
        at org.apache.solr.client.solrj.embedded.JettySolrRunner.getBaseUrl(JettySolrRunner.java:499)
        at org.apache.solr.cloud.MiniSolrCloudCluster.getReplicaJetty(MiniSolrCloudCluster.java:539)
        at org.apache.solr.cloud.LeaderTragicEventTest.corruptLeader(LeaderTragicEventTest.java:100)
        at org.apache.solr.cloud.LeaderTragicEventTest.testOtherReplicasAreNotActive(LeaderTragicEventTest.java:150)
        at sun.reflect.NativeMethodAccessorImpl.invoke0(Native Method)
        at sun.reflect.NativeMethodAccessorImpl.invoke(NativeMethodAccessorImpl.java:62)
        at sun.reflect.DelegatingMethodAccessorImpl.invoke(DelegatingMethodAccessorImpl.java:43)
        at java.lang.reflect.Method.invoke(Method.java:498)
        at com.carrotsearch.randomizedtesting.RandomizedRunner.invoke(RandomizedRunner.java:1737)
        at com.carrotsearch.randomizedtesting.RandomizedRunner$8.evaluate(RandomizedRunner.java:934)
        at com.carrotsearch.randomizedtesting.RandomizedRunner$9.evaluate(RandomizedRunner.java:970)
        at com.carrotsearch.randomizedtesting.RandomizedRunner$10.evaluate(RandomizedRunner.java:984)
        at com.carrotsearch.randomizedtesting.rules.SystemPropertiesRestoreRule$1.evaluate(SystemPropertiesRestoreRule.java:57)
        at org.apache.lucene.util.TestRuleSetupTeardownChained$1.evaluate(TestRuleSetupTeardownChained.java:49)
        at org.apache.lucene.util.AbstractBeforeAfterRule$1.evaluate(AbstractBeforeAfterRule.java:45)
        at org.apache.lucene.util.TestRuleThreadAndTestName$1.evaluate(TestRuleThreadAndTestName.java:48)
        at org.apache.lucene.util.TestRuleIgnoreAfterMaxFailures$1.evaluate(TestRuleIgnoreAfterMaxFailures.java:64)
        at org.apache.lucene.util.TestRuleMarkFailure$1.evaluate(TestRuleMarkFailure.java:47)
        at com.carrotsearch.randomizedtesting.rules.StatementAdapter.evaluate(StatementAdapter.java:36)
        at com.carrotsearch.randomizedtesting.ThreadLeakControl$StatementRunner.run(ThreadLeakControl.java:368)
        at com.carrotsearch.randomizedtesting.ThreadLeakControl.forkTimeoutingTask(ThreadLeakControl.java:817)
        at com.carrotsearch.randomizedtesting.ThreadLeakControl$3.evaluate(ThreadLeakControl.java:468)
        at com.carrotsearch.randomizedtesting.RandomizedRunner.runSingleTest(RandomizedRunner.java:943)
        at com.carrotsearch.randomizedtesting.RandomizedRunner$5.evaluate(RandomizedRunner.java:829)
        at com.carrotsearch.randomizedtesting.RandomizedRunner$6.evaluate(RandomizedRunner.java:879)
        at com.carrotsearch.randomizedtesting.RandomizedRunner$7.evaluate(RandomizedRunner.java:890)
        at com.carrotsearch.randomizedtesting.rules.StatementAdapter.evaluate(StatementAdapter.java:36)
        at com.carrotsearch.randomizedtesting.rules.SystemPropertiesRestoreRule$1.evaluate(SystemPropertiesRestoreRule.java:57)
        at org.apache.lucene.util.AbstractBeforeAfterRule$1.evaluate(AbstractBeforeAfterRule.java:45)
        at com.carrotsearch.randomizedtesting.rules.StatementAdapter.evaluate(StatementAdapter.java:36)
        at org.apache.lucene.util.TestRuleStoreClassName$1.evaluate(TestRuleStoreClassName.java:41)
        at com.carrotsearch.randomizedtesting.rules.NoShadowingOrOverridesOnMethodsRule$1.evaluate(NoShadowingOrOverridesOnMethodsRule.java:40)
        at com.carrotsearch.randomizedtesting.rules.NoShadowingOrOverridesOnMethodsRule$1.evaluate(NoShadowingOrOverridesOnMethodsRule.java:40)
        at com.carrotsearch.randomizedtesting.rules.StatementAdapter.evaluate(StatementAdapter.java:36)
        at com.carrotsearch.randomizedtesting.rules.StatementAdapter.evaluate(StatementAdapter.java:36)
        at com.carrotsearch.randomizedtesting.rules.StatementAdapter.evaluate(StatementAdapter.java:36)
        at org.apache.lucene.util.TestRuleAssertionsRequired$1.evaluate(TestRuleAssertionsRequired.java:53)
        at org.apache.lucene.util.TestRuleMarkFailure$1.evaluate(TestRuleMarkFailure.java:47)
        at org.apache.lucene.util.TestRuleIgnoreAfterMaxFailures$1.evaluate(TestRuleIgnoreAfterMaxFailures.java:64)
        at org.apache.lucene.util.TestRuleIgnoreTestSuites$1.evaluate(TestRuleIgnoreTestSuites.java:54)
        at com.carrotsearch.randomizedtesting.rules.StatementAdapter.evaluate(StatementAdapter.java:36)
        at com.carrotsearch.randomizedtesting.ThreadLeakControl$StatementRunner.run(ThreadLeakControl.java:368)
        at java.lang.Thread.run(Thread.java:748)


FAILED:  org.apache.solr.cloud.LeaderTragicEventTest.test

Error Message:
Error from server at http://127.0.0.1:37353/solr: collection already exists: collection1

Stack Trace:
org.apache.solr.client.solrj.impl.HttpSolrClient$RemoteSolrException: Error from server at http://127.0.0.1:37353/solr: collection already exists: collection1
        at __randomizedtesting.SeedInfo.seed([ECD1DCA15E778E3B:6485E37BF08BE3C3]:0)
        at org.apache.solr.client.solrj.impl.HttpSolrClient.executeMethod(HttpSolrClient.java:643)
        at org.apache.solr.client.solrj.impl.HttpSolrClient.request(HttpSolrClient.java:255)
        at org.apache.solr.client.solrj.impl.HttpSolrClient.request(HttpSolrClient.java:244)
        at org.apache.solr.client.solrj.impl.LBHttpSolrClient.doRequest(LBHttpSolrClient.java:483)
        at org.apache.solr.client.solrj.impl.LBHttpSolrClient.request(LBHttpSolrClient.java:413)
        at org.apache.solr.client.solrj.impl.CloudSolrClient.sendRequest(CloudSolrClient.java:1106)
        at org.apache.solr.client.solrj.impl.CloudSolrClient.requestWithRetryOnStaleState(CloudSolrClient.java:886)
        at org.apache.solr.client.solrj.impl.CloudSolrClient.request(CloudSolrClient.java:819)
        at org.apache.solr.client.solrj.SolrRequest.process(SolrRequest.java:194)
        at org.apache.solr.client.solrj.SolrRequest.process(SolrRequest.java:211)
        at org.apache.solr.cloud.LeaderTragicEventTest.test(LeaderTragicEventTest.java:70)
        at sun.reflect.NativeMethodAccessorImpl.invoke0(Native Method)
        at sun.reflect.NativeMethodAccessorImpl.invoke(NativeMethodAccessorImpl.java:62)
        at sun.reflect.DelegatingMethodAccessorImpl.invoke(DelegatingMethodAccessorImpl.java:43)
        at java.lang.reflect.Method.invoke(Method.java:498)
        at com.carrotsearch.randomizedtesting.RandomizedRunner.invoke(RandomizedRunner.java:1737)
        at com.carrotsearch.randomizedtesting.RandomizedRunner$8.evaluate(RandomizedRunner.java:934)
        at com.carrotsearch.randomizedtesting.RandomizedRunner$9.evaluate(RandomizedRunner.java:970)
        at com.carrotsearch.randomizedtesting.RandomizedRunner$10.evaluate(RandomizedRunner.java:984)
        at com.carrotsearch.randomizedtesting.rules.SystemPropertiesRestoreRule$1.evaluate(SystemPropertiesRestoreRule.java:57)
        at org.apache.lucene.util.TestRuleSetupTeardownChained$1.evaluate(TestRuleSetupTeardownChained.java:49)
        at org.apache.lucene.util.AbstractBeforeAfterRule$1.evaluate(AbstractBeforeAfterRule.java:45)
        at org.apache.lucene.util.TestRuleThreadAndTestName$1.evaluate(TestRuleThreadAndTestName.java:48)
        at org.apache.lucene.util.TestRuleIgnoreAfterMaxFailures$1.evaluate(TestRuleIgnoreAfterMaxFailures.java:64)
        at org.apache.lucene.util.TestRuleMarkFailure$1.evaluate(TestRuleMarkFailure.java:47)
        at com.carrotsearch.randomizedtesting.rules.StatementAdapter.evaluate(StatementAdapter.java:36)
        at com.carrotsearch.randomizedtesting.ThreadLeakControl$StatementRunner.run(ThreadLeakControl.java:368)
        at com.carrotsearch.randomizedtesting.ThreadLeakControl.forkTimeoutingTask(ThreadLeakControl.java:817)
        at com.carrotsearch.randomizedtesting.ThreadLeakControl$3.evaluate(ThreadLeakControl.java:468)
        at com.carrotsearch.randomizedtesting.RandomizedRunner.runSingleTest(RandomizedRunner.java:943)
        at com.carrotsearch.randomizedtesting.RandomizedRunner$5.evaluate(RandomizedRunner.java:829)
        at com.carrotsearch.randomizedtesting.RandomizedRunner$6.evaluate(RandomizedRunner.java:879)
        at com.carrotsearch.randomizedtesting.RandomizedRunner$7.evaluate(RandomizedRunner.java:890)
        at com.carrotsearch.randomizedtesting.rules.StatementAdapter.evaluate(StatementAdapter.java:36)
        at com.carrotsearch.randomizedtesting.rules.SystemPropertiesRestoreRule$1.evaluate(SystemPropertiesRestoreRule.java:57)
        at org.apache.lucene.util.AbstractBeforeAfterRule$1.evaluate(AbstractBeforeAfterRule.java:45)
        at com.carrotsearch.randomizedtesting.rules.StatementAdapter.evaluate(StatementAdapter.java:36)
        at org.apache.lucene.util.TestRuleStoreClassName$1.evaluate(TestRuleStoreClassName.java:41)
        at com.carrotsearch.randomizedtesting.rules.NoShadowingOrOverridesOnMethodsRule$1.evaluate(NoShadowingOrOverridesOnMethodsRule.java:40)
        at com.carrotsearch.randomizedtesting.rules.NoShadowingOrOverridesOnMethodsRule$1.evaluate(NoShadowingOrOverridesOnMethodsRule.java:40)
        at com.carrotsearch.randomizedtesting.rules.StatementAdapter.evaluate(StatementAdapter.java:36)
        at com.carrotsearch.randomizedtesting.rules.StatementAdapter.evaluate(StatementAdapter.java:36)
        at com.carrotsearch.randomizedtesting.rules.StatementAdapter.evaluate(StatementAdapter.java:36)
        at org.apache.lucene.util.TestRuleAssertionsRequired$1.evaluate(TestRuleAssertionsRequired.java:53)
        at org.apache.lucene.util.TestRuleMarkFailure$1.evaluate(TestRuleMarkFailure.java:47)
        at org.apache.lucene.util.TestRuleIgnoreAfterMaxFailures$1.evaluate(TestRuleIgnoreAfterMaxFailures.java:64)
        at org.apache.lucene.util.TestRuleIgnoreTestSuites$1.evaluate(TestRuleIgnoreTestSuites.java:54)
        at com.carrotsearch.randomizedtesting.rules.StatementAdapter.evaluate(StatementAdapter.java:36)
        at com.carrotsearch.randomizedtesting.ThreadLeakControl$StatementRunner.run(ThreadLeakControl.java:368)
        at java.lang.Thread.run(Thread.java:748)


FAILED:  org.apache.solr.cloud.LeaderTragicEventTest.testOtherReplicasAreNotActive

Error Message:
Jetty Connector is not open: -2

Stack Trace:
java.lang.IllegalStateException: Jetty Connector is not open: -2
        at __randomizedtesting.SeedInfo.seed([ECD1DCA15E778E3B:6965F0D6628837A3]:0)
        at org.apache.solr.client.solrj.embedded.JettySolrRunner.getBaseUrl(JettySolrRunner.java:499)
        at org.apache.solr.cloud.MiniSolrCloudCluster.getReplicaJetty(MiniSolrCloudCluster.java:539)
        at org.apache.solr.cloud.LeaderTragicEventTest.corruptLeader(LeaderTragicEventTest.java:100)
        at org.apache.solr.cloud.LeaderTragicEventTest.testOtherReplicasAreNotActive(LeaderTragicEventTest.java:150)
        at sun.reflect.NativeMethodAccessorImpl.invoke0(Native Method)
        at sun.reflect.NativeMethodAccessorImpl.invoke(NativeMethodAccessorImpl.java:62)
        at sun.reflect.DelegatingMethodAccessorImpl.invoke(DelegatingMethodAccessorImpl.java:43)
        at java.lang.reflect.Method.invoke(Method.java:498)
        at com.carrotsearch.randomizedtesting.RandomizedRunner.invoke(RandomizedRunner.java:1737)
        at com.carrotsearch.randomizedtesting.RandomizedRunner$8.evaluate(RandomizedRunner.java:934)
        at com.carrotsearch.randomizedtesting.RandomizedRunner$9.evaluate(RandomizedRunner.java:970)
        at com.carrotsearch.randomizedtesting.RandomizedRunner$10.evaluate(RandomizedRunner.java:984)
        at com.carrotsearch.randomizedtesting.rules.SystemPropertiesRestoreRule$1.evaluate(SystemPropertiesRestoreRule.java:57)
        at org.apache.lucene.util.TestRuleSetupTeardownChained$1.evaluate(TestRuleSetupTeardownChained.java:49)
        at org.apache.lucene.util.AbstractBeforeAfterRule$1.evaluate(AbstractBeforeAfterRule.java:45)
        at org.apache.lucene.util.TestRuleThreadAndTestName$1.evaluate(TestRuleThreadAndTestName.java:48)
        at org.apache.lucene.util.TestRuleIgnoreAfterMaxFailures$1.evaluate(TestRuleIgnoreAfterMaxFailures.java:64)
        at org.apache.lucene.util.TestRuleMarkFailure$1.evaluate(TestRuleMarkFailure.java:47)
        at com.carrotsearch.randomizedtesting.rules.StatementAdapter.evaluate(StatementAdapter.java:36)
        at com.carrotsearch.randomizedtesting.ThreadLeakControl$StatementRunner.run(ThreadLeakControl.java:368)
        at com.carrotsearch.randomizedtesting.ThreadLeakControl.forkTimeoutingTask(ThreadLeakControl.java:817)
        at com.carrotsearch.randomizedtesting.ThreadLeakControl$3.evaluate(ThreadLeakControl.java:468)
        at com.carrotsearch.randomizedtesting.RandomizedRunner.runSingleTest(RandomizedRunner.java:943)
        at com.carrotsearch.randomizedtesting.RandomizedRunner$5.evaluate(RandomizedRunner.java:829)
        at com.carrotsearch.randomizedtesting.RandomizedRunner$6.evaluate(RandomizedRunner.java:879)
        at com.carrotsearch.randomizedtesting.RandomizedRunner$7.evaluate(RandomizedRunner.java:890)
        at com.carrotsearch.randomizedtesting.rules.StatementAdapter.evaluate(StatementAdapter.java:36)
        at com.carrotsearch.randomizedtesting.rules.SystemPropertiesRestoreRule$1.evaluate(SystemPropertiesRestoreRule.java:57)
        at org.apache.lucene.util.AbstractBeforeAfterRule$1.evaluate(AbstractBeforeAfterRule.java:45)
        at com.carrotsearch.randomizedtesting.rules.StatementAdapter.evaluate(StatementAdapter.java:36)
        at org.apache.lucene.util.TestRuleStoreClassName$1.evaluate(TestRuleStoreClassName.java:41)
        at com.carrotsearch.randomizedtesting.rules.NoShadowingOrOverridesOnMethodsRule$1.evaluate(NoShadowingOrOverridesOnMethodsRule.java:40)
        at com.carrotsearch.randomizedtesting.rules.NoShadowingOrOverridesOnMethodsRule$1.evaluate(NoShadowingOrOverridesOnMethodsRule.java:40)
        at com.carrotsearch.randomizedtesting.rules.StatementAdapter.evaluate(StatementAdapter.java:36)
        at com.carrotsearch.randomizedtesting.rules.StatementAdapter.evaluate(StatementAdapter.java:36)
        at com.carrotsearch.randomizedtesting.rules.StatementAdapter.evaluate(StatementAdapter.java:36)
        at org.apache.lucene.util.TestRuleAssertionsRequired$1.evaluate(TestRuleAssertionsRequired.java:53)
        at org.apache.lucene.util.TestRuleMarkFailure$1.evaluate(TestRuleMarkFailure.java:47)
        at org.apache.lucene.util.TestRuleIgnoreAfterMaxFailures$1.evaluate(TestRuleIgnoreAfterMaxFailures.java:64)
        at org.apache.lucene.util.TestRuleIgnoreTestSuites$1.evaluate(TestRuleIgnoreTestSuites.java:54)
        at com.carrotsearch.randomizedtesting.rules.StatementAdapter.evaluate(StatementAdapter.java:36)
        at com.carrotsearch.randomizedtesting.ThreadLeakControl$StatementRunner.run(ThreadLeakControl.java:368)
        at java.lang.Thread.run(Thread.java:748)


FAILED:  org.apache.solr.cloud.LeaderTragicEventTest.test

Error Message:
Error from server at http://127.0.0.1:36107/solr: collection already exists: collection1

Stack Trace:
org.apache.solr.client.solrj.impl.HttpSolrClient$RemoteSolrException: Error from server at http://127.0.0.1:36107/solr: collection already exists: collection1
        at __randomizedtesting.SeedInfo.seed([ECD1DCA15E778E3B:6485E37BF08BE3C3]:0)
        at org.apache.solr.client.solrj.impl.HttpSolrClient.executeMethod(HttpSolrClient.java:643)
        at org.apache.solr.client.solrj.impl.HttpSolrClient.request(HttpSolrClient.java:255)
        at org.apache.solr.client.solrj.impl.HttpSolrClient.request(HttpSolrClient.java:244)
        at org.apache.solr.client.solrj.impl.LBHttpSolrClient.doRequest(LBHttpSolrClient.java:483)
        at org.apache.solr.client.solrj.impl.LBHttpSolrClient.request(LBHttpSolrClient.java:413)
        at org.apache.solr.client.solrj.impl.CloudSolrClient.sendRequest(CloudSolrClient.java:1106)
        at org.apache.solr.client.solrj.impl.CloudSolrClient.requestWithRetryOnStaleState(CloudSolrClient.java:886)
        at org.apache.solr.client.solrj.impl.CloudSolrClient.request(CloudSolrClient.java:819)
        at org.apache.solr.client.solrj.SolrRequest.process(SolrRequest.java:194)
        at org.apache.solr.client.solrj.SolrRequest.process(SolrRequest.java:211)
        at org.apache.solr.cloud.LeaderTragicEventTest.test(LeaderTragicEventTest.java:70)
        at sun.reflect.NativeMethodAccessorImpl.invoke0(Native Method)
        at sun.reflect.NativeMethodAccessorImpl.invoke(NativeMethodAccessorImpl.java:62)
        at sun.reflect.DelegatingMethodAccessorImpl.invoke(DelegatingMethodAccessorImpl.java:43)
        at java.lang.reflect.Method.invoke(Method.java:498)
        at com.carrotsearch.randomizedtesting.RandomizedRunner.invoke(RandomizedRunner.java:1737)
        at com.carrotsearch.randomizedtesting.RandomizedRunner$8.evaluate(RandomizedRunner.java:934)
        at com.carrotsearch.randomizedtesting.RandomizedRunner$9.evaluate(RandomizedRunner.java:970)
        at com.carrotsearch.randomizedtesting.RandomizedRunner$10.evaluate(RandomizedRunner.java:984)
        at com.carrotsearch.randomizedtesting.rules.SystemPropertiesRestoreRule$1.evaluate(SystemPropertiesRestoreRule.java:57)
        at org.apache.lucene.util.TestRuleSetupTeardownChained$1.evaluate(TestRuleSetupTeardownChained.java:49)
        at org.apache.lucene.util.AbstractBeforeAfterRule$1.evaluate(AbstractBeforeAfterRule.java:45)
        at org.apache.lucene.util.TestRuleThreadAndTestName$1.evaluate(TestRuleThreadAndTestName.java:48)
        at org.apache.lucene.util.TestRuleIgnoreAfterMaxFailures$1.evaluate(TestRuleIgnoreAfterMaxFailures.java:64)
        at org.apache.lucene.util.TestRuleMarkFailure$1.evaluate(TestRuleMarkFailure.java:47)
        at com.carrotsearch.randomizedtesting.rules.StatementAdapter.evaluate(StatementAdapter.java:36)
        at com.carrotsearch.randomizedtesting.ThreadLeakControl$StatementRunner.run(ThreadLeakControl.java:368)
        at com.carrotsearch.randomizedtesting.ThreadLeakControl.forkTimeoutingTask(ThreadLeakControl.java:817)
        at com.carrotsearch.randomizedtesting.ThreadLeakControl$3.evaluate(ThreadLeakControl.java:468)
        at com.carrotsearch.randomizedtesting.RandomizedRunner.runSingleTest(RandomizedRunner.java:943)
        at com.carrotsearch.randomizedtesting.RandomizedRunner$5.evaluate(RandomizedRunner.java:829)
        at com.carrotsearch.randomizedtesting.RandomizedRunner$6.evaluate(RandomizedRunner.java:879)
        at com.carrotsearch.randomizedtesting.RandomizedRunner$7.evaluate(RandomizedRunner.java:890)
        at com.carrotsearch.randomizedtesting.rules.StatementAdapter.evaluate(StatementAdapter.java:36)
        at com.carrotsearch.randomizedtesting.rules.SystemPropertiesRestoreRule$1.evaluate(SystemPropertiesRestoreRule.java:57)
        at org.apache.lucene.util.AbstractBeforeAfterRule$1.evaluate(AbstractBeforeAfterRule.java:45)
        at com.carrotsearch.randomizedtesting.rules.StatementAdapter.evaluate(StatementAdapter.java:36)
        at org.apache.lucene.util.TestRuleStoreClassName$1.evaluate(TestRuleStoreClassName.java:41)
        at com.carrotsearch.randomizedtesting.rules.NoShadowingOrOverridesOnMethodsRule$1.evaluate(NoShadowingOrOverridesOnMethodsRule.java:40)
        at com.carrotsearch.randomizedtesting.rules.NoShadowingOrOverridesOnMethodsRule$1.evaluate(NoShadowingOrOverridesOnMethodsRule.java:40)
        at com.carrotsearch.randomizedtesting.rules.StatementAdapter.evaluate(StatementAdapter.java:36)
        at com.carrotsearch.randomizedtesting.rules.StatementAdapter.evaluate(StatementAdapter.java:36)
        at com.carrotsearch.randomizedtesting.rules.StatementAdapter.evaluate(StatementAdapter.java:36)
        at org.apache.lucene.util.TestRuleAssertionsRequired$1.evaluate(TestRuleAssertionsRequired.java:53)
        at org.apache.lucene.util.TestRuleMarkFailure$1.evaluate(TestRuleMarkFailure.java:47)
        at org.apache.lucene.util.TestRuleIgnoreAfterMaxFailures$1.evaluate(TestRuleIgnoreAfterMaxFailures.java:64)
        at org.apache.lucene.util.TestRuleIgnoreTestSuites$1.evaluate(TestRuleIgnoreTestSuites.java:54)
        at com.carrotsearch.randomizedtesting.rules.StatementAdapter.evaluate(StatementAdapter.java:36)
        at com.carrotsearch.randomizedtesting.ThreadLeakControl$StatementRunner.run(ThreadLeakControl.java:368)
        at java.lang.Thread.run(Thread.java:748)




Build Log:
[...truncated 13803 lines...]
   [junit4] Suite: org.apache.solr.cloud.LeaderTragicEventTest
   [junit4]   2> 1117354 INFO  (SUITE-LeaderTragicEventTest-seed#[ECD1DCA15E778E3B]-worker) [    ] o.a.s.SolrTestCaseJ4 SecureRandom sanity checks: test.solr.allowed.securerandom=null & java.security.egd=file:/dev/./urandom
   [junit4]   2> Creating dataDir: /home/jenkins/workspace/Lucene-Solr-master-Linux/solr/build/solr-core/test/J2/temp/solr.cloud.LeaderTragicEventTest_ECD1DCA15E778E3B-001/init-core-data-001
   [junit4]   2> 1117356 INFO  (SUITE-LeaderTragicEventTest-seed#[ECD1DCA15E778E3B]-worker) [    ] o.a.s.SolrTestCaseJ4 Using PointFields (NUMERIC_POINTS_SYSPROP=true) w/NUMERIC_DOCVALUES_SYSPROP=true
   [junit4]   2> 1117357 INFO  (SUITE-LeaderTragicEventTest-seed#[ECD1DCA15E778E3B]-worker) [    ] o.a.s.SolrTestCaseJ4 Randomized ssl (false) and clientAuth (true) via: @org.apache.solr.util.RandomizeSSL(reason=, ssl=NaN, value=NaN, clientAuth=NaN)
   [junit4]   2> 1117358 INFO  (SUITE-LeaderTragicEventTest-seed#[ECD1DCA15E778E3B]-worker) [    ] o.a.s.c.MiniSolrCloudCluster Starting cluster of 2 servers in /home/jenkins/workspace/Lucene-Solr-master-Linux/solr/build/solr-core/test/J2/temp/solr.cloud.LeaderTragicEventTest_ECD1DCA15E778E3B-001/tempDir-001
   [junit4]   2> 1117358 INFO  (SUITE-LeaderTragicEventTest-seed#[ECD1DCA15E778E3B]-worker) [    ] o.a.s.c.ZkTestServer STARTING ZK TEST SERVER
   [junit4]   2> 1117358 INFO  (Thread-3092) [    ] o.a.s.c.ZkTestServer client port:0.0.0.0/0.0.0.0:0
   [junit4]   2> 1117358 INFO  (Thread-3092) [    ] o.a.s.c.ZkTestServer Starting server
   [junit4]   2> 1117361 ERROR (Thread-3092) [    ] o.a.z.s.ZooKeeperServer ZKShutdownHandler is not registered, so ZooKeeper server won't take any action on ERROR or SHUTDOWN server state changes
   [junit4]   2> 1117458 INFO  (SUITE-LeaderTragicEventTest-seed#[ECD1DCA15E778E3B]-worker) [    ] o.a.s.c.ZkTestServer start zk server on port:37811
   [junit4]   2> 1117460 INFO  (zkConnectionManagerCallback-3109-thread-1) [    ] o.a.s.c.c.ConnectionManager zkClient has connected
   [junit4]   2> 1117462 INFO  (jetty-launcher-3106-thread-2) [    ] o.e.j.s.Server jetty-9.4.11.v20180605; built: 2018-06-05T18:24:03.829Z; git: d5fc0523cfa96bfebfbda19606cad384d772f04c; jvm 1.8.0_172-b11
   [junit4]   2> 1117462 INFO  (jetty-launcher-3106-thread-1) [    ] o.e.j.s.Server jetty-9.4.11.v20180605; built: 2018-06-05T18:24:03.829Z; git: d5fc0523cfa96bfebfbda19606cad384d772f04c; jvm 1.8.0_172-b11
   [junit4]   2> 1117463 INFO  (jetty-launcher-3106-thread-1) [    ] o.e.j.s.session DefaultSessionIdManager workerName=node0
   [junit4]   2> 1117463 INFO  (jetty-launcher-3106-thread-2) [    ] o.e.j.s.session DefaultSessionIdManager workerName=node0
   [junit4]   2> 1117463 INFO  (jetty-launcher-3106-thread-1) [    ] o.e.j.s.session No SessionScavenger set, using defaults
   [junit4]   2> 1117463 INFO  (jetty-launcher-3106-thread-2) [    ] o.e.j.s.session No SessionScavenger set, using defaults
   [junit4]   2> 1117463 INFO  (jetty-launcher-3106-thread-1) [    ] o.e.j.s.session node0 Scavenging every 660000ms
   [junit4]   2> 1117463 INFO  (jetty-launcher-3106-thread-2) [    ] o.e.j.s.session node0 Scavenging every 660000ms
   [junit4]   2> 1117463 INFO  (jetty-launcher-3106-thread-1) [    ] o.e.j.s.h.ContextHandler Started o.e.j.s.ServletContextHandler@97dc164{/solr,null,AVAILABLE}
   [junit4]   2> 1117463 INFO  (jetty-launcher-3106-thread-2) [    ] o.e.j.s.h.ContextHandler Started o.e.j.s.ServletContextHandler@36a3c00c{/solr,null,AVAILABLE}
   [junit4]   2> 1117466 INFO  (jetty-launcher-3106-thread-1) [    ] o.e.j.s.AbstractConnector Started ServerConnector@18024afe{HTTP/1.1,[http/1.1]}{127.0.0.1:36107}
   [junit4]   2> 1117466 INFO  (jetty-launcher-3106-thread-2) [    ] o.e.j.s.AbstractConnector Started ServerConnector@6232c76e{HTTP/1.1,[http/1.1]}{127.0.0.1:32867}
   [junit4]   2> 1117466 INFO  (jetty-launcher-3106-thread-2) [    ] o.e.j.s.Server Started @1117495ms
   [junit4]   2> 1117466 INFO  (jetty-launcher-3106-thread-1) [    ] o.e.j.s.Server Started @1117495ms
   [junit4]   2> 1117466 INFO  (jetty-launcher-3106-thread-2) [    ] o.a.s.c.s.e.JettySolrRunner Jetty properties: {hostContext=/solr, hostPort=32867}
   [junit4]   2> 1117466 INFO  (jetty-launcher-3106-thread-1) [    ] o.a.s.c.s.e.JettySolrRunner Jetty properties: {hostContext=/solr, hostPort=36107}
   [junit4]   2> 1117466 ERROR (jetty-launcher-3106-thread-1) [    ] o.a.s.u.StartupLoggingUtils Missing Java Option solr.log.dir. Logging may be missing or incomplete.
   [junit4]   2> 1117466 ERROR (jetty-launcher-3106-thread-2) [    ] o.a.s.u.StartupLoggingUtils Missing Java Option solr.log.dir. Logging may be missing or incomplete.
   [junit4]   2> 1117466 INFO  (jetty-launcher-3106-thread-1) [    ] o.a.s.s.SolrDispatchFilter Using logger factory org.apache.logging.slf4j.Log4jLoggerFactory
   [junit4]   2> 1117466 INFO  (jetty-launcher-3106-thread-2) [    ] o.a.s.s.SolrDispatchFilter Using logger factory org.apache.logging.slf4j.Log4jLoggerFactory
   [junit4]   2> 1117466 INFO  (jetty-launcher-3106-thread-2) [    ] o.a.s.s.SolrDispatchFilter  ___      _       Welcome to Apache Solr? version 8.0.0
   [junit4]   2> 1117466 INFO  (jetty-launcher-3106-thread-1) [    ] o.a.s.s.SolrDispatchFilter  ___      _       Welcome to Apache Solr? version 8.0.0
   [junit4]   2> 1117466 INFO  (jetty-launcher-3106-thread-2) [    ] o.a.s.s.SolrDispatchFilter / __| ___| |_ _   Starting in cloud mode on port null
   [junit4]   2> 1117466 INFO  (jetty-launcher-3106-thread-1) [    ] o.a.s.s.SolrDispatchFilter / __| ___| |_ _   Starting in cloud mode on port null
   [junit4]   2> 1117466 INFO  (jetty-launcher-3106-thread-2) [    ] o.a.s.s.SolrDispatchFilter \__ \/ _ \ | '_|  Install dir: null
   [junit4]   2> 1117466 INFO  (jetty-launcher-3106-thread-1) [    ] o.a.s.s.SolrDispatchFilter \__ \/ _ \ | '_|  Install dir: null
   [junit4]   2> 1117466 INFO  (jetty-launcher-3106-thread-2) [    ] o.a.s.s.SolrDispatchFilter |___/\___/_|_|    Start time: 2018-07-11T17:14:41.545Z
   [junit4]   2> 1117466 INFO  (jetty-launcher-3106-thread-1) [    ] o.a.s.s.SolrDispatchFilter |___/\___/_|_|    Start time: 2018-07-11T17:14:41.545Z
   [junit4]   2> 1117468 INFO  (zkConnectionManagerCallback-3113-thread-1) [    ] o.a.s.c.c.ConnectionManager zkClient has connected
   [junit4]   2> 1117468 INFO  (zkConnectionManagerCallback-3112-thread-1) [    ] o.a.s.c.c.ConnectionManager zkClient has connected
   [junit4]   2> 1117468 INFO  (jetty-launcher-3106-thread-1) [    ] o.a.s.s.SolrDispatchFilter solr.xml found in ZooKeeper. Loading...
   [junit4]   2> 1117468 INFO  (jetty-launcher-3106-thread-2) [    ] o.a.s.s.SolrDispatchFilter solr.xml found in ZooKeeper. Loading...
   [junit4]   2> 1117519 INFO  (jetty-launcher-3106-thread-1) [    ] o.a.s.c.ZkContainer Zookeeper client=127.0.0.1:37811/solr
   [junit4]   2> 1117520 INFO  (zkConnectionManagerCallback-3117-thread-1) [    ] o.a.s.c.c.ConnectionManager zkClient has connected
   [junit4]   2> 1117521 INFO  (zkConnectionManagerCallback-3119-thread-1) [    ] o.a.s.c.c.ConnectionManager zkClient has connected
   [junit4]   2> 1117543 INFO  (jetty-launcher-3106-thread-2) [    ] o.a.s.c.ZkContainer Zookeeper client=127.0.0.1:37811/solr
   [junit4]   2> 1117543 INFO  (zkConnectionManagerCallback-3125-thread-1) [    ] o.a.s.c.c.ConnectionManager zkClient has connected
   [junit4]   2> 1117544 INFO  (zkConnectionManagerCallback-3127-thread-1) [    ] o.a.s.c.c.ConnectionManager zkClient has connected
   [junit4]   2> 1117548 INFO  (jetty-launcher-3106-thread-2) [n:127.0.0.1:32867_solr    ] o.a.s.c.Overseer Overseer (id=null) closing
   [junit4]   2> 1117548 INFO  (jetty-launcher-3106-thread-2) [n:127.0.0.1:32867_solr    ] o.a.s.c.OverseerElectionContext I am going to be the leader 127.0.0.1:32867_solr
   [junit4]   2> 1117549 INFO  (jetty-launcher-3106-thread-2) [n:127.0.0.1:32867_solr    ] o.a.s.c.Overseer Overseer (id=72109921799700486-127.0.0.1:32867_solr-n_0000000000) starting
   [junit4]   2> 1117551 INFO  (jetty-launcher-3106-thread-1) [n:127.0.0.1:36107_solr    ] o.a.s.c.Overseer Overseer (id=null) closing
   [junit4]   2> 1117552 INFO  (zkConnectionManagerCallback-3134-thread-1) [    ] o.a.s.c.c.ConnectionManager zkClient has connected
   [junit4]   2> 1117552 INFO  (jetty-launcher-3106-thread-1) [n:127.0.0.1:36107_solr    ] o.a.s.c.ZkController Register node as live in ZooKeeper:/live_nodes/127.0.0.1:36107_solr
   [junit4]   2> 1117553 INFO  (jetty-launcher-3106-thread-2) [n:127.0.0.1:32867_solr    ] o.a.s.c.c.ZkStateReader Updated live nodes from ZooKeeper... (0) -> (1)
   [junit4]   2> 1117553 INFO  (jetty-launcher-3106-thread-2) [n:127.0.0.1:32867_solr    ] o.a.s.c.s.i.ZkClientClusterStateProvider Cluster at 127.0.0.1:37811/solr ready
   [junit4]   2> 1117556 INFO  (zkCallback-3118-thread-1) [    ] o.a.s.c.c.ZkStateReader Updated live nodes from ZooKeeper... (0) -> (1)
   [junit4]   2> 1117556 INFO  (zkCallback-3126-thread-1) [    ] o.a.s.c.c.ZkStateReader Updated live nodes from ZooKeeper... (0) -> (1)
   [junit4]   2> 1117557 INFO  (jetty-launcher-3106-thread-2) [n:127.0.0.1:32867_solr    ] o.a.s.c.TransientSolrCoreCacheDefault Allocating transient cache for 2147483647 transient cores
   [junit4]   2> 1117557 INFO  (jetty-launcher-3106-thread-2) [n:127.0.0.1:32867_solr    ] o.a.s.c.ZkController Register node as live in ZooKeeper:/live_nodes/127.0.0.1:32867_solr
   [junit4]   2> 1117557 INFO  (zkCallback-3126-thread-1) [    ] o.a.s.c.c.ZkStateReader Updated live nodes from ZooKeeper... (1) -> (2)
   [junit4]   2> 1117557 INFO  (zkCallback-3133-thread-1) [    ] o.a.s.c.c.ZkStateReader Updated live nodes from ZooKeeper... (1) -> (2)
   [junit4]   2> 1117558 INFO  (zkCallback-3118-thread-1) [    ] o.a.s.c.c.ZkStateReader Updated live nodes from ZooKeeper... (1) -> (2)
   [junit4]   2> 1117564 INFO  (jetty-launcher-3106-thread-2) [n:127.0.0.1:32867_solr    ] o.a.s.h.a.MetricsHistoryHandler No .system collection, keeping metrics history in memory.
   [junit4]   2> 1117566 INFO  (zkConnectionManagerCallback-3140-thread-1) [    ] o.a.s.c.c.ConnectionManager zkClient has connected
   [junit4]   2> 1117567 INFO  (jetty-launcher-3106-thread-1) [n:127.0.0.1:36107_solr    ] o.a.s.c.c.ZkStateReader Updated live nodes from ZooKeeper... (0) -> (2)
   [junit4]   2> 1117567 INFO  (jetty-launcher-3106-thread-1) [n:127.0.0.1:36107_solr    ] o.a.s.c.s.i.ZkClientClusterStateProvider Cluster at 127.0.0.1:37811/solr ready
   [junit4]   2> 1117567 INFO  (jetty-launcher-3106-thread-1) [n:127.0.0.1:36107_solr    ] o.a.s.h.a.MetricsHistoryHandler No .system collection, keeping metrics history in memory.
   [junit4]   2> 1117582 INFO  (jetty-launcher-3106-thread-2) [n:127.0.0.1:32867_solr    ] o.a.s.m.r.SolrJmxReporter JMX monitoring for 'solr_32867.solr.node' (registry 'solr.node') enabled at server: com.sun.jmx.mbeanserver.JmxMBeanServer@70b654fc
   [junit4]   2> 1117585 INFO  (jetty-launcher-3106-thread-1) [n:127.0.0.1:36107_solr    ] o.a.s.m.r.SolrJmxReporter JMX monitoring for 'solr_36107.solr.node' (registry 'solr.node') enabled at server: com.sun.jmx.mbeanserver.JmxMBeanServer@70b654fc
   [junit4]   2> 1117587 INFO  (jetty-launcher-3106-thread-2) [n:127.0.0.1:32867_solr    ] o.a.s.m.r.SolrJmxReporter JMX monitoring for 'solr_32867.solr.jvm' (registry 'solr.jvm') enabled at server: com.sun.jmx.mbeanserver.JmxMBeanServer@70b654fc
   [junit4]   2> 1117587 INFO  (jetty-launcher-3106-thread-2) [n:127.0.0.1:32867_solr    ] o.a.s.m.r.SolrJmxReporter JMX monitoring for 'solr_32867.solr.jetty' (registry 'solr.jetty') enabled at server: com.sun.jmx.mbeanserver.JmxMBeanServer@70b654fc
   [junit4]   2> 1117587 INFO  (jetty-launcher-3106-thread-2) [n:127.0.0.1:32867_solr    ] o.a.s.c.CorePropertiesLocator Found 0 core definitions underneath /home/jenkins/workspace/Lucene-Solr-master-Linux/solr/build/solr-core/test/J2/temp/solr.cloud.LeaderTragicEventTest_ECD1DCA15E778E3B-001/tempDir-001/node2/.
   [junit4]   2> 1117592 INFO  (jetty-launcher-3106-thread-1) [n:127.0.0.1:36107_solr    ] o.a.s.m.r.SolrJmxReporter JMX monitoring for 'solr_36107.solr.jvm' (registry 'solr.jvm') enabled at server: com.sun.jmx.mbeanserver.JmxMBeanServer@70b654fc
   [junit4]   2> 1117592 INFO  (jetty-launcher-3106-thread-1) [n:127.0.0.1:36107_solr    ] o.a.s.m.r.SolrJmxReporter JMX monitoring for 'solr_36107.solr.jetty' (registry 'solr.jetty') enabled at server: com.sun.jmx.mbeanserver.JmxMBeanServer@70b654fc
   [junit4]   2> 1117593 INFO  (jetty-launcher-3106-thread-1) [n:127.0.0.1:36107_solr    ] o.a.s.c.CorePropertiesLocator Found 0 core definitions underneath /home/jenkins/workspace/Lucene-Solr-master-Linux/solr/build/solr-core/test/J2/temp/solr.cloud.LeaderTragicEventTest_ECD1DCA15E778E3B-001/tempDir-001/node1/.
   [junit4]   2> 1117622 INFO  (zkConnectionManagerCallback-3143-thread-1) [    ] o.a.s.c.c.ConnectionManager zkClient has connected
   [junit4]   2> 1117624 INFO  (zkConnectionManagerCallback-3148-thread-1) [    ] o.a.s.c.c.ConnectionManager zkClient has connected
   [junit4]   2> 1117625 INFO  (SUITE-LeaderTragicEventTest-seed#[ECD1DCA15E778E3B]-worker) [    ] o.a.s.c.c.ZkStateReader Updated live nodes from ZooKeeper... (0) -> (2)
   [junit4]   2> 1117625 INFO  (SUITE-LeaderTragicEventTest-seed#[ECD1DCA15E778E3B]-worker) [    ] o.a.s.c.s.i.ZkClientClusterStateProvider Cluster at 127.0.0.1:37811/solr ready
   [junit4]   2> 1117641 INFO  (TEST-LeaderTragicEventTest.testOtherReplicasAreNotActive-seed#[ECD1DCA15E778E3B]) [    ] o.a.s.SolrTestCaseJ4 ###Starting testOtherReplicasAreNotActive
   [junit4]   2> 1117643 INFO  (qtp1292390581-12446) [n:127.0.0.1:32867_solr    ] o.a.s.h.a.CollectionsHandler Invoked Collection Action :create with params collection.configName=config&name=collection1&nrtReplicas=2&action=CREATE&numShards=1&wt=javabin&version=2 and sendToOCPQueue=true
   [junit4]   2> 1117645 INFO  (OverseerThreadFactory-4921-thread-1) [    ] o.a.s.c.a.c.CreateCollectionCmd Create collection collection1
   [junit4]   2> 1117749 INFO  (OverseerStateUpdate-72109921799700486-127.0.0.1:32867_solr-n_0000000000) [    ] o.a.s.c.o.SliceMutator createReplica() {
   [junit4]   2>   "operation":"ADDREPLICA",
   [junit4]   2>   "collection":"collection1",
   [junit4]   2>   "shard":"shard1",
   [junit4]   2>   "core":"collection1_shard1_replica_n1",
   [junit4]   2>   "state":"down",
   [junit4]   2>   "base_url":"http://127.0.0.1:32867/solr",
   [junit4]   2>   "type":"NRT",
   [junit4]   2>   "waitForFinalState":"false"}
   [junit4]   2> 1117750 INFO  (OverseerStateUpdate-72109921799700486-127.0.0.1:32867_solr-n_0000000000) [    ] o.a.s.c.o.SliceMutator createReplica() {
   [junit4]   2>   "operation":"ADDREPLICA",
   [junit4]   2>   "collection":"collection1",
   [junit4]   2>   "shard":"shard1",
   [junit4]   2>   "core":"collection1_shard1_replica_n2",
   [junit4]   2>   "state":"down",
   [junit4]   2>   "base_url":"http://127.0.0.1:36107/solr",
   [junit4]   2>   "type":"NRT",
   [junit4]   2>   "waitForFinalState":"false"}
   [junit4]   2> 1117952 INFO  (qtp1028242752-12447) [n:127.0.0.1:36107_solr    x:collection1_shard1_replica_n2] o.a.s.h.a.CoreAdminOperation core create command qt=/admin/cores&coreNodeName=core_node4&collection.configName=config&newCollection=true&name=collection1_shard1_replica_n2&action=CREATE&numShards=1&collection=collection1&shard=shard1&wt=javabin&version=2&replicaType=NRT
   [junit4]   2> 1117952 INFO  (qtp1292390581-12436) [n:127.0.0.1:32867_solr    x:collection1_shard1_replica_n1] o.a.s.h.a.CoreAdminOperation core create command qt=/admin/cores&coreNodeName=core_node3&collection.configName=config&newCollection=true&name=collection1_shard1_replica_n1&action=CREATE&numShards=1&collection=collection1&shard=shard1&wt=javabin&version=2&replicaType=NRT
   [junit4]   2> 1117952 INFO  (qtp1028242752-12447) [n:127.0.0.1:36107_solr    x:collection1_shard1_replica_n2] o.a.s.c.TransientSolrCoreCacheDefault Allocating transient cache for 2147483647 transient cores
   [junit4]   2> 1118960 INFO  (qtp1292390581-12436) [n:127.0.0.1:32867_solr c:collection1 s:shard1 r:core_node3 x:collection1_shard1_replica_n1] o.a.s.c.SolrConfig Using Lucene MatchVersion: 8.0.0
   [junit4]   2> 1118960 INFO  (qtp1028242752-12447) [n:127.0.0.1:36107_solr c:collection1 s:shard1 r:core_node4 x:collection1_shard1_replica_n2] o.a.s.c.SolrConfig Using Lucene MatchVersion: 8.0.0
   [junit4]   2> 1118965 INFO  (qtp1028242752-12447) [n:127.0.0.1:36107_solr c:collection1 s:shard1 r:core_node4 x:collection1_shard1_replica_n2] o.a.s.s.IndexSchema [collection1_shard1_replica_n2] Schema name=minimal
   [junit4]   2> 1118965 INFO  (qtp1292390581-12436) [n:127.0.0.1:32867_solr c:collection1 s:shard1 r:core_node3 x:collection1_shard1_replica_n1] o.a.s.s.IndexSchema [collection1_shard1_replica_n1] Schema name=minimal
   [junit4]   2> 1118967 INFO  (qtp1028242752-12447) [n:127.0.0.1:36107_solr c:collection1 s:shard1 r:core_node4 x:collection1_shard1_replica_n2] o.a.s.s.IndexSchema Loaded schema minimal/1.1 with uniqueid field id
   [junit4]   2> 1118967 INFO  (qtp1292390581-12436) [n:127.0.0.1:32867_solr c:collection1 s:shard1 r:core_node3 x:collection1_shard1_replica_n1] o.a.s.s.IndexSchema Loaded schema minimal/1.1 with uniqueid field id
   [junit4]   2> 1118967 INFO  (qtp1028242752-12447) [n:127.0.0.1:36107_solr c:collection1 s:shard1 r:core_node4 x:collection1_shard1_replica_n2] o.a.s.c.CoreContainer Creating SolrCore 'collection1_shard1_replica_n2' using configuration from collection collection1, trusted=true
   [junit4]   2> 1118967 INFO  (qtp1292390581-12436) [n:127.0.0.1:32867_solr c:collection1 s:shard1 r:core_node3 x:collection1_shard1_replica_n1] o.a.s.c.CoreContainer Creating SolrCore 'collection1_shard1_replica_n1' using configuration from collection collection1, trusted=true
   [junit4]   2> 1118967 INFO  (qtp1292390581-12436) [n:127.0.0.1:32867_solr c:collection1 s:shard1 r:core_node3 x:collection1_shard1_replica_n1] o.a.s.m.r.SolrJmxReporter JMX monitoring for 'solr_32867.solr.core.collection1.shard1.replica_n1' (registry 'solr.core.collection1.shard1.replica_n1') enabled at server: com.sun.jmx.mbeanserver.JmxMBeanServer@70b654fc
   [junit4]   2> 1118967 INFO  (qtp1028242752-12447) [n:127.0.0.1:36107_solr c:collection1 s:shard1 r:core_node4 x:collection1_shard1_replica_n2] o.a.s.m.r.SolrJmxReporter JMX monitoring for 'solr_36107.solr.core.collection1.shard1.replica_n2' (registry 'solr.core.collection1.shard1.replica_n2') enabled at server: com.sun.jmx.mbeanserver.JmxMBeanServer@70b654fc
   [junit4]   2> 1118967 INFO  (qtp1292390581-12436) [n:127.0.0.1:32867_solr c:collection1 s:shard1 r:core_node3 x:collection1_shard1_replica_n1] o.a.s.c.SolrCore solr.RecoveryStrategy.Builder
   [junit4]   2> 1118967 INFO  (qtp1028242752-12447) [n:127.0.0.1:36107_solr c:collection1 s:shard1 r:core_node4 x:collection1_shard1_replica_n2] o.a.s.c.SolrCore solr.RecoveryStrategy.Builder
   [junit4]   2> 1118967 INFO  (qtp1292390581-12436) [n:127.0.0.1:32867_solr c:collection1 s:shard1 r:core_node3 x:collection1_shard1_replica_n1] o.a.s.c.SolrCore [[collection1_shard1_replica_n1] ] Opening new SolrCore at [/home/jenkins/workspace/Lucene-Solr-master-Linux/solr/build/solr-core/test/J2/temp/solr.cloud.LeaderTragicEventTest_ECD1DCA15E778E3B-001/tempDir-001/node2/collection1_shard1_replica_n1], dataDir=[/home/jenkins/workspace/Lucene-Solr-master-Linux/solr/build/solr-core/test/J2/temp/solr.cloud.LeaderTragicEventTest_ECD1DCA15E778E3B-001/tempDir-001/node2/./collection1_shard1_replica_n1/data/]
   [junit4]   2> 1118967 INFO  (qtp1028242752-12447) [n:127.0.0.1:36107_solr c:collection1 s:shard1 r:core_node4 x:collection1_shard1_replica_n2] o.a.s.c.SolrCore [[collection1_shard1_replica_n2] ] Opening new SolrCore at [/home/jenkins/workspace/Lucene-Solr-master-Linux/solr/build/solr-core/test/J2/temp/solr.cloud.LeaderTragicEventTest_ECD1DCA15E778E3B-001/tempDir-001/node1/collection1_shard1_replica_n2], dataDir=[/home/jenkins/workspace/Lucene-Solr-master-Linux/solr/build/solr-core/test/J2/temp/solr.cloud.LeaderTragicEventTest_ECD1DCA15E778E3B-001/tempDir-001/node1/./collection1_shard1_replica_n2/data/]
   [junit4]   2> 1119000 INFO  (qtp1028242752-12447) [n:127.0.0.1:36107_solr c:collection1 s:shard1 r:core_node4 x:collection1_shard1_replica_n2] o.a.s.u.UpdateHandler Using UpdateLog implementation: org.apache.solr.update.UpdateLog
   [junit4]   2> 1119000 INFO  (qtp1028242752-12447) [n:127.0.0.1:36107_solr c:collection1 s:shard1 r:core_node4 x:collection1_shard1_replica_n2] o.a.s.u.UpdateLog Initializing UpdateLog: dataDir=null defaultSyncLevel=FLUSH numRecordsToKeep=100 maxNumLogsToKeep=10 numVersionBuckets=65536
   [junit4]   2> 1119001 INFO  (qtp1028242752-12447) [n:127.0.0.1:36107_solr c:collection1 s:shard1 r:core_node4 x:collection1_shard1_replica_n2] o.a.s.u.CommitTracker Hard AutoCommit: disabled
   [junit4]   2> 1119001 INFO  (qtp1028242752-12447) [n:127.0.0.1:36107_solr c:collection1 s:shard1 r:core_node4 x:collection1_shard1_replica_n2] o.a.s.u.CommitTracker Soft AutoCommit: disabled
   [junit4]   2> 1119002 INFO  (qtp1028242752-12447) [n:127.0.0.1:36107_solr c:collection1 s:shard1 r:core_node4 x:collection1_shard1_replica_n2] o.a.s.s.SolrIndexSearcher Opening [Searcher@1bc108b8[collection1_shard1_replica_n2] main]
   [junit4]   2> 1119002 INFO  (qtp1028242752-12447) [n:127.0.0.1:36107_solr c:collection1 s:shard1 r:core_node4 x:collection1_shard1_replica_n2] o.a.s.r.ManagedResourceStorage Configured ZooKeeperStorageIO with znodeBase: /configs/config
   [junit4]   2> 1119002 INFO  (qtp1028242752-12447) [n:127.0.0.1:36107_solr c:collection1 s:shard1 r:core_node4 x:collection1_shard1_replica_n2] o.a.s.r.ManagedResourceStorage Loaded null at path _rest_managed.json using ZooKeeperStorageIO:path=/configs/config
   [junit4]   2> 1119003 INFO  (qtp1292390581-12436) [n:127.0.0.1:32867_solr c:collection1 s:shard1 r:core_node3 x:collection1_shard1_replica_n1] o.a.s.u.UpdateHandler Using UpdateLog implementation: org.apache.solr.update.UpdateLog
   [junit4]   2> 1119003 INFO  (qtp1292390581-12436) [n:127.0.0.1:32867_solr c:collection1 s:shard1 r:core_node3 x:collection1_shard1_replica_n1] o.a.s.u.UpdateLog Initializing UpdateLog: dataDir=null defaultSyncLevel=FLUSH numRecordsToKeep=100 maxNumLogsToKeep=10 numVersionBuckets=65536
   [junit4]   2> 1119003 INFO  (qtp1028242752-12447) [n:127.0.0.1:36107_solr c:collection1 s:shard1 r:core_node4 x:collection1_shard1_replica_n2] o.a.s.h.ReplicationHandler Commits will be reserved for 10000ms.
   [junit4]   2> 1119003 INFO  (searcherExecutor-4930-thread-1-processing-n:127.0.0.1:36107_solr x:collection1_shard1_replica_n2 c:collection1 s:shard1 r:core_node4) [n:127.0.0.1:36107_solr c:collection1 s:shard1 r:core_node4 x:collection1_shard1_replica_n2] o.a.s.c.SolrCore [collection1_shard1_replica_n2] Registered new searcher Searcher@1bc108b8[collection1_shard1_replica_n2] main{ExitableDirectoryReader(UninvertingDirectoryReader())}
   [junit4]   2> 1119003 INFO  (qtp1028242752-12447) [n:127.0.0.1:36107_solr c:collection1 s:shard1 r:core_node4 x:collection1_shard1_replica_n2] o.a.s.u.UpdateLog Could not find max version in index or recent updates, using new clock 1605715134336991232
   [junit4]   2> 1119004 INFO  (qtp1292390581-12436) [n:127.0.0.1:32867_solr c:collection1 s:shard1 r:core_node3 x:collection1_shard1_replica_n1] o.a.s.u.CommitTracker Hard AutoCommit: disabled
   [junit4]   2> 1119004 INFO  (qtp1292390581-12436) [n:127.0.0.1:32867_solr c:collection1 s:shard1 r:core_node3 x:collection1_shard1_replica_n1] o.a.s.u.CommitTracker Soft AutoCommit: disabled
   [junit4]   2> 1119005 INFO  (qtp1292390581-12436) [n:127.0.0.1:32867_solr c:collection1 s:shard1 r:core_node3 x:collection1_shard1_replica_n1] o.a.s.s.SolrIndexSearcher Opening [Searcher@3a95ab00[collection1_shard1_replica_n1] main]
   [junit4]   2> 1119006 INFO  (qtp1292390581-12436) [n:127.0.0.1:32867_solr c:collection1 s:shard1 r:core_node3 x:collection1_shard1_replica_n1] o.a.s.r.ManagedResourceStorage Configured ZooKeeperStorageIO with znodeBase: /configs/config
   [junit4]   2> 1119006 INFO  (qtp1292390581-12436) [n:127.0.0.1:32867_solr c:collection1 s:shard1 r:core_node3 x:collection1_shard1_replica_n1] o.a.s.r.ManagedResourceStorage Loaded null at path _rest_managed.json using ZooKeeperStorageIO:path=/configs/config
   [junit4]   2> 1119006 INFO  (qtp1292390581-12436) [n:127.0.0.1:32867_solr c:collection1 s:shard1 r:core_node3 x:collection1_shard1_replica_n1] o.a.s.h.ReplicationHandler Commits will be reserved for 10000ms.
   [junit4]   2> 1119007 INFO  (searcherExecutor-4931-thread-1-processing-n:127.0.0.1:32867_solr x:collection1_shard1_replica_n1 c:collection1 s:shard1 r:core_node3) [n:127.0.0.1:32867_solr c:collection1 s:shard1 r:core_node3 x:collection1_shard1_replica_n1] o.a.s.c.SolrCore [collection1_shard1_replica_n1] Registered new searcher Searcher@3a95ab00[collection1_shard1_replica_n1] main{ExitableDirectoryReader(UninvertingDirectoryReader())}
   [junit4]   2> 1119007 INFO  (qtp1292390581-12436) [n:127.0.0.1:32867_solr c:collection1 s:shard1 r:core_node3 x:collection1_shard1_replica_n1] o.a.s.u.UpdateLog Could not find max version in index or recent updates, using new clock 1605715134341185536
   [junit4]   2> 1119008 INFO  (qtp1028242752-12447) [n:127.0.0.1:36107_solr c:collection1 s:shard1 r:core_node4 x:collection1_shard1_replica_n2] o.a.s.c.ZkShardTerms Successful update of terms at /collections/collection1/terms/shard1 to Terms{values={core_node4=0}, version=0}
   [junit4]   2> 1119010 INFO  (qtp1292390581-12436) [n:127.0.0.1:32867_solr c:collection1 s:shard1 r:core_node3 x:collection1_shard1_replica_n1] o.a.s.c.ZkShardTerms Successful update of terms at /collections/collection1/terms/shard1 to Terms{values={core_node3=0, core_node4=0}, version=1}
   [junit4]   2> 1119010 INFO  (qtp1028242752-12447) [n:127.0.0.1:36107_solr c:collection1 s:shard1 r:core_node4 x:collection1_shard1_replica_n2] o.a.s.c.ShardLeaderElectionContext Waiting until we see more replicas up for shard shard1: total=2 found=1 timeoutin=9999ms
   [junit4]   2> 1119511 INFO  (qtp1028242752-12447) [n:127.0.0.1:36107_solr c:collection1 s:shard1 r:core_node4 x:collection1_shard1_replica_n2] o.a.s.c.ShardLeaderElectionContext Enough replicas found to continue.
   [junit4]   2> 1119511 INFO  (qtp1028242752-12447) [n:127.0.0.1:36107_solr c:collection1 s:shard1 r:core_node4 x:collection1_shard1_replica_n2] o.a.s.c.ShardLeaderElectionContext I may be the new leader - try and sync
   [junit4]   2> 1119511 INFO  (qtp1028242752-12447) [n:127.0.0.1:36107_solr c:collection1 s:shard1 r:core_node4 x:collection1_shard1_replica_n2] o.a.s.c.SyncStrategy Sync replicas to http://127.0.0.1:36107/solr/collection1_shard1_replica_n2/
   [junit4]   2> 1119511 INFO  (qtp1028242752-12447) [n:127.0.0.1:36107_solr c:collection1 s:shard1 r:core_node4 x:collection1_shard1_replica_n2] o.a.s.u.PeerSync PeerSync: core=collection1_shard1_replica_n2 url=http://127.0.0.1:36107/solr START replicas=[http://127.0.0.1:32867/solr/collection1_shard1_replica_n1/] nUpdates=100
   [junit4]   2> 1119511 INFO  (qtp1028242752-12447) [n:127.0.0.1:36107_solr c:collection1 s:shard1 r:core_node4 x:collection1_shard1_replica_n2] o.a.s.u.PeerSync PeerSync: core=collection1_shard1_replica_n2 url=http://127.0.0.1:36107/solr DONE.  We have no versions.  sync failed.
   [junit4]   2> 1119513 INFO  (qtp1292390581-12438) [n:127.0.0.1:32867_solr c:collection1 s:shard1 r:core_node3 x:collection1_shard1_replica_n1] o.a.s.c.S.Request [collection1_shard1_replica_n1]  webapp=/solr path=/get params={distrib=false&qt=/get&fingerprint=false&getVersions=100&wt=javabin&version=2} status=0 QTime=0
   [junit4]   2> 1119513 INFO  (qtp1028242752-12447) [n:127.0.0.1:36107_solr c:collection1 s:shard1 r:core_node4 x:collection1_shard1_replica_n2] o.a.s.c.SyncStrategy Leader's attempt to sync with shard failed, moving to the next candidate
   [junit4]   2> 1119513 INFO  (qtp1028242752-12447) [n:127.0.0.1:36107_solr c:collection1 s:shard1 r:core_node4 x:collection1_shard1_replica_n2] o.a.s.c.ShardLeaderElectionContext We failed sync, but we have no versions - we can't sync in that case - we were active before, so become leader anyway
   [junit4]   2> 1119513 INFO  (qtp1028242752-12447) [n:127.0.0.1:36107_solr c:collection1 s:shard1 r:core_node4 x:collection1_shard1_replica_n2] o.a.s.c.ShardLeaderElectionContext Found all replicas participating in election, clear LIR
   [junit4]   2> 1119515 INFO  (qtp1028242752-12447) [n:127.0.0.1:36107_solr c:collection1 s:shard1 r:core_node4 x:collection1_shard1_replica_n2] o.a.s.c.ShardLeaderElectionContext I am the new leader: http://127.0.0.1:36107/solr/collection1_shard1_replica_n2/ shard1
   [junit4]   2> 1119616 INFO  (qtp1028242752-12447) [n:127.0.0.1:36107_solr c:collection1 s:shard1 r:core_node4 x:collection1_shard1_replica_n2] o.a.s.c.ZkController I am the leader, no recovery necessary
   [junit4]   2> 1119678 INFO  (qtp1028242752-12447) [n:127.0.0.1:36107_solr c:collection1 s:shard1 r:core_node4 x:collection1_shard1_replica_n2] o.a.s.s.HttpSolrCall [admin] webapp=null path=/admin/cores params={qt=/admin/cores&coreNodeName=core_node4&collection.configName=config&newCollection=true&name=collection1_shard1_replica_n2&action=CREATE&numShards=1&collection=collection1&shard=shard1&wt=javabin&version=2&replicaType=NRT} status=0 QTime=1726
   [junit4]   2> 1119717 INFO  (zkCallback-3118-thread-1) [    ] o.a.s.c.c.ZkStateReader A cluster state change: [WatchedEvent state:SyncConnected type:NodeDataChanged path:/collections/collection1/state.json] for collection [collection1] has occurred - updating... (live nodes size: [2])
   [junit4]   2> 1120012 INFO  (qtp1292390581-12436) [n:127.0.0.1:32867_solr c:collection1 s:shard1 r:core_node3 x:collection1_shard1_replica_n1] o.a.s.s.HttpSolrCall [admin] webapp=null path=/admin/cores params={qt=/admin/cores&coreNodeName=core_node3&collection.configName=config&newCollection=true&name=collection1_shard1_replica_n1&action=CREATE&numShards=1&collection=collection1&shard=shard1&wt=javabin&version=2&replicaType=NRT} status=0 QTime=2060
   [junit4]   2> 1120014 INFO  (qtp1292390581-12446) [n:127.0.0.1:32867_solr    ] o.a.s.h.a.CollectionsHandler Wait for new collection to be active for at most 30 seconds. Check all shard replicas
   [junit4]   2> 1120112 INFO  (zkCallback-3118-thread-1) [    ] o.a.s.c.c.ZkStateReader A cluster state change: [WatchedEvent state:SyncConnected type:NodeDataChanged path:/collections/collection1/state.json] for collection [collection1] has occurred - updating... (live nodes size: [2])
   [junit4]   2> 1120112 INFO  (zkCallback-3126-thread-1) [    ] o.a.s.c.c.ZkStateReader A cluster state change: [WatchedEvent state:SyncConnected type:NodeDataChanged path:/collections/collection1/state.json] for collection [collection1] has occurred - updating... (live nodes size: [2])
   [junit4]   2> 1121014 INFO  (qtp1292390581-12446) [n:127.0.0.1:32867_solr    ] o.a.s.s.HttpSolrCall [admin] webapp=null path=/admin/collections params={collection.configName=config&name=collection1&nrtReplicas=2&action=CREATE&numShards=1&wt=javabin&version=2} status=0 QTime=3371
   [junit4]   2> 1121016 INFO  (TEST-LeaderTragicEventTest.testOtherReplicasAreNotActive-seed#[ECD1DCA15E778E3B]) [    ] o.e.j.s.AbstractConnector Stopped ServerConnector@6232c76e{HTTP/1.1,[http/1.1]}{127.0.0.1:0}
   [junit4]   2> 1121016 INFO  (TEST-LeaderTragicEventTest.testOtherReplicasAreNotActive-seed#[ECD1DCA15E778E3B]) [    ] o.a.s.c.CoreContainer Shutting down CoreContainer instance=1583577095
   [junit4]   2> 1121016 INFO  (TEST-LeaderTragicEventTest.testOtherReplicasAreNotActive-seed#[ECD1DCA15E778E3B]) [    ] o.a.s.m.SolrMetricManager Closing metric reporters for registry=solr.node, tag=null
   [junit4]   2> 1121016 INFO  (TEST-LeaderTragicEventTest.testOtherReplicasAreNotActive-seed#[ECD1DCA15E778E3B]) [    ] o.a.s.m.r.SolrJmxReporter Closing reporter [org.apache.solr.metrics.reporters.SolrJmxReporter@7ad0e7ba: rootName = solr_32867, domain = solr.node, service url = null, agent id = null] for registry solr.node / com.codahale.metrics.MetricRegistry@1cff233c
   [junit4]   2> 1121026 INFO  (TEST-LeaderTragicEventTest.testOtherReplicasAreNotActive-seed#[ECD1DCA15E778E3B]) [    ] o.a.s.m.SolrMetricManager Closing metric reporters for registry=solr.jvm, tag=null
   [junit4]   2> 1121026 INFO  (TEST-LeaderTragicEventTest.testOtherReplicasAreNotActive-seed#[ECD1DCA15E778E3B]) [    ] o.a.s.m.r.SolrJmxReporter Closing reporter [org.apache.solr.metrics.reporters.SolrJmxReporter@33b17b9e: rootName = solr_32867, domain = solr.jvm, service url = null, agent id = null] for registry solr.jvm / com.codahale.metrics.MetricRegistry@310ba721
   [junit4]   2> 1121031 INFO  (TEST-LeaderTragicEventTest.testOtherReplicasAreNotActive-seed#[ECD1DCA15E778E3B]) [    ] o.a.s.m.SolrMetricManager Closing metric reporters for registry=solr.jetty, tag=null
   [junit4]   2> 1121031 INFO  (TEST-LeaderTragicEventTest.testOtherReplicasAreNotActive-seed#[ECD1DCA15E778E3B]) [    ] o.a.s.m.r.SolrJmxReporter Closing reporter [org.apache.solr.metrics.reporters.SolrJmxReporter@453ebf41: rootName = solr_32867, domain = solr.jetty, service url = null, agent id = null] for registry solr.jetty / com.codahale.metrics.MetricRegistry@13e2727a
   [junit4]   2> 1121032 INFO  (TEST-LeaderTragicEventTest.testOtherReplicasAreNotActive-seed#[ECD1DCA15E778E3B]) [    ] o.a.s.c.ZkController Remove node as live in ZooKeeper:/live_nodes/127.0.0.1:32867_solr
   [junit4]   2> 1121032 INFO  (TEST-LeaderTragicEventTest.testOtherReplicasAreNotActive-seed#[ECD1DCA15E778E3B]) [    ] o.a.s.m.SolrMetricManager Closing metric reporters for registry=solr.cluster, tag=null
   [junit4]   2> 1121032 INFO  (zkCallback-3139-thread-1) [    ] o.a.s.c.c.ZkStateReader Updated live nodes from ZooKeeper... (2) -> (1)
   [junit4]   2> 1121032 INFO  (zkCallback-3147-thread-1) [    ] o.a.s.c.c.ZkStateReader Updated live nodes from ZooKeeper... (2) -> (1)
   [junit4]   2> 1121032 INFO  (zkCallback-3133-thread-1) [    ] o.a.s.c.c.ZkStateReader Updated live nodes from ZooKeeper... (2) -> (1)
   [junit4]   2> 1121033 INFO  (zkCallback-3118-thread-1) [    ] o.a.s.c.c.ZkStateReader Updated live nodes from ZooKeeper... (2) -> (1)
   [junit4]   2> 1121032 INFO  (zkCallback-3126-thread-2) [    ] o.a.s.c.c.ZkStateReader Updated live nodes from ZooKeeper... (2) -> (1)
   [junit4]   2> 1121033 INFO  (coreCloseExecutor-4940-thread-1) [n:127.0.0.1:32867_solr c:collection1 s:shard1 r:core_node3 x:collection1_shard1_replica_n1] o.a.s.c.SolrCore [collection1_shard1_replica_n1]  CLOSING SolrCore org.apache.solr.core.SolrCore@5d594bd2
   [junit4]   2> 1121034 INFO  (coreCloseExecutor-4940-thread-1) [n:127.0.0.1:32867_solr c:collection1 s:shard1 r:core_node3 x:collection1_shard1_replica_n1] o.a.s.m.SolrMetricManager Closing metric reporters for registry=solr.core.collection1.shard1.replica_n1, tag=5d594bd2
   [junit4]   2> 1121034 INFO  (coreCloseExecutor-4940-thread-1) [n:127.0.0.1:32867_solr c:collection1 s:shard1 r:core_node3 x:collection1_shard1_replica_n1] o.a.s.m.r.SolrJmxReporter Closing reporter [org.apache.solr.metrics.reporters.SolrJmxReporter@2a674d36: rootName = solr_32867, domain = solr.core.collection1.shard1.replica_n1, service url = null, agent id = null] for registry solr.core.collection1.shard1.replica_n1 / com.codahale.metrics.MetricRegistry@5f2d9408
   [junit4]   2> 1121038 INFO  (coreCloseExecutor-4940-thread-1) [n:127.0.0.1:32867_solr c:collection1 s:shard1 r:core_node3 x:collection1_shard1_replica_n1] o.a.s.m.SolrMetricManager Closing metric reporters for registry=solr.collection.collection1.shard1.leader, tag=5d594bd2
   [junit4]   2> 1121040 INFO  (TEST-LeaderTragicEventTest.testOtherReplicasAreNotActive-seed#[ECD1DCA15E778E3B]) [    ] o.a.s.c.Overseer Overseer (id=72109921799700486-127.0.0.1:32867_solr-n_0000000000) closing
   [junit4]   2> 1121040 INFO  (OverseerStateUpdate-72109921799700486-127.0.0.1:32867_solr-n_0000000000) [    ] o.a.s.c.Overseer Overseer Loop exiting : 127.0.0.1:32867_solr
   [junit4]   2> 1121040 WARN  (OverseerAutoScalingTriggerThread-72109921799700486-127.0.0.1:32867_solr-n_0000000000) [    ] o.a.s.c.a.OverseerTriggerThread OverseerTriggerThread woken up but we are closed, exiting.
   [junit4]   2> 1121042 INFO  (zkCallback-3118-thread-1) [    ] o.a.s.c.OverseerElectionContext I am going to be the leader 127.0.0.1:36107_solr
   [junit4]   2> 1121042 INFO  (TEST-LeaderTragicEventTest.testOtherReplicasAreNotActive-seed#[ECD1DCA15E778E3B]) [    ] o.e.j.s.h.ContextHandler Stopped o.e.j.s.ServletContextHandler@36a3c00c{/solr,null,UNAVAILABLE}
   [junit4]   2> 1121042 INFO  (TEST-LeaderTragicEventTest.testOtherReplicasAreNotActive-seed#[ECD1DCA15E778E3B]) [    ] o.e.j.s.session node0 Stopped scavenging
   [junit4]   2> 1121042 INFO  (zkCallback-3118-thread-1) [    ] o.a.s.c.Overseer Overseer (id=72109921799700484-127.0.0.1:36107_solr-n_0000000001) starting
   [junit4]   2> 1121046 INFO  (zkCallback-3147-thread-1) [    ] o.a.s.c.c.ZkStateReader A cluster state change: [WatchedEvent state:SyncConnected type:NodeDataChanged path:/collections/collection1/state.json] for collection [collection1] has occurred - updating... (live nodes size: [1])
   [junit4]   2> 1121047 INFO  (zkCallback-3118-thread-1) [    ] o.a.s.c.c.ZkStateReader A cluster state change: [WatchedEvent state:SyncConnected type:NodeDataChanged path:/collections/collection1/state.json] for collection [collection1] has occurred - updating... (live nodes size: [1])
   [junit4]   2> 1121048 INFO  (TEST-LeaderTragicEventTest.testOtherReplicasAreNotActive-seed#[ECD1DCA15E778E3B]) [    ] o.a.s.SolrTestCaseJ4 ###Ending testOtherReplicasAreNotActive
   [junit4]   2> NOTE: reproduce with: ant test  -Dtestcase=LeaderTragicEventTest -Dtests.method=testOtherReplicasAreNotActive -Dtests.seed=ECD1DCA15E778E3B -Dtests.multiplier=3 -Dtests.slow=true -Dtests.locale=hu-HU -Dtests.timezone=Europe/Riga -Dtests.asserts=true -Dtests.file.encoding=US-ASCII
   [junit4] ERROR   3.42s J2 | LeaderTragicEventTest.testOtherReplicasAreNotActive <<<
   [junit4]    > Throwable #1: java.lang.IllegalStateException: Jetty Connector is not open: -2
   [junit4]    > at __randomizedtesting.SeedInfo.seed([ECD1DCA15E778E3B:6965F0D6628837A3]:0)
   [junit4]    > at org.apache.solr.client.solrj.embedded.JettySolrRunner.getBaseUrl(JettySolrRunner.java:499)
   [junit4]    > at org.apache.solr.cloud.MiniSolrCloudCluster.getReplicaJetty(MiniSolrCloudCluster.java:539)
   [junit4]    > at org.apache.solr.cloud.LeaderTragicEventTest.corruptLeader(LeaderTragicEventTest.java:100)
   [junit4]    > at org.apache.solr.cloud.LeaderTragicEventTest.testOtherReplicasAreNotActive(LeaderTragicEventTest.java:150)
   [junit4]    > at java.lang.Thread.run(Thread.java:748)
   [junit4]   2> 1121060 INFO  (TEST-LeaderTragicEventTest.test-seed#[ECD1DCA15E778E3B]) [    ] o.a.s.SolrTestCaseJ4 ###Starting test
   [junit4]   2> 1121060 INFO  (qtp1028242752-12437) [n:127.0.0.1:36107_solr    ] o.a.s.h.a.CollectionsHandler Invoked Collection Action :create with params collection.configName=config&name=collection1&nrtReplicas=2&action=CREATE&numShards=1&wt=javabin&version=2 and sendToOCPQueue=true
   [junit4]   2> 1121062 INFO  (OverseerThreadFactory-4945-thread-1) [    ] o.a.s.c.a.c.CreateCollectionCmd Create collection collection1
   [junit4]   2> 1121062 ERROR (OverseerThreadFactory-4945-thread-1) [    ] o.a.s.c.a.c.OverseerCollectionMessageHandler Collection: collection1 operation: create failed:org.apache.solr.common.SolrException: collection already exists: collection1
   [junit4]   2> at org.apache.solr.cloud.api.collections.CreateCollectionCmd.call(CreateCollectionCmd.java:106)
   [junit4]   2> at org.apache.solr.cloud.api.collections.OverseerCollectionMessageHandler.processMessage(OverseerCollectionMessageHandler.java:255)
   [junit4]   2> at org.apache.solr.cloud.OverseerTaskProcessor$Runner.run(OverseerTaskProcessor.java:469)
   [junit4]   2> at org.apache.solr.common.util.ExecutorUtil$MDCAwareThreadPoolExecutor.lambda$execute$0(ExecutorUtil.java:209)
   [junit4]   2> at java.util.concurrent.ThreadPoolExecutor.runWorker(ThreadPoolExecutor.java:1149)
   [junit4]   2> at java.util.concurrent.ThreadPoolExecutor$Worker.run(ThreadPoolExecutor.java:624)
   [junit4]   2> at java.lang.Thread.run(Thread.java:748)
   [junit4]   2>
   [junit4]   2> 1121064 INFO  (qtp1028242752-12437) [n:127.0.0.1:36107_solr    ] o.a.s.s.HttpSolrCall [admin] webapp=null path=/admin/collections params={collection.configName=config&name=collection1&nrtReplicas=2&action=CREATE&numShards=1&wt=javabin&version=2} status=400 QTime=3
   [junit4]   2> 1121065 INFO  (TEST-LeaderTragicEventTest.test-seed#[ECD1DCA15E778E3B]) [    ] o.a.s.SolrTestCaseJ4 ###Ending test
   [junit4]   2> NOTE: reproduce with: ant test  -Dtestcase=LeaderTragicEventTest -Dtests.method=test -Dtests.seed=ECD1DCA15E778E3B -Dtests.multiplier=3 -Dtests.slow=true -Dtests.locale=hu-HU -Dtests.timezone=Europe/Riga -Dtests.asserts=true -Dtests.file.encoding=US-ASCII
   [junit4] ERROR   0.02s J2 | LeaderTragicEventTest.test <<<
   [junit4]    > Throwable #1: org.apache.solr.client.solrj.impl.HttpSolrClient$RemoteSolrException: Error from server at http://127.0.0.1:36107/solr: collection already exists: collection1
   [junit4]    > at __randomizedtesting.SeedInfo.seed([ECD1DCA15E778E3B:6485E37BF08BE3C3]:0)
   [junit4]    > at org.apache.solr.client.solrj.impl.HttpSolrClient.executeMethod(HttpSolrClient.java:643)
   [junit4]    > at org.apache.solr.client.solrj.impl.HttpSolrClient.request(HttpSolrClient.java:255)
   [junit4]    > at org.apache.solr.client.solrj.impl.HttpSolrClient.request(HttpSolrClient.java:244)
   [junit4]    > at org.apache.solr.client.solrj.impl.LBHttpSolrClient.doRequest(LBHttpSolrClient.java:483)
   [junit4]    > at org.apache.solr.client.solrj.impl.LBHttpSolrClient.request(LBHttpSolrClient.java:413)
   [junit4]    > at org.apache.solr.client.solrj.impl.CloudSolrClient.sendRequest(CloudSolrClient.java:1106)
   [junit4]    > at org.apache.solr.client.solrj.impl.CloudSolrClient.requestWithRetryOnStaleState(CloudSolrClient.java:886)
   [junit4]    > at org.apache.solr.client.solrj.impl.CloudSolrClient.request(CloudSolrClient.java:819)
   [junit4]    > at org.apache.solr.client.solrj.SolrRequest.process(SolrRequest.java:194)
   [junit4]    > at org.apache.solr.client.solrj.SolrRequest.process(SolrRequest.java:211)
   [junit4]    > at org.apache.solr.cloud.LeaderTragicEventTest.test(LeaderTragicEventTest.java:70)
   [junit4]    > at java.lang.Thread.run(Thread.java:748)
   [junit4]   2> 1121068 INFO  (jetty-closer-3107-thread-2) [    ] o.e.j.s.AbstractConnector Stopped ServerConnector@18024afe{HTTP/1.1,[http/1.1]}{127.0.0.1:0}
   [junit4]   2> 1121068 INFO  (jetty-closer-3107-thread-2) [    ] o.a.s.c.CoreContainer Shutting down CoreContainer instance=540479561
   [junit4]   2> 1121068 INFO  (jetty-closer-3107-thread-2) [    ] o.a.s.m.SolrMetricManager Closing metric reporters for registry=solr.node, tag=null
   [junit4]   2> 1121068 INFO  (jetty-closer-3107-thread-2) [    ] o.a.s.m.r.SolrJmxReporter Closing reporter [org.apache.solr.metrics.reporters.SolrJmxReporter@26d1819c: rootName = solr_36107, domain = solr.node, service url = null, agent id = null] for registry solr.node / com.codahale.metrics.MetricRegistry@3fc62d83
   [junit4]   2> 1121074 INFO  (jetty-closer-3107-thread-2) [    ] o.a.s.m.SolrMetricManager Closing metric reporters for registry=solr.jvm, tag=null
   [junit4]   2> 1121074 INFO  (jetty-closer-3107-thread-2) [    ] o.a.s.m.r.SolrJmxReporter Closing reporter [org.apache.solr.metrics.reporters.SolrJmxReporter@60b3a122: rootName = solr_36107, domain = solr.jvm, service url = null, agent id = null] for registry solr.jvm / com.codahale.metrics.MetricRegistry@310ba721
   [junit4]   2> 1121078 INFO  (jetty-closer-3107-thread-2) [    ] o.a.s.m.SolrMetricManager Closing metric reporters for registry=solr.jetty, tag=null
   [junit4]   2> 1121078 INFO  (jetty-closer-3107-thread-2) [    ] o.a.s.m.r.SolrJmxReporter Closing reporter [org.apache.solr.metrics.reporters.SolrJmxReporter@1342f5c6: rootName = solr_36107, domain = solr.jetty, service url = null, agent id = null] for registry solr.jetty / com.codahale.metrics.MetricRegistry@13e2727a
   [junit4]   2> 1121079 INFO  (jetty-closer-3107-thread-2) [    ] o.a.s.c.ZkController Remove node as live in ZooKeeper:/live_nodes/127.0.0.1:36107_solr
   [junit4]   2> 1121079 INFO  (jetty-closer-3107-thread-2) [    ] o.a.s.m.SolrMetricManager Closing metric reporters for registry=solr.cluster, tag=null
   [junit4]   2> 1121079 INFO  (zkCallback-3139-thread-1) [    ] o.a.s.c.c.ZkStateReader Updated live nodes from ZooKeeper... (1) -> (0)
   [junit4]   2> 1121080 INFO  (coreCloseExecutor-4946-thread-1) [n:127.0.0.1:36107_solr c:collection1 s:shard1 r:core_node4 x:collection1_shard1_replica_n2] o.a.s.c.SolrCore [collection1_shard1_replica_n2]  CLOSING SolrCore org.apache.solr.core.SolrCore@45ff25
   [junit4]   2> 1121080 INFO  (coreCloseExecutor-4946-thread-1) [n:127.0.0.1:36107_solr c:collection1 s:shard1 r:core_node4 x:collection1_shard1_replica_n2] o.a.s.m.SolrMetricManager Closing metric reporters for registry=solr.core.collection1.shard1.replica_n2, tag=45ff25
   [junit4]   2> 1121080 INFO  (coreCloseExecutor-4946-thread-1) [n:127.0.0.1:36107_solr c:collection1 s:shard1 r:core_node4 x:collection1_shard1_replica_n2] o.a.s.m.r.SolrJmxReporter Closing reporter [org.apache.solr.metrics.reporters.SolrJmxReporter@4ff97267: rootName = solr_36107, domain = solr.core.collection1.shard1.replica_n2, service url = null, agent id = null] for registry solr.core.collection1.shard1.replica_n2 / com.codahale.metrics.MetricRegistry@e0874a4
   [junit4]   2> 1121081 INFO  (zkCallback-3118-thread-1) [    ] o.a.s.c.c.ZkStateReader Updated live nodes from ZooKeeper... (1) -> (0)
   [junit4]   2> 1121088 INFO  (coreCloseExecutor-4946-thread-1) [n:127.0.0.1:36107_solr c:collection1 s:shard1 r:core_node4 x:collection1_shard1_replica_n2] o.a.s.m.SolrMetricManager Closing metric reporters for registry=solr.collection.collection1.shard1.leader, tag=45ff25
   [junit4]   2> 1121092 INFO  (jetty-closer-3107-thread-2) [    ] o.a.s.c.Overseer Overseer (id=72109921799700484-127.0.0.1:36107_solr-n_0000000001) closing
   [junit4]   2> 1121092 INFO  (OverseerStateUpdate-72109921799700484-127.0.0.1:36107_solr-n_0000000001) [    ] o.a.s.c.Overseer Overseer Loop exiting : 127.0.0.1:36107_solr
   [junit4]   2> 1121092 WARN  (OverseerAutoScalingTriggerThread-72109921799700484-127.0.0.1:36107_solr-n_0000000001) [    ] o.a.s.c.a.OverseerTriggerThread OverseerTriggerThread woken up but we are closed, exiting.
   [junit4]   2> 1121094 INFO  (jetty-closer-3107-thread-2) [    ] o.e.j.s.h.ContextHandler Stopped o.e.j.s.ServletContextHandler@97dc164{/solr,null,UNAVAILABLE}
   [junit4]   2> 1121095 INFO  (jetty-closer-3107-thread-2) [    ] o.e.j.s.session node0 Stopped scavenging
   [junit4]   2> 1121095 ERROR (SUITE-LeaderTragicEventTest-seed#[ECD1DCA15E778E3B]-worker) [    ] o.a.z.s.ZooKeeperServer ZKShutdownHandler is not registered, so ZooKeeper server won't take any action on ERROR or SHUTDOWN server state changes
   [junit4]   2> 1121095 INFO  (SUITE-LeaderTragicEventTest-seed#[ECD1DCA15E778E3B]-worker) [    ] o.a.s.c.ZkTestServer connecting to 127.0.0.1:37811 37811
   [junit4]   2> 1121209 INFO  (Thread-3092) [    ] o.a.s.c.ZkTestServer connecting to 127.0.0.1:37811 37811
   [junit4]   2> 1121210 WARN  (Thread-3092) [    ] o.a.s.c.ZkTestServer Watch limit violations:
   [junit4]   2> Maximum concurrent create/delete watches above limit:
   [junit4]   2>
   [junit4]   2> 5 /solr/aliases.json
   [junit4]   2> 5 /solr/clusterprops.json
   [junit4]   2> 5 /solr/collections/collection1/terms/shard1
   [junit4]   2> 2 /solr/security.json
   [junit4]   2> 2 /solr/configs/config
   [junit4]   2>
   [junit4]   2> Maximum concurrent data watches above limit:
   [junit4]   2>
   [junit4]   2> 5 /solr/clusterstate.json
   [junit4]   2> 3 /solr/collections/collection1/state.json
   [junit4]   2> 2 /solr/autoscaling.json
   [junit4]   2>
   [junit4]   2> Maximum concurrent children watches above limit:
   [junit4]   2>
   [junit4]   2> 5 /solr/live_nodes
   [junit4]   2> 5 /solr/collections
   [junit4]   2> 2 /solr/overseer/queue
   [junit4]   2> 2 /solr/autoscaling/events/.scheduled_maintenance
   [junit4]   2> 2 /solr/autoscaling/events/.auto_add_replicas
   [junit4]   2> 2 /solr/overseer/queue-work
   [junit4]   2> 2 /solr/overseer/collection-queue-work
   [junit4]   2>
   [junit4]   2> NOTE: leaving temporary files on disk at: /home/jenkins/workspace/Lucene-Solr-master-Linux/solr/build/solr-core/test/J2/temp/solr.cloud.LeaderTragicEventTest_ECD1DCA15E778E3B-001
   [junit4]   2> Jul 11, 2018 5:14:45 PM com.carrotsearch.randomizedtesting.ThreadLeakControl checkThreadLeaks
   [junit4]   2> WARNING: Will linger awaiting termination of 1 leaked thread(s).
   [junit4]   2> NOTE: test params are: codec=CheapBastard, sim=Asserting(org.apache.lucene.search.similarities.AssertingSimilarity@2c9719ec), locale=hu-HU, timezone=Europe/Riga
   [junit4]   2> NOTE: Linux 4.15.0-24-generic amd64/Oracle Corporation 1.8.0_172 (64-bit)/cpus=8,threads=1,free=231659512,total=528482304
   [junit4]   2> NOTE: All tests run in this JVM: [ImplicitSnitchTest, TaggerTest, TestJsonFacets, TestCloudSearcherWarming, TestMacros, TestDirectoryFactory, ScheduledTriggerIntegrationTest, TestSimpleTrackingShardHandler, TestPhraseSuggestions, TestFunctionQuery, TestPointFields, TestSortableTextField, TestManagedSchemaAPI, TestTlogReplica, UpdateRequestProcessorFactoryTest, AssignTest, CurrencyFieldTypeTest, MergeStrategyTest, TestMaxTokenLenTokenizer, JsonLoaderTest, NodeMarkersRegistrationTest, NotRequiredUniqueKeyTest, ClassificationUpdateProcessorFactoryTest, UtilsToolTest, TestXmlQParser, TestReplicationHandlerBackup, HLLUtilTest, IndexBasedSpellCheckerTest, DistributedMLTComponentTest, TestElisionMultitermQuery, TestDeleteCollectionOnDownNodes, FastVectorHighlighterTest, BlockJoinFacetDistribTest, DistribCursorPagingTest, TestAuthenticationFramework, MultiSolrCloudTestCaseTest, BigEndianAscendingWordDeserializerTest, SolrRrdBackendFactoryTest, ClusterStateUpdateTest, SolrGraphiteReporterTest, OutOfBoxZkACLAndCredentialsProvidersTest, TestNonDefinedSimilarityFactory, PKIAuthenticationIntegrationTest, TestStressReorder, HdfsSyncSliceTest, TestFieldCacheReopen, DistributedFacetPivotSmallAdvancedTest, TestOverriddenPrefixQueryForCustomFieldType, TestFieldTypeResource, RangeFacetCloudTest, RAMDirectoryFactoryTest, ChaosMonkeySafeLeaderTest, HdfsAutoAddReplicasIntegrationTest, AlternateDirectoryTest, DataDrivenBlockJoinTest, TestSolrIndexConfig, TestUniqueKeyFieldResource, TestCloudPivotFacet, TestFoldingMultitermQuery, IndexSchemaTest, ShowFileRequestHandlerTest, TestMissingGroups, TestLegacyFieldReuse, PeerSyncWithIndexFingerprintCachingTest, TestManagedResourceStorage, TestRequestForwarding, RestartWhileUpdatingTest, TestSolrCloudSnapshots, HdfsRecoverLeaseTest, TestPrepRecovery, ExplicitHLLTest, TestInPlaceUpdatesDistrib, TestScoreJoinQPNoSco

[...truncated too long message...]

ryOnStaleState(CloudSolrClient.java:886)
   [junit4]    > at org.apache.solr.client.solrj.impl.CloudSolrClient.request(CloudSolrClient.java:819)
   [junit4]    > at org.apache.solr.client.solrj.SolrRequest.process(SolrRequest.java:194)
   [junit4]    > at org.apache.solr.client.solrj.SolrRequest.process(SolrRequest.java:211)
   [junit4]    > at org.apache.solr.cloud.LeaderTragicEventTest.test(LeaderTragicEventTest.java:70)
   [junit4]    > at java.lang.Thread.run(Thread.java:748)
   [junit4]   2> 15887 INFO  (jetty-closer-45-thread-2) [    ] o.e.j.s.AbstractConnector Stopped ServerConnector@3f572916{HTTP/1.1,[http/1.1]}{127.0.0.1:0}
   [junit4]   2> 15888 INFO  (jetty-closer-45-thread-2) [    ] o.a.s.c.CoreContainer Shutting down CoreContainer instance=1656782116
   [junit4]   2> 15888 INFO  (jetty-closer-45-thread-2) [    ] o.a.s.m.SolrMetricManager Closing metric reporters for registry=solr.node, tag=null
   [junit4]   2> 15888 INFO  (jetty-closer-45-thread-2) [    ] o.a.s.m.r.SolrJmxReporter Closing reporter [org.apache.solr.metrics.reporters.SolrJmxReporter@43c2d696: rootName = solr_37353, domain = solr.node, service url = null, agent id = null] for registry solr.node / com.codahale.metrics.MetricRegistry@60abe518
   [junit4]   2> 15892 INFO  (jetty-closer-45-thread-2) [    ] o.a.s.m.SolrMetricManager Closing metric reporters for registry=solr.jvm, tag=null
   [junit4]   2> 15892 INFO  (jetty-closer-45-thread-2) [    ] o.a.s.m.r.SolrJmxReporter Closing reporter [org.apache.solr.metrics.reporters.SolrJmxReporter@6e614bc8: rootName = solr_37353, domain = solr.jvm, service url = null, agent id = null] for registry solr.jvm / com.codahale.metrics.MetricRegistry@73bc274f
   [junit4]   2> 15895 INFO  (jetty-closer-45-thread-2) [    ] o.a.s.m.SolrMetricManager Closing metric reporters for registry=solr.jetty, tag=null
   [junit4]   2> 15895 INFO  (jetty-closer-45-thread-2) [    ] o.a.s.m.r.SolrJmxReporter Closing reporter [org.apache.solr.metrics.reporters.SolrJmxReporter@45f75b98: rootName = solr_37353, domain = solr.jetty, service url = null, agent id = null] for registry solr.jetty / com.codahale.metrics.MetricRegistry@57338a0
   [junit4]   2> 15896 INFO  (jetty-closer-45-thread-2) [    ] o.a.s.c.ZkController Remove node as live in ZooKeeper:/live_nodes/127.0.0.1:37353_solr
   [junit4]   2> 15896 INFO  (jetty-closer-45-thread-2) [    ] o.a.s.m.SolrMetricManager Closing metric reporters for registry=solr.cluster, tag=null
   [junit4]   2> 15897 INFO  (zkCallback-64-thread-2) [    ] o.a.s.c.c.ZkStateReader Updated live nodes from ZooKeeper... (1) -> (0)
   [junit4]   2> 15897 INFO  (zkCallback-71-thread-1) [    ] o.a.s.c.c.ZkStateReader Updated live nodes from ZooKeeper... (1) -> (0)
   [junit4]   2> 15899 INFO  (coreCloseExecutor-71-thread-1) [n:127.0.0.1:37353_solr c:collection1 s:shard1 r:core_node3 x:collection1_shard1_replica_n1] o.a.s.c.SolrCore [collection1_shard1_replica_n1]  CLOSING SolrCore org.apache.solr.core.SolrCore@31f0cb97
   [junit4]   2> 15899 INFO  (coreCloseExecutor-71-thread-1) [n:127.0.0.1:37353_solr c:collection1 s:shard1 r:core_node3 x:collection1_shard1_replica_n1] o.a.s.m.SolrMetricManager Closing metric reporters for registry=solr.core.collection1.shard1.replica_n1, tag=31f0cb97
   [junit4]   2> 15899 INFO  (coreCloseExecutor-71-thread-1) [n:127.0.0.1:37353_solr c:collection1 s:shard1 r:core_node3 x:collection1_shard1_replica_n1] o.a.s.m.r.SolrJmxReporter Closing reporter [org.apache.solr.metrics.reporters.SolrJmxReporter@429ac593: rootName = solr_37353, domain = solr.core.collection1.shard1.replica_n1, service url = null, agent id = null] for registry solr.core.collection1.shard1.replica_n1 / com.codahale.metrics.MetricRegistry@2ab031ac
   [junit4]   2> 15909 INFO  (coreCloseExecutor-71-thread-1) [n:127.0.0.1:37353_solr c:collection1 s:shard1 r:core_node3 x:collection1_shard1_replica_n1] o.a.s.m.SolrMetricManager Closing metric reporters for registry=solr.collection.collection1.shard1.leader, tag=31f0cb97
   [junit4]   2> 15911 INFO  (jetty-closer-45-thread-2) [    ] o.a.s.c.Overseer Overseer (id=72110048105267206-127.0.0.1:37353_solr-n_0000000000) closing
   [junit4]   2> 15911 INFO  (OverseerStateUpdate-72110048105267206-127.0.0.1:37353_solr-n_0000000000) [    ] o.a.s.c.Overseer Overseer Loop exiting : 127.0.0.1:37353_solr
   [junit4]   2> 15915 WARN  (OverseerAutoScalingTriggerThread-72110048105267206-127.0.0.1:37353_solr-n_0000000000) [    ] o.a.s.c.a.OverseerTriggerThread OverseerTriggerThread woken up but we are closed, exiting.
   [junit4]   2> 15916 INFO  (jetty-closer-45-thread-2) [    ] o.e.j.s.h.ContextHandler Stopped o.e.j.s.ServletContextHandler@332aec09{/solr,null,UNAVAILABLE}
   [junit4]   2> 15916 INFO  (jetty-closer-45-thread-2) [    ] o.e.j.s.session node0 Stopped scavenging
   [junit4]   2> 15917 ERROR (SUITE-LeaderTragicEventTest-seed#[ECD1DCA15E778E3B]-worker) [    ] o.a.z.s.ZooKeeperServer ZKShutdownHandler is not registered, so ZooKeeper server won't take any action on ERROR or SHUTDOWN server state changes
   [junit4]   2> 15917 INFO  (SUITE-LeaderTragicEventTest-seed#[ECD1DCA15E778E3B]-worker) [    ] o.a.s.c.ZkTestServer connecting to 127.0.0.1:34075 34075
   [junit4]   2> 16941 INFO  (Thread-25) [    ] o.a.s.c.ZkTestServer connecting to 127.0.0.1:34075 34075
   [junit4]   2> 16941 WARN  (Thread-25) [    ] o.a.s.c.ZkTestServer Watch limit violations:
   [junit4]   2> Maximum concurrent create/delete watches above limit:
   [junit4]   2>
   [junit4]   2> 6 /solr/collections/collection1/terms/shard1
   [junit4]   2> 5 /solr/aliases.json
   [junit4]   2> 5 /solr/clusterprops.json
   [junit4]   2> 2 /solr/security.json
   [junit4]   2> 2 /solr/configs/config
   [junit4]   2>
   [junit4]   2> Maximum concurrent data watches above limit:
   [junit4]   2>
   [junit4]   2> 5 /solr/clusterstate.json
   [junit4]   2> 3 /solr/collections/collection1/state.json
   [junit4]   2>
   [junit4]   2> Maximum concurrent children watches above limit:
   [junit4]   2>
   [junit4]   2> 5 /solr/live_nodes
   [junit4]   2> 5 /solr/collections
   [junit4]   2>
   [junit4]   2> NOTE: leaving temporary files on disk at: /home/jenkins/workspace/Lucene-Solr-master-Linux/solr/build/solr-core/test/J1/temp/solr.cloud.LeaderTragicEventTest_ECD1DCA15E778E3B-002
   [junit4]   2> NOTE: test params are: codec=CheapBastard, sim=Asserting(org.apache.lucene.search.similarities.AssertingSimilarity@3ff3d003), locale=hu-HU, timezone=Europe/Riga
   [junit4]   2> NOTE: Linux 4.15.0-24-generic amd64/Oracle Corporation 1.8.0_172 (64-bit)/cpus=8,threads=1,free=411567408,total=520617984
   [junit4]   2> NOTE: All tests run in this JVM: [LeaderTragicEventTest, LeaderTragicEventTest]
   [junit4] Completed [4/5 (4!)] on J1 in 5.56s, 2 tests, 2 errors <<< FAILURES!
   [junit4]
   [junit4] Suite: org.apache.solr.cloud.LeaderTragicEventTest
   [junit4] OK      12.8s J0 | LeaderTragicEventTest.testOtherReplicasAreNotActive
   [junit4] OK      18.3s J0 | LeaderTragicEventTest.test
   [junit4] Completed [5/5 (4!)] on J0 in 37.55s, 2 tests
   [junit4]
   [junit4]
   [junit4] Tests with failures [seed: ECD1DCA15E778E3B]:
   [junit4]   - org.apache.solr.cloud.LeaderTragicEventTest.testOtherReplicasAreNotActive
   [junit4]   - org.apache.solr.cloud.LeaderTragicEventTest.test
   [junit4]   - org.apache.solr.cloud.LeaderTragicEventTest.testOtherReplicasAreNotActive
   [junit4]   - org.apache.solr.cloud.LeaderTragicEventTest.test
   [junit4]   - org.apache.solr.cloud.LeaderTragicEventTest.testOtherReplicasAreNotActive
   [junit4]   - org.apache.solr.cloud.LeaderTragicEventTest.testOtherReplicasAreNotActive
   [junit4]   - org.apache.solr.cloud.LeaderTragicEventTest.test
   [junit4]   - org.apache.solr.cloud.LeaderTragicEventTest.test
   [junit4]
   [junit4]
   [junit4] JVM J0:     0.45 ..    38.77 =    38.33s
   [junit4] JVM J1:     0.44 ..    17.63 =    17.19s
   [junit4] JVM J2:     0.46 ..    17.55 =    17.09s
   [junit4] Execution time total: 38 seconds
   [junit4] Tests summary: 5 suites, 10 tests, 8 errors

BUILD FAILED
/home/jenkins/workspace/Lucene-Solr-master-Linux/lucene/common-build.xml:1568: The following error occurred while executing this line:
/home/jenkins/workspace/Lucene-Solr-master-Linux/lucene/common-build.xml:1092: There were test failures: 5 suites, 10 tests, 8 errors [seed: ECD1DCA15E778E3B]

Total time: 40 seconds

[repro] Setting last failure code to 256

[repro] Failures:
[repro]   4/5 failed: org.apache.solr.cloud.LeaderTragicEventTest
[repro] Exiting with code 256
+ mv lucene/build lucene/build.repro
+ mv solr/build solr/build.repro
+ mv lucene/build.orig lucene/build
+ mv solr/build.orig solr/build
Archiving artifacts
Setting ANT_1_8_2_HOME=/var/lib/jenkins/tools/hudson.tasks.Ant_AntInstallation/ANT_1.8.2
[WARNINGS] Parsing warnings in console log with parser Java Compiler (javac)
Setting ANT_1_8_2_HOME=/var/lib/jenkins/tools/hudson.tasks.Ant_AntInstallation/ANT_1.8.2
Setting ANT_1_8_2_HOME=/var/lib/jenkins/tools/hudson.tasks.Ant_AntInstallation/ANT_1.8.2
<Git Blamer> Using GitBlamer to create author and commit information for all warnings.
<Git Blamer> GIT_COMMIT=fe180bbd59ef45679f3cffa252fff0aa069b7427, workspace=/var/lib/jenkins/workspace/Lucene-Solr-master-Linux
[WARNINGS] Computing warning deltas based on reference build #22435
Recording test results
Setting ANT_1_8_2_HOME=/var/lib/jenkins/tools/hudson.tasks.Ant_AntInstallation/ANT_1.8.2
Build step 'Publish JUnit test result report' changed build result to UNSTABLE
Email was triggered for: Unstable (Test Failures)
Sending email for trigger: Unstable (Test Failures)
Setting ANT_1_8_2_HOME=/var/lib/jenkins/tools/hudson.tasks.Ant_AntInstallation/ANT_1.8.2
Setting ANT_1_8_2_HOME=/var/lib/jenkins/tools/hudson.tasks.Ant_AntInstallation/ANT_1.8.2
Setting ANT_1_8_2_HOME=/var/lib/jenkins/tools/hudson.tasks.Ant_AntInstallation/ANT_1.8.2
Setting ANT_1_8_2_HOME=/var/lib/jenkins/tools/hudson.tasks.Ant_AntInstallation/ANT_1.8.2


---------------------------------------------------------------------
To unsubscribe, e-mail: [hidden email]
For additional commands, e-mail: [hidden email]
Reply | Threaded
Open this post in threaded view
|

[JENKINS] Lucene-Solr-master-Linux (32bit/jdk1.8.0_172) - Build # 22437 - Still Unstable!

Policeman Jenkins Server-2
Build: https://jenkins.thetaphi.de/job/Lucene-Solr-master-Linux/22437/
Java: 32bit/jdk1.8.0_172 -server -XX:+UseG1GC

2 tests failed.
FAILED:  org.apache.solr.cloud.LeaderTragicEventTest.testOtherReplicasAreNotActive

Error Message:
Jetty Connector is not open: -2

Stack Trace:
java.lang.IllegalStateException: Jetty Connector is not open: -2
        at __randomizedtesting.SeedInfo.seed([E84D2EBDB3FC3E2A:6DF902CA8F0387B2]:0)
        at org.apache.solr.client.solrj.embedded.JettySolrRunner.getBaseUrl(JettySolrRunner.java:499)
        at org.apache.solr.cloud.MiniSolrCloudCluster.getReplicaJetty(MiniSolrCloudCluster.java:539)
        at org.apache.solr.cloud.LeaderTragicEventTest.corruptLeader(LeaderTragicEventTest.java:100)
        at org.apache.solr.cloud.LeaderTragicEventTest.testOtherReplicasAreNotActive(LeaderTragicEventTest.java:150)
        at sun.reflect.NativeMethodAccessorImpl.invoke0(Native Method)
        at sun.reflect.NativeMethodAccessorImpl.invoke(NativeMethodAccessorImpl.java:62)
        at sun.reflect.DelegatingMethodAccessorImpl.invoke(DelegatingMethodAccessorImpl.java:43)
        at java.lang.reflect.Method.invoke(Method.java:498)
        at com.carrotsearch.randomizedtesting.RandomizedRunner.invoke(RandomizedRunner.java:1737)
        at com.carrotsearch.randomizedtesting.RandomizedRunner$8.evaluate(RandomizedRunner.java:934)
        at com.carrotsearch.randomizedtesting.RandomizedRunner$9.evaluate(RandomizedRunner.java:970)
        at com.carrotsearch.randomizedtesting.RandomizedRunner$10.evaluate(RandomizedRunner.java:984)
        at com.carrotsearch.randomizedtesting.rules.SystemPropertiesRestoreRule$1.evaluate(SystemPropertiesRestoreRule.java:57)
        at org.apache.lucene.util.TestRuleSetupTeardownChained$1.evaluate(TestRuleSetupTeardownChained.java:49)
        at org.apache.lucene.util.AbstractBeforeAfterRule$1.evaluate(AbstractBeforeAfterRule.java:45)
        at org.apache.lucene.util.TestRuleThreadAndTestName$1.evaluate(TestRuleThreadAndTestName.java:48)
        at org.apache.lucene.util.TestRuleIgnoreAfterMaxFailures$1.evaluate(TestRuleIgnoreAfterMaxFailures.java:64)
        at org.apache.lucene.util.TestRuleMarkFailure$1.evaluate(TestRuleMarkFailure.java:47)
        at com.carrotsearch.randomizedtesting.rules.StatementAdapter.evaluate(StatementAdapter.java:36)
        at com.carrotsearch.randomizedtesting.ThreadLeakControl$StatementRunner.run(ThreadLeakControl.java:368)
        at com.carrotsearch.randomizedtesting.ThreadLeakControl.forkTimeoutingTask(ThreadLeakControl.java:817)
        at com.carrotsearch.randomizedtesting.ThreadLeakControl$3.evaluate(ThreadLeakControl.java:468)
        at com.carrotsearch.randomizedtesting.RandomizedRunner.runSingleTest(RandomizedRunner.java:943)
        at com.carrotsearch.randomizedtesting.RandomizedRunner$5.evaluate(RandomizedRunner.java:829)
        at com.carrotsearch.randomizedtesting.RandomizedRunner$6.evaluate(RandomizedRunner.java:879)
        at com.carrotsearch.randomizedtesting.RandomizedRunner$7.evaluate(RandomizedRunner.java:890)
        at com.carrotsearch.randomizedtesting.rules.StatementAdapter.evaluate(StatementAdapter.java:36)
        at com.carrotsearch.randomizedtesting.rules.SystemPropertiesRestoreRule$1.evaluate(SystemPropertiesRestoreRule.java:57)
        at org.apache.lucene.util.AbstractBeforeAfterRule$1.evaluate(AbstractBeforeAfterRule.java:45)
        at com.carrotsearch.randomizedtesting.rules.StatementAdapter.evaluate(StatementAdapter.java:36)
        at org.apache.lucene.util.TestRuleStoreClassName$1.evaluate(TestRuleStoreClassName.java:41)
        at com.carrotsearch.randomizedtesting.rules.NoShadowingOrOverridesOnMethodsRule$1.evaluate(NoShadowingOrOverridesOnMethodsRule.java:40)
        at com.carrotsearch.randomizedtesting.rules.NoShadowingOrOverridesOnMethodsRule$1.evaluate(NoShadowingOrOverridesOnMethodsRule.java:40)
        at com.carrotsearch.randomizedtesting.rules.StatementAdapter.evaluate(StatementAdapter.java:36)
        at com.carrotsearch.randomizedtesting.rules.StatementAdapter.evaluate(StatementAdapter.java:36)
        at com.carrotsearch.randomizedtesting.rules.StatementAdapter.evaluate(StatementAdapter.java:36)
        at org.apache.lucene.util.TestRuleAssertionsRequired$1.evaluate(TestRuleAssertionsRequired.java:53)
        at org.apache.lucene.util.TestRuleMarkFailure$1.evaluate(TestRuleMarkFailure.java:47)
        at org.apache.lucene.util.TestRuleIgnoreAfterMaxFailures$1.evaluate(TestRuleIgnoreAfterMaxFailures.java:64)
        at org.apache.lucene.util.TestRuleIgnoreTestSuites$1.evaluate(TestRuleIgnoreTestSuites.java:54)
        at com.carrotsearch.randomizedtesting.rules.StatementAdapter.evaluate(StatementAdapter.java:36)
        at com.carrotsearch.randomizedtesting.ThreadLeakControl$StatementRunner.run(ThreadLeakControl.java:368)
        at java.lang.Thread.run(Thread.java:748)


FAILED:  org.apache.solr.cloud.LeaderTragicEventTest.testOtherReplicasAreNotActive

Error Message:
Jetty Connector is not open: -2

Stack Trace:
java.lang.IllegalStateException: Jetty Connector is not open: -2
        at __randomizedtesting.SeedInfo.seed([E84D2EBDB3FC3E2A:6DF902CA8F0387B2]:0)
        at org.apache.solr.client.solrj.embedded.JettySolrRunner.getBaseUrl(JettySolrRunner.java:499)
        at org.apache.solr.cloud.MiniSolrCloudCluster.getReplicaJetty(MiniSolrCloudCluster.java:539)
        at org.apache.solr.cloud.LeaderTragicEventTest.corruptLeader(LeaderTragicEventTest.java:100)
        at org.apache.solr.cloud.LeaderTragicEventTest.testOtherReplicasAreNotActive(LeaderTragicEventTest.java:150)
        at sun.reflect.NativeMethodAccessorImpl.invoke0(Native Method)
        at sun.reflect.NativeMethodAccessorImpl.invoke(NativeMethodAccessorImpl.java:62)
        at sun.reflect.DelegatingMethodAccessorImpl.invoke(DelegatingMethodAccessorImpl.java:43)
        at java.lang.reflect.Method.invoke(Method.java:498)
        at com.carrotsearch.randomizedtesting.RandomizedRunner.invoke(RandomizedRunner.java:1737)
        at com.carrotsearch.randomizedtesting.RandomizedRunner$8.evaluate(RandomizedRunner.java:934)
        at com.carrotsearch.randomizedtesting.RandomizedRunner$9.evaluate(RandomizedRunner.java:970)
        at com.carrotsearch.randomizedtesting.RandomizedRunner$10.evaluate(RandomizedRunner.java:984)
        at com.carrotsearch.randomizedtesting.rules.SystemPropertiesRestoreRule$1.evaluate(SystemPropertiesRestoreRule.java:57)
        at org.apache.lucene.util.TestRuleSetupTeardownChained$1.evaluate(TestRuleSetupTeardownChained.java:49)
        at org.apache.lucene.util.AbstractBeforeAfterRule$1.evaluate(AbstractBeforeAfterRule.java:45)
        at org.apache.lucene.util.TestRuleThreadAndTestName$1.evaluate(TestRuleThreadAndTestName.java:48)
        at org.apache.lucene.util.TestRuleIgnoreAfterMaxFailures$1.evaluate(TestRuleIgnoreAfterMaxFailures.java:64)
        at org.apache.lucene.util.TestRuleMarkFailure$1.evaluate(TestRuleMarkFailure.java:47)
        at com.carrotsearch.randomizedtesting.rules.StatementAdapter.evaluate(StatementAdapter.java:36)
        at com.carrotsearch.randomizedtesting.ThreadLeakControl$StatementRunner.run(ThreadLeakControl.java:368)
        at com.carrotsearch.randomizedtesting.ThreadLeakControl.forkTimeoutingTask(ThreadLeakControl.java:817)
        at com.carrotsearch.randomizedtesting.ThreadLeakControl$3.evaluate(ThreadLeakControl.java:468)
        at com.carrotsearch.randomizedtesting.RandomizedRunner.runSingleTest(RandomizedRunner.java:943)
        at com.carrotsearch.randomizedtesting.RandomizedRunner$5.evaluate(RandomizedRunner.java:829)
        at com.carrotsearch.randomizedtesting.RandomizedRunner$6.evaluate(RandomizedRunner.java:879)
        at com.carrotsearch.randomizedtesting.RandomizedRunner$7.evaluate(RandomizedRunner.java:890)
        at com.carrotsearch.randomizedtesting.rules.StatementAdapter.evaluate(StatementAdapter.java:36)
        at com.carrotsearch.randomizedtesting.rules.SystemPropertiesRestoreRule$1.evaluate(SystemPropertiesRestoreRule.java:57)
        at org.apache.lucene.util.AbstractBeforeAfterRule$1.evaluate(AbstractBeforeAfterRule.java:45)
        at com.carrotsearch.randomizedtesting.rules.StatementAdapter.evaluate(StatementAdapter.java:36)
        at org.apache.lucene.util.TestRuleStoreClassName$1.evaluate(TestRuleStoreClassName.java:41)
        at com.carrotsearch.randomizedtesting.rules.NoShadowingOrOverridesOnMethodsRule$1.evaluate(NoShadowingOrOverridesOnMethodsRule.java:40)
        at com.carrotsearch.randomizedtesting.rules.NoShadowingOrOverridesOnMethodsRule$1.evaluate(NoShadowingOrOverridesOnMethodsRule.java:40)
        at com.carrotsearch.randomizedtesting.rules.StatementAdapter.evaluate(StatementAdapter.java:36)
        at com.carrotsearch.randomizedtesting.rules.StatementAdapter.evaluate(StatementAdapter.java:36)
        at com.carrotsearch.randomizedtesting.rules.StatementAdapter.evaluate(StatementAdapter.java:36)
        at org.apache.lucene.util.TestRuleAssertionsRequired$1.evaluate(TestRuleAssertionsRequired.java:53)
        at org.apache.lucene.util.TestRuleMarkFailure$1.evaluate(TestRuleMarkFailure.java:47)
        at org.apache.lucene.util.TestRuleIgnoreAfterMaxFailures$1.evaluate(TestRuleIgnoreAfterMaxFailures.java:64)
        at org.apache.lucene.util.TestRuleIgnoreTestSuites$1.evaluate(TestRuleIgnoreTestSuites.java:54)
        at com.carrotsearch.randomizedtesting.rules.StatementAdapter.evaluate(StatementAdapter.java:36)
        at com.carrotsearch.randomizedtesting.ThreadLeakControl$StatementRunner.run(ThreadLeakControl.java:368)
        at java.lang.Thread.run(Thread.java:748)




Build Log:
[...truncated 13813 lines...]
   [junit4] Suite: org.apache.solr.cloud.LeaderTragicEventTest
   [junit4]   2> Creating dataDir: /home/jenkins/workspace/Lucene-Solr-master-Linux/solr/build/solr-core/test/J1/temp/solr.cloud.LeaderTragicEventTest_E84D2EBDB3FC3E2A-001/init-core-data-001
   [junit4]   2> 1420908 INFO  (SUITE-LeaderTragicEventTest-seed#[E84D2EBDB3FC3E2A]-worker) [    ] o.a.s.SolrTestCaseJ4 Using PointFields (NUMERIC_POINTS_SYSPROP=true) w/NUMERIC_DOCVALUES_SYSPROP=true
   [junit4]   2> 1420909 INFO  (SUITE-LeaderTragicEventTest-seed#[E84D2EBDB3FC3E2A]-worker) [    ] o.a.s.SolrTestCaseJ4 Randomized ssl (true) and clientAuth (true) via: @org.apache.solr.util.RandomizeSSL(reason=, ssl=NaN, value=NaN, clientAuth=NaN)
   [junit4]   2> 1420909 INFO  (SUITE-LeaderTragicEventTest-seed#[E84D2EBDB3FC3E2A]-worker) [    ] o.a.s.SolrTestCaseJ4 SecureRandom sanity checks: test.solr.allowed.securerandom=null & java.security.egd=file:/dev/./urandom
   [junit4]   2> 1420910 INFO  (SUITE-LeaderTragicEventTest-seed#[E84D2EBDB3FC3E2A]-worker) [    ] o.a.s.c.MiniSolrCloudCluster Starting cluster of 2 servers in /home/jenkins/workspace/Lucene-Solr-master-Linux/solr/build/solr-core/test/J1/temp/solr.cloud.LeaderTragicEventTest_E84D2EBDB3FC3E2A-001/tempDir-001
   [junit4]   2> 1420910 INFO  (SUITE-LeaderTragicEventTest-seed#[E84D2EBDB3FC3E2A]-worker) [    ] o.a.s.c.ZkTestServer STARTING ZK TEST SERVER
   [junit4]   2> 1420910 INFO  (Thread-5294) [    ] o.a.s.c.ZkTestServer client port:0.0.0.0/0.0.0.0:0
   [junit4]   2> 1420910 INFO  (Thread-5294) [    ] o.a.s.c.ZkTestServer Starting server
   [junit4]   2> 1420911 ERROR (Thread-5294) [    ] o.a.z.s.ZooKeeperServer ZKShutdownHandler is not registered, so ZooKeeper server won't take any action on ERROR or SHUTDOWN server state changes
   [junit4]   2> 1421010 INFO  (SUITE-LeaderTragicEventTest-seed#[E84D2EBDB3FC3E2A]-worker) [    ] o.a.s.c.ZkTestServer start zk server on port:32883
   [junit4]   2> 1421012 INFO  (zkConnectionManagerCallback-8211-thread-1) [    ] o.a.s.c.c.ConnectionManager zkClient has connected
   [junit4]   2> 1421015 INFO  (jetty-launcher-8208-thread-2) [    ] o.e.j.s.Server jetty-9.4.11.v20180605; built: 2018-06-05T18:24:03.829Z; git: d5fc0523cfa96bfebfbda19606cad384d772f04c; jvm 1.8.0_172-b11
   [junit4]   2> 1421015 INFO  (jetty-launcher-8208-thread-1) [    ] o.e.j.s.Server jetty-9.4.11.v20180605; built: 2018-06-05T18:24:03.829Z; git: d5fc0523cfa96bfebfbda19606cad384d772f04c; jvm 1.8.0_172-b11
   [junit4]   2> 1421022 INFO  (jetty-launcher-8208-thread-1) [    ] o.e.j.s.session DefaultSessionIdManager workerName=node0
   [junit4]   2> 1421022 INFO  (jetty-launcher-8208-thread-1) [    ] o.e.j.s.session No SessionScavenger set, using defaults
   [junit4]   2> 1421022 INFO  (jetty-launcher-8208-thread-1) [    ] o.e.j.s.session node0 Scavenging every 600000ms
   [junit4]   2> 1421024 INFO  (jetty-launcher-8208-thread-2) [    ] o.e.j.s.session DefaultSessionIdManager workerName=node0
   [junit4]   2> 1421024 INFO  (jetty-launcher-8208-thread-2) [    ] o.e.j.s.session No SessionScavenger set, using defaults
   [junit4]   2> 1421024 INFO  (jetty-launcher-8208-thread-2) [    ] o.e.j.s.session node0 Scavenging every 600000ms
   [junit4]   2> 1421025 INFO  (jetty-launcher-8208-thread-1) [    ] o.e.j.s.h.ContextHandler Started o.e.j.s.ServletContextHandler@1414898{/solr,null,AVAILABLE}
   [junit4]   2> 1421025 INFO  (jetty-launcher-8208-thread-2) [    ] o.e.j.s.h.ContextHandler Started o.e.j.s.ServletContextHandler@be2fe0{/solr,null,AVAILABLE}
   [junit4]   2> 1421028 INFO  (jetty-launcher-8208-thread-1) [    ] o.e.j.s.AbstractConnector Started ServerConnector@1fac054{SSL,[ssl, http/1.1]}{127.0.0.1:42023}
   [junit4]   2> 1421028 INFO  (jetty-launcher-8208-thread-2) [    ] o.e.j.s.AbstractConnector Started ServerConnector@1507b{SSL,[ssl, http/1.1]}{127.0.0.1:46791}
   [junit4]   2> 1421028 INFO  (jetty-launcher-8208-thread-1) [    ] o.e.j.s.Server Started @1421094ms
   [junit4]   2> 1421028 INFO  (jetty-launcher-8208-thread-2) [    ] o.e.j.s.Server Started @1421094ms
   [junit4]   2> 1421028 INFO  (jetty-launcher-8208-thread-1) [    ] o.a.s.c.s.e.JettySolrRunner Jetty properties: {hostContext=/solr, hostPort=42023}
   [junit4]   2> 1421028 INFO  (jetty-launcher-8208-thread-2) [    ] o.a.s.c.s.e.JettySolrRunner Jetty properties: {hostContext=/solr, hostPort=46791}
   [junit4]   2> 1421028 ERROR (jetty-launcher-8208-thread-1) [    ] o.a.s.u.StartupLoggingUtils Missing Java Option solr.log.dir. Logging may be missing or incomplete.
   [junit4]   2> 1421028 ERROR (jetty-launcher-8208-thread-2) [    ] o.a.s.u.StartupLoggingUtils Missing Java Option solr.log.dir. Logging may be missing or incomplete.
   [junit4]   2> 1421028 INFO  (jetty-launcher-8208-thread-1) [    ] o.a.s.s.SolrDispatchFilter Using logger factory org.apache.logging.slf4j.Log4jLoggerFactory
   [junit4]   2> 1421028 INFO  (jetty-launcher-8208-thread-2) [    ] o.a.s.s.SolrDispatchFilter Using logger factory org.apache.logging.slf4j.Log4jLoggerFactory
   [junit4]   2> 1421028 INFO  (jetty-launcher-8208-thread-1) [    ] o.a.s.s.SolrDispatchFilter  ___      _       Welcome to Apache Solr™ version 8.0.0
   [junit4]   2> 1421028 INFO  (jetty-launcher-8208-thread-2) [    ] o.a.s.s.SolrDispatchFilter  ___      _       Welcome to Apache Solr™ version 8.0.0
   [junit4]   2> 1421028 INFO  (jetty-launcher-8208-thread-1) [    ] o.a.s.s.SolrDispatchFilter / __| ___| |_ _   Starting in cloud mode on port null
   [junit4]   2> 1421028 INFO  (jetty-launcher-8208-thread-2) [    ] o.a.s.s.SolrDispatchFilter / __| ___| |_ _   Starting in cloud mode on port null
   [junit4]   2> 1421028 INFO  (jetty-launcher-8208-thread-1) [    ] o.a.s.s.SolrDispatchFilter \__ \/ _ \ | '_|  Install dir: null
   [junit4]   2> 1421028 INFO  (jetty-launcher-8208-thread-2) [    ] o.a.s.s.SolrDispatchFilter \__ \/ _ \ | '_|  Install dir: null
   [junit4]   2> 1421028 INFO  (jetty-launcher-8208-thread-2) [    ] o.a.s.s.SolrDispatchFilter |___/\___/_|_|    Start time: 2018-07-11T20:24:20.573Z
   [junit4]   2> 1421028 INFO  (jetty-launcher-8208-thread-1) [    ] o.a.s.s.SolrDispatchFilter |___/\___/_|_|    Start time: 2018-07-11T20:24:20.573Z
   [junit4]   2> 1421030 INFO  (zkConnectionManagerCallback-8214-thread-1) [    ] o.a.s.c.c.ConnectionManager zkClient has connected
   [junit4]   2> 1421030 INFO  (zkConnectionManagerCallback-8215-thread-1) [    ] o.a.s.c.c.ConnectionManager zkClient has connected
   [junit4]   2> 1421030 INFO  (jetty-launcher-8208-thread-2) [    ] o.a.s.s.SolrDispatchFilter solr.xml found in ZooKeeper. Loading...
   [junit4]   2> 1421030 INFO  (jetty-launcher-8208-thread-1) [    ] o.a.s.s.SolrDispatchFilter solr.xml found in ZooKeeper. Loading...
   [junit4]   2> 1421506 INFO  (jetty-launcher-8208-thread-2) [    ] o.a.s.c.ZkContainer Zookeeper client=127.0.0.1:32883/solr
   [junit4]   2> 1421507 INFO  (zkConnectionManagerCallback-8219-thread-1) [    ] o.a.s.c.c.ConnectionManager zkClient has connected
   [junit4]   2> 1421510 INFO  (zkConnectionManagerCallback-8221-thread-1) [    ] o.a.s.c.c.ConnectionManager zkClient has connected
   [junit4]   2> 1421555 INFO  (jetty-launcher-8208-thread-2) [n:127.0.0.1:46791_solr    ] o.a.s.c.Overseer Overseer (id=null) closing
   [junit4]   2> 1421556 INFO  (jetty-launcher-8208-thread-2) [n:127.0.0.1:46791_solr    ] o.a.s.c.OverseerElectionContext I am going to be the leader 127.0.0.1:46791_solr
   [junit4]   2> 1421556 INFO  (jetty-launcher-8208-thread-2) [n:127.0.0.1:46791_solr    ] o.a.s.c.Overseer Overseer (id=72110667535024132-127.0.0.1:46791_solr-n_0000000000) starting
   [junit4]   2> 1421562 INFO  (zkConnectionManagerCallback-8228-thread-1) [    ] o.a.s.c.c.ConnectionManager zkClient has connected
   [junit4]   2> 1421563 INFO  (jetty-launcher-8208-thread-2) [n:127.0.0.1:46791_solr    ] o.a.s.c.s.i.ZkClientClusterStateProvider Cluster at 127.0.0.1:32883/solr ready
   [junit4]   2> 1421566 INFO  (jetty-launcher-8208-thread-2) [n:127.0.0.1:46791_solr    ] o.a.s.c.ZkController Register node as live in ZooKeeper:/live_nodes/127.0.0.1:46791_solr
   [junit4]   2> 1421575 INFO  (zkCallback-8227-thread-1) [    ] o.a.s.c.c.ZkStateReader Updated live nodes from ZooKeeper... (0) -> (1)
   [junit4]   2> 1421575 INFO  (zkCallback-8220-thread-1) [    ] o.a.s.c.c.ZkStateReader Updated live nodes from ZooKeeper... (0) -> (1)
   [junit4]   2> 1421592 INFO  (jetty-launcher-8208-thread-2) [n:127.0.0.1:46791_solr    ] o.a.s.h.a.MetricsHistoryHandler No .system collection, keeping metrics history in memory.
   [junit4]   2> 1421619 INFO  (jetty-launcher-8208-thread-2) [n:127.0.0.1:46791_solr    ] o.a.s.m.r.SolrJmxReporter JMX monitoring for 'solr_46791.solr.node' (registry 'solr.node') enabled at server: com.sun.jmx.mbeanserver.JmxMBeanServer@16ba0c9
   [junit4]   2> 1421626 INFO  (jetty-launcher-8208-thread-2) [n:127.0.0.1:46791_solr    ] o.a.s.m.r.SolrJmxReporter JMX monitoring for 'solr_46791.solr.jvm' (registry 'solr.jvm') enabled at server: com.sun.jmx.mbeanserver.JmxMBeanServer@16ba0c9
   [junit4]   2> 1421626 INFO  (jetty-launcher-8208-thread-2) [n:127.0.0.1:46791_solr    ] o.a.s.m.r.SolrJmxReporter JMX monitoring for 'solr_46791.solr.jetty' (registry 'solr.jetty') enabled at server: com.sun.jmx.mbeanserver.JmxMBeanServer@16ba0c9
   [junit4]   2> 1421627 INFO  (jetty-launcher-8208-thread-2) [n:127.0.0.1:46791_solr    ] o.a.s.c.CorePropertiesLocator Found 0 core definitions underneath /home/jenkins/workspace/Lucene-Solr-master-Linux/solr/build/solr-core/test/J1/temp/solr.cloud.LeaderTragicEventTest_E84D2EBDB3FC3E2A-001/tempDir-001/node2/.
   [junit4]   2> 1421693 INFO  (jetty-launcher-8208-thread-1) [    ] o.a.s.c.ZkContainer Zookeeper client=127.0.0.1:32883/solr
   [junit4]   2> 1421694 INFO  (zkConnectionManagerCallback-8233-thread-1) [    ] o.a.s.c.c.ConnectionManager zkClient has connected
   [junit4]   2> 1421695 INFO  (zkConnectionManagerCallback-8235-thread-1) [    ] o.a.s.c.c.ConnectionManager zkClient has connected
   [junit4]   2> 1421698 INFO  (jetty-launcher-8208-thread-1) [n:127.0.0.1:42023_solr    ] o.a.s.c.c.ZkStateReader Updated live nodes from ZooKeeper... (0) -> (1)
   [junit4]   2> 1421699 INFO  (jetty-launcher-8208-thread-1) [n:127.0.0.1:42023_solr    ] o.a.s.c.Overseer Overseer (id=null) closing
   [junit4]   2> 1421700 INFO  (jetty-launcher-8208-thread-1) [n:127.0.0.1:42023_solr    ] o.a.s.c.TransientSolrCoreCacheDefault Allocating transient cache for 2147483647 transient cores
   [junit4]   2> 1421700 INFO  (jetty-launcher-8208-thread-1) [n:127.0.0.1:42023_solr    ] o.a.s.c.ZkController Register node as live in ZooKeeper:/live_nodes/127.0.0.1:42023_solr
   [junit4]   2> 1421700 INFO  (zkCallback-8227-thread-1) [    ] o.a.s.c.c.ZkStateReader Updated live nodes from ZooKeeper... (1) -> (2)
   [junit4]   2> 1421700 INFO  (zkCallback-8220-thread-1) [    ] o.a.s.c.c.ZkStateReader Updated live nodes from ZooKeeper... (1) -> (2)
   [junit4]   2> 1421702 INFO  (zkCallback-8234-thread-1) [    ] o.a.s.c.c.ZkStateReader Updated live nodes from ZooKeeper... (1) -> (2)
   [junit4]   2> 1421720 INFO  (zkConnectionManagerCallback-8242-thread-1) [    ] o.a.s.c.c.ConnectionManager zkClient has connected
   [junit4]   2> 1421721 INFO  (jetty-launcher-8208-thread-1) [n:127.0.0.1:42023_solr    ] o.a.s.c.c.ZkStateReader Updated live nodes from ZooKeeper... (0) -> (2)
   [junit4]   2> 1421721 INFO  (jetty-launcher-8208-thread-1) [n:127.0.0.1:42023_solr    ] o.a.s.c.s.i.ZkClientClusterStateProvider Cluster at 127.0.0.1:32883/solr ready
   [junit4]   2> 1421721 INFO  (jetty-launcher-8208-thread-1) [n:127.0.0.1:42023_solr    ] o.a.s.h.a.MetricsHistoryHandler No .system collection, keeping metrics history in memory.
   [junit4]   2> 1421740 INFO  (jetty-launcher-8208-thread-1) [n:127.0.0.1:42023_solr    ] o.a.s.m.r.SolrJmxReporter JMX monitoring for 'solr_42023.solr.node' (registry 'solr.node') enabled at server: com.sun.jmx.mbeanserver.JmxMBeanServer@16ba0c9
   [junit4]   2> 1421748 INFO  (jetty-launcher-8208-thread-1) [n:127.0.0.1:42023_solr    ] o.a.s.m.r.SolrJmxReporter JMX monitoring for 'solr_42023.solr.jvm' (registry 'solr.jvm') enabled at server: com.sun.jmx.mbeanserver.JmxMBeanServer@16ba0c9
   [junit4]   2> 1421748 INFO  (jetty-launcher-8208-thread-1) [n:127.0.0.1:42023_solr    ] o.a.s.m.r.SolrJmxReporter JMX monitoring for 'solr_42023.solr.jetty' (registry 'solr.jetty') enabled at server: com.sun.jmx.mbeanserver.JmxMBeanServer@16ba0c9
   [junit4]   2> 1421749 INFO  (jetty-launcher-8208-thread-1) [n:127.0.0.1:42023_solr    ] o.a.s.c.CorePropertiesLocator Found 0 core definitions underneath /home/jenkins/workspace/Lucene-Solr-master-Linux/solr/build/solr-core/test/J1/temp/solr.cloud.LeaderTragicEventTest_E84D2EBDB3FC3E2A-001/tempDir-001/node1/.
   [junit4]   2> 1421773 INFO  (zkConnectionManagerCallback-8245-thread-1) [    ] o.a.s.c.c.ConnectionManager zkClient has connected
   [junit4]   2> 1421776 INFO  (zkConnectionManagerCallback-8250-thread-1) [    ] o.a.s.c.c.ConnectionManager zkClient has connected
   [junit4]   2> 1421777 INFO  (SUITE-LeaderTragicEventTest-seed#[E84D2EBDB3FC3E2A]-worker) [    ] o.a.s.c.c.ZkStateReader Updated live nodes from ZooKeeper... (0) -> (2)
   [junit4]   2> 1421777 INFO  (SUITE-LeaderTragicEventTest-seed#[E84D2EBDB3FC3E2A]-worker) [    ] o.a.s.c.s.i.ZkClientClusterStateProvider Cluster at 127.0.0.1:32883/solr ready
   [junit4]   2> 1421795 INFO  (TEST-LeaderTragicEventTest.test-seed#[E84D2EBDB3FC3E2A]) [    ] o.a.s.SolrTestCaseJ4 ###Starting test
   [junit4]   2> 1421842 INFO  (qtp26672895-24587) [n:127.0.0.1:42023_solr    ] o.a.s.h.a.CollectionsHandler Invoked Collection Action :create with params collection.configName=config&name=collection1&nrtReplicas=2&action=CREATE&numShards=1&wt=javabin&version=2 and sendToOCPQueue=true
   [junit4]   2> 1421843 INFO  (OverseerThreadFactory-6788-thread-1) [    ] o.a.s.c.a.c.CreateCollectionCmd Create collection collection1
   [junit4]   2> 1421947 INFO  (OverseerStateUpdate-72110667535024132-127.0.0.1:46791_solr-n_0000000000) [    ] o.a.s.c.o.SliceMutator createReplica() {
   [junit4]   2>   "operation":"ADDREPLICA",
   [junit4]   2>   "collection":"collection1",
   [junit4]   2>   "shard":"shard1",
   [junit4]   2>   "core":"collection1_shard1_replica_n1",
   [junit4]   2>   "state":"down",
   [junit4]   2>   "base_url":"https://127.0.0.1:42023/solr",
   [junit4]   2>   "type":"NRT",
   [junit4]   2>   "waitForFinalState":"false"}
   [junit4]   2> 1421948 INFO  (OverseerStateUpdate-72110667535024132-127.0.0.1:46791_solr-n_0000000000) [    ] o.a.s.c.o.SliceMutator createReplica() {
   [junit4]   2>   "operation":"ADDREPLICA",
   [junit4]   2>   "collection":"collection1",
   [junit4]   2>   "shard":"shard1",
   [junit4]   2>   "core":"collection1_shard1_replica_n2",
   [junit4]   2>   "state":"down",
   [junit4]   2>   "base_url":"https://127.0.0.1:46791/solr",
   [junit4]   2>   "type":"NRT",
   [junit4]   2>   "waitForFinalState":"false"}
   [junit4]   2> 1422152 INFO  (qtp26672895-24661) [n:127.0.0.1:42023_solr    x:collection1_shard1_replica_n1] o.a.s.h.a.CoreAdminOperation core create command qt=/admin/cores&coreNodeName=core_node3&collection.configName=config&newCollection=true&name=collection1_shard1_replica_n1&action=CREATE&numShards=1&collection=collection1&shard=shard1&wt=javabin&version=2&replicaType=NRT
   [junit4]   2> 1422187 INFO  (qtp10905298-24592) [n:127.0.0.1:46791_solr    x:collection1_shard1_replica_n2] o.a.s.h.a.CoreAdminOperation core create command qt=/admin/cores&coreNodeName=core_node4&collection.configName=config&newCollection=true&name=collection1_shard1_replica_n2&action=CREATE&numShards=1&collection=collection1&shard=shard1&wt=javabin&version=2&replicaType=NRT
   [junit4]   2> 1422188 INFO  (qtp10905298-24592) [n:127.0.0.1:46791_solr    x:collection1_shard1_replica_n2] o.a.s.c.TransientSolrCoreCacheDefault Allocating transient cache for 2147483647 transient cores
   [junit4]   2> 1423164 INFO  (qtp26672895-24661) [n:127.0.0.1:42023_solr c:collection1 s:shard1 r:core_node3 x:collection1_shard1_replica_n1] o.a.s.c.SolrConfig Using Lucene MatchVersion: 8.0.0
   [junit4]   2> 1423168 INFO  (qtp26672895-24661) [n:127.0.0.1:42023_solr c:collection1 s:shard1 r:core_node3 x:collection1_shard1_replica_n1] o.a.s.s.IndexSchema [collection1_shard1_replica_n1] Schema name=minimal
   [junit4]   2> 1423170 INFO  (qtp26672895-24661) [n:127.0.0.1:42023_solr c:collection1 s:shard1 r:core_node3 x:collection1_shard1_replica_n1] o.a.s.s.IndexSchema Loaded schema minimal/1.1 with uniqueid field id
   [junit4]   2> 1423170 INFO  (qtp26672895-24661) [n:127.0.0.1:42023_solr c:collection1 s:shard1 r:core_node3 x:collection1_shard1_replica_n1] o.a.s.c.CoreContainer Creating SolrCore 'collection1_shard1_replica_n1' using configuration from collection collection1, trusted=true
   [junit4]   2> 1423170 INFO  (qtp26672895-24661) [n:127.0.0.1:42023_solr c:collection1 s:shard1 r:core_node3 x:collection1_shard1_replica_n1] o.a.s.m.r.SolrJmxReporter JMX monitoring for 'solr_42023.solr.core.collection1.shard1.replica_n1' (registry 'solr.core.collection1.shard1.replica_n1') enabled at server: com.sun.jmx.mbeanserver.JmxMBeanServer@16ba0c9
   [junit4]   2> 1423170 INFO  (qtp26672895-24661) [n:127.0.0.1:42023_solr c:collection1 s:shard1 r:core_node3 x:collection1_shard1_replica_n1] o.a.s.c.SolrCore solr.RecoveryStrategy.Builder
   [junit4]   2> 1423170 INFO  (qtp26672895-24661) [n:127.0.0.1:42023_solr c:collection1 s:shard1 r:core_node3 x:collection1_shard1_replica_n1] o.a.s.c.SolrCore [[collection1_shard1_replica_n1] ] Opening new SolrCore at [/home/jenkins/workspace/Lucene-Solr-master-Linux/solr/build/solr-core/test/J1/temp/solr.cloud.LeaderTragicEventTest_E84D2EBDB3FC3E2A-001/tempDir-001/node1/collection1_shard1_replica_n1], dataDir=[/home/jenkins/workspace/Lucene-Solr-master-Linux/solr/build/solr-core/test/J1/temp/solr.cloud.LeaderTragicEventTest_E84D2EBDB3FC3E2A-001/tempDir-001/node1/./collection1_shard1_replica_n1/data/]
   [junit4]   2> 1423197 INFO  (qtp10905298-24592) [n:127.0.0.1:46791_solr c:collection1 s:shard1 r:core_node4 x:collection1_shard1_replica_n2] o.a.s.c.SolrConfig Using Lucene MatchVersion: 8.0.0
   [junit4]   2> 1423211 INFO  (qtp10905298-24592) [n:127.0.0.1:46791_solr c:collection1 s:shard1 r:core_node4 x:collection1_shard1_replica_n2] o.a.s.s.IndexSchema [collection1_shard1_replica_n2] Schema name=minimal
   [junit4]   2> 1423212 INFO  (qtp10905298-24592) [n:127.0.0.1:46791_solr c:collection1 s:shard1 r:core_node4 x:collection1_shard1_replica_n2] o.a.s.s.IndexSchema Loaded schema minimal/1.1 with uniqueid field id
   [junit4]   2> 1423212 INFO  (qtp10905298-24592) [n:127.0.0.1:46791_solr c:collection1 s:shard1 r:core_node4 x:collection1_shard1_replica_n2] o.a.s.c.CoreContainer Creating SolrCore 'collection1_shard1_replica_n2' using configuration from collection collection1, trusted=true
   [junit4]   2> 1423213 INFO  (qtp10905298-24592) [n:127.0.0.1:46791_solr c:collection1 s:shard1 r:core_node4 x:collection1_shard1_replica_n2] o.a.s.m.r.SolrJmxReporter JMX monitoring for 'solr_46791.solr.core.collection1.shard1.replica_n2' (registry 'solr.core.collection1.shard1.replica_n2') enabled at server: com.sun.jmx.mbeanserver.JmxMBeanServer@16ba0c9
   [junit4]   2> 1423213 INFO  (qtp10905298-24592) [n:127.0.0.1:46791_solr c:collection1 s:shard1 r:core_node4 x:collection1_shard1_replica_n2] o.a.s.c.SolrCore solr.RecoveryStrategy.Builder
   [junit4]   2> 1423213 INFO  (qtp10905298-24592) [n:127.0.0.1:46791_solr c:collection1 s:shard1 r:core_node4 x:collection1_shard1_replica_n2] o.a.s.c.SolrCore [[collection1_shard1_replica_n2] ] Opening new SolrCore at [/home/jenkins/workspace/Lucene-Solr-master-Linux/solr/build/solr-core/test/J1/temp/solr.cloud.LeaderTragicEventTest_E84D2EBDB3FC3E2A-001/tempDir-001/node2/collection1_shard1_replica_n2], dataDir=[/home/jenkins/workspace/Lucene-Solr-master-Linux/solr/build/solr-core/test/J1/temp/solr.cloud.LeaderTragicEventTest_E84D2EBDB3FC3E2A-001/tempDir-001/node2/./collection1_shard1_replica_n2/data/]
   [junit4]   2> 1423223 INFO  (qtp26672895-24661) [n:127.0.0.1:42023_solr c:collection1 s:shard1 r:core_node3 x:collection1_shard1_replica_n1] o.a.s.u.UpdateHandler Using UpdateLog implementation: org.apache.solr.update.UpdateLog
   [junit4]   2> 1423223 INFO  (qtp26672895-24661) [n:127.0.0.1:42023_solr c:collection1 s:shard1 r:core_node3 x:collection1_shard1_replica_n1] o.a.s.u.UpdateLog Initializing UpdateLog: dataDir=null defaultSyncLevel=FLUSH numRecordsToKeep=100 maxNumLogsToKeep=10 numVersionBuckets=65536
   [junit4]   2> 1423225 INFO  (qtp26672895-24661) [n:127.0.0.1:42023_solr c:collection1 s:shard1 r:core_node3 x:collection1_shard1_replica_n1] o.a.s.u.CommitTracker Hard AutoCommit: disabled
   [junit4]   2> 1423225 INFO  (qtp26672895-24661) [n:127.0.0.1:42023_solr c:collection1 s:shard1 r:core_node3 x:collection1_shard1_replica_n1] o.a.s.u.CommitTracker Soft AutoCommit: disabled
   [junit4]   2> 1423226 INFO  (qtp26672895-24661) [n:127.0.0.1:42023_solr c:collection1 s:shard1 r:core_node3 x:collection1_shard1_replica_n1] o.a.s.s.SolrIndexSearcher Opening [Searcher@1b38564[collection1_shard1_replica_n1] main]
   [junit4]   2> 1423227 INFO  (qtp26672895-24661) [n:127.0.0.1:42023_solr c:collection1 s:shard1 r:core_node3 x:collection1_shard1_replica_n1] o.a.s.r.ManagedResourceStorage Configured ZooKeeperStorageIO with znodeBase: /configs/config
   [junit4]   2> 1423227 INFO  (qtp26672895-24661) [n:127.0.0.1:42023_solr c:collection1 s:shard1 r:core_node3 x:collection1_shard1_replica_n1] o.a.s.r.ManagedResourceStorage Loaded null at path _rest_managed.json using ZooKeeperStorageIO:path=/configs/config
   [junit4]   2> 1423228 INFO  (qtp26672895-24661) [n:127.0.0.1:42023_solr c:collection1 s:shard1 r:core_node3 x:collection1_shard1_replica_n1] o.a.s.h.ReplicationHandler Commits will be reserved for 10000ms.
   [junit4]   2> 1423228 INFO  (qtp26672895-24661) [n:127.0.0.1:42023_solr c:collection1 s:shard1 r:core_node3 x:collection1_shard1_replica_n1] o.a.s.u.UpdateLog Could not find max version in index or recent updates, using new clock 1605727066807861248
   [junit4]   2> 1423229 INFO  (searcherExecutor-6800-thread-1-processing-n:127.0.0.1:42023_solr x:collection1_shard1_replica_n1 c:collection1 s:shard1 r:core_node3) [n:127.0.0.1:42023_solr c:collection1 s:shard1 r:core_node3 x:collection1_shard1_replica_n1] o.a.s.c.SolrCore [collection1_shard1_replica_n1] Registered new searcher Searcher@1b38564[collection1_shard1_replica_n1] main{ExitableDirectoryReader(UninvertingDirectoryReader())}
   [junit4]   2> 1423233 INFO  (qtp26672895-24661) [n:127.0.0.1:42023_solr c:collection1 s:shard1 r:core_node3 x:collection1_shard1_replica_n1] o.a.s.c.ZkShardTerms Successful update of terms at /collections/collection1/terms/shard1 to Terms{values={core_node3=0}, version=0}
   [junit4]   2> 1423235 INFO  (qtp26672895-24661) [n:127.0.0.1:42023_solr c:collection1 s:shard1 r:core_node3 x:collection1_shard1_replica_n1] o.a.s.c.ShardLeaderElectionContext Waiting until we see more replicas up for shard shard1: total=2 found=1 timeoutin=9999ms
   [junit4]   2> 1423249 INFO  (qtp10905298-24592) [n:127.0.0.1:46791_solr c:collection1 s:shard1 r:core_node4 x:collection1_shard1_replica_n2] o.a.s.u.UpdateHandler Using UpdateLog implementation: org.apache.solr.update.UpdateLog
   [junit4]   2> 1423249 INFO  (qtp10905298-24592) [n:127.0.0.1:46791_solr c:collection1 s:shard1 r:core_node4 x:collection1_shard1_replica_n2] o.a.s.u.UpdateLog Initializing UpdateLog: dataDir=null defaultSyncLevel=FLUSH numRecordsToKeep=100 maxNumLogsToKeep=10 numVersionBuckets=65536
   [junit4]   2> 1423250 INFO  (qtp10905298-24592) [n:127.0.0.1:46791_solr c:collection1 s:shard1 r:core_node4 x:collection1_shard1_replica_n2] o.a.s.u.CommitTracker Hard AutoCommit: disabled
   [junit4]   2> 1423250 INFO  (qtp10905298-24592) [n:127.0.0.1:46791_solr c:collection1 s:shard1 r:core_node4 x:collection1_shard1_replica_n2] o.a.s.u.CommitTracker Soft AutoCommit: disabled
   [junit4]   2> 1423251 INFO  (qtp10905298-24592) [n:127.0.0.1:46791_solr c:collection1 s:shard1 r:core_node4 x:collection1_shard1_replica_n2] o.a.s.s.SolrIndexSearcher Opening [Searcher@b3ca48[collection1_shard1_replica_n2] main]
   [junit4]   2> 1423252 INFO  (qtp10905298-24592) [n:127.0.0.1:46791_solr c:collection1 s:shard1 r:core_node4 x:collection1_shard1_replica_n2] o.a.s.r.ManagedResourceStorage Configured ZooKeeperStorageIO with znodeBase: /configs/config
   [junit4]   2> 1423253 INFO  (qtp10905298-24592) [n:127.0.0.1:46791_solr c:collection1 s:shard1 r:core_node4 x:collection1_shard1_replica_n2] o.a.s.r.ManagedResourceStorage Loaded null at path _rest_managed.json using ZooKeeperStorageIO:path=/configs/config
   [junit4]   2> 1423253 INFO  (qtp10905298-24592) [n:127.0.0.1:46791_solr c:collection1 s:shard1 r:core_node4 x:collection1_shard1_replica_n2] o.a.s.h.ReplicationHandler Commits will be reserved for 10000ms.
   [junit4]   2> 1423253 INFO  (qtp10905298-24592) [n:127.0.0.1:46791_solr c:collection1 s:shard1 r:core_node4 x:collection1_shard1_replica_n2] o.a.s.u.UpdateLog Could not find max version in index or recent updates, using new clock 1605727066834075648
   [junit4]   2> 1423254 INFO  (searcherExecutor-6802-thread-1-processing-n:127.0.0.1:46791_solr x:collection1_shard1_replica_n2 c:collection1 s:shard1 r:core_node4) [n:127.0.0.1:46791_solr c:collection1 s:shard1 r:core_node4 x:collection1_shard1_replica_n2] o.a.s.c.SolrCore [collection1_shard1_replica_n2] Registered new searcher Searcher@b3ca48[collection1_shard1_replica_n2] main{ExitableDirectoryReader(UninvertingDirectoryReader())}
   [junit4]   2> 1423256 INFO  (qtp10905298-24592) [n:127.0.0.1:46791_solr c:collection1 s:shard1 r:core_node4 x:collection1_shard1_replica_n2] o.a.s.c.ZkShardTerms Successful update of terms at /collections/collection1/terms/shard1 to Terms{values={core_node3=0, core_node4=0}, version=1}
   [junit4]   2> 1423735 INFO  (qtp26672895-24661) [n:127.0.0.1:42023_solr c:collection1 s:shard1 r:core_node3 x:collection1_shard1_replica_n1] o.a.s.c.ShardLeaderElectionContext Enough replicas found to continue.
   [junit4]   2> 1423735 INFO  (qtp26672895-24661) [n:127.0.0.1:42023_solr c:collection1 s:shard1 r:core_node3 x:collection1_shard1_replica_n1] o.a.s.c.ShardLeaderElectionContext I may be the new leader - try and sync
   [junit4]   2> 1423736 INFO  (qtp26672895-24661) [n:127.0.0.1:42023_solr c:collection1 s:shard1 r:core_node3 x:collection1_shard1_replica_n1] o.a.s.c.SyncStrategy Sync replicas to https://127.0.0.1:42023/solr/collection1_shard1_replica_n1/
   [junit4]   2> 1423736 INFO  (qtp26672895-24661) [n:127.0.0.1:42023_solr c:collection1 s:shard1 r:core_node3 x:collection1_shard1_replica_n1] o.a.s.u.PeerSync PeerSync: core=collection1_shard1_replica_n1 url=https://127.0.0.1:42023/solr START replicas=[https://127.0.0.1:46791/solr/collection1_shard1_replica_n2/] nUpdates=100
   [junit4]   2> 1423736 INFO  (qtp26672895-24661) [n:127.0.0.1:42023_solr c:collection1 s:shard1 r:core_node3 x:collection1_shard1_replica_n1] o.a.s.u.PeerSync PeerSync: core=collection1_shard1_replica_n1 url=https://127.0.0.1:42023/solr DONE.  We have no versions.  sync failed.
   [junit4]   2> 1423739 INFO  (qtp10905298-24595) [n:127.0.0.1:46791_solr c:collection1 s:shard1 r:core_node4 x:collection1_shard1_replica_n2] o.a.s.c.S.Request [collection1_shard1_replica_n2]  webapp=/solr path=/get params={distrib=false&qt=/get&fingerprint=false&getVersions=100&wt=javabin&version=2} status=0 QTime=0
   [junit4]   2> 1423739 INFO  (qtp26672895-24661) [n:127.0.0.1:42023_solr c:collection1 s:shard1 r:core_node3 x:collection1_shard1_replica_n1] o.a.s.c.SyncStrategy Leader's attempt to sync with shard failed, moving to the next candidate
   [junit4]   2> 1423739 INFO  (qtp26672895-24661) [n:127.0.0.1:42023_solr c:collection1 s:shard1 r:core_node3 x:collection1_shard1_replica_n1] o.a.s.c.ShardLeaderElectionContext We failed sync, but we have no versions - we can't sync in that case - we were active before, so become leader anyway
   [junit4]   2> 1423739 INFO  (qtp26672895-24661) [n:127.0.0.1:42023_solr c:collection1 s:shard1 r:core_node3 x:collection1_shard1_replica_n1] o.a.s.c.ShardLeaderElectionContext Found all replicas participating in election, clear LIR
   [junit4]   2> 1423741 INFO  (qtp26672895-24661) [n:127.0.0.1:42023_solr c:collection1 s:shard1 r:core_node3 x:collection1_shard1_replica_n1] o.a.s.c.ShardLeaderElectionContext I am the new leader: https://127.0.0.1:42023/solr/collection1_shard1_replica_n1/ shard1
   [junit4]   2> 1423843 INFO  (qtp26672895-24661) [n:127.0.0.1:42023_solr c:collection1 s:shard1 r:core_node3 x:collection1_shard1_replica_n1] o.a.s.c.ZkController I am the leader, no recovery necessary
   [junit4]   2> 1423844 INFO  (qtp26672895-24661) [n:127.0.0.1:42023_solr c:collection1 s:shard1 r:core_node3 x:collection1_shard1_replica_n1] o.a.s.s.HttpSolrCall [admin] webapp=null path=/admin/cores params={qt=/admin/cores&coreNodeName=core_node3&collection.configName=config&newCollection=true&name=collection1_shard1_replica_n1&action=CREATE&numShards=1&collection=collection1&shard=shard1&wt=javabin&version=2&replicaType=NRT} status=0 QTime=1692
   [junit4]   2> 1423944 INFO  (zkCallback-8234-thread-1) [    ] o.a.s.c.c.ZkStateReader A cluster state change: [WatchedEvent state:SyncConnected type:NodeDataChanged path:/collections/collection1/state.json] for collection [collection1] has occurred - updating... (live nodes size: [2])
   [junit4]   2> 1424293 INFO  (qtp10905298-24592) [n:127.0.0.1:46791_solr c:collection1 s:shard1 r:core_node4 x:collection1_shard1_replica_n2] o.a.s.s.HttpSolrCall [admin] webapp=null path=/admin/cores params={qt=/admin/cores&coreNodeName=core_node4&collection.configName=config&newCollection=true&name=collection1_shard1_replica_n2&action=CREATE&numShards=1&collection=collection1&shard=shard1&wt=javabin&version=2&replicaType=NRT} status=0 QTime=2105
   [junit4]   2> 1424294 INFO  (qtp26672895-24587) [n:127.0.0.1:42023_solr    ] o.a.s.h.a.CollectionsHandler Wait for new collection to be active for at most 30 seconds. Check all shard replicas
   [junit4]   2> 1424361 INFO  (zkCallback-8234-thread-1) [    ] o.a.s.c.c.ZkStateReader A cluster state change: [WatchedEvent state:SyncConnected type:NodeDataChanged path:/collections/collection1/state.json] for collection [collection1] has occurred - updating... (live nodes size: [2])
   [junit4]   2> 1424361 INFO  (zkCallback-8220-thread-1) [    ] o.a.s.c.c.ZkStateReader A cluster state change: [WatchedEvent state:SyncConnected type:NodeDataChanged path:/collections/collection1/state.json] for collection [collection1] has occurred - updating... (live nodes size: [2])
   [junit4]   2> 1425295 INFO  (qtp26672895-24587) [n:127.0.0.1:42023_solr    ] o.a.s.s.HttpSolrCall [admin] webapp=null path=/admin/collections params={collection.configName=config&name=collection1&nrtReplicas=2&action=CREATE&numShards=1&wt=javabin&version=2} status=0 QTime=3452
   [junit4]   2> 1425303 INFO  (qtp26672895-24587) [n:127.0.0.1:42023_solr c:collection1 s:shard1 r:core_node3 x:collection1_shard1_replica_n1] o.a.s.c.ZkShardTerms Successful update of terms at /collections/collection1/terms/shard1 to Terms{values={core_node3=1, core_node4=1}, version=2}
   [junit4]   2> 1425305 INFO  (qtp10905298-24592) [n:127.0.0.1:46791_solr c:collection1 s:shard1 r:core_node4 x:collection1_shard1_replica_n2] o.a.s.u.p.LogUpdateProcessorFactory [collection1_shard1_replica_n2]  webapp=/solr path=/update params={update.distrib=FROMLEADER&distrib.from=https://127.0.0.1:42023/solr/collection1_shard1_replica_n1/&wt=javabin&version=2}{add=[0 (1605727068980510720)]} 0 0
   [junit4]   2> 1425306 INFO  (qtp26672895-24587) [n:127.0.0.1:42023_solr c:collection1 s:shard1 r:core_node3 x:collection1_shard1_replica_n1] o.a.s.u.p.LogUpdateProcessorFactory [collection1_shard1_replica_n1]  webapp=/solr path=/update params={wt=javabin&version=2}{add=[0 (1605727068980510720)]} 0 5
   [junit4]   2> 1425308 INFO  (qtp10905298-24595) [n:127.0.0.1:46791_solr c:collection1 s:shard1 r:core_node4 x:collection1_shard1_replica_n2] o.a.s.u.DirectUpdateHandler2 start commit{_version_=1605727068988899328,optimize=false,openSearcher=true,waitSearcher=true,expungeDeletes=false,softCommit=false,prepareCommit=false}
   [junit4]   2> 1425308 INFO  (qtp10905298-24595) [n:127.0.0.1:46791_solr c:collection1 s:shard1 r:core_node4 x:collection1_shard1_replica_n2] o.a.s.u.SolrIndexWriter Calling setCommitData with IW:org.apache.solr.update.SolrIndexWriter@35c70c commitCommandVersion:1605727068988899328
   [junit4]   2> 1425311 INFO  (qtp26672895-24581) [n:127.0.0.1:42023_solr c:collection1 s:shard1 r:core_node3 x:collection1_shard1_replica_n1] o.a.s.u.DirectUpdateHandler2 start commit{_version_=1605727068992045056,optimize=false,openSearcher=true,waitSearcher=true,expungeDeletes=false,softCommit=false,prepareCommit=false}
   [junit4]   2> 1425311 INFO  (qtp26672895-24581) [n:127.0.0.1:42023_solr c:collection1 s:shard1 r:core_node3 x:collection1_shard1_replica_n1] o.a.s.u.SolrIndexWriter Calling setCommitData with IW:org.apache.solr.update.SolrIndexWriter@12d99e2 commitCommandVersion:1605727068992045056
   [junit4]   2> 1425311 INFO  (qtp10905298-24595) [n:127.0.0.1:46791_solr c:collection1 s:shard1 r:core_node4 x:collection1_shard1_replica_n2] o.a.s.s.SolrIndexSearcher Opening [Searcher@16f5587[collection1_shard1_replica_n2] main]
   [junit4]   2> 1425312 INFO  (qtp10905298-24595) [n:127.0.0.1:46791_solr c:collection1 s:shard1 r:core_node4 x:collection1_shard1_replica_n2] o.a.s.u.DirectUpdateHandler2 end_commit_flush
   [junit4]   2> 1425313 INFO  (searcherExecutor-6802-thread-1-processing-n:127.0.0.1:46791_solr x:collection1_shard1_replica_n2 c:collection1 s:shard1 r:core_node4) [n:127.0.0.1:46791_solr c:collection1 s:shard1 r:core_node4 x:collection1_shard1_replica_n2] o.a.s.c.SolrCore [collection1_shard1_replica_n2] Registered new searcher Searcher@16f5587[collection1_shard1_replica_n2] main{ExitableDirectoryReader(UninvertingDirectoryReader(Uninverting(_0(8.0.0):C1)))}
   [junit4]   2> 1425313 INFO  (qtp10905298-24595) [n:127.0.0.1:46791_solr c:collection1 s:shard1 r:core_node4 x:collection1_shard1_replica_n2] o.a.s.u.p.LogUpdateProcessorFactory [collection1_shard1_replica_n2]  webapp=/solr path=/update params={update.distrib=FROMLEADER&waitSearcher=true&openSearcher=true&commit=true&softCommit=false&distrib.from=https://127.0.0.1:42023/solr/collection1_shard1_replica_n1/&commit_end_point=true&wt=javabin&version=2&expungeDeletes=false}{commit=} 0 5
   [junit4]   2> 1425316 INFO  (qtp26672895-24581) [n:127.0.0.1:42023_solr c:collection1 s:shard1 r:core_node3 x:collection1_shard1_replica_n1] o.a.s.s.SolrIndexSearcher Opening [Searcher@11e8b61[collection1_shard1_replica_n1] main]
   [junit4]   2> 1425317 INFO  (qtp26672895-24581) [n:127.0.0.1:42023_solr c:collection1 s:shard1 r:core_node3 x:collection1_shard1_replica_n1] o.a.s.u.DirectUpdateHandler2 end_commit_flush
   [junit4]   2> 1425318 INFO  (searcherExecutor-6800-thread-1-processing-n:127.0.0.1:42023_solr x:collection1_shard1_replica_n1 c:collection1 s:shard1 r:core_node3) [n:127.0.0.1:42023_solr c:collection1 s:shard1 r:core_node3 x:collection1_shard1_replica_n1] o.a.s.c.SolrCore [collection1_shard1_replica_n1] Registered new searcher Searcher@11e8b61[collection1_shard1_replica_n1] main{ExitableDirectoryReader(UninvertingDirectoryReader(Uninverting(_0(8.0.0):C1)))}
   [junit4]   2> 1425318 INFO  (qtp26672895-24581) [n:127.0.0.1:42023_solr c:collection1 s:shard1 r:core_node3 x:collection1_shard1_replica_n1] o.a.s.u.p.LogUpdateProcessorFactory [collection1_shard1_replica_n1]  webapp=/solr path=/update params={update.distrib=FROMLEADER&waitSearcher=true&openSearcher=true&commit=true&softCommit=false&distrib.from=https://127.0.0.1:42023/solr/collection1_shard1_replica_n1/&commit_end_point=true&wt=javabin&version=2&expungeDeletes=false}{commit=} 0 8
   [junit4]   2> 1425318 INFO  (qtp26672895-24661) [n:127.0.0.1:42023_solr c:collection1 s:shard1 r:core_node3 x:collection1_shard1_replica_n1] o.a.s.u.p.LogUpdateProcessorFactory [collection1_shard1_replica_n1]  webapp=/solr path=/update params={waitSearcher=true&commit=true&softCommit=false&wt=javabin&version=2}{commit=} 0 12
   [junit4]   2> 1425321 INFO  (qtp10905298-24592) [n:127.0.0.1:46791_solr c:collection1 s:shard1 r:core_node4 x:collection1_shard1_replica_n2] o.a.s.u.p.LogUpdateProcessorFactory [collection1_shard1_replica_n2]  webapp=/solr path=/update params={update.distrib=FROMLEADER&distrib.from=https://127.0.0.1:42023/solr/collection1_shard1_replica_n1/&wt=javabin&version=2}{add=[1 (1605727069000433664)]} 0 0
   [junit4]   2> 1425321 INFO  (qtp26672895-24587) [n:127.0.0.1:42023_solr c:collection1 s:shard1 r:core_node3 x:collection1_shard1_replica_n1] o.a.s.u.p.LogUpdateProcessorFactory [collection1_shard1_replica_n1]  webapp=/solr path=/update params={wt=javabin&version=2}{add=[1 (1605727069000433664)]} 0 2
   [junit4]   2> 1425322 INFO  (qtp26672895-24583) [n:127.0.0.1:42023_solr c:collection1 s:shard1 r:core_node3 x:collection1_shard1_replica_n1] o.a.s.u.DirectUpdateHandler2 start commit{_version_=1605727069003579392,optimize=false,openSearcher=true,waitSearcher=true,expungeDeletes=false,softCommit=false,prepareCommit=false}
   [junit4]   2> 1425322 INFO  (qtp10905298-24595) [n:127.0.0.1:46791_solr c:collection1 s:shard1 r:core_node4 x:collection1_shard1_replica_n2] o.a.s.u.DirectUpdateHandler2 start commit{_version_=1605727069003579392,optimize=false,openSearcher=true,waitSearcher=true,expungeDeletes=false,softCommit=false,prepareCommit=false}
   [junit4]   2> 1425322 INFO  (qtp26672895-24583) [n:127.0.0.1:42023_solr c:collection1 s:shard1 r:core_node3 x:collection1_shard1_replica_n1] o.a.s.u.SolrIndexWriter Calling setCommitData with IW:org.apache.solr.update.SolrIndexWriter@12d99e2 commitCommandVersion:1605727069003579392
   [junit4]   2> 1425322 INFO  (qtp10905298-24595) [n:127.0.0.1:46791_solr c:collection1 s:shard1 r:core_node4 x:collection1_shard1_replica_n2] o.a.s.u.SolrIndexWriter Calling setCommitData with IW:org.apache.solr.update.SolrIndexWriter@35c70c commitCommandVersion:1605727069003579392
   [junit4]   2> 1425323 INFO  (qtp26672895-24583) [n:127.0.0.1:42023_solr c:collection1 s:shard1 r:core_node3 x:collection1_shard1_replica_n1] o.a.s.s.SolrIndexSearcher Opening [Searcher@deb94a[collection1_shard1_replica_n1] main]
   [junit4]   2> 1425323 INFO  (qtp10905298-24595) [n:127.0.0.1:46791_solr c:collection1 s:shard1 r:core_node4 x:collection1_shard1_replica_n2] o.a.s.s.SolrIndexSearcher Opening [Searcher@4f019d[collection1_shard1_replica_n2] main]
   [junit4]   2> 1425324 INFO  (qtp26672895-24583) [n:127.0.0.1:42023_solr c:collection1 s:shard1 r:core_node3 x:collection1_shard1_replica_n1] o.a.s.u.DirectUpdateHandler2 end_commit_flush
   [junit4]   2> 1425324 INFO  (qtp10905298-24595) [n:127.0.0.1:46791_solr c:collection1 s:shard1 r:core_node4 x:collection1_shard1_replica_n2] o.a.s.u.DirectUpdateHandler2 end_commit_flush
   [junit4]   2> 1425325 INFO  (searcherExecutor-6800-thread-1-processing-n:127.0.0.1:42023_solr x:collection1_shard1_replica_n1 c:collection1 s:shard1 r:core_node3) [n:127.0.0.1:42023_solr c:collection1 s:shard1 r:core_node3 x:collection1_shard1_replica_n1] o.a.s.c.SolrCore [collection1_shard1_replica_n1] Registered new searcher Searcher@deb94a[collection1_shard1_replica_n1] main{ExitableDirectoryReader(UninvertingDirectoryReader(Uninverting(_0(8.0.0):C1) Uninverting(_1(8.0.0):C1)))}
   [junit4]   2> 1425325 INFO  (searcherExecutor-6802-thread-1-processing-n:127.0.0.1:46791_solr x:collection1_shard1_replica_n2 c:collection1 s:shard1 r:core_node4) [n:127.0.0.1:46791_solr c:collection1 s:shard1 r:core_node4 x:collection1_shard1_replica_n2] o.a.s.c.SolrCore [collection1_shard1_replica_n2] Registered new searcher Searcher@4f019d[collection1_shard1_replica_n2] main{ExitableDirectoryReader(UninvertingDirectoryReader(Uninverting(_0(8.0.0):C1) Uninverting(_1(8.0.0):C1)))}
   [junit4]   2> 1425325 INFO  (qtp26672895-24583) [n:127.0.0.1:42023_solr c:collection1 s:shard1 r:core_node3 x:collection1_shard1_replica_n1] o.a.s.u.p.LogUpdateProcessorFactory [collection1_shard1_replica_n1]  webapp=/solr path=/update params={update.distrib=FROMLEADER&waitSearcher=true&openSearcher=true&commit=true&softCommit=false&distrib.from=https://127.0.0.1:42023/solr/collection1_shard1_replica_n1/&commit_end_point=true&wt=javabin&version=2&expungeDeletes=false}{commit=} 0 3
   [junit4]   2> 1425325 INFO  (qtp10905298-24595) [n:127.0.0.1:46791_solr c:collection1 s:shard1 r:core_node4 x:collection1_shard1_replica_n2] o.a.s.u.p.LogUpdateProcessorFactory [collection1_shard1_replica_n2]  webapp=/solr path=/update params={update.distrib=FROMLEADER&waitSearcher=true&openSearcher=true&commit=true&softCommit=false&distrib.from=https://127.0.0.1:42023/solr/collection1_shard1_replica_n1/&commit_end_point=true&wt=javabin&version=2&expungeDeletes=false}{commit=} 0 3
   [junit4]   2> 1425325 INFO  (qtp26672895-24661) [n:127.0.0.1:42023_solr c:collection1 s:shard1 r:core_node3 x:collection1_shard1_replica_n1] o.a.s.u.p.LogUpdateProcessorFactory [collection1_shard1_replica_n1]  webapp=/solr path=/update params={waitSearcher=true&commit=true&softCommit=false&wt=javabin&version=2}{commit=} 0 4
   [junit4]   2> 1425328 INFO  (qtp10905298-24592) [n:127.0.0.1:46791_solr c:collection1 s:shard1 r:core_node4 x:collection1_shard1_replica_n2] o.a.s.u.p.LogUpdateProcessorFactory [collection1_shard1_replica_n2]  webapp=/solr path=/update params={update.distrib=FROMLEADER&distrib.from=https://127.0.0.1:42023/solr/collection1_shard1_replica_n1/&wt=javabin&version=2}{add=[2 (1605727069007773696)]} 0 0
   [junit4]   2> 1425328 INFO  (qtp26672895-24587) [n:127.0.0.1:42023_solr c:collection1 s:shard1 r:core_node3 x:collection1_shard1_replica_n1] o.a.s.u.p.LogUpdateProcessorFactory [collection1_shard1_replica_n1]  webapp=/solr path=/update params={wt=javabin&version=2}{add=[2 (1605727069007773696)]} 0 1
   [junit4]   2> 1425329 INFO  (qtp26672895-24581) [n:127.0.0.1:42023_solr c:collection1 s:shard1 r:core_node3 x:collection1_shard1_replica_n1] o.a.s.u.DirectUpdateHandler2 start commit{_version_=1605727069010919424,optimize=false,openSearcher=true,waitSearcher=true,expungeDeletes=false,softCommit=false,prepareCommit=false}
   [junit4]   2> 1425329 INFO  (qtp26672895-24581) [n:127.0.0.1:42023_solr c:collection1 s:shard1 r:core_node3 x:collection1_shard1_replica_n1] o.a.s.u.SolrIndexWriter Calling setCommitData with IW:org.apache.solr.update.SolrIndexWriter@12d99e2 commitCommandVersion:1605727069010919424
   [junit4]   2> 1425329 INFO  (qtp10905298-24595) [n:127.0.0.1:46791_solr c:collection1 s:shard1 r:core_node4 x:collection1_shard1_replica_n2] o.a.s.u.DirectUpdateHandler2 start commit{_version_=1605727069010919424,optimize=false,openSearcher=true,waitSearcher=true,expungeDeletes=false,softCommit=false,prepareCommit=false}
   [junit4]   2> 1425329 INFO  (qtp10905298-24595) [n:127.0.0.1:46791_solr c:collection1 s:shard1 r:core_node4 x:collection1_shard1_replica_n2] o.a.s.u.SolrIndexWriter Calling setCommitData with IW:org.apache.solr.update.SolrIndexWriter@35c70c commitCommandVersion:1605727069010919424
   [junit4]   2> 1425330 INFO  (qtp26672895-24581) [n:127.0.0.1:42023_solr c:collection1 s:shard1 r:core_node3 x:collection1_shard1_replica_n1] o.a.s.s.SolrIndexSearcher Opening [Searcher@9aa355[collection1_shard1_replica_n1] main]
   [junit4]   2> 1425330 INFO  (qtp10905298-24595) [n:127.0.0.1:46791_solr c:collection1 s:shard1 r:core_node4 x:collection1_shard1_replica_n2] o.a.s.s.SolrIndexSearcher Opening [Searcher@b1b00c[collection1_shard1_replica_n2] main]
   [junit4]   2> 1425330 INFO  (qtp10905298-24595) [n:127.0.0.1:46791_solr c:collection1 s:shard1 r:core_node4 x:collection1_shard1_replica_n2] o.a.s.u.DirectUpdateHandler2 end_commit_flush
   [junit4]   2> 1425330 INFO  (qtp26672895-24581) [n:127.0.0.1:42023_solr c:collection1 s:shard1 r:core_node3 x:collection1_shard1_replica_n1] o.a.s.u.DirectUpdateHandler2 end_commit_flush
   [junit4]   2> 1425331 INFO  (searcherExecutor-6802-thread-1-processing-n:127.0.0.1:46791_solr x:collection1_shard1_replica_n2 c:collection1 s:shard1 r:core_node4) [n:127.0.0.1:46791_solr c:collection1 s:shard1 r:core_node4 x:collection1_shard1_replica_n2] o.a.s.c.SolrCore [collection1_shard1_replica_n2] Registered new searcher Searcher@b1b00c[collection1_shard1_replica_n2] main{ExitableDirectoryReader(UninvertingDirectoryReader(Uninverting(_0(8.0.0):C1) Uninverting(_1(8.0.0):C1) Uninverting(_2(8.0.0):C1)))}
   [junit4]   2> 1425331 INFO  (qtp10905298-24595) [n:127.0.0.1:46791_solr c:collection1 s:shard1 r:core_node4 x:collection1_shard1_replica_n2] o.a.s.u.p.LogUpdateProcessorFactory [collection1_shard1_replica_n2]  webapp=/solr path=/update params={update.distrib=FROMLEADER&waitSearcher=true&openSearcher=true&commit=true&softCommit=false&distrib.from=https://127.0.0.1:42023/solr/collection1_shard1_replica_n1/&commit_end_point=true&wt=javabin&version=2&expungeDeletes=false}{commit=} 0 2
   [junit4]   2> 1425331 INFO  (searcherExecutor-6800-thread-1-processing-n:127.0.0.1:42023_solr x:collection1_shard1_replica_n1 c:collection1 s:shard1 r:core_node3) [n:127.0.0.1:42023_solr c:collection1 s:shard1 r:core_node3 x:collection1_shard1_replica_n1] o.a.s.c.SolrCore [collection1_shard1_replica_n1] Registered new searcher Searcher@9aa355[collection1_shard1_replica_n1] main{ExitableDirectoryReader(UninvertingDirectoryReader(Uninverting(_0(8.0.0):C1) Uninverting(_1(8.0.0):C1) Uninverting(_2(8.0.0):C1)))}
   [junit4]   2> 1425332 INFO  (qtp26672895-24581) [n:127.0.0.1:42023_solr c:collection1 s:shard1 r:core_node3 x:collection1_shard1_replica_n1] o.a.s.u.p.LogUpdateProcessorFactory [collection1_shard1_replica_n1]  webapp=/solr path=/update params={update.distrib=FROMLEADER&waitSearcher=true&openSearcher=true&commit=true&softCommit=false&distrib.from=https://127.0.0.1:42023/solr/collection1_shard1_replica_n1/&commit_end_point=true&wt=javabin&version=2&expungeDeletes=false}{commit=} 0 2
   [junit4]   2> 1425332 INFO  (qtp26672895-24661) [n:127.0.0.1:42023_solr c:collection1 s:shard1 r:core_node3 x:collection1_shard1_replica_n1] o.a.s.u.p.LogUpdateProcessorFactory [collection1_shard1_replica_n1]  webapp=/solr path=/update params={waitSearcher=true&commit=true&softCommit=false&wt=javabin&version=2}{commit=} 0 3
   [junit4]   2> 1425334 INFO  (qtp10905298-24592) [n:127.0.0.1:46791_solr c:collection1 s:shard1 r:core_node4 x:collection1_shard1_replica_n2] o.a.s.u.p.LogUpdateProcessorFactory [collection1_shard1_replica_n2]  webapp=/solr path=/update params={update.distrib=FROMLEADER&distrib.from=https://127.0.0.1:42023/solr/collection1_shard1_replica_n1/&wt=javabin&version=2}{add=[3 (1605727069014065152)]} 0 0
   [junit4]   2> 1425335 INFO  (qtp26672895-24587) [n:127.0.0.1:42023_solr c:collection1 s:shard1 r:core_node3 x:collection1_shard1_replica_n1] o.a.s.u.p.LogUpdateProcessorFactory [collection1_shard1_replica_n1]  webapp=/solr path=/update params={wt=javabin&version=2}{add=[3 (1605727069014065152)]} 0 2
   [junit4]   2> 1425336 INFO  (qtp26672895-24583) [n:127.0.0.1:42023_solr c:collection1 s:shard1 r:core_node3 x:collection1_shard1_replica_n1] o.a.s.u.DirectUpdateHandler2 start commit{_version_=1605727069018259456,optimize=false,openSearcher=true,waitSearcher=true,expungeDeletes=false,softCommit=false,prepareCommit=false}
   [junit4]   2> 1425336 INFO  (qtp26672895-24583) [n:127.0.0.1:42023_solr c:collection1 s:shard1 r:core_node3 x:collection1_shard1_replica_n1] o.a.s.u.SolrIndexWriter Calling setCommitData with IW:org.apache.solr.update.SolrIndexWriter@12d99e2 commitCommandVersion:1605727069018259456
   [junit4]   2> 1425336 INFO  (qtp10905298-24595) [n:127.0.0.1:46791_solr c:collection1 s:shard1 r:core_node4 x:collection1_shard1_replica_n2] o.a.s.u.DirectUpdateHandler2 start commit{_version_=1605727069018259456,optimize=false,openSearcher=true,waitSearcher=true,expungeDeletes=false,softCommit=false,prepareCommit=false}
   [junit4]   2> 1425336 INFO  (qtp10905298-24595) [n:127.0.0.1:46791_solr c:collection1 s:shard1 r:core_node4 x:collection1_shard1_replica_n2] o.a.s.u.SolrIndexWriter Calling setCommitData with IW:org.apache.solr.update.SolrIndexWriter@35c70c commitCommandVersion:1605727069018259456
   [junit4]   2> 1425337 INFO  (qtp26672895-24583) [n:127.0.0.1:42023_solr c:collection1 s:shard1 r:core_node3 x:collection1_shard1_replica_n1] o.a.s.s.SolrIndexSearcher Opening [Searcher@7c0f64[collection1_shard1_replica_n1] main]
   [junit4]   2> 1425337 INFO  (qtp10905298-24595) [n:127.0.0.1:46791_solr c:collection1 s:shard1 r:core_node4 x:collection1_shard1_replica_n2] o.a.s.s.SolrIndexSearcher Opening [Searcher@13abb07[collection1_shard1_replica_n2] main]
   [junit4]   2> 1425337 INFO  (qtp26672895-24583) [n:127.0.0.1:42023_solr c:collection1 s:shard1 r:core_node3 x:collection1_shard1_replica_n1] o.a.s.u.DirectUpdateHandler2 end_commit_flush
   [junit4]   2> 1425337 INFO  (qtp10905298-24595) [n:127.0.0.1:46791_solr c:collection1 s:shard1 r:core_node4 x:collection1_shard1_replica_n2] o.a.s.u.DirectUpdateHandler2 end_commit_flush
   [junit4]   2> 1425338 INFO  (searcherExecutor-6800-thread-1-processing-n:127.0.0.1:42023_solr x:collection1_shard1_replica_n1 c:collection1 s:shard1 r:core_node3) [n:127.0.0.1:42023_solr c:collection1 s:shard1 r:core_node3 x:collection1_shard1_replica_n1] o.a.s.c.SolrCore [collection1_shard1_replica_n1] Registered new searcher Searcher@7c0f64[collection1_shard1_replica_n1] main{ExitableDirectoryReader(UninvertingDirectoryReader(Uninverting(_0(8.0.0):C1) Uninverting(_1(8.0.0):C1) Uninverting(_2(8.0.0):C1) Uninverting(_3(8.0.0):C1)))}
   [junit4]   2> 1425338 INFO  (qtp26672895-24583) [n:127.0.0.1:42023_solr c:collection1 s:shard1 r:core_node3 x:collection1_shard1_replica_n1] o.a.s.u.p.LogUpdateProcessorFactory [collection1_shard1_replica_n1]  webapp=/solr path=/update params={update.distrib=FROMLEADER&waitSearcher=true&openSearcher=true&commit=true&softCommit=false&distrib.from=https://127.0.0.1:42023/solr/collection1_shard1_replica_n1/&commit_end_point=true&wt=javabin&version=2&expungeDeletes=false}{commit=} 0 2
   [junit4]   2> 1425338 INFO  (searcherExecutor-6802-thread-1-processing-n:127.0.0.1:46791_solr x:collection1_shard1_replica_n2 c:collection1 s:shard1 r:core_node4) [n:127.0.0.1:46791_solr c:collection1 s:shard1 r:core_node4 x:collection1_shard1_replica_n2] o.a.s.c.SolrCore [collection1_shard1_replica_n2] Registered new searcher Searcher@13abb07[collection1_shard1_replica_n2] main{ExitableDirectoryReader(UninvertingDirectoryReader(Uninverting(_0(8.0.0):C1) Uninverting(_1(8.0.0):C1) Uninverting(_2(8.0.0):C1) Uninverting(_3(8.0.0):C1)))}
   [junit4]   2> 1425338 INFO  (qtp10905298-24595) [n:127.0.0.1:46791_solr c:collection1 s:shard1 r:core_node4 x:collection1_shard1_replica_n2] o.a.s.u.p.LogUpdateProcessorFactory [collection1_shard1_replica_n2]  webapp=/solr path=/update params={update.distrib=FROMLEADER&waitSearcher=true&openSearcher=true&commit=true&softCommit=false&distrib.from=https://127.0.0.1:42023/solr/collection1_shard1_replica_n1/&commit_end_point=true&wt=javabin&version=2&expungeDeletes=false}{commit=} 0 2
   [junit4]   2> 1425338 INFO  (qtp26672895-24661) [n:127.0.0.1:42023_solr c:collection1 s:shard1 r:core_node3 x:collection1_shard1_replica_n1] o.a.s.u.p.LogUpdateProcessorFactory [collection1_shard1_replica_n1]  webapp=/solr path=/update params={waitSearcher=true&commit=true&softCommit=false&wt=javabin&version=2}{commit=} 0 3
   [junit4]   2> 1425341 INFO  (qtp10905298-24592) [n:127.0.0.1:46791_solr c:collection1 s:shard1 r:core_node4 x:collection1_shard1_replica_n2] o.a.s.u.p.LogUpdateProcessorFactory [collection1_shard1_replica_n2]  webapp=/solr path=/update params={update.distrib=FROMLEADER&distrib.from=https://127.0.0.1:42023/solr/collection1_shard1_replica_n1/&wt=javabin&version=2}{add=[4 (1605727069021405184)]} 0 0
   [junit4]   2> 1425341 INFO  (qtp26672895-24587) [n:127.0.0.1:42023_solr c:collection1 s:shard1 r:core_node3 x:collection1_shard1_replica_n1] o.a.s.u.p.LogUpdateProcessorFactory [collection1_shard1_replica_n1]  webapp=/solr path=/update params={wt=javabin&version=2}{add=[4 (1605727069021405184)]} 0 2
   [junit4]   2> 1425342 INFO  (qtp10905298-24595) [n:127.0.0.1:46791_solr c:collection1 s:shard1 r:core_node4 x:collection1_shard1_replica_n2] o.a.s.u.DirectUpdateHandler2 start commit{_version_=1605727069024550912,optimize=false,openSearcher=true,waitSearcher=true,expungeDeletes=false,softCommit=false,prepareCommit=false}
   [junit4]   2> 1425342 INFO  (qtp10905298-24595) [n:127.0.0.1:46791_solr c:collection1 s:shard1 r:core_node4 x:collection1_shard1_replica_n2] o.a.s.u.SolrIndexWriter Calling setCommitData with IW:org.apache.solr.update.SolrIndexWriter@35c70c commitCommandVersion:1605727069024550912
   [junit4]   2> 1425342 INFO  (qtp26672895-24581) [n:127.0.0.1:42023_solr c:collection1 s:shard1 r:core_node3 x:collection1_shard1_replica_n1] o.a.s.u.DirectUpdateHandler2 start commit{_version_=1605727069024550912,optimize=false,openSearcher=true,waitSearcher=true,expungeDeletes=false,softCommit=false,prepareCommit=false}
   [junit4]   2> 1425342 INFO  (qtp26672895-24581) [n:127.0.0.1:42023_solr c:collection1 s:shard1 r:core_node3 x:collection1_shard1_replica_n1] o.a.s.u.SolrIndexWriter Calling setCommitData with IW:org.apache.solr.update.SolrIndexWriter@12d99e2 commitCommandVersion:1605727069024550912
   [junit4]   2> 1425343 INFO  (qtp10905298-24595) [n:127.0.0.1:46791_solr c:collection1 s:shard1 r:core_node4 x:collection1_shard1_replica_n2] o.a.s.s.SolrIndexSearcher Opening [Searcher@1c31b26[collection1_shard1_replica_n2] main]
   [junit4]   2> 1425343 INFO  (qtp26672895-24581) [n:127.0.0.1:42023_solr c:collection1 s:shard1 r:core_node3 x:collection1_shard1_replica_n1] o.a.s.s.SolrIndexSearcher Opening [Searcher@1752737[collection1_shard1_replica_n1] main]
   [junit4]   2> 1425344 INFO  (qtp10905298-24595) [n:127.0.0.1:46791_solr c:collection1 s:shard1 r:core_node4 x:collection1_shard1_replica_n2] o.a.s.u.DirectUpdateHandler2 end_commit_flush
   [junit4]   2> 1425344 INFO  (qtp26672895-24581) [n:127.0.0.1:42023_solr c:collection1 s:shard1 r:core_node3 x:collection1_shard1_replica_n1] o.a.s.u.DirectUpdateHandler2 end_commit_flush
   [junit4]   2> 1425344 INFO  (searcherExecutor-6802-thread-1-processing-n:127.0.0.1:46791_solr x:collection1_shard1_replica_n2 c:collection1 s:shard1 r:core_node4) [n:127.0.0.1:46791_solr c:collection1 s:shard1 r:core_node4 x:collection1_shard1_replica_n2] o.a.s.c.SolrCore [collection1_shard1_replica_n2] Registered new searcher Searcher@1c31b26[collection1_shard1_replica_n2] main{ExitableDirectoryReader(UninvertingDirectoryReader(Uninverting(_0(8.0.0):C1) Uninverting(_1(8.0.0):C1) Uninverting(_2(8.0.0):C1) Uninverting(_3(8.0.0):C1) Uninverting(_4(8.0.0):C1)))}
   [junit4]   2> 1425345 INFO  (qtp10905298-24595) [n:127.0.0.1:46791_solr c:collection1 s:shard1 r:core_node4 x:collection1_shard1_replica_n2] o.a.s.u.p.LogUpdateProcessorFactory [collection1_shard1_replica_n2]  webapp=/solr path=/update params={update.distrib=FROMLEADER&waitSearcher=true&openSearcher=true&commit=true&softCommit=false&distrib.from=https://127.0.0.1:42023/solr/collection1_shard1_replica_n1/&commit_end_point=true&wt=javabin&version=2&expungeDeletes=false}{commit=} 0 2
   [junit4]   2> 1425345 INFO  (searcherExecutor-6800-thread-1-processing-n:127.0.0.1:42023_solr x:collection1_shard1_replica_n1 c:collection1 s:shard1 r:core_node3) [n:127.0.0.1:42023_solr c:collection1 s:shard1 r:core_node3 x:collection1_shard1_replica_n1] o.a.s.c.SolrCore [collection1_shard1_replica_n1] Registered new searcher Searcher@1752737[collection1_shard1_replica_n1] main{ExitableDirectoryReader(UninvertingDirectoryReader(Uninverting(_0(8.0.0):C1) Uninverting(_1(8.0.0):C1) Uninverting(_2(8.0.0):C1) Uninverting(_3(8.0.0):C1) Uninverting(_4(8.0.0):C1)))}
   [junit4]   2> 1425345 INFO  (qtp26672895-24581) [n:127.0.0.1:42023_solr c:collection1 s:shard1 r:core_node3 x:collection1_shard1_replica_n1] o.a.s.u.p.LogUpdateProcessorFactory [collection1_shard1_replica_n1]  webapp=/solr path=/update params={update.distrib=FROMLEADER&waitSearcher=true&openSearcher=true&commit=true&softCommit=false&distrib.from=https://127.0.0.1:42023/solr/collection1_shard1_replica_n1/&commit_end_point=true&wt=javabin&version=2&expungeDeletes=false}{commit=} 0 2
   [junit4]   2> 1425345 INFO  (qtp26672895-24661) [n:127.0.0.1:42023_solr c:collection1 s:shard1 r:core_node3 x:collection1_shard1_replica_n1] o.a.s.u.p.LogUpdateProcessorFactory [collection1_shard1_replica_n1]  webapp=/solr path=/update params={waitSearcher=true&commit=true&softCommit=false&wt=javabin&version=2}{commit=} 0 3
   [junit4]   2> 1425348 INFO  (qtp10905298-24592) [n:127.0.0.1:46791_solr c:collection1 s:shard1 r:core_node4 x:collection1_shard1_replica_n2] o.a.s.u.p.LogUpdateProcessorFactory [collection1_shard1_replica_n2]  webapp=/solr path=/update params={update.distrib=FROMLEADER&distrib.from=https://127.0.0.1:42023/solr/collection1_shard1_replica_n1/&wt=javabin&version=2}{add=[5 (1605727069028745216)]} 0 0
   [junit4]   2> 1425348 INFO  (qtp26672895-24587) [n:127.0.0.1:42023_solr c:collection1 s:shard1 r:core_node3 x:collection1_shard1_replica_n1] o.a.s.u.p.LogUpdateProcessorFactory [collection1_shard1_replica_n1]  webapp=/solr path=/update params={wt=javabin&version=2}{add=[5 (1605727069028745216)]} 0 2
   [junit4]   2> 1425349 INFO  (qtp10905298-24595) [n:127.0.0.1:46791_solr c:collection1 s:shard1 r:core_node4 x:collection1_shard1_replica_n2] o.a.s.u.DirectUpdateHandler2 start commit{_version_=1605727069031890944,optimize=false,openSearcher=true,waitSearcher=true,expungeDeletes=false,softCommit=false,prepareCommit=false}
   [junit4]   2> 1425349 INFO  (qtp26672895-24583) [n:127.0.0.1:42023_solr c:collection1 s:shard1 r:core_node3 x:collection1_shard1_replica_n1] o.a.s.u.DirectUpdateHandler2 start commit{_version_=1605727069031890944,optimize=false,openSearcher=true,waitSearcher=true,expungeDeletes=false,softCommit=false,prepareCommit=false}
   [junit4]   2> 1425349 INFO  (qtp10905298-24595) [n:127.0.0.1:46791_solr c:collection1 s:shard1 r:core_node4 x:collection1_shard1_replica_n2] o.a.s.u.SolrIndexWriter Calling setCommitData with IW:org.apache.solr.update.SolrIndexWriter@35c70c commitCommandVersion:1605727069031890944
   [junit4]   2> 1425349 INFO  (qtp26672895-24583) [n:127.0.0.1:42023_solr c:collection1 s:shard1 r:core_node3 x:collection1_shard1_replica_n1] o.a.s.u.SolrIndexWriter Calling setCommitData with IW:org.apache.solr.update.SolrIndexWriter@12d99e2 commitCommandVersion:1605727069031890944
   [junit4]   2> 1425350 INFO  (qtp10905298-24595) [n:127.0.0.1:46791_solr c:collection1 s:shard1 r:core_node4 x:collection1_shard1_replica_n2] o.a.s.s.SolrIndexSearcher Opening [Searcher@bd65ed[collection1_shard1_replica_n2] main]
   [junit4]   2> 1425350 INFO  (qtp26672895-24583) [n:127.0.0.1:42023_solr c:collection1 s:shard1 r:core_node3 x:collection1_shard1_replica_n1] o.a.s.s.SolrIndexSearcher Opening [Searcher@f7ef55[collection1_shard1_replica_n1] main]
   [junit4]   2> 1425350 INFO  (qtp10905298-24595) [n:127.0.0.1:46791_solr c:collection1 s:shard1 r:core_node4 x:collection1_shard1_replica_n2] o.a.s.u.DirectUpdateHandler2 end_commit_flush
   [junit4]   2> 1425350 INFO  (qtp26672895-24583) [n:127.0.0.1:42023_solr c:collection1 s:shard1 r:core_node3 x:collection1_shard1_replica_n1] o.a.s.u.DirectUpdateHandler2 end_commit_flush
   [junit4]   2> 1425351 INFO  (searcherExecutor-6800-thread-1-processing-n:127.0.0.1:42023_solr x:collection1_shard1_replica_n1 c:collection1 s:shard1 r:core_node3) [n:127.0.0.1:42023_solr c:collection1 s:shard1 r:core_node3 x:collection1_shard1_replica_n1] o.a.s.c.SolrCore [collection1_shard1_replica_n1] Registered new searcher Searcher@f7ef55[collection1_shard1_replica_n1] main{ExitableDirectoryReader(UninvertingDirectoryReader(Uninverting(_0(8.0.0):C1) Uninverting(_1(8.0.0):C1) Uninverting(_2(8.0.0):C1) Uninverting(_3(8.0.0):C1) Uninverting(_4(8.0.0):C1) Uninverting(_5(8.0.0):C1)))}
   [junit4]   2> 1425351 INFO  (searcherExecutor-6802-thread-1-processing-n:127.0.0.1:46791_solr x:collection1_shard1_replica_n2 c:collection1 s:shard1 r:core_node4) [n:127.0.0.1:46791_solr c:collection1 s:shard1 r:core_node4 x:collection1_shard1_replica_n2] o.a.s.c.SolrCore [collection1_shard1_replica_n2] Registered new searcher Searcher@bd65ed[collection1_shard1_replica_n2] main{ExitableDirectoryReader(UninvertingDirectoryReader(Uninverting(_0(8.0.0):C1) Uninverting(_1(8.0.0):C1) Uninverting(_2(8.0.0):C1) Uninverting(_3(8.0.0):C1) Uninverting(_4(8.0.0):C1) Uninverting(_5(8.0.0):C1)))}
   [junit4]   2> 1425351 INFO  (qtp26672895-24583) [n:127.0.0.1:42023_solr c:collection1 s:shard1 r:core_node3 x:collection1_shard1_replica_n1] o.a.s.u.p.LogUpdateProcessorFactory [collection1_shard1_replica_n1]  webapp=/solr path=/update params={update.distrib=FROMLEADER&waitSearcher=true&openSearcher=true&commit=true&softCommit=false&distrib.from=https://127.0.0.1:42023/solr/collection1_shard1_replica_n1/&commit_end_point=true&wt=javabin&version=2&expungeDeletes=false}{commit=} 0 2
   [junit4]   2> 1425351 INFO  (qtp10905298-24595) [n:127.0.0.1:46791_solr c:collection1 s:shard1 r:core_node4 x:collection1_shard1_replica_n2] o.a.s.u.p.LogUpdateProcessorFactory [collection1_shard1_replica_n2]  webapp=/solr path=/update params={update.distrib=FROMLEADER&waitSearcher=true&openSearcher=true&commit=true&softCommit=false&distrib.from=https://127.0.0.1:42023/solr/collection1_shard1_replica_n1/&commit_end_point=true&wt=javabin&version=2&expungeDeletes=false}{commit=} 0 2
   [junit4]   2> 1425352 INFO  (qtp26672895-24661) [n:127.0.0.1:42023_solr c:collection1 s:shard1 r:core_node3 x:collection1_shard1_replica_n1] o.a.s.u.p.LogUpdateProcessorFactory [collection1_shard1_replica_n1]  webapp=/solr path=/update params={waitSearcher=true&commit=true&softCommit=false&wt=javabin&version=2}{commit=} 0 3
   [junit4]   2> 1425354 INFO  (qtp10905298-24592) [n:127.0.0.1:46791_solr c:collection1 s:shard1 r:core_node4 x:collection1_shard1_replica_n2] o.a.s.u.p.LogUpdateProcessorFactory [collection1_shard1_replica_n2]  webapp=/solr path=/update params={update.distrib=FROMLEADER&distrib.from=https://127.0.0.1:42023/solr/collection1_shard1_replica_n1/&wt=javabin&version=2}{add=[6 (1605727069035036672)]} 0 0
   [junit4]   2> 1425354 INFO  (qtp26672895-24587) [n:127.0.0.1:42023_solr c:collection1 s:shard1 r:core_node3 x:collection1_shard1_replica_n1] o.a.s.u.p.LogUpdateProcessorFactory [collection1_shard1_replica_n1]  webapp=/solr path=/update params={wt=javabin&version=2}{add=[6 (1605727069035036672)]} 0 2
   [junit4]   2> 1425356 INFO  (qtp26672895-24581) [n:127.0.0.1:42023_solr c:collection1 s:shard1 r:core_node3 x:collection1_shard1_replica_n1] o.a.s.u.DirectUpdateHandler2 start commit{_version_=1605727069039230976,optimize=false,openSearcher=true,waitSearcher=true,expungeDeletes=false,softCommit=false,prepareCommit=false}
   [junit4]   2> 1425356 INFO  (qtp10905298-24595) [n:127.0.0.1:46791_solr c:collection1 s:shard1 r:core_node4 x:collection1_shard1_replica_n2] o.a.s.u.DirectUpdateHandler2 start commit{_version_=1605727069039230976,optimize=false,openSearcher=true,waitSearcher=true,expungeDeletes=false,softCommit=false,prepareCommit=false}
   [junit4]   2> 1425356 INFO  (qtp26672895-24581) [n:127.0.0.1:42023_solr c:collection1 s:shard1 r:core_node3 x:collection1_shard1_replica_n1] o.a.s.u.SolrIndexWriter Calling setCommitData with IW:org.apache.solr.update.SolrIndexWriter@12d99e2 commitCommandVersion:1605727069039230976
   [junit4]   2> 1425356 INFO  (qtp10905298-24595) [n:127.0.0.1:46791_solr c:collection1 s:shard1 r:core_node4 x:collection1_shard1_replica_n2] o.a.s.u.SolrIndexWriter Calling setCommitData with IW:org.apache.solr.update.SolrIndexWriter@35c70c commitCommandVersion:1605727069039230976
   [junit4]   2> 1425357 INFO  (qtp26672895-24581) [n:127.0.0.1:42023_solr c:collection1 s:shard1 r:core_node3 x:collection1_shard1_replica_n1] o.a.s.s.SolrIndexSearcher Opening [Searcher@1558568[collection1_shard1_replica_n1] main]
   [junit4]   2> 1425357 INFO  (qtp10905298-24595) [n:127.0.0.1:46791_solr c:collection1 s:shard1 r:core_node4 x:collection1_shard1_replica_n2] o.a.s.s.SolrIndexSearcher Opening [Searcher@1fba767[collection1_shard1_replica_n2] main]
   [junit4]   2> 1425357 INFO  (qtp10905298-24595) [n:127.0.0.1:46791_solr c:collection1 s:shard1 r:core_node4 x:collection1_shard1_replica_n2] o.a.s.u.DirectUpdateHandler2 end_commit_flush
   [junit4]   2> 1425357 INFO  (qtp26672895-24581) [n:127.0.0.1:42023_solr c:collection1 s:shard1 r:core_node3 x:collection1_shard1_replica_n1] o.a.s.u.DirectUpdateHandler2 end_commit_flush
   [junit4]   2> 1425358 INFO  (searcherExecutor-6802-thread-1-processing-n:127.0.0.1:46791_solr x:collection1_shard1_replica_n2 c:collection1 s:shard1 r:core_node4) [n:127.0.0.1:46791_solr c:collection1 s:shard1 r:core_node4 x:collection1_shard1_replica_n2] o.a.s.c.SolrCore [collection1_shard1_replica_n2] Registered new searcher Searcher@1fba767[collection1_shard1_replica_n2] main{ExitableDirectoryReader(UninvertingDirectoryReader(Uninverting(_0(8.0.0):C1) Uninverting(_1(8.0.0):C1) Uninverting(_2(8.0.0):C1) Uninverting(_3(8.0.0):C1) Uninverting(_4(8.0.0):C1) Uninverting(_5(8.0.0):C1) Uninverting(_6(8.0.0):C1)))}
   [junit4]   2> 1425358 INFO  (searcherExecutor-6800-thread-1-processing-n:127.0.0.1:42023_solr x:collection1_shard1_replica_n1 c:collection1 s:shard1 r:core_node3) [n:127.0.0.1:42023_solr c:collection1 s:shard1 r:core_node3 x:collection1_shard1_replica_n1] o.a.s.c.SolrCore [collection1_shard1_replica_n1] Registered new searcher Searcher@1558568[collection1_shard1_replica_n1] main{ExitableDirectoryReader(UninvertingDirectoryReader(Uninverting(_0(8.0.0):C1) Uninverting(_1(8.0.0):C1) Uninverting(_2(8.0.0):C1) Uninverting(_3(8.0.0):C1) Uninverting(_4(8.0.0):C1) Uninverting(_5(8.0.0):C1) Uninverting(_6(8.0.0):C1)))}
   [junit4]   2> 1425358 INFO  (qtp10905298-24595) [n:127.0.0.1:46791_solr c:collection1 s:shard1 r:core_node4 x:collection1_shard1_replica_n2] o.a.s.u.p.LogUpdateProcessorFactory [collection1_shard1_replica_n2]  webapp=/solr path=/update params={update.distrib=FROMLEADER&waitSearcher=true&openSearcher=true&commit=true&softCommit=false&distrib.from=https://127.0.0.1:42023/solr/collection1_shard1_replica_n1/&commit_end_point=true&wt=javabin&version=2&expungeDeletes=false}{commit=} 0 2
   [junit4]   2> 1425358 INFO  (qtp26672895-24581) [n:127.0.0.1:42023_solr c:collection1 s:shard1 r:core_node3 x:collection1_shard1_replica_n1] o.a.s.u.p.LogUpdateProcessorFactory [collection1_shard1_replica_n1]  webapp=/solr path=/update params={update.distrib=FROMLEADER&waitSearcher=true&openSearcher=true&commit=true&softCommit=false&distrib.from=https://127.0.0.1:42023/solr/collection1_shard1_replica_n1/&commit_end_point=true&wt=javabin&version=2&expungeDeletes=false}{commit=} 0 2
   [junit4]   2> 1425358 INFO  (qtp26672895-24661) [n:127.0.0.1:42023_solr c:collection1 s:shard1 r:core_node3 x:collection1_shard1_replica_n1] o.a.s.u.p.LogUpdateProcessorFactory [collection1_shard1_replica_n1]  webapp=/solr path=/update params={waitSearcher=true&commit=true&softCommit=false&wt=javabin&version=2}{commit=} 0 3
   [junit4]   2> 1425361 INFO  (qtp10905298-24592) [n:127.0.0.1:46791_solr c:collection1 s:shard1 r:core_node4 x:collection1_shard1_replica_n2] o.a.s.u.p.LogUpdateProcessorFactory [collection1_shard1_replica_n2]  webapp=/solr path=/update params={update.distrib=FROMLEADER&distrib.from=https://127.0.0.1:42023/solr/collection1_shard1_replica_n1/&wt=javabin&version=2}{add=[7 (1605727069042376704)]} 0 1
   [junit4]   2> 1425362 INFO  (qtp26672895-24587) [n:127.0.0.1:42023_solr c:collection1 s:shard1 r:core_node3 x:collection1_shard1_replica_n1] o.a.s.u.p.LogUpdateProcessorFactory [collection1_shard1_replica_n1]  webapp=/solr path=/update params={wt=javabin&version=2}{add=[7 (1605727069042376704)]} 0 2
   [junit4]   2> 1425363 INFO  (qtp10905298-24595) [n:127.0.0.1:46791_solr c:collection1 s:shard1 r:core_node4 x:collection1_shard1_replica_n2] o.a.s.u.DirectUpdateHandler2 start commit{_version_=1605727069046571008,optimize=false,openSearcher=true,waitSearcher=true,expungeDeletes=false,softCommit=false,prepareCommit=false}
   [junit4]   2> 1425363 INFO  (qtp26672895-24583) [n:127.0.0.1:42023_solr c:collection1 s:shard1 r:core_node3 x:collection1_shard1_replica_n1] o.a.s.u.DirectUpdateHandler2 start commit{_version_=1605727069046571008,optimize=false,openSearcher=true,waitSearcher=true,expungeDeletes=false,softCommit=false,prepareCommit=false}
   [junit4]   2> 1425363 INFO  (qtp10905298-24595) [n:127.0.0.1:46791_solr c:collection1 s:shard1 r:core_node4 x:collection1_shard1_replica_n2] o.a.s.u.SolrIndexWriter Calling setCommitData with IW:org.apache.solr.update.SolrIndexWriter@35c70c commitCommandVersion:1605727069046571008
   [junit4]   2> 1425363 INFO  (qtp26672895-24583) [n:127.0.0.1:42023_solr c:collection1 s:shard1 r:core_node3 x:collection1_shard1_replica_n1] o.a.s.u.SolrIndexWriter Calling setCommitData with IW:org.apache.solr.update.SolrIndexWriter@12d99e2 commitCommandVersion:1605727069046571008
   [junit4]   2> 1425364 INFO  (qtp26672895-24583) [n:127.0.0.1:42023_solr c:collection1 s:shard1 r:core_node3 x:collection1_shard1_replica_n1] o.a.s.s.SolrIndexSearcher Opening [Searcher@f9241a[collection1_shard1_replica_n1] main]
   [junit4]   2> 1425364 INFO  (qtp10905298-24595) [n:127.0.0.1:46791_solr c:collection1 s:shard1 r:core_node4 x:collection1_shard1_replica_n2] o.a.s.s.SolrIndexSearcher Opening [Searcher@12eac1e[collection1_shard1_replica_n2] main]
   [junit4]   2> 1425365 INFO  (qtp26672895-24583) [n:127.0.0.1:42023_solr c:collection1 s:shard1 r:core_node3 x:collection1_shard1_replica_n1] o.a.s.u.DirectUpdateHandler2 end_commit_flush
   [junit4]   2> 1425365 INFO  (qtp10905298-24595) [n:127.0.0.1:46791_solr c:collection1 s:shard1 r:core_node4 x:collection1_shard1_replica_n2] o.a.s.u.DirectUpdateHandler2 end_commit_flush
   [junit4]   2> 1425365 INFO  (searcherExecutor-6802-thread-1-processing-n:127.0.0.1:46791_solr x:collection1_shard1_replica_n2 c:collection1 s:shard1 r:core_node4) [n:127.0.0.1:46791_solr c:collection1 s:shard1 r:core_node4 x:collection1_shard1_replica_n2] o.a.s.c.SolrCore [collection1_shard1_replica_n2] Registered new searcher Searcher@12eac1e[collection1_shard1_replica_n2] main{ExitableDirectoryReader(UninvertingDirectoryReader(Uninverting(_0(8.0.0):C1) Uninverting(_1(8.0.0):C1) Uninverting(_2(8.0.0):C1) Uninverting(_3(8.0.0):C1) Uninverting(_4(8.0.0):C1) Uninverting(_5(8.0.0):C1) Uninverting(_6(8.0.0):C1) Uninverting(_7(8.0.0):C1)))}
   [junit4]   2> 1425365 INFO  (searcherExecutor-6800-thread-1-processing-n:127.0.0.1:42023_solr x:collection1_shard1_replica_n1 c:collection1 s:shard1 r:core_node3) [n:127.0.0.1:42023_solr c:collection1 s:shard1 r:core_node3 x:collection1_shard1_replica_n1] o.a.s.c.SolrCore [collection1_shard1_replica_n1] Registered new searcher Searcher@f9241a[collection1_shard1_replica_n1] main{ExitableDirectoryReader(UninvertingDirectoryReader(Uninverting(_0(8.0.0):C1) Uninverting(_1(8.0.0):C1) Uninverting(_2(8.0.0):C1) Uninverting(_3(8.0.0):C1) Uninverting(_4(8.0.0):C1) Uninverting(_5(8.0.0):C1) Uninverting(_6(8.0.0):C1) Uninverting(_7(8.0.0):C1)))}
   [junit4]   2> 1425366 INFO  (qtp10905298-24595) [n:127.0.0.1:46791_solr c:collection1 s:shard1 r:core_node4 x:collection1_shard1_replica_n2] o.a.s.u.p.LogUpdateProcessorFactory [collection1_shard1_replica_n2]  webapp=/solr path=/update params={update.distrib=FROMLEADER&waitSearcher=true&openSearcher=true&commit=true&softCommit=false&distrib.from=https://127.0.0.1:42023/solr/collection1_shard1_replica_n1/&commit_end_point=true&wt=javabin&version=2&expungeDeletes=false}{commit=} 0 3
   [junit4]   2> 1425366 INFO  (qtp26672895-24583) [n:127.0.0.1:42023_solr c:collection1 s:shard1 r:core_node3 x:collection1_shard1_replica_n1] o.a.s.u.p.LogUpdateProcessorFactory [collection1_shard1_replica_n1]  webapp=/solr path=/update params={update.distrib=FROMLEADER&waitSearcher=true&openSearcher=true&commit=true&softCommit=false&distrib.from=https://127.0.0.1:42023/solr/collection1_shard1_replica_n1/&commit_end_point=true&wt=javabin&version=2&expungeDeletes=false}{commit=} 0 3
   [junit4]   2> 1425366 INFO  (qtp26672895-24661) [n:127.0.0.1:42023_solr c:collection1 s:shard1 r:core_node3 x:collection1_shard1_replica_n1] o.a.s.u.p.LogUpdateProcessorFactory [collection1_shard1_replica_n1]  webapp=/solr path=/update params={waitSearcher=true&commit=true&softCommit=false&wt=javabin&version=2}{commit=} 0 3
   [junit4]   2> 1425369 INFO  (qtp10905298-24592) [n:127.0.0.1:46791_solr c:collection1 s:shard1 r:core_node4 x:collection1_shard1_replica_n2] o.a.s.u.p.LogUpdateProcessorFactory [collection1_shard1_replica_n2]  webapp=/solr path=/update params={update.distrib=FROMLEADER&distrib.from=https://127.0.0.1:42023/solr/collection1_shard1_replica_n1/&wt=javabin&version=2}{add=[8 (1605727069049716736)]} 0 0
   [junit4]   2> 1425369 INFO  (qtp26672895-24587) [n:127.0.0.1:42023_solr c:collection1 s:shard1 r:core_node3 x:collection1_shard1_replica_n1] o.a.s.u.p.LogUpdateProcessorFactory [collection1_shard1_replica_n1]  webapp=/solr path=/update params={wt=javabin&version=2}{add=[8 (1605727069049716736)]} 0 2
   [junit4]   2> 1425370 INFO  (qtp10905298-24595) [n:127.0.0.1:46791_solr c:collection1 s:shard1 r:core_node4 x:collection1_shard1_replica_n2] o.a.s.u.DirectUpdateHandler2 start commit{_version_=1605727069053911040,optimize=false,openSearcher=true,waitSearcher=true,expungeDeletes=false,softCommit=false,prepareCommit=false}
   [junit4]   2> 1425370 INFO  (qtp26672895-24581) [n:127.0.0.1:42023_solr c:collection1 s:shard1 r:core_node3 x:collection1_shard1_replica_n1] o.a.s.u.DirectUpdateHandler2 start commit{_version_=1605727069053911040,optimize=false,openSearcher=true,waitSearcher=true,expungeDeletes=false,softCommit=false,prepareCommit=false}
   [junit4]   2> 1425370 INFO  (qtp26672895-24581) [n:127.0.0.1:42023_solr c:collection1 s:shard1 r:core_node3 x:collection1_shard1_replica_n1] o.a.s.u.SolrIndexWriter Calling setCommitData with IW:org.apache.solr.update.SolrIndexWriter@12d99e2 commitCommandVersion:1605727069053911040
   [junit4]   2> 1425370 INFO  (qtp10905298-24595) [n:127.0.0.1:46791_solr c:collection1 s:shard1 r:core_node4 x:collection1_shard1_replica_n2] o.a.s.u.SolrIndexWriter Calling setCommitData with IW:org.apache.solr.update.SolrIndexWriter@35c70c commitCommandVersion:1605727069053911040
   [junit4]   2> 1425372 INFO  (qtp10905298-24595) [n:127.0.0.1:46791_solr c:collection1 s:shard1 r:core_node4 x:collection1_shard1_replica_n2] o.a.s.s.SolrIndexSearcher Opening [Searcher@185dff2[collection1_shard1_replica_n2] main]
   [junit4]   2> 1425372 INFO  (qtp26672895-24581) [n:127.0.0.1:42023_solr c:collection1 s:shard1 r:core_node3 x:collection1_shard1_replica_n1] o.a.s.s.SolrIndexSearcher Opening [Searcher@1368f9f[collection1_shard1_replica_n1] main]
   [junit4]   2> 1425372 INFO  (qtp10905298-24595) [n:127.0.0.1:46791_solr c:collection1 s:shard1 r:core_node4 x:collection1_shard1_replica_n2] o.a.s.u.DirectUpdateHandler2 end_commit_flush
   [junit4]   2> 1425372 INFO  (qtp26672895-24581) [n:127.0.0.1:42023_solr c:collection1 s:shard1 r:core_node3 x:collection1_shard1_replica_n1] o.a.s.u.DirectUpdateHandler2 end_commit_flush
   [junit4]   2> 1425374 INFO  (searcherExecutor-6800-thread-1-processing-n:127.0.0.1:42023_solr x:collection1_shard1_replica_n1 c:collection1 s:shard1 r:core_node3) [n:127.0.0.1:42023_solr c:collection1 s:shard1 r:core_node3 x:collection1_shard1_replica_n1] o.a.s.c.SolrCore [collection1_shard1_replica_n1] Registered new searcher Searcher@1368f9f[collection1_shard1_replica_n1] main{ExitableDirectoryReader(UninvertingDirectoryReader(Uninverting(_0(8.0.0):C1) Uninverting(_1(8.0.0):C1) Uninverting(_2(8.0.0):C1) Uninverting(_3(8.0.0):C1) Uninverting(_4(8.0.0):C1) Uninverting(_5(8.0.0):C1) Uninverting(_6(8.0.0):C1) Uninverting(_7(8.0.0):C1) Uninverting(_8(8.0.0):C1)))}
   [junit4]   2> 1425374 INFO  (searcherExecutor-6802-thread-1-processing-n:127.0.0.1:46791_solr x:collection1_shard1_replica_n2 c:collection1 s:shard1 r:core_node4) [n:127.0.0.1:46791_solr c:collection1 s:shard1 r:core_node4 x:collection1_shard1_replica_n2] o.a.s.c.SolrCore [collection1_shard1_replica_n2] Registered new searcher Searcher@185dff2[collection1_shard1_replica_n2] main{ExitableDirectoryReader(UninvertingDirectoryReader(Uninverting(_0(8.0.0):C1) Uninverting(_1(8.0.0):C1) Uninverting(_2(8.0.0):C1) Uninverting(_3(8.0.0):C1) Uninverting(_4(8.0.0):C1) Uninverting(_5(8.0.0):C1) Uninverting(_6(8.0.0):C1) Uninverting(_7(8.0.0):C1) Uninverting(_8(8.0.0):C1)))}
   [junit4]   2> 1425374 INFO  (qtp26672895-24581) [n:127.0.0.1:42023_solr c:collection1 s:shard1 r:core_node3 x:collection1_shard1_replica_n1] o.a.s.u.p.LogUpdateProcessorFactory [collection1_shard1_replica_n1]  webapp=/solr path=/update params={update.distrib=FROMLEADER&waitSearcher=true&openSearcher=true&commit=true&softCommit=false&distrib.from=https://127.0.0.1:42023/solr/collection1_shard1_replica_n1/&commit_end_point=true&wt=javabin&version=2&expungeDeletes=false}{commit=} 0 4
   [junit4]   2> 1425374 INFO  (qtp10905298-24595) [n:127.0.0.1:46791_solr c:collection1 s:shard1 r:core_node4 x:collection1_shard1_replica_n2] o.a.s.u.p.LogUpdateProcessorFactory [collection1_shard1_replica_n2]  webapp=/solr path=/update params={update.distrib=FROMLEADER&waitSearcher=true&openSearcher=true&commit=true&softCommit=false&distrib.from=https://127.0.0.1:42023/solr/collection1_shard1_replica_n1/&commit_end_point=true&wt=javabin&version=2&expungeDeletes=false}{commit=} 0 4
   [junit4]   2> 1425374 INFO  (qtp26672895-24661) [n:127.0.0.1:42023_solr c:collection1 s:shard1 r:core_node3 x:collection1_shard1_replica_n1] o.a.s.u.p.LogUpdateProcessorFactory [collection1_shard1_replica_n1]  webapp=/solr path=/update params={waitSearcher=true&commit=true&softCommit=false&wt=javabin&version=2}{commit=} 0 5
   [junit4]   2> 1425377 INFO  (qtp10905298-24592) [n:127.0.0.1:46791_solr c:collection1 s:shard1 r:core_node4 x:collection1_shard1_replica_n2] o.a.s.u.p.LogUpdateProcessorFactory [collection1_shard1_replica_n2]  webapp=/solr path=/update params={update.distrib=FROMLEADER&distrib.from=https://127.0.0.1:42023/solr/collection1_shard1_replica_n1/&wt=javabin&version=2}{add=[9 (1605727069059153920)]} 0 0
   [junit4]   2> 1425377 INFO  (qtp26672895-24587) [n:127.0.0.1:42023_solr c:collection1 s:shard1 r:core_node3 x:collection1_shard1_replica_n1] o.a.s.u.p.LogUpdateProcessorFactory [collection1_shard1_replica_n1]  webapp=/solr path=/update params={wt=javabin&version=2}{add=[9 (1605727069059153920)]} 0 2
   [junit4]   2> 1425378 INFO  (qtp26672895-24583) [n:127.0.0.1:42023_solr c:collection1 s:shard1 r:core_node3 x:collection1_shard1_replica_n1] o.a.s.u.DirectUpdateHandler2 start commit{_version_=1605727069062299648,optimize=false,openSearcher=true,waitSearcher=true,expungeDeletes=false,softCommit=false,prepareCommit=false}
   [junit4]   2> 1425378 INFO  (qtp26672895-24583) [n:127.0.0.1:42023_solr c:collection1 s:shard1 r:core_node3 x:collection1_shard1_replica_n1] o.a.s.u.SolrIndexWriter Calling setCommitData with IW:org.apache.solr.update.SolrIndexWriter@12d99e2 commitCommandVersion:1605727069062299648
   [junit4]   2> 1425378 INFO  (qtp10905298-24595) [n:127.0.0.1:46791_solr c:collection1 s:shard1 r:core_node4 x:collection1_shard1_replica_n2] o.a.s.u.DirectUpdateHandler2 start commit{_version_=1605727069062299648,optimize=false,openSearcher=true,waitSearcher=true,expungeDeletes=false,softCommit=false,prepareCommit=false}
   [junit4]   2> 1425378 INFO  (qtp10905298-24595) [n:127.0.0.1:46791_solr c:collection1 s:shard1 r:core_node4 x:collection1_shard1_replica_n2] o.a.s.u.SolrIndexWriter Calling setCommitData with IW:org.apache.solr.update.SolrIndexWriter@35c70c commitCommandVersion:1605727069062299648
   [junit4]   2> 1425380 INFO  (qtp26672895-24583) [n:127.0.0.1:42023_solr c:collection1 s:shard1 r:core_node3 x:collection1_shard1_replica_n1] o.a.s.s.SolrIndexSearcher Opening [Searcher@6659a3[collection1_shard1_replica_n1] main]
   [junit4]   2> 1425380 INFO  (qtp10905298-24595) [n:127.0.0.1:46791_solr c:collection1 s:shard1 r:core_node4 x:collection1_shard1_replica_n2] o.a.s.s.SolrIndexSearcher Opening [Searcher@12baccf[collection1_shard1_replica_n2] main]
   [junit4]   2> 1425380 INFO  (qtp26672895-24583) [n:127.0.0.1:42023_solr c:collection1 s:shard1 r:core_node3 x:collection1_shard1_replica_n1] o.a.s.u.DirectUpdateHan

[...truncated too long message...]

s.SolrTestCaseJ4 ###Ending testOtherReplicasAreNotActive
   [junit4]   2> NOTE: reproduce with: ant test  -Dtestcase=LeaderTragicEventTest -Dtests.method=testOtherReplicasAreNotActive -Dtests.seed=E84D2EBDB3FC3E2A -Dtests.multiplier=3 -Dtests.slow=true -Dtests.badapples=true -Dtests.locale=el-CY -Dtests.timezone=Africa/Kampala -Dtests.asserts=true -Dtests.file.encoding=UTF-8
   [junit4] ERROR   2.88s J0 | LeaderTragicEventTest.testOtherReplicasAreNotActive <<<
   [junit4]    > Throwable #1: java.lang.IllegalStateException: Jetty Connector is not open: -2
   [junit4]    > at __randomizedtesting.SeedInfo.seed([E84D2EBDB3FC3E2A:6DF902CA8F0387B2]:0)
   [junit4]    > at org.apache.solr.client.solrj.embedded.JettySolrRunner.getBaseUrl(JettySolrRunner.java:499)
   [junit4]    > at org.apache.solr.cloud.MiniSolrCloudCluster.getReplicaJetty(MiniSolrCloudCluster.java:539)
   [junit4]    > at org.apache.solr.cloud.LeaderTragicEventTest.corruptLeader(LeaderTragicEventTest.java:100)
   [junit4]    > at org.apache.solr.cloud.LeaderTragicEventTest.testOtherReplicasAreNotActive(LeaderTragicEventTest.java:150)
   [junit4]    > at java.lang.Thread.run(Thread.java:748)
   [junit4]   2> 58690 INFO  (jetty-closer-47-thread-2) [    ] o.e.j.s.AbstractConnector Stopped ServerConnector@17cb721{SSL,[ssl, http/1.1]}{127.0.0.1:0}
   [junit4]   2> 58690 INFO  (jetty-closer-47-thread-2) [    ] o.a.s.c.CoreContainer Shutting down CoreContainer instance=6359548
   [junit4]   2> 58691 INFO  (jetty-closer-47-thread-2) [    ] o.a.s.m.SolrMetricManager Closing metric reporters for registry=solr.node, tag=null
   [junit4]   2> 58691 INFO  (jetty-closer-47-thread-2) [    ] o.a.s.m.r.SolrJmxReporter Closing reporter [org.apache.solr.metrics.reporters.SolrJmxReporter@1d8a206: rootName = solr_35399, domain = solr.node, service url = null, agent id = null] for registry solr.node / com.codahale.metrics.MetricRegistry@477f30
   [junit4]   2> 58698 INFO  (jetty-closer-47-thread-2) [    ] o.a.s.m.SolrMetricManager Closing metric reporters for registry=solr.jvm, tag=null
   [junit4]   2> 58698 INFO  (jetty-closer-47-thread-2) [    ] o.a.s.m.r.SolrJmxReporter Closing reporter [org.apache.solr.metrics.reporters.SolrJmxReporter@195df05: rootName = solr_35399, domain = solr.jvm, service url = null, agent id = null] for registry solr.jvm / com.codahale.metrics.MetricRegistry@e26c2
   [junit4]   2> 58702 INFO  (jetty-closer-47-thread-2) [    ] o.a.s.m.SolrMetricManager Closing metric reporters for registry=solr.jetty, tag=null
   [junit4]   2> 58702 INFO  (jetty-closer-47-thread-2) [    ] o.a.s.m.r.SolrJmxReporter Closing reporter [org.apache.solr.metrics.reporters.SolrJmxReporter@1ed9aa3: rootName = solr_35399, domain = solr.jetty, service url = null, agent id = null] for registry solr.jetty / com.codahale.metrics.MetricRegistry@14392be
   [junit4]   2> 58703 INFO  (jetty-closer-47-thread-2) [    ] o.a.s.c.ZkController Remove node as live in ZooKeeper:/live_nodes/127.0.0.1:35399_solr
   [junit4]   2> 58704 INFO  (jetty-closer-47-thread-2) [    ] o.a.s.m.SolrMetricManager Closing metric reporters for registry=solr.cluster, tag=null
   [junit4]   2> 58704 INFO  (zkCallback-79-thread-1) [    ] o.a.s.c.c.ZkStateReader Updated live nodes from ZooKeeper... (1) -> (0)
   [junit4]   2> 58704 INFO  (zkCallback-72-thread-1) [    ] o.a.s.c.c.ZkStateReader Updated live nodes from ZooKeeper... (1) -> (0)
   [junit4]   2> 58705 INFO  (coreCloseExecutor-111-thread-1) [n:127.0.0.1:35399_solr c:collection1 s:shard1 r:core_node4 x:collection1_shard1_replica_n2] o.a.s.c.SolrCore [collection1_shard1_replica_n2]  CLOSING SolrCore org.apache.solr.core.SolrCore@1452b9d
   [junit4]   2> 58705 INFO  (coreCloseExecutor-111-thread-1) [n:127.0.0.1:35399_solr c:collection1 s:shard1 r:core_node4 x:collection1_shard1_replica_n2] o.a.s.m.SolrMetricManager Closing metric reporters for registry=solr.core.collection1.shard1.replica_n2, tag=1452b9d
   [junit4]   2> 58705 INFO  (coreCloseExecutor-111-thread-1) [n:127.0.0.1:35399_solr c:collection1 s:shard1 r:core_node4 x:collection1_shard1_replica_n2] o.a.s.m.r.SolrJmxReporter Closing reporter [org.apache.solr.metrics.reporters.SolrJmxReporter@1a394df: rootName = solr_35399, domain = solr.core.collection1.shard1.replica_n2, service url = null, agent id = null] for registry solr.core.collection1.shard1.replica_n2 / com.codahale.metrics.MetricRegistry@1fb0f1e
   [junit4]   2> 58715 INFO  (coreCloseExecutor-111-thread-1) [n:127.0.0.1:35399_solr c:collection1 s:shard1 r:core_node4 x:collection1_shard1_replica_n2] o.a.s.m.SolrMetricManager Closing metric reporters for registry=solr.collection.collection1.shard1.leader, tag=1452b9d
   [junit4]   2> 58718 INFO  (jetty-closer-47-thread-2) [    ] o.a.s.c.Overseer Overseer (id=72110793723740167-127.0.0.1:35399_solr-n_0000000001) closing
   [junit4]   2> 58718 INFO  (OverseerStateUpdate-72110793723740167-127.0.0.1:35399_solr-n_0000000001) [    ] o.a.s.c.Overseer Overseer Loop exiting : 127.0.0.1:35399_solr
   [junit4]   2> 58718 WARN  (OverseerAutoScalingTriggerThread-72110793723740167-127.0.0.1:35399_solr-n_0000000001) [    ] o.a.s.c.a.OverseerTriggerThread OverseerTriggerThread woken up but we are closed, exiting.
   [junit4]   2> 58732 INFO  (jetty-closer-47-thread-2) [    ] o.e.j.s.h.ContextHandler Stopped o.e.j.s.ServletContextHandler@10bb8e6{/solr,null,UNAVAILABLE}
   [junit4]   2> 58733 INFO  (jetty-closer-47-thread-2) [    ] o.e.j.s.session node0 Stopped scavenging
   [junit4]   2> 58733 ERROR (SUITE-LeaderTragicEventTest-seed#[E84D2EBDB3FC3E2A]-worker) [    ] o.a.z.s.ZooKeeperServer ZKShutdownHandler is not registered, so ZooKeeper server won't take any action on ERROR or SHUTDOWN server state changes
   [junit4]   2> 58733 INFO  (SUITE-LeaderTragicEventTest-seed#[E84D2EBDB3FC3E2A]-worker) [    ] o.a.s.c.ZkTestServer connecting to 127.0.0.1:38233 38233
   [junit4]   2> 59598 INFO  (Thread-30) [    ] o.a.s.c.ZkTestServer connecting to 127.0.0.1:38233 38233
   [junit4]   2> 59599 WARN  (Thread-30) [    ] o.a.s.c.ZkTestServer Watch limit violations:
   [junit4]   2> Maximum concurrent create/delete watches above limit:
   [junit4]   2>
   [junit4]   2> 23 /solr/collections/collection1/terms/shard1
   [junit4]   2> 5 /solr/aliases.json
   [junit4]   2> 5 /solr/configs/config
   [junit4]   2> 2 /solr/security.json
   [junit4]   2>
   [junit4]   2> Maximum concurrent data watches above limit:
   [junit4]   2>
   [junit4]   2> 5 /solr/clusterstate.json
   [junit4]   2> 5 /solr/collections/collection1/state.json
   [junit4]   2> 5 /solr/clusterprops.json
   [junit4]   2> 2 /solr/autoscaling.json
   [junit4]   2>
   [junit4]   2> Maximum concurrent children watches above limit:
   [junit4]   2>
   [junit4]   2> 5 /solr/live_nodes
   [junit4]   2> 5 /solr/collections
   [junit4]   2> 2 /solr/overseer/queue
   [junit4]   2> 2 /solr/autoscaling/events/.scheduled_maintenance
   [junit4]   2> 2 /solr/autoscaling/events/.auto_add_replicas
   [junit4]   2> 2 /solr/overseer/queue-work
   [junit4]   2> 2 /solr/overseer/collection-queue-work
   [junit4]   2>
   [junit4]   2> NOTE: leaving temporary files on disk at: /home/jenkins/workspace/Lucene-Solr-master-Linux/solr/build/solr-core/test/J0/temp/solr.cloud.LeaderTragicEventTest_E84D2EBDB3FC3E2A-002
   [junit4]   2> NOTE: test params are: codec=DummyCompressingStoredFields(storedFieldsFormat=CompressingStoredFieldsFormat(compressionMode=DUMMY, chunkSize=10, maxDocsPerChunk=417, blockSize=481), termVectorsFormat=CompressingTermVectorsFormat(compressionMode=DUMMY, chunkSize=10, blockSize=481)), sim=Asserting(org.apache.lucene.search.similarities.AssertingSimilarity@f7e709), locale=el-CY, timezone=Africa/Kampala
   [junit4]   2> NOTE: Linux 4.15.0-24-generic i386/Oracle Corporation 1.8.0_172 (32-bit)/cpus=8,threads=1,free=48328560,total=145752064
   [junit4]   2> NOTE: All tests run in this JVM: [LeaderTragicEventTest, LeaderTragicEventTest]
   [junit4] Completed [4/5 (2!)] on J0 in 23.96s, 2 tests, 1 error <<< FAILURES!

[...truncated 17 lines...]
BUILD FAILED
/home/jenkins/workspace/Lucene-Solr-master-Linux/lucene/common-build.xml:1568: The following error occurred while executing this line:
/home/jenkins/workspace/Lucene-Solr-master-Linux/lucene/common-build.xml:1092: There were test failures: 5 suites, 10 tests, 2 errors [seed: E84D2EBDB3FC3E2A]

Total time: 1 minute 16 seconds

[repro] Setting last failure code to 256

[repro] Failures:
[repro]   2/5 failed: org.apache.solr.cloud.LeaderTragicEventTest
[repro] Exiting with code 256
+ mv lucene/build lucene/build.repro
+ mv solr/build solr/build.repro
+ mv lucene/build.orig lucene/build
+ mv solr/build.orig solr/build
Archiving artifacts
Setting ANT_1_8_2_HOME=/var/lib/jenkins/tools/hudson.tasks.Ant_AntInstallation/ANT_1.8.2
[WARNINGS] Parsing warnings in console log with parser Java Compiler (javac)
Setting ANT_1_8_2_HOME=/var/lib/jenkins/tools/hudson.tasks.Ant_AntInstallation/ANT_1.8.2
Setting ANT_1_8_2_HOME=/var/lib/jenkins/tools/hudson.tasks.Ant_AntInstallation/ANT_1.8.2
<Git Blamer> Using GitBlamer to create author and commit information for all warnings.
<Git Blamer> GIT_COMMIT=fe180bbd59ef45679f3cffa252fff0aa069b7427, workspace=/var/lib/jenkins/workspace/Lucene-Solr-master-Linux
[WARNINGS] Computing warning deltas based on reference build #22436
Recording test results
Setting ANT_1_8_2_HOME=/var/lib/jenkins/tools/hudson.tasks.Ant_AntInstallation/ANT_1.8.2
Build step 'Publish JUnit test result report' changed build result to UNSTABLE
Email was triggered for: Unstable (Test Failures)
Sending email for trigger: Unstable (Test Failures)
Setting ANT_1_8_2_HOME=/var/lib/jenkins/tools/hudson.tasks.Ant_AntInstallation/ANT_1.8.2
Setting ANT_1_8_2_HOME=/var/lib/jenkins/tools/hudson.tasks.Ant_AntInstallation/ANT_1.8.2
Setting ANT_1_8_2_HOME=/var/lib/jenkins/tools/hudson.tasks.Ant_AntInstallation/ANT_1.8.2
Setting ANT_1_8_2_HOME=/var/lib/jenkins/tools/hudson.tasks.Ant_AntInstallation/ANT_1.8.2


---------------------------------------------------------------------
To unsubscribe, e-mail: [hidden email]
For additional commands, e-mail: [hidden email]