Quantcast

[JENKINS] Lucene-Solr-master-MacOSX (64bit/jdk1.8.0) - Build # 3964 - Unstable!

Previous Topic Next Topic
 
classic Classic list List threaded Threaded
3 messages Options
Reply | Threaded
Open this post in threaded view
|  
Report Content as Inappropriate

[JENKINS] Lucene-Solr-master-MacOSX (64bit/jdk1.8.0) - Build # 3964 - Unstable!

Policeman Jenkins Server-2
Build: https://jenkins.thetaphi.de/job/Lucene-Solr-master-MacOSX/3964/
Java: 64bit/jdk1.8.0 -XX:-UseCompressedOops -XX:+UseSerialGC

1 tests failed.
FAILED:  org.apache.solr.cloud.DeleteNodeTest.test

Error Message:
org/apache/solr/client/solrj/request/CollectionAdminRequest$DeleteNode

Stack Trace:
java.lang.NoClassDefFoundError: org/apache/solr/client/solrj/request/CollectionAdminRequest$DeleteNode
        at __randomizedtesting.SeedInfo.seed([73C316FBEA9A9A4:8F680EB51055C45C]:0)
        at org.apache.solr.cloud.DeleteNodeTest.test(DeleteNodeTest.java:61)
        at sun.reflect.NativeMethodAccessorImpl.invoke0(Native Method)
        at sun.reflect.NativeMethodAccessorImpl.invoke(NativeMethodAccessorImpl.java:62)
        at sun.reflect.DelegatingMethodAccessorImpl.invoke(DelegatingMethodAccessorImpl.java:43)
        at java.lang.reflect.Method.invoke(Method.java:498)
        at com.carrotsearch.randomizedtesting.RandomizedRunner.invoke(RandomizedRunner.java:1713)
        at com.carrotsearch.randomizedtesting.RandomizedRunner$8.evaluate(RandomizedRunner.java:907)
        at com.carrotsearch.randomizedtesting.RandomizedRunner$9.evaluate(RandomizedRunner.java:943)
        at com.carrotsearch.randomizedtesting.RandomizedRunner$10.evaluate(RandomizedRunner.java:957)
        at com.carrotsearch.randomizedtesting.rules.SystemPropertiesRestoreRule$1.evaluate(SystemPropertiesRestoreRule.java:57)
        at org.apache.lucene.util.TestRuleSetupTeardownChained$1.evaluate(TestRuleSetupTeardownChained.java:49)
        at org.apache.lucene.util.AbstractBeforeAfterRule$1.evaluate(AbstractBeforeAfterRule.java:45)
        at org.apache.lucene.util.TestRuleThreadAndTestName$1.evaluate(TestRuleThreadAndTestName.java:48)
        at org.apache.lucene.util.TestRuleIgnoreAfterMaxFailures$1.evaluate(TestRuleIgnoreAfterMaxFailures.java:64)
        at org.apache.lucene.util.TestRuleMarkFailure$1.evaluate(TestRuleMarkFailure.java:47)
        at com.carrotsearch.randomizedtesting.rules.StatementAdapter.evaluate(StatementAdapter.java:36)
        at com.carrotsearch.randomizedtesting.ThreadLeakControl$StatementRunner.run(ThreadLeakControl.java:368)
        at com.carrotsearch.randomizedtesting.ThreadLeakControl.forkTimeoutingTask(ThreadLeakControl.java:817)
        at com.carrotsearch.randomizedtesting.ThreadLeakControl$3.evaluate(ThreadLeakControl.java:468)
        at com.carrotsearch.randomizedtesting.RandomizedRunner.runSingleTest(RandomizedRunner.java:916)
        at com.carrotsearch.randomizedtesting.RandomizedRunner$5.evaluate(RandomizedRunner.java:802)
        at com.carrotsearch.randomizedtesting.RandomizedRunner$6.evaluate(RandomizedRunner.java:852)
        at com.carrotsearch.randomizedtesting.RandomizedRunner$7.evaluate(RandomizedRunner.java:863)
        at com.carrotsearch.randomizedtesting.rules.StatementAdapter.evaluate(StatementAdapter.java:36)
        at com.carrotsearch.randomizedtesting.rules.SystemPropertiesRestoreRule$1.evaluate(SystemPropertiesRestoreRule.java:57)
        at org.apache.lucene.util.AbstractBeforeAfterRule$1.evaluate(AbstractBeforeAfterRule.java:45)
        at com.carrotsearch.randomizedtesting.rules.StatementAdapter.evaluate(StatementAdapter.java:36)
        at org.apache.lucene.util.TestRuleStoreClassName$1.evaluate(TestRuleStoreClassName.java:41)
        at com.carrotsearch.randomizedtesting.rules.NoShadowingOrOverridesOnMethodsRule$1.evaluate(NoShadowingOrOverridesOnMethodsRule.java:40)
        at com.carrotsearch.randomizedtesting.rules.NoShadowingOrOverridesOnMethodsRule$1.evaluate(NoShadowingOrOverridesOnMethodsRule.java:40)
        at com.carrotsearch.randomizedtesting.rules.StatementAdapter.evaluate(StatementAdapter.java:36)
        at com.carrotsearch.randomizedtesting.rules.StatementAdapter.evaluate(StatementAdapter.java:36)
        at com.carrotsearch.randomizedtesting.rules.StatementAdapter.evaluate(StatementAdapter.java:36)
        at org.apache.lucene.util.TestRuleAssertionsRequired$1.evaluate(TestRuleAssertionsRequired.java:53)
        at org.apache.lucene.util.TestRuleMarkFailure$1.evaluate(TestRuleMarkFailure.java:47)
        at org.apache.lucene.util.TestRuleIgnoreAfterMaxFailures$1.evaluate(TestRuleIgnoreAfterMaxFailures.java:64)
        at org.apache.lucene.util.TestRuleIgnoreTestSuites$1.evaluate(TestRuleIgnoreTestSuites.java:54)
        at com.carrotsearch.randomizedtesting.rules.StatementAdapter.evaluate(StatementAdapter.java:36)
        at com.carrotsearch.randomizedtesting.ThreadLeakControl$StatementRunner.run(ThreadLeakControl.java:368)
        at java.lang.Thread.run(Thread.java:745)
Caused by: java.lang.ClassNotFoundException: org.apache.solr.client.solrj.request.CollectionAdminRequest$DeleteNode
        at java.net.URLClassLoader$1.run(URLClassLoader.java:370)
        at java.net.URLClassLoader$1.run(URLClassLoader.java:362)
        at java.security.AccessController.doPrivileged(Native Method)
        at java.net.URLClassLoader.findClass(URLClassLoader.java:361)
        at java.lang.ClassLoader.loadClass(ClassLoader.java:424)
        at sun.misc.Launcher$AppClassLoader.loadClass(Launcher.java:331)
        at java.lang.ClassLoader.loadClass(ClassLoader.java:357)
        ... 40 more
Caused by: java.io.FileNotFoundException: /Users/jenkins/workspace/Lucene-Solr-master-MacOSX/solr/build/solr-solrj/classes/java/org/apache/solr/client/solrj/request/CollectionAdminRequest$DeleteNode.class (Too many open files)
        at java.io.FileInputStream.open0(Native Method)
        at java.io.FileInputStream.open(FileInputStream.java:195)
        at java.io.FileInputStream.<init>(FileInputStream.java:138)
        at sun.misc.URLClassPath$FileLoader$1.getInputStream(URLClassPath.java:1288)
        at sun.misc.Resource.cachedInputStream(Resource.java:77)
        at sun.misc.Resource.getByteBuffer(Resource.java:160)
        at java.net.URLClassLoader.defineClass(URLClassLoader.java:454)
        at java.net.URLClassLoader.access$100(URLClassLoader.java:73)
        at java.net.URLClassLoader$1.run(URLClassLoader.java:368)
        ... 46 more




Build Log:
[...truncated 11225 lines...]
   [junit4] Suite: org.apache.solr.cloud.DeleteNodeTest
   [junit4]   2> Creating dataDir: /Users/jenkins/workspace/Lucene-Solr-master-MacOSX/solr/build/solr-core/test/J1/temp/solr.cloud.DeleteNodeTest_73C316FBEA9A9A4-001/init-core-data-001
   [junit4]   2> 1019163 WARN  (SUITE-DeleteNodeTest-seed#[73C316FBEA9A9A4]-worker) [    ] o.a.s.SolrTestCaseJ4 startTrackingSearchers: numOpens=27 numCloses=27
   [junit4]   2> 1019163 INFO  (SUITE-DeleteNodeTest-seed#[73C316FBEA9A9A4]-worker) [    ] o.a.s.SolrTestCaseJ4 Using TrieFields
   [junit4]   2> 1019167 INFO  (SUITE-DeleteNodeTest-seed#[73C316FBEA9A9A4]-worker) [    ] o.a.s.SolrTestCaseJ4 Randomized ssl (false) and clientAuth (false) via: @org.apache.solr.util.RandomizeSSL(reason=, value=NaN, ssl=NaN, clientAuth=NaN) w/ MAC_OS_X supressed clientAuth
   [junit4]   2> 1019167 INFO  (SUITE-DeleteNodeTest-seed#[73C316FBEA9A9A4]-worker) [    ] o.a.s.c.MiniSolrCloudCluster Starting cluster of 6 servers in /Users/jenkins/workspace/Lucene-Solr-master-MacOSX/solr/build/solr-core/test/J1/temp/solr.cloud.DeleteNodeTest_73C316FBEA9A9A4-001/tempDir-001
   [junit4]   2> 1019168 INFO  (SUITE-DeleteNodeTest-seed#[73C316FBEA9A9A4]-worker) [    ] o.a.s.c.ZkTestServer STARTING ZK TEST SERVER
   [junit4]   2> 1019168 INFO  (Thread-1377) [    ] o.a.s.c.ZkTestServer client port:0.0.0.0/0.0.0.0:0
   [junit4]   2> 1019168 INFO  (Thread-1377) [    ] o.a.s.c.ZkTestServer Starting server
   [junit4]   2> 1019277 INFO  (SUITE-DeleteNodeTest-seed#[73C316FBEA9A9A4]-worker) [    ] o.a.s.c.ZkTestServer start zk server on port:50344
   [junit4]   2> 1019363 INFO  (jetty-launcher-2125-thread-2) [    ] o.e.j.s.Server jetty-9.3.14.v20161028
   [junit4]   2> 1019363 INFO  (jetty-launcher-2125-thread-1) [    ] o.e.j.s.Server jetty-9.3.14.v20161028
   [junit4]   2> 1019364 INFO  (jetty-launcher-2125-thread-3) [    ] o.e.j.s.Server jetty-9.3.14.v20161028
   [junit4]   2> 1019365 INFO  (jetty-launcher-2125-thread-4) [    ] o.e.j.s.Server jetty-9.3.14.v20161028
   [junit4]   2> 1019365 INFO  (jetty-launcher-2125-thread-5) [    ] o.e.j.s.Server jetty-9.3.14.v20161028
   [junit4]   2> 1019366 INFO  (jetty-launcher-2125-thread-6) [    ] o.e.j.s.Server jetty-9.3.14.v20161028
   [junit4]   2> 1019371 INFO  (jetty-launcher-2125-thread-5) [    ] o.e.j.s.h.ContextHandler Started o.e.j.s.ServletContextHandler@22a72363{/solr,null,AVAILABLE}
   [junit4]   2> 1019382 INFO  (jetty-launcher-2125-thread-1) [    ] o.e.j.s.h.ContextHandler Started o.e.j.s.ServletContextHandler@205a637b{/solr,null,AVAILABLE}
   [junit4]   2> 1019383 INFO  (jetty-launcher-2125-thread-5) [    ] o.e.j.s.AbstractConnector Started ServerConnector@24fd73ff{HTTP/1.1,[http/1.1]}{127.0.0.1:50346}
   [junit4]   2> 1019383 INFO  (jetty-launcher-2125-thread-5) [    ] o.e.j.s.Server Started @1024542ms
   [junit4]   2> 1019383 INFO  (jetty-launcher-2125-thread-5) [    ] o.a.s.c.s.e.JettySolrRunner Jetty properties: {hostContext=/solr, hostPort=50346}
   [junit4]   2> 1019383 INFO  (jetty-launcher-2125-thread-1) [    ] o.e.j.s.AbstractConnector Started ServerConnector@515e2c21{HTTP/1.1,[http/1.1]}{127.0.0.1:50347}
   [junit4]   2> 1019383 INFO  (jetty-launcher-2125-thread-1) [    ] o.e.j.s.Server Started @1024543ms
   [junit4]   2> 1019383 INFO  (jetty-launcher-2125-thread-1) [    ] o.a.s.c.s.e.JettySolrRunner Jetty properties: {hostContext=/solr, hostPort=50347}
   [junit4]   2> 1019383 ERROR (jetty-launcher-2125-thread-5) [    ] o.a.s.s.StartupLoggingUtils Missing Java Option solr.log.dir. Logging may be missing or incomplete.
   [junit4]   2> 1019385 INFO  (jetty-launcher-2125-thread-2) [    ] o.e.j.s.h.ContextHandler Started o.e.j.s.ServletContextHandler@39836857{/solr,null,AVAILABLE}
   [junit4]   2> 1019386 INFO  (jetty-launcher-2125-thread-4) [    ] o.e.j.s.h.ContextHandler Started o.e.j.s.ServletContextHandler@5a95bdd4{/solr,null,AVAILABLE}
   [junit4]   2> 1019386 INFO  (jetty-launcher-2125-thread-5) [    ] o.a.s.s.SolrDispatchFilter  ___      _       Welcome to Apache Solr™ version 7.0.0
   [junit4]   2> 1019386 INFO  (jetty-launcher-2125-thread-5) [    ] o.a.s.s.SolrDispatchFilter / __| ___| |_ _   Starting in cloud mode on port null
   [junit4]   2> 1019386 INFO  (jetty-launcher-2125-thread-5) [    ] o.a.s.s.SolrDispatchFilter \__ \/ _ \ | '_|  Install dir: null
   [junit4]   2> 1019386 INFO  (jetty-launcher-2125-thread-5) [    ] o.a.s.s.SolrDispatchFilter |___/\___/_|_|    Start time: 2017-04-21T12:29:00.409Z
   [junit4]   2> 1019386 INFO  (jetty-launcher-2125-thread-2) [    ] o.e.j.s.AbstractConnector Started ServerConnector@39425add{HTTP/1.1,[http/1.1]}{127.0.0.1:50348}
   [junit4]   2> 1019386 INFO  (jetty-launcher-2125-thread-2) [    ] o.e.j.s.Server Started @1024546ms
   [junit4]   2> 1019386 INFO  (jetty-launcher-2125-thread-2) [    ] o.a.s.c.s.e.JettySolrRunner Jetty properties: {hostContext=/solr, hostPort=50348}
   [junit4]   2> 1019386 INFO  (jetty-launcher-2125-thread-4) [    ] o.e.j.s.AbstractConnector Started ServerConnector@716a1b4e{HTTP/1.1,[http/1.1]}{127.0.0.1:50349}
   [junit4]   2> 1019386 INFO  (jetty-launcher-2125-thread-4) [    ] o.e.j.s.Server Started @1024546ms
   [junit4]   2> 1019386 ERROR (jetty-launcher-2125-thread-2) [    ] o.a.s.s.StartupLoggingUtils Missing Java Option solr.log.dir. Logging may be missing or incomplete.
   [junit4]   2> 1019386 INFO  (jetty-launcher-2125-thread-4) [    ] o.a.s.c.s.e.JettySolrRunner Jetty properties: {hostContext=/solr, hostPort=50349}
   [junit4]   2> 1019387 ERROR (jetty-launcher-2125-thread-4) [    ] o.a.s.s.StartupLoggingUtils Missing Java Option solr.log.dir. Logging may be missing or incomplete.
   [junit4]   2> 1019383 ERROR (jetty-launcher-2125-thread-1) [    ] o.a.s.s.StartupLoggingUtils Missing Java Option solr.log.dir. Logging may be missing or incomplete.
   [junit4]   2> 1019388 INFO  (jetty-launcher-2125-thread-2) [    ] o.a.s.s.SolrDispatchFilter  ___      _       Welcome to Apache Solr™ version 7.0.0
   [junit4]   2> 1019389 INFO  (jetty-launcher-2125-thread-1) [    ] o.a.s.s.SolrDispatchFilter  ___      _       Welcome to Apache Solr™ version 7.0.0
   [junit4]   2> 1019389 INFO  (jetty-launcher-2125-thread-2) [    ] o.a.s.s.SolrDispatchFilter / __| ___| |_ _   Starting in cloud mode on port null
   [junit4]   2> 1019389 INFO  (jetty-launcher-2125-thread-1) [    ] o.a.s.s.SolrDispatchFilter / __| ___| |_ _   Starting in cloud mode on port null
   [junit4]   2> 1019388 INFO  (jetty-launcher-2125-thread-3) [    ] o.e.j.s.h.ContextHandler Started o.e.j.s.ServletContextHandler@4409e4e8{/solr,null,AVAILABLE}
   [junit4]   2> 1019388 INFO  (jetty-launcher-2125-thread-4) [    ] o.a.s.s.SolrDispatchFilter  ___      _       Welcome to Apache Solr™ version 7.0.0
   [junit4]   2> 1019391 INFO  (jetty-launcher-2125-thread-4) [    ] o.a.s.s.SolrDispatchFilter / __| ___| |_ _   Starting in cloud mode on port null
   [junit4]   2> 1019391 INFO  (jetty-launcher-2125-thread-4) [    ] o.a.s.s.SolrDispatchFilter \__ \/ _ \ | '_|  Install dir: null
   [junit4]   2> 1019391 INFO  (jetty-launcher-2125-thread-4) [    ] o.a.s.s.SolrDispatchFilter |___/\___/_|_|    Start time: 2017-04-21T12:29:00.414Z
   [junit4]   2> 1019391 INFO  (jetty-launcher-2125-thread-3) [    ] o.e.j.s.AbstractConnector Started ServerConnector@4310df28{HTTP/1.1,[http/1.1]}{127.0.0.1:50350}
   [junit4]   2> 1019391 INFO  (jetty-launcher-2125-thread-3) [    ] o.e.j.s.Server Started @1024551ms
   [junit4]   2> 1019391 INFO  (jetty-launcher-2125-thread-3) [    ] o.a.s.c.s.e.JettySolrRunner Jetty properties: {hostContext=/solr, hostPort=50350}
   [junit4]   2> 1019391 ERROR (jetty-launcher-2125-thread-3) [    ] o.a.s.s.StartupLoggingUtils Missing Java Option solr.log.dir. Logging may be missing or incomplete.
   [junit4]   2> 1019388 INFO  (jetty-launcher-2125-thread-6) [    ] o.e.j.s.h.ContextHandler Started o.e.j.s.ServletContextHandler@1b381c55{/solr,null,AVAILABLE}
   [junit4]   2> 1019392 INFO  (jetty-launcher-2125-thread-3) [    ] o.a.s.s.SolrDispatchFilter  ___      _       Welcome to Apache Solr™ version 7.0.0
   [junit4]   2> 1019392 INFO  (jetty-launcher-2125-thread-3) [    ] o.a.s.s.SolrDispatchFilter / __| ___| |_ _   Starting in cloud mode on port null
   [junit4]   2> 1019392 INFO  (jetty-launcher-2125-thread-3) [    ] o.a.s.s.SolrDispatchFilter \__ \/ _ \ | '_|  Install dir: null
   [junit4]   2> 1019392 INFO  (jetty-launcher-2125-thread-3) [    ] o.a.s.s.SolrDispatchFilter |___/\___/_|_|    Start time: 2017-04-21T12:29:00.415Z
   [junit4]   2> 1019389 INFO  (jetty-launcher-2125-thread-1) [    ] o.a.s.s.SolrDispatchFilter \__ \/ _ \ | '_|  Install dir: null
   [junit4]   2> 1019392 INFO  (jetty-launcher-2125-thread-1) [    ] o.a.s.s.SolrDispatchFilter |___/\___/_|_|    Start time: 2017-04-21T12:29:00.415Z
   [junit4]   2> 1019389 INFO  (jetty-launcher-2125-thread-2) [    ] o.a.s.s.SolrDispatchFilter \__ \/ _ \ | '_|  Install dir: null
   [junit4]   2> 1019393 INFO  (jetty-launcher-2125-thread-2) [    ] o.a.s.s.SolrDispatchFilter |___/\___/_|_|    Start time: 2017-04-21T12:29:00.416Z
   [junit4]   2> 1019395 INFO  (jetty-launcher-2125-thread-6) [    ] o.e.j.s.AbstractConnector Started ServerConnector@631d2380{HTTP/1.1,[http/1.1]}{127.0.0.1:50352}
   [junit4]   2> 1019395 INFO  (jetty-launcher-2125-thread-6) [    ] o.e.j.s.Server Started @1024554ms
   [junit4]   2> 1019395 INFO  (jetty-launcher-2125-thread-6) [    ] o.a.s.c.s.e.JettySolrRunner Jetty properties: {hostContext=/solr, hostPort=50352}
   [junit4]   2> 1019395 ERROR (jetty-launcher-2125-thread-6) [    ] o.a.s.s.StartupLoggingUtils Missing Java Option solr.log.dir. Logging may be missing or incomplete.
   [junit4]   2> 1019396 INFO  (jetty-launcher-2125-thread-6) [    ] o.a.s.s.SolrDispatchFilter  ___      _       Welcome to Apache Solr™ version 7.0.0
   [junit4]   2> 1019396 INFO  (jetty-launcher-2125-thread-6) [    ] o.a.s.s.SolrDispatchFilter / __| ___| |_ _   Starting in cloud mode on port null
   [junit4]   2> 1019396 INFO  (jetty-launcher-2125-thread-6) [    ] o.a.s.s.SolrDispatchFilter \__ \/ _ \ | '_|  Install dir: null
   [junit4]   2> 1019396 INFO  (jetty-launcher-2125-thread-6) [    ] o.a.s.s.SolrDispatchFilter |___/\___/_|_|    Start time: 2017-04-21T12:29:00.419Z
   [junit4]   2> 1019400 INFO  (jetty-launcher-2125-thread-4) [    ] o.a.s.s.SolrDispatchFilter solr.xml found in ZooKeeper. Loading...
   [junit4]   2> 1019406 INFO  (jetty-launcher-2125-thread-3) [    ] o.a.s.s.SolrDispatchFilter solr.xml found in ZooKeeper. Loading...
   [junit4]   2> 1019411 INFO  (jetty-launcher-2125-thread-5) [    ] o.a.s.s.SolrDispatchFilter solr.xml found in ZooKeeper. Loading...
   [junit4]   2> 1019417 INFO  (jetty-launcher-2125-thread-6) [    ] o.a.s.s.SolrDispatchFilter solr.xml found in ZooKeeper. Loading...
   [junit4]   2> 1019417 INFO  (jetty-launcher-2125-thread-2) [    ] o.a.s.s.SolrDispatchFilter solr.xml found in ZooKeeper. Loading...
   [junit4]   2> 1019418 INFO  (jetty-launcher-2125-thread-1) [    ] o.a.s.s.SolrDispatchFilter solr.xml found in ZooKeeper. Loading...
   [junit4]   2> 1019422 INFO  (jetty-launcher-2125-thread-3) [    ] o.a.s.c.ZkContainer Zookeeper client=127.0.0.1:50344/solr
   [junit4]   2> 1019422 INFO  (jetty-launcher-2125-thread-4) [    ] o.a.s.c.ZkContainer Zookeeper client=127.0.0.1:50344/solr
   [junit4]   2> 1019426 INFO  (jetty-launcher-2125-thread-5) [    ] o.a.s.c.ZkContainer Zookeeper client=127.0.0.1:50344/solr
   [junit4]   2> 1019431 INFO  (jetty-launcher-2125-thread-1) [    ] o.a.s.c.ZkContainer Zookeeper client=127.0.0.1:50344/solr
   [junit4]   2> 1019433 INFO  (jetty-launcher-2125-thread-2) [    ] o.a.s.c.ZkContainer Zookeeper client=127.0.0.1:50344/solr
   [junit4]   2> 1019433 INFO  (jetty-launcher-2125-thread-6) [    ] o.a.s.c.ZkContainer Zookeeper client=127.0.0.1:50344/solr
   [junit4]   2> 1019505 INFO  (jetty-launcher-2125-thread-2) [n:127.0.0.1:50348_solr    ] o.a.s.c.Overseer Overseer (id=null) closing
   [junit4]   2> 1019505 INFO  (jetty-launcher-2125-thread-6) [n:127.0.0.1:50352_solr    ] o.a.s.c.Overseer Overseer (id=null) closing
   [junit4]   2> 1019508 INFO  (jetty-launcher-2125-thread-6) [n:127.0.0.1:50352_solr    ] o.a.s.c.OverseerElectionContext I am going to be the leader 127.0.0.1:50352_solr
   [junit4]   2> 1019509 INFO  (jetty-launcher-2125-thread-2) [n:127.0.0.1:50348_solr    ] o.a.s.c.ZkController Register node as live in ZooKeeper:/live_nodes/127.0.0.1:50348_solr
   [junit4]   2> 1019513 INFO  (jetty-launcher-2125-thread-1) [n:127.0.0.1:50347_solr    ] o.a.s.c.Overseer Overseer (id=null) closing
   [junit4]   2> 1019514 INFO  (jetty-launcher-2125-thread-6) [n:127.0.0.1:50352_solr    ] o.a.s.c.Overseer Overseer (id=97830681981354002-127.0.0.1:50352_solr-n_0000000000) starting
   [junit4]   2> 1019515 INFO  (jetty-launcher-2125-thread-3) [n:127.0.0.1:50350_solr    ] o.a.s.c.Overseer Overseer (id=null) closing
   [junit4]   2> 1019518 INFO  (zkCallback-2156-thread-1-processing-n:127.0.0.1:50348_solr) [n:127.0.0.1:50348_solr    ] o.a.s.c.c.ZkStateReader Updated live nodes from ZooKeeper... (0) -> (1)
   [junit4]   2> 1019518 INFO  (zkCallback-2155-thread-1-processing-n:127.0.0.1:50347_solr) [n:127.0.0.1:50347_solr    ] o.a.s.c.c.ZkStateReader Updated live nodes from ZooKeeper... (0) -> (1)
   [junit4]   2> 1019518 INFO  (zkCallback-2157-thread-1-processing-n:127.0.0.1:50352_solr) [n:127.0.0.1:50352_solr    ] o.a.s.c.c.ZkStateReader Updated live nodes from ZooKeeper... (0) -> (1)
   [junit4]   2> 1019518 INFO  (zkCallback-2147-thread-1-processing-n:127.0.0.1:50350_solr) [n:127.0.0.1:50350_solr    ] o.a.s.c.c.ZkStateReader Updated live nodes from ZooKeeper... (0) -> (1)
   [junit4]   2> 1019519 INFO  (jetty-launcher-2125-thread-1) [n:127.0.0.1:50347_solr    ] o.a.s.c.ZkController Register node as live in ZooKeeper:/live_nodes/127.0.0.1:50347_solr
   [junit4]   2> 1019529 INFO  (zkCallback-2154-thread-1-processing-n:127.0.0.1:50346_solr) [n:127.0.0.1:50346_solr    ] o.a.s.c.c.ZkStateReader Updated live nodes from ZooKeeper... (0) -> (1)
   [junit4]   2> 1019529 INFO  (zkCallback-2156-thread-1-processing-n:127.0.0.1:50348_solr) [n:127.0.0.1:50348_solr    ] o.a.s.c.c.ZkStateReader Updated live nodes from ZooKeeper... (1) -> (2)
   [junit4]   2> 1019530 INFO  (zkCallback-2155-thread-1-processing-n:127.0.0.1:50347_solr) [n:127.0.0.1:50347_solr    ] o.a.s.c.c.ZkStateReader Updated live nodes from ZooKeeper... (1) -> (2)
   [junit4]   2> 1019530 INFO  (zkCallback-2154-thread-2-processing-n:127.0.0.1:50346_solr) [n:127.0.0.1:50346_solr    ] o.a.s.c.c.ZkStateReader Updated live nodes from ZooKeeper... (1) -> (2)
   [junit4]   2> 1019532 INFO  (zkCallback-2157-thread-1-processing-n:127.0.0.1:50352_solr) [n:127.0.0.1:50352_solr    ] o.a.s.c.c.ZkStateReader Updated live nodes from ZooKeeper... (1) -> (2)
   [junit4]   2> 1019535 INFO  (zkCallback-2147-thread-1-processing-n:127.0.0.1:50350_solr) [n:127.0.0.1:50350_solr    ] o.a.s.c.c.ZkStateReader Updated live nodes from ZooKeeper... (1) -> (2)
   [junit4]   2> 1019536 INFO  (jetty-launcher-2125-thread-3) [n:127.0.0.1:50350_solr    ] o.a.s.c.ZkController Register node as live in ZooKeeper:/live_nodes/127.0.0.1:50350_solr
   [junit4]   2> 1019542 INFO  (jetty-launcher-2125-thread-5) [n:127.0.0.1:50346_solr    ] o.a.s.c.Overseer Overseer (id=null) closing
   [junit4]   2> 1019548 INFO  (zkCallback-2155-thread-1-processing-n:127.0.0.1:50347_solr) [n:127.0.0.1:50347_solr    ] o.a.s.c.c.ZkStateReader Updated live nodes from ZooKeeper... (2) -> (3)
   [junit4]   2> 1019548 INFO  (zkCallback-2156-thread-1-processing-n:127.0.0.1:50348_solr) [n:127.0.0.1:50348_solr    ] o.a.s.c.c.ZkStateReader Updated live nodes from ZooKeeper... (2) -> (3)
   [junit4]   2> 1019549 INFO  (zkCallback-2154-thread-2-processing-n:127.0.0.1:50346_solr) [n:127.0.0.1:50346_solr    ] o.a.s.c.c.ZkStateReader Updated live nodes from ZooKeeper... (2) -> (3)
   [junit4]   2> 1019549 INFO  (zkCallback-2157-thread-1-processing-n:127.0.0.1:50352_solr) [n:127.0.0.1:50352_solr    ] o.a.s.c.c.ZkStateReader Updated live nodes from ZooKeeper... (2) -> (3)
   [junit4]   2> 1019550 INFO  (zkCallback-2147-thread-1-processing-n:127.0.0.1:50350_solr) [n:127.0.0.1:50350_solr    ] o.a.s.c.c.ZkStateReader Updated live nodes from ZooKeeper... (2) -> (3)
   [junit4]   2> 1019564 INFO  (jetty-launcher-2125-thread-5) [n:127.0.0.1:50346_solr    ] o.a.s.c.ZkController Register node as live in ZooKeeper:/live_nodes/127.0.0.1:50346_solr
   [junit4]   2> 1019564 INFO  (jetty-launcher-2125-thread-4) [n:127.0.0.1:50349_solr    ] o.a.s.c.c.ZkStateReader Updated live nodes from ZooKeeper... (0) -> (3)
   [junit4]   2> 1019567 INFO  (zkCallback-2154-thread-2-processing-n:127.0.0.1:50346_solr) [n:127.0.0.1:50346_solr    ] o.a.s.c.c.ZkStateReader Updated live nodes from ZooKeeper... (3) -> (4)
   [junit4]   2> 1019567 INFO  (zkCallback-2155-thread-1-processing-n:127.0.0.1:50347_solr) [n:127.0.0.1:50347_solr    ] o.a.s.c.c.ZkStateReader Updated live nodes from ZooKeeper... (3) -> (4)
   [junit4]   2> 1019567 INFO  (zkCallback-2156-thread-1-processing-n:127.0.0.1:50348_solr) [n:127.0.0.1:50348_solr    ] o.a.s.c.c.ZkStateReader Updated live nodes from ZooKeeper... (3) -> (4)
   [junit4]   2> 1019567 INFO  (zkCallback-2157-thread-1-processing-n:127.0.0.1:50352_solr) [n:127.0.0.1:50352_solr    ] o.a.s.c.c.ZkStateReader Updated live nodes from ZooKeeper... (3) -> (4)
   [junit4]   2> 1019568 INFO  (zkCallback-2147-thread-1-processing-n:127.0.0.1:50350_solr) [n:127.0.0.1:50350_solr    ] o.a.s.c.c.ZkStateReader Updated live nodes from ZooKeeper... (3) -> (4)
   [junit4]   2> 1019601 INFO  (zkCallback-2152-thread-1-processing-n:127.0.0.1:50349_solr) [n:127.0.0.1:50349_solr    ] o.a.s.c.c.ZkStateReader Updated live nodes from ZooKeeper... (3) -> (4)
   [junit4]   2> 1019602 INFO  (jetty-launcher-2125-thread-6) [n:127.0.0.1:50352_solr    ] o.a.s.c.ZkController Register node as live in ZooKeeper:/live_nodes/127.0.0.1:50352_solr
   [junit4]   2> 1019604 INFO  (jetty-launcher-2125-thread-4) [n:127.0.0.1:50349_solr    ] o.a.s.c.Overseer Overseer (id=null) closing
   [junit4]   2> 1019606 INFO  (zkCallback-2156-thread-1-processing-n:127.0.0.1:50348_solr) [n:127.0.0.1:50348_solr    ] o.a.s.c.c.ZkStateReader Updated live nodes from ZooKeeper... (4) -> (5)
   [junit4]   2> 1019606 INFO  (zkCallback-2155-thread-1-processing-n:127.0.0.1:50347_solr) [n:127.0.0.1:50347_solr    ] o.a.s.c.c.ZkStateReader Updated live nodes from ZooKeeper... (4) -> (5)
   [junit4]   2> 1019606 INFO  (zkCallback-2152-thread-1-processing-n:127.0.0.1:50349_solr) [n:127.0.0.1:50349_solr    ] o.a.s.c.c.ZkStateReader Updated live nodes from ZooKeeper... (4) -> (5)
   [junit4]   2> 1019606 INFO  (zkCallback-2154-thread-2-processing-n:127.0.0.1:50346_solr) [n:127.0.0.1:50346_solr    ] o.a.s.c.c.ZkStateReader Updated live nodes from ZooKeeper... (4) -> (5)
   [junit4]   2> 1019606 INFO  (zkCallback-2147-thread-1-processing-n:127.0.0.1:50350_solr) [n:127.0.0.1:50350_solr    ] o.a.s.c.c.ZkStateReader Updated live nodes from ZooKeeper... (4) -> (5)
   [junit4]   2> 1019606 INFO  (zkCallback-2157-thread-1-processing-n:127.0.0.1:50352_solr) [n:127.0.0.1:50352_solr    ] o.a.s.c.c.ZkStateReader Updated live nodes from ZooKeeper... (4) -> (5)
   [junit4]   2> 1019610 INFO  (jetty-launcher-2125-thread-4) [n:127.0.0.1:50349_solr    ] o.a.s.c.ZkController Register node as live in ZooKeeper:/live_nodes/127.0.0.1:50349_solr
   [junit4]   2> 1019614 INFO  (zkCallback-2147-thread-1-processing-n:127.0.0.1:50350_solr) [n:127.0.0.1:50350_solr    ] o.a.s.c.c.ZkStateReader Updated live nodes from ZooKeeper... (5) -> (6)
   [junit4]   2> 1019614 INFO  (zkCallback-2155-thread-1-processing-n:127.0.0.1:50347_solr) [n:127.0.0.1:50347_solr    ] o.a.s.c.c.ZkStateReader Updated live nodes from ZooKeeper... (5) -> (6)
   [junit4]   2> 1019614 INFO  (zkCallback-2152-thread-1-processing-n:127.0.0.1:50349_solr) [n:127.0.0.1:50349_solr    ] o.a.s.c.c.ZkStateReader Updated live nodes from ZooKeeper... (5) -> (6)
   [junit4]   2> 1019614 INFO  (zkCallback-2154-thread-2-processing-n:127.0.0.1:50346_solr) [n:127.0.0.1:50346_solr    ] o.a.s.c.c.ZkStateReader Updated live nodes from ZooKeeper... (5) -> (6)
   [junit4]   2> 1019615 INFO  (zkCallback-2156-thread-1-processing-n:127.0.0.1:50348_solr) [n:127.0.0.1:50348_solr    ] o.a.s.c.c.ZkStateReader Updated live nodes from ZooKeeper... (5) -> (6)
   [junit4]   2> 1019615 INFO  (zkCallback-2157-thread-1-processing-n:127.0.0.1:50352_solr) [n:127.0.0.1:50352_solr    ] o.a.s.c.c.ZkStateReader Updated live nodes from ZooKeeper... (5) -> (6)
   [junit4]   2> 1019748 INFO  (jetty-launcher-2125-thread-2) [n:127.0.0.1:50348_solr    ] o.a.s.m.r.SolrJmxReporter JMX monitoring for 'solr_50348.solr.node' (registry 'solr.node') enabled at server: com.sun.jmx.mbeanserver.JmxMBeanServer@38f6ee6c
   [junit4]   2> 1019751 INFO  (jetty-launcher-2125-thread-2) [n:127.0.0.1:50348_solr    ] o.a.s.m.r.SolrJmxReporter JMX monitoring for 'solr_50348.solr.jvm' (registry 'solr.jvm') enabled at server: com.sun.jmx.mbeanserver.JmxMBeanServer@38f6ee6c
   [junit4]   2> 1019751 INFO  (jetty-launcher-2125-thread-2) [n:127.0.0.1:50348_solr    ] o.a.s.m.r.SolrJmxReporter JMX monitoring for 'solr_50348.solr.jetty' (registry 'solr.jetty') enabled at server: com.sun.jmx.mbeanserver.JmxMBeanServer@38f6ee6c
   [junit4]   2> 1019753 INFO  (jetty-launcher-2125-thread-2) [n:127.0.0.1:50348_solr    ] o.a.s.c.CorePropertiesLocator Found 0 core definitions underneath /Users/jenkins/workspace/Lucene-Solr-master-MacOSX/solr/build/solr-core/test/J1/temp/solr.cloud.DeleteNodeTest_73C316FBEA9A9A4-001/tempDir-001/node2/.
   [junit4]   2> 1019758 INFO  (jetty-launcher-2125-thread-3) [n:127.0.0.1:50350_solr    ] o.a.s.m.r.SolrJmxReporter JMX monitoring for 'solr_50350.solr.node' (registry 'solr.node') enabled at server: com.sun.jmx.mbeanserver.JmxMBeanServer@38f6ee6c
   [junit4]   2> 1019760 INFO  (jetty-launcher-2125-thread-6) [n:127.0.0.1:50352_solr    ] o.a.s.m.r.SolrJmxReporter JMX monitoring for 'solr_50352.solr.node' (registry 'solr.node') enabled at server: com.sun.jmx.mbeanserver.JmxMBeanServer@38f6ee6c
   [junit4]   2> 1019766 INFO  (jetty-launcher-2125-thread-6) [n:127.0.0.1:50352_solr    ] o.a.s.m.r.SolrJmxReporter JMX monitoring for 'solr_50352.solr.jvm' (registry 'solr.jvm') enabled at server: com.sun.jmx.mbeanserver.JmxMBeanServer@38f6ee6c
   [junit4]   2> 1019770 INFO  (jetty-launcher-2125-thread-1) [n:127.0.0.1:50347_solr    ] o.a.s.m.r.SolrJmxReporter JMX monitoring for 'solr_50347.solr.node' (registry 'solr.node') enabled at server: com.sun.jmx.mbeanserver.JmxMBeanServer@38f6ee6c
   [junit4]   2> 1019774 INFO  (jetty-launcher-2125-thread-3) [n:127.0.0.1:50350_solr    ] o.a.s.m.r.SolrJmxReporter JMX monitoring for 'solr_50350.solr.jvm' (registry 'solr.jvm') enabled at server: com.sun.jmx.mbeanserver.JmxMBeanServer@38f6ee6c
   [junit4]   2> 1019776 INFO  (jetty-launcher-2125-thread-1) [n:127.0.0.1:50347_solr    ] o.a.s.m.r.SolrJmxReporter JMX monitoring for 'solr_50347.solr.jvm' (registry 'solr.jvm') enabled at server: com.sun.jmx.mbeanserver.JmxMBeanServer@38f6ee6c
   [junit4]   2> 1019776 INFO  (jetty-launcher-2125-thread-1) [n:127.0.0.1:50347_solr    ] o.a.s.m.r.SolrJmxReporter JMX monitoring for 'solr_50347.solr.jetty' (registry 'solr.jetty') enabled at server: com.sun.jmx.mbeanserver.JmxMBeanServer@38f6ee6c
   [junit4]   2> 1019777 INFO  (jetty-launcher-2125-thread-1) [n:127.0.0.1:50347_solr    ] o.a.s.c.CorePropertiesLocator Found 0 core definitions underneath /Users/jenkins/workspace/Lucene-Solr-master-MacOSX/solr/build/solr-core/test/J1/temp/solr.cloud.DeleteNodeTest_73C316FBEA9A9A4-001/tempDir-001/node1/.
   [junit4]   2> 1019779 INFO  (jetty-launcher-2125-thread-3) [n:127.0.0.1:50350_solr    ] o.a.s.m.r.SolrJmxReporter JMX monitoring for 'solr_50350.solr.jetty' (registry 'solr.jetty') enabled at server: com.sun.jmx.mbeanserver.JmxMBeanServer@38f6ee6c
   [junit4]   2> 1019780 INFO  (jetty-launcher-2125-thread-3) [n:127.0.0.1:50350_solr    ] o.a.s.c.CorePropertiesLocator Found 0 core definitions underneath /Users/jenkins/workspace/Lucene-Solr-master-MacOSX/solr/build/solr-core/test/J1/temp/solr.cloud.DeleteNodeTest_73C316FBEA9A9A4-001/tempDir-001/node3/.
   [junit4]   2> 1019781 INFO  (jetty-launcher-2125-thread-6) [n:127.0.0.1:50352_solr    ] o.a.s.m.r.SolrJmxReporter JMX monitoring for 'solr_50352.solr.jetty' (registry 'solr.jetty') enabled at server: com.sun.jmx.mbeanserver.JmxMBeanServer@38f6ee6c
   [junit4]   2> 1019782 INFO  (jetty-launcher-2125-thread-6) [n:127.0.0.1:50352_solr    ] o.a.s.c.CorePropertiesLocator Found 0 core definitions underneath /Users/jenkins/workspace/Lucene-Solr-master-MacOSX/solr/build/solr-core/test/J1/temp/solr.cloud.DeleteNodeTest_73C316FBEA9A9A4-001/tempDir-001/node6/.
   [junit4]   2> 1019818 INFO  (jetty-launcher-2125-thread-4) [n:127.0.0.1:50349_solr    ] o.a.s.m.r.SolrJmxReporter JMX monitoring for 'solr_50349.solr.node' (registry 'solr.node') enabled at server: com.sun.jmx.mbeanserver.JmxMBeanServer@38f6ee6c
   [junit4]   2> 1019825 INFO  (jetty-launcher-2125-thread-4) [n:127.0.0.1:50349_solr    ] o.a.s.m.r.SolrJmxReporter JMX monitoring for 'solr_50349.solr.jvm' (registry 'solr.jvm') enabled at server: com.sun.jmx.mbeanserver.JmxMBeanServer@38f6ee6c
   [junit4]   2> 1019825 INFO  (jetty-launcher-2125-thread-4) [n:127.0.0.1:50349_solr    ] o.a.s.m.r.SolrJmxReporter JMX monitoring for 'solr_50349.solr.jetty' (registry 'solr.jetty') enabled at server: com.sun.jmx.mbeanserver.JmxMBeanServer@38f6ee6c
   [junit4]   2> 1019826 INFO  (jetty-launcher-2125-thread-4) [n:127.0.0.1:50349_solr    ] o.a.s.c.CorePropertiesLocator Found 0 core definitions underneath /Users/jenkins/workspace/Lucene-Solr-master-MacOSX/solr/build/solr-core/test/J1/temp/solr.cloud.DeleteNodeTest_73C316FBEA9A9A4-001/tempDir-001/node4/.
   [junit4]   2> 1019869 INFO  (jetty-launcher-2125-thread-5) [n:127.0.0.1:50346_solr    ] o.a.s.m.r.SolrJmxReporter JMX monitoring for 'solr_50346.solr.node' (registry 'solr.node') enabled at server: com.sun.jmx.mbeanserver.JmxMBeanServer@38f6ee6c
   [junit4]   2> 1019874 INFO  (jetty-launcher-2125-thread-5) [n:127.0.0.1:50346_solr    ] o.a.s.m.r.SolrJmxReporter JMX monitoring for 'solr_50346.solr.jvm' (registry 'solr.jvm') enabled at server: com.sun.jmx.mbeanserver.JmxMBeanServer@38f6ee6c
   [junit4]   2> 1019875 INFO  (jetty-launcher-2125-thread-5) [n:127.0.0.1:50346_solr    ] o.a.s.m.r.SolrJmxReporter JMX monitoring for 'solr_50346.solr.jetty' (registry 'solr.jetty') enabled at server: com.sun.jmx.mbeanserver.JmxMBeanServer@38f6ee6c
   [junit4]   2> 1019877 INFO  (jetty-launcher-2125-thread-5) [n:127.0.0.1:50346_solr    ] o.a.s.c.CorePropertiesLocator Found 0 core definitions underneath /Users/jenkins/workspace/Lucene-Solr-master-MacOSX/solr/build/solr-core/test/J1/temp/solr.cloud.DeleteNodeTest_73C316FBEA9A9A4-001/tempDir-001/node5/.
   [junit4]   2> 1020089 INFO  (SUITE-DeleteNodeTest-seed#[73C316FBEA9A9A4]-worker) [    ] o.a.s.c.c.ZkStateReader Updated live nodes from ZooKeeper... (0) -> (6)
   [junit4]   2> 1020092 INFO  (SUITE-DeleteNodeTest-seed#[73C316FBEA9A9A4]-worker) [    ] o.a.s.c.s.i.ZkClientClusterStateProvider Cluster at 127.0.0.1:50344/solr ready
   [junit4]   2> 1020154 INFO  (TEST-DeleteNodeTest.test-seed#[73C316FBEA9A9A4]) [    ] o.a.s.SolrTestCaseJ4 ###Starting test
   [junit4]   2> 1020162 INFO  (qtp496296326-8990) [n:127.0.0.1:50352_solr    ] o.a.s.h.a.CollectionsHandler Invoked Collection Action :create with params replicationFactor=2&collection.configName=conf1&maxShardsPerNode=3&name=deletenodetest_coll&action=CREATE&numShards=5&createNodeSet=127.0.0.1:50347_solr,127.0.0.1:50348_solr,127.0.0.1:50349_solr,127.0.0.1:50346_solr,127.0.0.1:50352_solr,127.0.0.1:50350_solr&wt=javabin&version=2 and sendToOCPQueue=true
   [junit4]   2> 1020166 INFO  (OverseerThreadFactory-3750-thread-1-processing-n:127.0.0.1:50352_solr) [n:127.0.0.1:50352_solr    ] o.a.s.c.CreateCollectionCmd Create collection deletenodetest_coll
   [junit4]   2> 1020291 INFO  (qtp496296326-8992) [n:127.0.0.1:50352_solr    ] o.a.s.h.a.CoreAdminOperation core create command qt=/admin/cores&collection.configName=conf1&newCollection=true&name=deletenodetest_coll_shard5_replica2&action=CREATE&numShards=5&collection=deletenodetest_coll&shard=shard5&wt=javabin&version=2
   [junit4]   2> 1020292 INFO  (qtp496296326-9001) [n:127.0.0.1:50352_solr    ] o.a.s.h.a.CoreAdminOperation core create command qt=/admin/cores&collection.configName=conf1&newCollection=true&name=deletenodetest_coll_shard2_replica2&action=CREATE&numShards=5&collection=deletenodetest_coll&shard=shard2&wt=javabin&version=2
   [junit4]   2> 1020292 INFO  (qtp496296326-8992) [n:127.0.0.1:50352_solr    ] o.a.s.c.TransientSolrCoreCacheDefault Allocating transient cache for 2147483647 transient cores
   [junit4]   2> 1020296 INFO  (qtp1661548678-8982) [n:127.0.0.1:50349_solr    ] o.a.s.h.a.CoreAdminOperation core create command qt=/admin/cores&collection.configName=conf1&newCollection=true&name=deletenodetest_coll_shard1_replica1&action=CREATE&numShards=5&collection=deletenodetest_coll&shard=shard1&wt=javabin&version=2
   [junit4]   2> 1020296 INFO  (qtp1661548678-8997) [n:127.0.0.1:50349_solr    ] o.a.s.h.a.CoreAdminOperation core create command qt=/admin/cores&collection.configName=conf1&newCollection=true&name=deletenodetest_coll_shard4_replica1&action=CREATE&numShards=5&collection=deletenodetest_coll&shard=shard4&wt=javabin&version=2
   [junit4]   2> 1020296 INFO  (qtp1661548678-8997) [n:127.0.0.1:50349_solr    ] o.a.s.c.TransientSolrCoreCacheDefault Allocating transient cache for 2147483647 transient cores
   [junit4]   2> 1020298 INFO  (qtp609542088-8964) [n:127.0.0.1:50347_solr    ] o.a.s.h.a.CoreAdminOperation core create command qt=/admin/cores&collection.configName=conf1&newCollection=true&name=deletenodetest_coll_shard2_replica1&action=CREATE&numShards=5&collection=deletenodetest_coll&shard=shard2&wt=javabin&version=2
   [junit4]   2> 1020298 INFO  (qtp81016826-8978) [n:127.0.0.1:50346_solr    ] o.a.s.h.a.CoreAdminOperation core create command qt=/admin/cores&collection.configName=conf1&newCollection=true&name=deletenodetest_coll_shard3_replica1&action=CREATE&numShards=5&collection=deletenodetest_coll&shard=shard3&wt=javabin&version=2
   [junit4]   2> 1020298 INFO  (qtp609542088-8967) [n:127.0.0.1:50347_solr    ] o.a.s.h.a.CoreAdminOperation core create command qt=/admin/cores&collection.configName=conf1&newCollection=true&name=deletenodetest_coll_shard5_replica1&action=CREATE&numShards=5&collection=deletenodetest_coll&shard=shard5&wt=javabin&version=2
   [junit4]   2> 1020298 INFO  (qtp609542088-8964) [n:127.0.0.1:50347_solr    ] o.a.s.c.TransientSolrCoreCacheDefault Allocating transient cache for 2147483647 transient cores
   [junit4]   2> 1020298 INFO  (qtp81016826-8978) [n:127.0.0.1:50346_solr    ] o.a.s.c.TransientSolrCoreCacheDefault Allocating transient cache for 2147483647 transient cores
   [junit4]   2> 1020299 INFO  (qtp1041729515-8973) [n:127.0.0.1:50350_solr    ] o.a.s.h.a.CoreAdminOperation core create command qt=/admin/cores&collection.configName=conf1&newCollection=true&name=deletenodetest_coll_shard1_replica2&action=CREATE&numShards=5&collection=deletenodetest_coll&shard=shard1&wt=javabin&version=2
   [junit4]   2> 1020299 INFO  (qtp1041729515-8976) [n:127.0.0.1:50350_solr    ] o.a.s.h.a.CoreAdminOperation core create command qt=/admin/cores&collection.configName=conf1&newCollection=true&name=deletenodetest_coll_shard4_replica2&action=CREATE&numShards=5&collection=deletenodetest_coll&shard=shard4&wt=javabin&version=2
   [junit4]   2> 1020299 INFO  (qtp1524048082-8989) [n:127.0.0.1:50348_solr    ] o.a.s.h.a.CoreAdminOperation core create command qt=/admin/cores&collection.configName=conf1&newCollection=true&name=deletenodetest_coll_shard3_replica2&action=CREATE&numShards=5&collection=deletenodetest_coll&shard=shard3&wt=javabin&version=2
   [junit4]   2> 1020299 INFO  (qtp1041729515-8973) [n:127.0.0.1:50350_solr    ] o.a.s.c.TransientSolrCoreCacheDefault Allocating transient cache for 2147483647 transient cores
   [junit4]   2> 1020300 INFO  (qtp1524048082-8989) [n:127.0.0.1:50348_solr    ] o.a.s.c.TransientSolrCoreCacheDefault Allocating transient cache for 2147483647 transient cores
   [junit4]   2> 1020440 INFO  (zkCallback-2152-thread-1-processing-n:127.0.0.1:50349_solr) [n:127.0.0.1:50349_solr    ] o.a.s.c.c.ZkStateReader A cluster state change: [WatchedEvent state:SyncConnected type:NodeDataChanged path:/collections/deletenodetest_coll/state.json] for collection [deletenodetest_coll] has occurred - updating... (live nodes size: [6])
   [junit4]   2> 1020440 INFO  (zkCallback-2155-thread-1-processing-n:127.0.0.1:50347_solr) [n:127.0.0.1:50347_solr    ] o.a.s.c.c.ZkStateReader A cluster state change: [WatchedEvent state:SyncConnected type:NodeDataChanged path:/collections/deletenodetest_coll/state.json] for collection [deletenodetest_coll] has occurred - updating... (live nodes size: [6])
   [junit4]   2> 1020440 INFO  (zkCallback-2156-thread-1-processing-n:127.0.0.1:50348_solr) [n:127.0.0.1:50348_solr    ] o.a.s.c.c.ZkStateReader A cluster state change: [WatchedEvent state:SyncConnected type:NodeDataChanged path:/collections/deletenodetest_coll/state.json] for collection [deletenodetest_coll] has occurred - updating... (live nodes size: [6])
   [junit4]   2> 1020440 INFO  (zkCallback-2154-thread-2-processing-n:127.0.0.1:50346_solr) [n:127.0.0.1:50346_solr    ] o.a.s.c.c.ZkStateReader A cluster state change: [WatchedEvent state:SyncConnected type:NodeDataChanged path:/collections/deletenodetest_coll/state.json] for collection [deletenodetest_coll] has occurred - updating... (live nodes size: [6])
   [junit4]   2> 1020440 INFO  (zkCallback-2147-thread-1-processing-n:127.0.0.1:50350_solr) [n:127.0.0.1:50350_solr    ] o.a.s.c.c.ZkStateReader A cluster state change: [WatchedEvent state:SyncConnected type:NodeDataChanged path:/collections/deletenodetest_coll/state.json] for collection [deletenodetest_coll] has occurred - updating... (live nodes size: [6])
   [junit4]   2> 1020440 INFO  (zkCallback-2157-thread-2-processing-n:127.0.0.1:50352_solr) [n:127.0.0.1:50352_solr    ] o.a.s.c.c.ZkStateReader A cluster state change: [WatchedEvent state:SyncConnected type:NodeDataChanged path:/collections/deletenodetest_coll/state.json] for collection [deletenodetest_coll] has occurred - updating... (live nodes size: [6])
   [junit4]   2> 1021361 INFO  (qtp1661548678-8982) [n:127.0.0.1:50349_solr c:deletenodetest_coll s:shard1  x:deletenodetest_coll_shard1_replica1] o.a.s.c.SolrConfig Using Lucene MatchVersion: 7.0.0
   [junit4]   2> 1021380 INFO  (qtp496296326-9001) [n:127.0.0.1:50352_solr c:deletenodetest_coll s:shard2  x:deletenodetest_coll_shard2_replica2] o.a.s.c.SolrConfig Using Lucene MatchVersion: 7.0.0
   [junit4]   2> 1021381 INFO  (qtp1661548678-8997) [n:127.0.0.1:50349_solr c:deletenodetest_coll s:shard4  x:deletenodetest_coll_shard4_replica1] o.a.s.c.SolrConfig Using Lucene MatchVersion: 7.0.0
   [junit4]   2> 1021387 INFO  (qtp609542088-8967) [n:127.0.0.1:50347_solr c:deletenodetest_coll s:shard5  x:deletenodetest_coll_shard5_replica1] o.a.s.c.SolrConfig Using Lucene MatchVersion: 7.0.0
   [junit4]   2> 1021406 INFO  (qtp81016826-8978) [n:127.0.0.1:50346_solr c:deletenodetest_coll s:shard3  x:deletenodetest_coll_shard3_replica1] o.a.s.c.SolrConfig Using Lucene MatchVersion: 7.0.0
   [junit4]   2> 1021408 INFO  (qtp1524048082-8989) [n:127.0.0.1:50348_solr c:deletenodetest_coll s:shard3  x:deletenodetest_coll_shard3_replica2] o.a.s.c.SolrConfig Using Lucene MatchVersion: 7.0.0
   [junit4]   2> 1021409 INFO  (qtp496296326-9001) [n:127.0.0.1:50352_solr c:deletenodetest_coll s:shard2  x:deletenodetest_coll_shard2_replica2] o.a.s.s.IndexSchema [deletenodetest_coll_shard2_replica2] Schema name=cloud-dynamic
   [junit4]   2> 1021414 INFO  (qtp1041729515-8976) [n:127.0.0.1:50350_solr c:deletenodetest_coll s:shard4  x:deletenodetest_coll_shard4_replica2] o.a.s.c.SolrConfig Using Lucene MatchVersion: 7.0.0
   [junit4]   2> 1021417 INFO  (qtp1661548678-8982) [n:127.0.0.1:50349_solr c:deletenodetest_coll s:shard1  x:deletenodetest_coll_shard1_replica1] o.a.s.s.IndexSchema [deletenodetest_coll_shard1_replica1] Schema name=cloud-dynamic
   [junit4]   2> 1021440 INFO  (qtp609542088-8964) [n:127.0.0.1:50347_solr c:deletenodetest_coll s:shard2  x:deletenodetest_coll_shard2_replica1] o.a.s.c.SolrConfig Using Lucene MatchVersion: 7.0.0
   [junit4]   2> 1021443 INFO  (qtp81016826-8978) [n:127.0.0.1:50346_solr c:deletenodetest_coll s:shard3  x:deletenodetest_coll_shard3_replica1] o.a.s.s.IndexSchema [deletenodetest_coll_shard3_replica1] Schema name=cloud-dynamic
   [junit4]   2> 1021445 INFO  (qtp609542088-8967) [n:127.0.0.1:50347_solr c:deletenodetest_coll s:shard5  x:deletenodetest_coll_shard5_replica1] o.a.s.s.IndexSchema [deletenodetest_coll_shard5_replica1] Schema name=cloud-dynamic
   [junit4]   2> 1021452 INFO  (qtp609542088-8964) [n:127.0.0.1:50347_solr c:deletenodetest_coll s:shard2  x:deletenodetest_coll_shard2_replica1] o.a.s.s.IndexSchema [deletenodetest_coll_shard2_replica1] Schema name=cloud-dynamic
   [junit4]   2> 1021487 INFO  (qtp1661548678-8997) [n:127.0.0.1:50349_solr c:deletenodetest_coll s:shard4  x:deletenodetest_coll_shard4_replica1] o.a.s.s.IndexSchema [deletenodetest_coll_shard4_replica1] Schema name=cloud-dynamic
   [junit4]   2> 1021488 INFO  (qtp1041729515-8973) [n:127.0.0.1:50350_solr c:deletenodetest_coll s:shard1  x:deletenodetest_coll_shard1_replica2] o.a.s.c.SolrConfig Using Lucene MatchVersion: 7.0.0
   [junit4]   2> 1021526 INFO  (qtp1041729515-8973) [n:127.0.0.1:50350_solr c:deletenodetest_coll s:shard1  x:deletenodetest_coll_shard1_replica2] o.a.s.s.IndexSchema [deletenodetest_coll_shard1_replica2] Schema name=cloud-dynamic
   [junit4]   2> 1021535 INFO  (qtp1041729515-8976) [n:127.0.0.1:50350_solr c:deletenodetest_coll s:shard4  x:deletenodetest_coll_shard4_replica2] o.a.s.s.IndexSchema [deletenodetest_coll_shard4_replica2] Schema name=cloud-dynamic
   [junit4]   2> 1021536 WARN  (qtp1661548678-8997) [n:127.0.0.1:50349_solr c:deletenodetest_coll s:shard4  x:deletenodetest_coll_shard4_replica1] o.a.s.s.IndexSchema [deletenodetest_coll_shard4_replica1] default search field in schema is text. WARNING: Deprecated, please use 'df' on request instead.
   [junit4]   2> 1021537 INFO  (qtp1661548678-8997) [n:127.0.0.1:50349_solr c:deletenodetest_coll s:shard4  x:deletenodetest_coll_shard4_replica1] o.a.s.s.IndexSchema Loaded schema cloud-dynamic/1.6 with uniqueid field id
   [junit4]   2> 1021537 INFO  (qtp1661548678-8997) [n:127.0.0.1:50349_solr c:deletenodetest_coll s:shard4  x:deletenodetest_coll_shard4_replica1] o.a.s.c.CoreContainer Creating SolrCore 'deletenodetest_coll_shard4_replica1' using configuration from collection deletenodetest_coll, trusted=true
   [junit4]   2> 1021537 INFO  (qtp1661548678-8997) [n:127.0.0.1:50349_solr c:deletenodetest_coll s:shard4  x:deletenodetest_coll_shard4_replica1] o.a.s.m.r.SolrJmxReporter JMX monitoring for 'solr_50349.solr.core.deletenodetest_coll.shard4.replica1' (registry 'solr.core.deletenodetest_coll.shard4.replica1') enabled at server: com.sun.jmx.mbeanserver.JmxMBeanServer@38f6ee6c
   [junit4]   2> 1021537 INFO  (qtp1661548678-8997) [n:127.0.0.1:50349_solr c:deletenodetest_coll s:shard4  x:deletenodetest_coll_shard4_replica1] o.a.s.c.SolrCore solr.RecoveryStrategy.Builder
   [junit4]   2> 1021538 INFO  (qtp1661548678-8997) [n:127.0.0.1:50349_solr c:deletenodetest_coll s:shard4  x:deletenodetest_coll_shard4_replica1] o.a.s.c.SolrCore [[deletenodetest_coll_shard4_replica1] ] Opening new SolrCore at [/Users/jenkins/workspace/Lucene-Solr-master-MacOSX/solr/build/solr-core/test/J1/temp/solr.cloud.DeleteNodeTest_73C316FBEA9A9A4-001/tempDir-001/node4/deletenodetest_coll_shard4_replica1], dataDir=[/Users/jenkins/workspace/Lucene-Solr-master-MacOSX/solr/build/solr-core/test/J1/temp/solr.cloud.DeleteNodeTest_73C316FBEA9A9A4-001/tempDir-001/node4/./deletenodetest_coll_shard4_replica1/data/]
   [junit4]   2> 1021569 WARN  (qtp1041729515-8976) [n:127.0.0.1:50350_solr c:deletenodetest_coll s:shard4  x:deletenodetest_coll_shard4_replica2] o.a.s.s.IndexSchema [deletenodetest_coll_shard4_replica2] default search field in schema is text. WARNING: Deprecated, please use 'df' on request instead.
   [junit4]   2> 1021647 INFO  (qtp1041729515-8976) [n:127.0.0.1:50350_solr c:deletenodetest_coll s:shard4  x:deletenodetest_coll_shard4_replica2] o.a.s.s.IndexSchema Loaded schema cloud-dynamic/1.6 with uniqueid field id
   [junit4]   2> 1021647 INFO  (qtp1041729515-8976) [n:127.0.0.1:50350_solr c:deletenodetest_coll s:shard4  x:deletenodetest_coll_shard4_replica2] o.a.s.c.CoreContainer Creating SolrCore 'deletenodetest_coll_shard4_replica2' using configuration from collection deletenodetest_coll, trusted=true
   [junit4]   2> 1021648 INFO  (qtp1041729515-8976) [n:127.0.0.1:50350_solr c:deletenodetest_coll s:shard4  x:deletenodetest_coll_shard4_replica2] o.a.s.m.r.SolrJmxReporter JMX monitoring for 'solr_50350.solr.core.deletenodetest_coll.shard4.replica2' (registry 'solr.core.deletenodetest_coll.shard4.replica2') enabled at server: com.sun.jmx.mbeanserver.JmxMBeanServer@38f6ee6c
   [junit4]   2> 1021648 INFO  (qtp1041729515-8976) [n:127.0.0.1:50350_solr c:deletenodetest_coll s:shard4  x:deletenodetest_coll_shard4_replica2] o.a.s.c.SolrCore solr.RecoveryStrategy.Builder
   [junit4]   2> 1021648 INFO  (qtp1041729515-8976) [n:127.0.0.1:50350_solr c:deletenodetest_coll s:shard4  x:deletenodetest_coll_shard4_replica2] o.a.s.c.SolrCore [[deletenodetest_coll_shard4_replica2] ] Opening new SolrCore at [/Users/jenkins/workspace/Lucene-Solr-master-MacOSX/solr/build/solr-core/test/J1/temp/solr.cloud.DeleteNodeTest_73C316FBEA9A9A4-001/tempDir-001/node3/deletenodetest_coll_shard4_replica2], dataDir=[/Users/jenkins/workspace/Lucene-Solr-master-MacOSX/solr/build/solr-core/test/J1/temp/solr.cloud.DeleteNodeTest_73C316FBEA9A9A4-001/tempDir-001/node3/./deletenodetest_coll_shard4_replica2/data/]
   [junit4]   2> 1021644 WARN  (qtp496296326-9001) [n:127.0.0.1:50352_solr c:deletenodetest_coll s:shard2  x:deletenodetest_coll_shard2_replica2] o.a.s.s.IndexSchema [deletenodetest_coll_shard2_replica2] default search field in schema is text. WARNING: Deprecated, please use 'df' on request instead.
   [junit4]   2> 1021652 INFO  (qtp496296326-9001) [n:127.0.0.1:50352_solr c:deletenodetest_coll s:shard2  x:deletenodetest_coll_shard2_replica2] o.a.s.s.IndexSchema Loaded schema cloud-dynamic/1.6 with uniqueid field id
   [junit4]   2> 1021652 INFO  (qtp496296326-9001) [n:127.0.0.1:50352_solr c:deletenodetest_coll s:shard2  x:deletenodetest_coll_shard2_replica2] o.a.s.c.CoreContainer Creating SolrCore 'deletenodetest_coll_shard2_replica2' using configuration from collection deletenodetest_coll, trusted=true
   [junit4]   2> 1021652 INFO  (qtp496296326-9001) [n:127.0.0.1:50352_solr c:deletenodetest_coll s:shard2  x:deletenodetest_coll_shard2_replica2] o.a.s.m.r.SolrJmxReporter JMX monitoring for 'solr_50352.solr.core.deletenodetest_coll.shard2.replica2' (registry 'solr.core.deletenodetest_coll.shard2.replica2') enabled at server: com.sun.jmx.mbeanserver.JmxMBeanServer@38f6ee6c
   [junit4]   2> 1021653 INFO  (qtp496296326-9001) [n:127.0.0.1:50352_solr c:deletenodetest_coll s:shard2  x:deletenodetest_coll_shard2_replica2] o.a.s.c.SolrCore solr.RecoveryStrategy.Builder
   [junit4]   2> 1021653 INFO  (qtp496296326-9001) [n:127.0.0.1:50352_solr c:deletenodetest_coll s:shard2  x:deletenodetest_coll_shard2_replica2] o.a.s.c.SolrCore [[deletenodetest_coll_shard2_replica2] ] Opening new SolrCore at [/Users/jenkins/workspace/Lucene-Solr-master-MacOSX/solr/build/solr-core/test/J1/temp/solr.cloud.DeleteNodeTest_73C316FBEA9A9A4-001/tempDir-001/node6/deletenodetest_coll_shard2_replica2], dataDir=[/Users/jenkins/workspace/Lucene-Solr-master-MacOSX/solr/build/solr-core/test/J1/temp/solr.cloud.DeleteNodeTest_73C316FBEA9A9A4-001/tempDir-001/node6/./deletenodetest_coll_shard2_replica2/data/]
   [junit4]   2> 1021642 WARN  (qtp1661548678-8982) [n:127.0.0.1:50349_solr c:deletenodetest_coll s:shard1  x:deletenodetest_coll_shard1_replica1] o.a.s.s.IndexSchema [deletenodetest_coll_shard1_replica1] default search field in schema is text. WARNING: Deprecated, please use 'df' on request instead.
   [junit4]   2> 1021655 INFO  (qtp1661548678-8982) [n:127.0.0.1:50349_solr c:deletenodetest_coll s:shard1  x:deletenodetest_coll_shard1_replica1] o.a.s.s.IndexSchema Loaded schema cloud-dynamic/1.6 with uniqueid field id
   [junit4]   2> 1021655 INFO  (qtp1661548678-8982) [n:127.0.0.1:50349_solr c:deletenodetest_coll s:shard1  x:deletenodetest_coll_shard1_replica1] o.a.s.c.CoreContainer Creating SolrCore 'deletenodetest_coll_shard1_replica1' using configuration from collection deletenodetest_coll, trusted=true
   [junit4]   2> 1021656 INFO  (qtp1661548678-8982) [n:127.0.0.1:50349_solr c:deletenodetest_coll s:shard1  x:deletenodetest_coll_shard1_replica1] o.a.s.m.r.SolrJmxReporter JMX monitoring for 'solr_50349.solr.core.deletenodetest_coll.shard1.replica1' (registry 'solr.core.deletenodetest_coll.shard1.replica1') enabled at server: com.sun.jmx.mbeanserver.JmxMBeanServer@38f6ee6c
   [junit4]   2> 1021656 INFO  (qtp1661548678-8982) [n:127.0.0.1:50349_solr c:deletenodetest_coll s:shard1  x:deletenodetest_coll_shard1_replica1] o.a.s.c.SolrCore solr.RecoveryStrategy.Builder
   [junit4]   2> 1021656 INFO  (qtp1661548678-8982) [n:127.0.0.1:50349_solr c:deletenodetest_coll s:shard1  x:deletenodetest_coll_shard1_replica1] o.a.s.c.SolrCore [[deletenodetest_coll_shard1_replica1] ] Opening new SolrCore at [/Users/jenkins/workspace/Lucene-Solr-master-MacOSX/solr/build/solr-core/test/J1/temp/solr.cloud.DeleteNodeTest_73C316FBEA9A9A4-001/tempDir-001/node4/deletenodetest_coll_shard1_replica1], dataDir=[/Users/jenkins/workspace/Lucene-Solr-master-MacOSX/solr/build/solr-core/test/J1/temp/solr.cloud.DeleteNodeTest_73C316FBEA9A9A4-001/tempDir-001/node4/./deletenodetest_coll_shard1_replica1/data/]
   [junit4]   2> 1021640 WARN  (qtp609542088-8967) [n:127.0.0.1:50347_solr c:deletenodetest_coll s:shard5  x:deletenodetest_coll_shard5_replica1] o.a.s.s.IndexSchema [deletenodetest_coll_shard5_replica1] default search field in schema is text. WARNING: Deprecated, please use 'df' on request instead.
   [junit4]   2> 1021657 INFO  (qtp609542088-8967) [n:127.0.0.1:50347_solr c:deletenodetest_coll s:shard5  x:deletenodetest_coll_shard5_replica1] o.a.s.s.IndexSchema Loaded schema cloud-dynamic/1.6 with uniqueid field id
   [junit4]   2> 1021657 INFO  (qtp609542088-8967) [n:127.0.0.1:50347_solr c:deletenodetest_coll s:shard5  x:deletenodetest_coll_shard5_replica1] o.a.s.c.CoreContainer Creating SolrCore 'deletenodetest_coll_shard5_replica1' using configuration from collection deletenodetest_coll, trusted=true
   [junit4]   2> 1021657 INFO  (qtp609542088-8967) [n:127.0.0.1:50347_solr c:deletenodetest_coll s:shard5  x:deletenodetest_coll_shard5_replica1] o.a.s.m.r.SolrJmxReporter JMX monitoring for 'solr_50347.solr.core.deletenodetest_coll.shard5.replica1' (registry 'solr.core.deletenodetest_coll.shard5.replica1') enabled at server: com.sun.jmx.mbeanserver.JmxMBeanServer@38f6ee6c
   [junit4]   2> 1021657 INFO  (qtp609542088-8967) [n:127.0.0.1:50347_solr c:deletenodetest_coll s:shard5  x:deletenodetest_coll_shard5_replica1] o.a.s.c.SolrCore solr.RecoveryStrategy.Builder
   [junit4]   2> 1021657 INFO  (qtp609542088-8967) [n:127.0.0.1:50347_solr c:deletenodetest_coll s:shard5  x:deletenodetest_coll_shard5_replica1] o.a.s.c.SolrCore [[deletenodetest_coll_shard5_replica1] ] Opening new SolrCore at [/Users/jenkins/workspace/Lucene-Solr-master-MacOSX/solr/build/solr-core/test/J1/temp/solr.cloud.DeleteNodeTest_73C316FBEA9A9A4-001/tempDir-001/node1/deletenodetest_coll_shard5_replica1], dataDir=[/Users/jenkins/workspace/Lucene-Solr-master-MacOSX/solr/build/solr-core/test/J1/temp/solr.cloud.DeleteNodeTest_73C316FBEA9A9A4-001/tempDir-001/node1/./deletenodetest_coll_shard5_replica1/data/]
   [junit4]   2> 1021612 WARN  (qtp1041729515-8973) [n:127.0.0.1:50350_solr c:deletenodetest_coll s:shard1  x:deletenodetest_coll_shard1_replica2] o.a.s.s.IndexSchema [deletenodetest_coll_shard1_replica2] default search field in schema is text. WARNING: Deprecated, please use 'df' on request instead.
   [junit4]   2> 1021660 INFO  (qtp1041729515-8973) [n:127.0.0.1:50350_solr c:deletenodetest_coll s:shard1  x:deletenodetest_coll_shard1_replica2] o.a.s.s.IndexSchema Loaded schema cloud-dynamic/1.6 with uniqueid field id
   [junit4]   2> 1021660 INFO  (qtp1041729515-8973) [n:127.0.0.1:50350_solr c:deletenodetest_coll s:shard1  x:deletenodetest_coll_shard1_replica2] o.a.s.c.CoreContainer Creating SolrCore 'deletenodetest_coll_shard1_replica2' using configuration from collection deletenodetest_coll, trusted=true
   [junit4]   2> 1021660 INFO  (qtp1041729515-8973) [n:127.0.0.1:50350_solr c:deletenodetest_coll s:shard1  x:deletenodetest_coll_shard1_replica2] o.a.s.m.r.SolrJmxReporter JMX monitoring for 'solr_50350.solr.core.deletenodetest_coll.shard1.replica2' (registry 'solr.core.deletenodetest_coll.shard1.replica2') enabled at server: com.sun.jmx.mbeanserver.JmxMBeanServer@38f6ee6c
   [junit4]   2> 1021604 WARN  (qtp609542088-8964) [n:127.0.0.1:50347_solr c:deletenodetest_coll s:shard2  x:deletenodetest_coll_shard2_replica1] o.a.s.s.IndexSchema [deletenodetest_coll_shard2_replica1] default search field in schema is text. WARNING: Deprecated, please use 'df' on request instead.
   [junit4]   2> 1021660 INFO  (qtp1041729515-8973) [n:127.0.0.1:50350_solr c:deletenodetest_coll s:shard1  x:deletenodetest_coll_shard1_replica2] o.a.s.c.SolrCore solr.RecoveryStrategy.Builder
   [junit4]   2> 1021660 INFO  (qtp1041729515-8973) [n:127.0.0.1:50350_solr c:deletenodetest_coll s:shard1  x:deletenodetest_coll_shard1_replica2] o.a.s.c.SolrCore [[deletenodetest_coll_shard1_replica2] ] Opening new SolrCore at [/Users/jenkins/workspace/Lucene-Solr-master-MacOSX/solr/build/solr-core/test/J1/temp/solr.cloud.DeleteNodeTest_73C316FBEA9A9A4-001/tempDir-001/node3/deletenodetest_coll_shard1_replica2], dataDir=[/Users/jenkins/workspace/Lucene-Solr-master-MacOSX/solr/build/solr-core/test/J1/temp/solr.cloud.DeleteNodeTest_73C316FBEA9A9A4-001/tempDir-001/node3/./deletenodetest_coll_shard1_replica2/data/]
   [junit4]   2> 1021661 INFO  (qtp609542088-8964) [n:127.0.0.1:50347_solr c:deletenodetest_coll s:shard2  x:deletenodetest_coll_shard2_replica1] o.a.s.s.IndexSchema Loaded schema cloud-dynamic/1.6 with uniqueid field id
   [junit4]   2> 1021661 INFO  (qtp609542088-8964) [n:127.0.0.1:50347_solr c:deletenodetest_coll s:shard2  x:deletenodetest_coll_shard2_replica1] o.a.s.c.CoreContainer Creating SolrCore 'deletenodetest_coll_shard2_replica1' using configuration from collection deletenodetest_coll, trusted=true
   [junit4]   2> 1021661 INFO  (qtp609542088-8964) [n:127.0.0.1:50347_solr c:deletenodetest_coll s:shard2  x:deletenodetest_coll_shard2_replica1] o.a.s.m.r.SolrJmxReporter JMX monitoring for 'solr_50347.solr.core.deletenodetest_coll.shard2.replica1' (registry 'solr.core.deletenodetest_coll.shard2.replica1') enabled at server: com.sun.jmx.mbeanserver.JmxMBeanServer@38f6ee6c
   [junit4]   2> 1021661 INFO  (qtp609542088-8964) [n:127.0.0.1:50347_solr c:deletenodetest_coll s:shard2  x:deletenodetest_coll_shard2_replica1] o.a.s.c.SolrCore solr.RecoveryStrategy.Builder
   [junit4]   2> 1021661 INFO  (qtp609542088-8964) [n:127.0.0.1:50347_solr c:deletenodetest_coll s:shard2  x:deletenodetest_coll_shard2_replica1] o.a.s.c.SolrCore [[deletenodetest_coll_shard2_replica1] ] Opening new SolrCore at [/Users/jenkins/workspace/Lucene-Solr-master-MacOSX/solr/build/solr-core/test/J1/temp/solr.cloud.DeleteNodeTest_73C316FBEA9A9A4-001/tempDir-001/node1/deletenodetest_coll_shard2_replica1], dataDir=[/Users/jenkins/workspace/Lucene-Solr-master-MacOSX/solr/build/solr-core/test/J1/temp/solr.cloud.DeleteNodeTest_73C316FBEA9A9A4-001/tempDir-001/node1/./deletenodetest_coll_shard2_replica1/data/]
   [junit4]   2> 1021600 INFO  (qtp496296326-8992) [n:127.0.0.1:50352_solr c:deletenodetest_coll s:shard5  x:deletenodetest_coll_shard5_replica2] o.a.s.c.SolrConfig Using Lucene MatchVersion: 7.0.0
   [junit4]   2> 1021582 INFO  (qtp1524048082-8989) [n:127.0.0.1:50348_solr c:deletenodetest_coll s:shard3  x:deletenodetest_coll_shard3_replica2] o.a.s.s.IndexSchema [deletenodetest_coll_shard3_replica2] Schema name=cloud-dynamic
   [junit4]   2> 1021581 WARN  (qtp81016826-8978) [n:127.0.0.1:50346_solr c:deletenodetest_coll s:shard3  x:deletenodetest_coll_shard3_replica1] o.a.s.s.IndexSchema [deletenodetest_coll_shard3_replica1] default search field in schema is text. WARNING: Deprecated, please use 'df' on request instead.
   [junit4]   2> 1021705 INFO  (qtp496296326-8992) [n:127.0.0.1:50352_solr c:deletenodetest_coll s:shard5  x:deletenodetest_coll_shard5_replica2] o.a.s.s.IndexSchema [deletenodetest_coll_shard5_replica2] Schema name=cloud-dynamic
   [junit4]   2> 1021733 WARN  (qtp1524048082-8989) [n:127.0.0.1:50348_solr c:deletenodetest_coll s:shard3  x:deletenodetest_coll_shard3_replica2] o.a.s.s.IndexSchema [deletenodetest_coll_shard3_replica2] default search field in schema is text. WARNING: Deprecated, please use 'df' on request instead.
   [junit4]   2> 1021735 INFO  (qtp1524048082-8989) [n:127.0.0.1:50348_solr c:deletenodetest_coll s:shard3  x:deletenodetest_coll_shard3_replica2] o.a.s.s.IndexSchema Loaded schema cloud-dynamic/1.6 with uniqueid field id
   [junit4]   2> 1021735 INFO  (qtp1524048082-8989) [n:127.0.0.1:50348_solr c:deletenodetest_coll s:shard3  x:deletenodetest_coll_shard3_replica2] o.a.s.c.CoreContainer Creating SolrCore 'deletenodetest_coll_shard3_replica2' using configuration from collection deletenodetest_coll, trusted=true
   [junit4]   2> 1021736 INFO  (qtp1524048082-8989) [n:127.0.0.1:50348_solr c:deletenodetest_coll s:shard3  x:deletenodetest_coll_shard3_replica2] o.a.s.m.r.SolrJmxReporter JMX monitoring for 'solr_50348.solr.core.deletenodetest_coll.shard3.replica2' (registry 'solr.core.deletenodetest_coll.shard3.replica2') enabled at server: com.sun.jmx.mbeanserver.JmxMBeanServer@38f6ee6c
   [junit4]   2> 1021736 INFO  (qtp1524048082-8989) [n:127.0.0.1:50348_solr c:deletenodetest_coll s:shard3  x:deletenodetest_coll_shard3_replica2] o.a.s.c.SolrCore solr.RecoveryStrategy.Builder
   [junit4]   2> 1021736 INFO  (qtp1524048082-8989) [n:127.0.0.1:50348_solr c:deletenodetest_coll s:shard3  x:deletenodetest_coll_shard3_replica2] o.a.s.c.SolrCore [[deletenodetest_coll_shard3_replica2] ] Opening new SolrCore at [/Users/jenkins/workspace/Lucene-Solr-master-MacOSX/solr/build/solr-core/test/J1/temp/solr.cloud.DeleteNodeTest_73C316FBEA9A9A4-001/tempDir-001/node2/deletenodetest_coll_shard3_replica2], dataDir=[/Users/jenkins/workspace/Lucene-Solr-master-MacOSX/solr/build/solr-core/test/J1/temp/solr.cloud.DeleteNodeTest_73C316FBEA9A9A4-001/tempDir-001/node2/./deletenodetest_coll_shard3_replica2/data/]
   [junit4]   2> 1021738 INFO  (qtp81016826-8978) [n:127.0.0.1:50346_solr c:deletenodetest_coll s:shard3  x:deletenodetest_coll_shard3_replica1] o.a.s.s.IndexSchema Loaded schema cloud-dynamic/1.6 with uniqueid field id
   [junit4]   2> 1021738 INFO  (qtp81016826-8978) [n:127.0.0.1:50346_solr c:deletenodetest_coll s:shard3  x:deletenodetest_coll_shard3_replica1] o.a.s.c.CoreContainer Creating SolrCore 'deletenodetest_coll_shard3_replica1' using configuration from collection deletenodetest_coll, trusted=true
   [junit4]   2> 1021738 INFO  (qtp81016826-8978) [n:127.0.0.1:50346_solr c:deletenodetest_coll s:shard3  x:deletenodetest_coll_shard3_replica1] o.a.s.m.r.SolrJmxReporter JMX monitoring for 'solr_50346.solr.core.deletenodetest_coll.shard3.replica1' (registry 'solr.core.deletenodetest_coll.shard3.replica1') enabled at server: com.sun.jmx.mbeanserver.JmxMBeanServer@38f6ee6c
   [junit4]   2> 1021739 INFO  (qtp81016826-8978) [n:127.0.0.1:50346_solr c:deletenodetest_coll s:shard3  x:deletenodetest_coll_shard3_replica1] o.a.s.c.SolrCore solr.RecoveryStrategy.Builder
   [junit4]   2> 1021739 INFO  (qtp81016826-8978) [n:127.0.0.1:50346_solr c:deletenodetest_coll s:shard3  x:deletenodetest_coll_shard3_replica1] o.a.s.c.SolrCore [[deletenodetest_coll_shard3_replica1] ] Opening new SolrCore at [/Users/jenkins/workspace/Lucene-Solr-master-MacOSX/solr/build/solr-core/test/J1/temp/solr.cloud.DeleteNodeTest_73C316FBEA9A9A4-001/tempDir-001/node5/deletenodetest_coll_shard3_replica1], dataDir=[/Users/jenkins/workspace/Lucene-Solr-master-MacOSX/solr/build/solr-core/test/J1/temp/solr.cloud.DeleteNodeTest_73C316FBEA9A9A4-001/tempDir-001/node5/./deletenodetest_coll_shard3_replica1/data/]
   [junit4]   2> 1021740 WARN  (qtp496296326-8992) [n:127.0.0.1:50352_solr c:deletenodetest_coll s:shard5  x:deletenodetest_coll_shard5_replica2] o.a.s.s.IndexSchema [deletenodetest_coll_shard5_replica2] default search field in schema is text. WARNING: Deprecated, please use 'df' on request instead.
   [junit4]   2> 1021740 INFO  (qtp496296326-8992) [n:127.0.0.1:50352_solr c:deletenodetest_coll s:shard5  x:deletenodetest_coll_shard5_replica2] o.a.s.s.IndexSchema Loaded schema cloud-dynamic/1.6 with uniqueid field id
   [junit4]   2> 1021740 INFO  (qtp496296326-8992) [n:127.0.0.1:50352_solr c:deletenodetest_coll s:shard5  x:deletenodetest_coll_shard5_replica2] o.a.s.c.CoreContainer Creating SolrCore 'deletenodetest_coll_shard5_replica2' using configuration from collection deletenodetest_coll, trusted=true
   [junit4]   2> 1021741 INFO  (qtp496296326-8992) [n:127.0.0.1:50352_solr c:deletenodetest_coll s:shard5  x:deletenodetest_coll_shard5_replica2] o.a.s.m.r.SolrJmxReporter JMX monitoring for 'solr_50352.solr.core.deletenodetest_coll.shard5.replica2' (registry 'solr.core.deletenodetest_coll.shard5.replica2') enabled at server: com.sun.jmx.mbeanserver.JmxMBeanServer@38f6ee6c
   [junit4]   2> 1021741 INFO  (qtp496296326-8992) [n:127.0.0.1:50352_solr c:deletenodetest_coll s:shard5  x:deletenodetest_coll_shard5_replica2] o.a.s.c.SolrCore solr.RecoveryStrategy.Builder
   [junit4]   2> 1021741 INFO  (qtp496296326-8992) [n:127.0.0.1:50352_solr c:deletenodetest_coll s:shard5  x:deletenodetest_coll_shard5_replica2] o.a.s.c.SolrCore [[deletenodetest_coll_shard5_replica2] ] Opening new SolrCore at [/Users/jenkins/workspace/Lucene-Solr-master-MacOSX/solr/build/solr-core/test/J1/temp/solr.cloud.DeleteNodeTest_73C316FBEA9A9A4-001/tempDir-001/node6/deletenodetest_coll_shard5_replica2], dataDir=[/Users/jenkins/workspace/Lucene-Solr-master-MacOSX/solr/build/solr-core/test/J1/temp/solr.cloud.DeleteNodeTest_73C316FBEA9A9A4-001/tempDir-001/node6/./deletenodetest_coll_shard5_replica2/data/]
   [junit4]   2> 1021762 INFO  (qtp1661548678-8997) [n:127.0.0.1:50349_solr c:deletenodetest_coll s:shard4  x:deletenodetest_coll_shard4_replica1] o.a.s.u.UpdateHandler Using UpdateLog implementation: org.apache.solr.update.UpdateLog
   [junit4]   2> 1021762 INFO  (qtp1661548678-8997) [n:127.0.0.1:50349_solr c:deletenodetest_coll s:shard4  x:deletenodetest_coll_shard4_replica1] o.a.s.u.UpdateLog Initializing UpdateLog: dataDir=null defaultSyncLevel=FLUSH numRecordsToKeep=100 maxNumLogsToKeep=10 numVersionBuckets=65536
   [junit4]   2> 1021765 INFO  (qtp1661548678-8997) [n:127.0.0.1:50349_solr c:deletenodetest_coll s:shard4  x:deletenodetest_coll_shard4_replica1] o.a.s.u.CommitTracker Hard AutoCommit: disabled
   [junit4]   2> 1021765 INFO  (qtp1661548678-8997) [n:127.0.0.1:50349_solr c:deletenodetest_coll s:shard4  x:deletenodetest_coll_shard4_replica1] o.a.s.u.CommitTracker Soft AutoCommit: disabled
   [junit4]   2> 1021766 INFO  (qtp1661548678-8997) [n:127.0.0.1:50349_solr c:deletenodetest_coll s:shard4  x:deletenodetest_coll_shard4_replica1] o.a.s.s.SolrIndexSearcher Opening [Searcher@4158ed5b[deletenodetest_coll_shard4_replica1] main]
   [junit4]   2> 1021830 INFO  (qtp1661548678-8997) [n:127.0.0.1:50349_solr c:deletenodetest_coll s:shard4  x:deletenodetest_coll_shard4_replica1] o.a.s.r.ManagedResourceStorage Configured ZooKeeperStorageIO with znodeBase: /configs/conf1
   [junit4]   2> 1021855 INFO  (qtp1661548678-8997) [n:127.0.0.1:50349_solr c:deletenodetest_coll s:shard4  x:deletenodetest_coll_shard4_replica1] o.a.s.r.ManagedResourceStorage Loaded null at path _rest_managed.json using ZooKeeperStorageIO:path=/configs/conf1
   [junit4]   2> 1021858 INFO  (qtp1661548678-8997) [n:127.0.0.1:50349_solr c:deletenodetest_coll s:shard4  x:deletenodetest_coll_shard4_replica1] o.a.s.h.ReplicationHandler Commits will be reserved for  10000
   [junit4]   2> 1021862 INFO  (searcherExecutor-3763-thread-1-processing-n:127.0.0.1:50349_solr x:deletenodetest_coll_shard4_replica1 s:shard4 c:deletenodetest_coll) [n:127.0.0.1:50349_solr c:deletenodetest_coll s:shard4  x:deletenodetest_coll_shard4_replica1] o.a.s.c.SolrCore [deletenodetest_coll_shard4_replica1] Registered new searcher Searcher@4158ed5b[deletenodetest_coll_shard4_replica1] main{ExitableDirectoryReader(UninvertingDirectoryReader())}
   [junit4]   2> 1021863 INFO  (qtp1661548678-8997) [n:127.0.0.1:50349_solr c:deletenodetest_coll s:shard4  x:deletenodetest_coll_shard4_replica1] o.a.s.u.UpdateLog Could not find max version in index or recent updates, using new clock 1565290914524430336
   [junit4]   2> 1021869 INFO  (qtp496296326-9001) [n:127.0.0.1:50352_solr c:deletenodetest_coll s:shard2  x:deletenodetest_coll_shard2_replica2] o.a.s.c.SolrCore [deletenodetest_coll_shard2_replica2]  CLOSING SolrCore org.apache.solr.core.SolrCore@2fc4b8e
   [junit4]   2> 1021869 INFO  (qtp1661548678-8982) [n:127.0.0.1:50349_solr c:deletenodetest_coll s:shard1  x:deletenodetest_coll_shard1_replica1] o.a.s.c.SolrCore [deletenodetest_coll_shard1_replica1]  CLOSING SolrCore org.apache.solr.core.SolrCore@2aea16d5
   [junit4]   2> 1021870 INFO  (qtp496296326-8992) [n:127.0.0.1:50352_solr c:deletenodetest_coll s:shard5  x:deletenodetest_coll_shard5_replica2] o.a.s.c.SolrCore [deletenodetest_coll_shard5_replica2]  CLOSING SolrCore org.apache.solr.core.SolrCore@5065d83e
   [junit4]   2> 1021870 INFO  (qtp1041729515-8976) [n:127.0.0.1:50350_solr c:deletenodetest_coll s:shard4  x:deletenodetest_coll_shard4_replica2] o.a.s.c.SolrCore [deletenodetest_coll_shard4_replica2]  CLOSING SolrCore org.apache.solr.core.SolrCore@2a0c83d6
   [junit4]   2> 1021870 INFO  (qtp1524048082-8989) [n:127.0.0.1:50348_solr c:deletenodetest_coll s:shard3  x:deletenodetest_coll_shard3_replica2] o.a.s.c.SolrCore [deletenodetest_coll_shard3_replica2]  CLOSING SolrCore org.apache.solr.core.SolrCore@385545b
   [junit4]   2> 1021870 INFO  (qtp1041729515-8973) [n:127.0.0.1:50350_solr c:deletenodetest_coll s:shard1  x:deletenodetest_coll_shard1_replica2] o.a.s.c.SolrCore [deletenodetest_coll_shard1_replica2]  CLOSING SolrCore org.apache.solr.core.SolrCore@28b4a4e
   [junit4]   2> 1021870 INFO  (qtp496296326-9001) [n:127.0.0.1:50352_solr c:deletenodetest_coll s:shard2  x:deletenodetest_coll_shard2_replica2] o.a.s.m.SolrMetricManager Closing metric reporters for registry=solr.core.deletenodetest_coll.shard2.replica2, tag=50088846
   [junit4]   2> 1021871 INFO  (qtp1041729515-8973) [n:127.0.0.1:50350_solr c:deletenodetest_coll s:shard1  x:deletenodetest_coll_shard1_replica2] o.a.s.m.SolrMetricManager Closing metric reporters for registry=solr.core.deletenodetest_coll.shard1.replica2, tag=42682958
   [junit4]   2> 1021873 INFO  (qtp1524048082-8989) [n:127.0.0.1:50348_solr c:deletenodetest_coll s:shard3  x:deletenodetest_coll_shard3_replica2] o.a.s.m.SolrMetricManager Closing metric reporters for registry=solr.core.deletenodetest_coll.shard3.replica2, tag=59069531
   [junit4]   2> 1021873 INFO  (qtp496296326-9001) [n:127.0.0.1:50352_solr c:deletenodetest_coll s:shard2  x:deletenodetest_coll_shard2_replica2] o.a.s.m.SolrMetricManager Closing metric reporters for registry=solr.collection.deletenodetest_coll.shard2.leader, tag=50088846
   [junit4]   2> 1021873 INFO  (qtp609542088-8967) [n:127.0.0.1:50347_solr c:deletenodetest_coll s:shard5  x:deletenodetest_coll_shard5_replica1] o.a.s.c.SolrCore [deletenodetest_coll_shard5_replica1]  CLOSING SolrCore org.apache.solr.core.SolrCore@2ca66b61
   [junit4]   2> 1021874 INFO  (qtp1524048082-8989) [n:127.0.0.1:50348_solr c:deletenodetest_coll s:shard3  x:deletenodetest_coll_shard3_replica2] o.a.s.m.SolrMetricManager Closing metric reporters for registry=solr.collection.deletenodetest_coll.shard3.leader, tag=59069531
   [junit4]   2> 1021874 INFO  (qtp609542088-8967) [n:127.0.0.1:50347_solr c:deletenodetest_coll s:shard5  x:deletenodetest_coll_shard5_replica1] o.a.s.m.SolrMetricManager Closing metric reporters for registry=solr.core.deletenodetest_coll.shard5.replica1, tag=749103969
   [junit4]   2> 1021874 INFO  (qtp1661548678-8982) [n:127.0.0.1:50349_solr c:deletenodetest_coll s:shard1  x:deletenodetest_coll_shard1_replica1] o.a.s.m.SolrMetricManager Closing metric reporters for registry=solr.core.deletenodetest_coll.shard1.replica1, tag=719984341
   [junit4]   2> 1021874 INFO  (qtp1041729515-8973) [n:127.0.0.1:50350_solr c:deletenodetest_coll s:shard1  x:deletenodetest_coll_shard1_replica2] o.a.s.m.SolrMetricManager Closing metric reporters for registry=solr.collection.deletenodetest_coll.shard1.leader, tag=42682958
   [junit4]   2> 1021875 INFO  (qtp496296326-8992) [n:127.0.0.1:50352_solr c:deletenodetest_coll s:shard5  x:deletenodetest_coll_shard5_replica2] o.a.s.m.SolrMetricManager Closing metric reporters for registry=solr.core.deletenodetest_coll.shard5.replica2, tag=1348851774
   [junit4]   2> 1021875 INFO  (qtp1041729515-8976) [n:127.0.0.1:50350_solr c:deletenodetest_coll s:shard4  x:deletenodetest_coll_shard4_replica2] o.a.s.m.SolrMetricManager Closing metric reporters for registry=solr.core.deletenodetest_coll.shard4.replica2, tag=705463254
   [junit4]   2> 1021879 INFO  (qtp1661548678-8997) [n:127.0.0.1:50349_solr c:deletenodetest_coll s:shard4  x:deletenodetest_coll_shard4_replica1] o.a.s.c.ShardLeaderElectionContext Waiting until we see more replicas up for shard shard4: total=2 found=1 timeoutin=9999ms
   [junit4]   2> 1021882 INFO  (qtp609542088-8964) [n:127.0.0.1:50347_solr c:deletenodetest_coll s:shard2  x:deletenodetest_coll_shard2_replica1] o.a.s.c.SolrCore [deletenodetest_coll_shard2_replica1]  CLOSING SolrCore org.apache.solr.core.SolrCore@568164d0
   [junit4]   2> 1021882 INFO  (qtp81016826-8978) [n:127.0.0.1:50346_solr c:deletenodetest_coll s:shard3  x:deletenodetest_coll_shard3_replica1] o.a.s.c.SolrCore [deletenodetest_coll_shard3_replica1]  CLOSING SolrCore org.apache.solr.core.SolrCore@342efa0e
   [junit4]   2> 1021882 INFO  (qtp81016826-8978) [n:127.0.0.1:50346_solr c:deletenodetest_coll s:shard3  x:deletenodetest_coll_shard3_replica1] o.a.s.m.SolrMetricManager Closing metric reporters for registry=solr.core.deletenodetest_coll.shard3.replica1, tag=875493902
   [junit4]   2> 1021883 INFO  (qtp1661548678-8982) [n:127.0.0.1:50349_solr c:deletenodetest_coll s:shard1  x:deletenodetest_coll_shard1_replica1] o.a.s.m.SolrMetricManager Closing metric reporters for registry=solr.collection.deletenodetest_coll.shard1.leader, tag=719984341
   [junit4]   2> 1021886 ERROR (qtp496296326-9001) [n:127.0.0.1:50352_solr c:deletenodetest_coll s:shard2  x:deletenodetest_coll_shard2_replica2] o.a.s.h.RequestHandlerBase org.apache.solr.common.SolrException: Error CREATEing SolrCore 'deletenodetest_coll_shard2_replica2': Unable to create core [deletenodetest_coll_shard2_replica2] Caused by: invalid API spec: apispec/core.config.Commands.json
   [junit4]   2> at org.apache.solr.core.CoreContainer.create(CoreContainer.java:927)
   [junit4]   2> at org.apache.solr.handler.admin.CoreAdminOperation.lambda$static$0(CoreAdminOperation.java:88)
   [junit4]   2> at org.apache.solr.handler.admin.CoreAdminOperation.execute(CoreAdminOperation.java:370)
   [junit4]   2> at org.apache.solr.handler.admin.CoreAdminHandler$CallInfo.call(CoreAdminHandler.java:388)
   [junit4]   2> at org.apache.solr.handler.admin.CoreAdminHandler.handleRequestBody(CoreAdminHandler.java:174)
   [junit4]   2> at org.apache.solr.handler.RequestHandlerBase.handleRequest(RequestHandlerBase.java:178)
   [junit4]   2> at org.apache.solr.servlet.HttpSolrCall.handleAdmin(HttpSolrCall.java:747)
   [junit4]   2> at org.apache.solr.servlet.HttpSolrCall.handleAdminRequest(HttpSolrCall.java:728)
   [junit4]   2> at org.apache.solr.servlet.HttpSolrCall.call(HttpSolrCall.java:509)
   [junit4]   2> at org.apache.solr.servlet.SolrDispatchFilter.doFilter(SolrDispatchFilter.java:355)
   [junit4]   2> at org.apache.solr.servlet.SolrDispatchFilter.doFilter(SolrDispatchFilter.java:306)
   [junit4]   2> at org.eclipse.jetty.servlet.ServletHandler$CachedChain.doFilter(ServletHandler.java:1699)
   [junit4]   2> at org.apache.solr.client.solrj.embedded.JettySolrRunner$DebugFilter.doFilter(JettySolrRunner.java:139)
   [junit4]   2> at org.eclipse.jetty.servlet.ServletHandler$CachedChain.doFilter(ServletHandler.java:1699)
   [junit4]   2> at org.eclipse.jetty.servlet.ServletHandler.doHandle(ServletHandler.java:582)
   [junit4]   2> at org.eclipse.jetty.server.session.SessionHandler.doHandle(SessionHandler.java:224)
   [junit4]   2> at org.eclipse.jetty.server.handler.ContextHandler.doHandle(ContextHandler.java:1180)
   [junit4]   2> at org.eclipse.jetty.servlet.ServletHandler.doScope(ServletHandler.java:512)
   [junit4]   2> at org.eclipse.jetty.server.session.SessionHandler.doScope(SessionHandler.java:185)
   [junit4]   2> at org.eclipse.jetty.server.handler.ContextHandler.doScope(ContextHandler.java:1112)
   [junit4]   2> at org.eclipse.jetty.server.handler.ScopedHandler.handle(ScopedHandler.java:141)
   [junit4]   2> at org.eclipse.jetty.server.handler.gzip.GzipHandler.handle(GzipHandler.java:395)
   [junit4]   2> at org.eclipse.jetty.server.handler.HandlerWrapper.handle(HandlerWrapper.java:134)
   [junit4]   2> at org.eclipse.jetty.server.Server.handle(Server.java:534)
   [junit4]   2> at org.eclipse.jetty.server.HttpChannel.handle(HttpChannel.java:320)
   [junit4]   2> at org.eclipse.jetty.server.HttpConnection.onFillable(HttpConnection.java:251)
   [junit4]   2> at org.eclipse.jetty.io.AbstractConnection$ReadCallback.succeeded(AbstractConnection.java:273)
   [junit4]   2> at org.eclipse.jetty.io.FillInterest.fillable(FillInterest.java:95)
   [junit4]   2> at org.eclipse.jetty.io.SelectChannelEndPoint$2.run(SelectChannelEndPoint.java:93)
   [junit4]   2> at org.eclipse.jetty.util.thread.strategy.ExecuteProduceConsume.executeProduceConsume(ExecuteProduceConsume.java:303)
   [junit4]   2> at org.eclipse.jetty.util.thread.strategy.ExecuteProduceConsume.produceConsume(ExecuteProduceConsume.java:148)
   [junit4]   2> at org.eclipse.jetty.util.thread.strategy.ExecuteProduceConsume.run(ExecuteProduceConsume.java:136)
   [junit4]   2> at org.eclipse.jetty.util.thread.QueuedThreadPool.runJob(QueuedThreadPool.java:671)
   [junit4]   2> at org.eclipse.jetty.util.thread.QueuedThreadPool$2.run(QueuedThreadPool.java:589)
   [junit4]   2> at java.lang.Thread.run(Thread.java:745)
   [junit4]   2> Caused by: org.apache.solr.common.SolrException: Unable to create core [deletenodetest_coll_shard2_replica2]
   [junit4]   2> at org.apache.solr.core.CoreContainer.create(CoreContainer.java:973)
   [junit4]   2> at org.apache.solr.core.CoreContainer.create(CoreContainer.java:893)
   [junit4]   2> ... 34 more
   [junit4]   2> Caused by: org.apache.solr.common.SolrException: invalid API spec: apispec/core.config.Commands.json
   [junit4]   2> at org.apache.solr.core.SolrCore.<init>(SolrCore.java:1001)
   [junit4]   2> at org.apache.solr.core.SolrCore.<init>(SolrCore.java:854)
   [junit4]   2> at org.apache.solr.core.CoreContainer.create(CoreContainer.java:958)
   [junit4]   2> ... 35 more
   [junit4]   2> Caused by: java.lang.RuntimeException: invalid API spec: apispec/core.config.Commands.json
   [junit4]   2> at org.apache.solr.common.util.ValidatingJsonMap.parse(ValidatingJsonMap.java:318)
   [junit4]   2> at org.apache.solr.api.ApiBag.lambda$getSpec$0(ApiBag.java:229)
   [junit4]   2> at org.apache.solr.api.Api.getSpec(Api.java:64)
   [junit4]   2> at org.apache.solr.api.ApiBag.register(ApiBag.java:72)
   [junit4]   2> at org.apache.solr.core.PluginBag.put(PluginBag.java:215)
   [junit4]   2> at org.apache.solr.core.PluginBag.init(PluginBag.java:272)
   [junit4]   2> at org.apache.solr.core.RequestHandlers.initHandlersFromConfig(RequestHandlers.java:130)
   [junit4]   2> at org.apache.solr.core.SolrCore.<init>(SolrCore.java:959)
   [junit4]   2> ... 37 more
   [junit4]   2>
   [junit4]   2> 1021886 INFO  (qtp496296326-9001) [n:127.0.0.1:50352_solr c:deletenodetest_coll s:shard2  x:deletenodetest_coll_shard2_replica2] o.a.s.s.HttpSolrCall [admin] webapp=null path=/admin/cores params={qt=/admin/cores&collection.configName=conf1&newCollection=true&name=deletenodetest_coll_shard2_replica2&action=CREATE&numShards=5&collection=deletenodetest_coll&shard=shard2&wt=javabin&version=2} status=400 QTime=1594
   [junit4]   2> 1021887 ERROR (OverseerThreadFactory-3750-thread-1-processing-n:127.0.0.1:50352_solr) [n:127.0.0.1:50352_solr    ] o.a.s.c.OverseerCollectionMessageHandler Error from shard: http://127.0.0.1:50352/solr
   [junit4]   2> org.apache.solr.client.solrj.impl.HttpSolrClient$RemoteSolrException: Error from server at http://127.0.0.1:50352/solr: Error CREATEing SolrCore 'deletenodetest_coll_shard2_replica2': Unable to create core [deletenodetest_coll_shard2_replica2] Caused by: invalid API spec: apispec/core.config.Commands.json
   [junit4]   2> at org.apache.solr.client.solrj.impl.HttpSolrClient.executeMethod(HttpSolrClient.java:627)
   [junit4]   2> at org.apache.solr.client.solrj.impl.HttpSolrClient.request(HttpSolrClient.java:279)
   [junit4]   2> at org.apache.solr.client.solrj.impl.HttpSolrClient.request(HttpSolrClient.java:268)
   [junit4]   2> at org.apache.solr.client.solrj.SolrClient.request(SolrClient.java:1219)
   [junit4]   2> at org.apache.solr.handler.component.HttpShardHandler.lambda$submit$0(HttpShardHandler.java:163)
   [junit4]   2> at java.util.concurrent.FutureTask.run(FutureTask.java:266)
   [junit4]   2> at java.util.concurrent.Executors$RunnableAdapter.call(Executors.java:511)
   [junit4]   2> at java.util.concurrent.FutureTask.run(FutureTask.java:266)
   [junit4]   2> at com.codahale.metrics.InstrumentedExecutorService$InstrumentedRunnable.run(InstrumentedExecutorService.java:176)
   [junit4]   2> at org.apache.solr.common.util.ExecutorUtil$MDCAwareThreadPoolExecutor.lambda$execute$0(ExecutorUtil.java:229)
   [junit4]   2> at java.util.concurrent.ThreadPoolExecutor.runWorker(ThreadPoolExecutor.java:1142)
   [junit4]   2> at java.util.concurrent.ThreadPoolExecutor$Worker.run(ThreadPoolExecutor.java:617)
   [junit4]   2> at java.lang.Thread.run(Thread.java:745)
   [junit4]   2> 1021890 ERROR (qtp1661548678-8982) [n:127.0.0.1:50349_solr c:deletenodetest_coll s:shard1  x:deletenodetest_coll_shard1_replica1] o.a.s.h.RequestHandlerBase org.apache.solr.common.SolrException: Error CREATEing SolrCore 'deletenodetest_coll_shard1_replica1': Unable to create core [deletenodetest_coll_shard1_replica1] Caused by: invalid API spec: apispec/core.config.Commands.json
   [junit4]   2> at org.apache.solr.core.CoreContainer.create(CoreContainer.java:927)
   [junit4]   2> at org.apache.solr.handler.admin.CoreAdminOperation.lambda$static$0(CoreAdminOperation.java:88)
   [junit4]   2> at org.apache.solr.handler.admin.CoreAdminOperation.execute(CoreAdminOperation.java:370)
   [junit4]   2> at org.apache.solr.handler.admin.CoreAdminHandler$CallInfo.call(CoreAdminHandler.java:388)
   [junit4]   2> at org.apache.solr.handler.admin.CoreAdminHandler.handleRequestBody(CoreAdminHandler.java:174)
   [junit4]   2> at org.apache.solr.handler.RequestHandlerBase.handleRequest(RequestHandlerBase.java:178)
   [junit4]   2> at org.apache.solr.servlet.HttpSolrCall.handleAdmin(HttpSolrCall.java:747)
   [junit4]   2> at org.apache.solr.servlet.HttpSolrCall.handleAdminRequest(HttpSolrCall.java:728)
   [junit4]   2> at org.apache.solr.servlet.HttpSolrCall.call(HttpSolrCall.java:509)
   [junit4]   2> at org.apache.solr.servlet.SolrDispatchFilter.doFilter(SolrDispatchFilter.java:355)
   [junit4]   2> at org.apache.solr.servlet.SolrDispatchFilter.doFilter(SolrDispatchFilter.java:306)
   [junit4]   2> at org.eclipse.jetty.servlet.ServletHandler$CachedChain.doFilter(ServletHandler.java:1699)
   [junit4]   2> at org.apache.solr.client.solrj.embedded.JettySolrRunner$DebugFilter.doFilter(JettySolrRunner.java:139)
   [junit4]   2> at org.eclipse.jetty.servlet.ServletHandler$CachedChain.doFilter(ServletHandler.java:1699)
   [junit4]   2> at org.eclipse.jetty.servlet.ServletHandler.doHandle(ServletHandler.java:582)
   [junit4]   2> at org.eclipse.jetty.server.session.SessionHandler.doHandle(SessionHandler.java:224)
   [junit4]   2> at org.eclipse.jetty.server.handler.ContextHandler.doHandle(ContextHandler.java:1180)
   [junit4]   2> at org.eclipse.jetty.servlet.ServletHandler.doScope(ServletHandler.java:512)
   [junit4]   2> at org.eclipse.jetty.server.session.SessionHandler.doScope(SessionHandler.java:185)
   [junit4]   2> at org.eclipse.jetty.server.handler.ContextHandler.doScope(ContextHandler.java:1112)
   [junit4]   2> at org.eclipse.jetty.server.handler.ScopedHandler.handle(ScopedHandler.java:141)
   [junit4]   2> at org.eclipse.jetty.server.handler.gzip.GzipHandler.handle(GzipHandler.java:395)
   [junit4]   2> at org.eclipse.jetty.server.handler.HandlerWrapper.handle(HandlerWrapper.java:134)
   [junit4]   2> at org.eclipse.jetty.server.Server.handle(Server.java:534)
   [junit4]   2> at org.eclipse.jetty.server.HttpChannel.handle(HttpChannel.java:320)
   [junit4]   2> at org.eclipse.jetty.server.HttpConnection.onFillable(HttpConnection.java:251)
   [junit4]   2> at org.eclipse.jetty.io.AbstractConnection$ReadCallback.succeeded(AbstractConnection.java:273)
   [junit4]   2> at org.eclipse.jetty.io.FillInterest.fillable(FillInterest.java:95)
   [junit4]   2> at org.eclipse.jetty.io.SelectChannelEndPoint$2.run(SelectChannelEndPoint.java:93)
   [junit4]   2> at org.eclipse.jetty.util.thread.strategy.ExecuteProduceConsume.executeProduceConsume(ExecuteProduceConsume.java:303)
   [junit4]   2> at org.eclipse.jetty.util.thread.strategy.ExecuteProduceConsume.produceConsume(ExecuteProduceConsume.java:148)
   [junit4]   2> at org.eclipse.jetty.util.thread.strategy.ExecuteProduceConsume.run(ExecuteProduceConsume.java:136)
   [junit4]   2> at org.eclipse.jetty.util.thread.QueuedThreadPool.runJob(QueuedThreadPool.java:671)
   [junit4]   2> at org.eclipse.jetty.util.thread.QueuedThreadPool$2.run(QueuedThreadPool.java:589)
   [junit4]   2> at java.lang.Thread.run(Thread.java:745)
   [junit4]   2> Caused by: org.apache.solr.common.SolrException: Unable to create core [deletenodetest_coll_shard1_replica1]
   [junit4]   2> at org.apache.solr.core.CoreContainer.create(CoreContainer.java:973)
   [junit4]   2> at org.apache.solr.core.CoreContainer.create(CoreContainer.java:893)
   [junit4]   2> ... 34 more
   [junit4]   2> Caused by: org.apache.solr.common.SolrException: invalid API spec: apispec/core.config.Commands.json
   [junit4]   2> at org.apache.solr.core.SolrCore.<init>(SolrCore.java:1001)
   [junit4]   2> at org.apache.solr.core.SolrCore.<init>(SolrCore.java:854)
   [junit4]   2> at org.apache.solr.core.CoreContainer.create(CoreContainer.java:958)
   [junit4]   2> ... 35 more
   [junit4]   2> Caused by: java.lang.RuntimeException: invalid API spec: apispec/core.config.Commands.json
   [junit4]   2> at org.apache.solr.common.util.ValidatingJsonMap.parse(ValidatingJsonMap.java:318)
   [junit4]   2> at org.apache.solr.api.ApiBag.lambda$getSpec$0(ApiBag.java:229)
   [junit4]   2> at org.apache.solr.api.Api.getSpec(Api.java:64)
   [junit4]   2> at org.apache.solr.api.ApiBag.register(ApiBag.java:72)
   [junit4]   2> at org.apache.solr.core.PluginBag.put(PluginBag.java:215)
   [junit4]   2> at org.apache.solr.core.PluginBag.init(PluginBag.java:272)
   [junit4]   2> at org.apache.solr.core.RequestHandlers.initHandlersFromConfig(RequestHandlers.java:130)
   [junit4]   2> at org.apache.solr.core.SolrCore.<init>(SolrCore.java:959)
   [junit4]   2> ... 37 more
   [junit4]   2>
   [junit4]   2> 1021891 INFO  (qtp1661548678-8982) [n:127.0.0.1:50349_solr c:deletenodetest_coll s:shard1  x:deletenodetest_coll_shard1_replica1] o.a.s.s.HttpSolrCall [admin] webapp=null path=/admin/cores params={qt=/admin/cores&collection.configName=conf1&newCollection=true&name=deletenodetest_coll_shard1_replica1&action=CREATE&numShards=5&collection=deletenodetest_coll&shard=shard1&wt=javabin&version=2} status=400 QTime=1594
   [junit4]   2> 1021891 ERROR (OverseerThreadFactory-3750-thread-1-processing-n:127.0.0.1:50352_solr) [n:127.0.0.1:50352_solr    ] o.a.s.c.OverseerCollectionMessageHandler Error from shard: http://127.0.0.1:50349/solr
   [junit4]   2> org.apache.solr.client.solrj.impl.HttpSolrClient$RemoteSolrException: Error from server at http://127.0.0.1:50349/solr: Error CREATEing SolrCore 'deletenodetest_coll_shard1_replica1': Unable to create core [deletenodetest_coll_shard1_replica1] Caused by: invalid API spec: apispec/core.config.Commands.json
   [junit4]   2> at org.apache.solr.client.solrj.impl.HttpSolrClient.executeMethod(HttpSolrClient.java:627)
   [junit4]   2> at org.apache.solr.client.solrj.impl.HttpSolrClient.request(HttpSolrClient.java:279)
   [junit4]   2> at org.apache.solr.client.solrj.impl.HttpSolrClient.request(HttpSolrClient.java:268)
   [junit4]   2> at org.apache.solr.client.solrj.SolrClient.request(SolrClient.java:1219)
   [junit4]   2> at org.apache.solr.handler.component.HttpShardHandler.lambda$submit$0(HttpShardHandler.java:163)
   [junit4]   2> at java.util.concurrent.FutureTask.run(FutureTask.java:266)
   [junit4]   2> at java.util.concurrent.Executors$RunnableAdapter.call(Executors.java:511)
   [junit4]   2> at java.util.concurrent.FutureTask.run(FutureTask.java:266)
   [junit4]   2> at com.codahale.metrics.InstrumentedExecutorService$InstrumentedRunnable.run(InstrumentedExecutorService.java:176)
   [junit4]   2> at org.apache.solr.common.util.ExecutorUtil$MDCAwareThreadPoolExecutor.lambda$execute$0(ExecutorUtil.java:229)
   [junit4]   2> at java.util.concurrent.ThreadPoolExecutor.runWorker(ThreadPoolExecutor.java:1142)
   [junit4]   2> at java.util.concurrent.ThreadPoolExecutor$Worker.run(ThreadPoolExecutor.java:617)
   [junit4]   2> at java.lang.Thread.run(Thread.java:745)
   [junit4]   2> 1021888 ERROR (qtp1041729515-8973) [n:127.0.0.1:50350_solr c:deletenodetest_coll s:shard1  x:deletenodetest_coll_shard1_replica2] o.a.s.h.RequestHandlerBase org.apache.solr.common.SolrException: Error CREATEing SolrCore 'deletenodetest_coll_shard1_replica2': Unable to create core [deletenodetest_coll_shard1_replica2] Caused by: invalid API spec: apispec/core.SchemaEdit.json
   [junit4]   2> at org.apache.solr.core.CoreContainer.create(CoreContainer.java:927)
   [junit4]   2> at org.apache.solr.handler.admin.CoreAdminOperation.lambda$static$0(CoreAdminOperation.java:88)
   [junit4]   2> at org.apache.solr.handler.admin.CoreAdminOperation.execute(CoreAdminOperation.java:370)
   [junit4]   2> at org.apache.solr.handler.admin.CoreAdminHandler$CallInfo.call(CoreAdminHandler.java:388)
   [junit4]   2> at org.apache.solr.handler.admin.CoreAdminHandler.handleRequestBody(CoreAdminHandler.java:174)
   [junit4]   2> at org.apache.solr.handler.RequestHandlerBase.handleRequest(RequestHandlerBase.java:178)
   [junit4]   2> at org.apache.solr.servlet.HttpSolrCall.handleAdmin(HttpSolrCall.java:747)
   [junit4]   2> at org.apache.solr.servlet.HttpSolrCall.handleAdminRequest(HttpSolrCall.java:728)
   [junit4]   2> at org.apache.solr.servlet.HttpSolrCall.call(HttpSolrCall.java:509)
   [junit4]   2> at org.apache.solr.servlet.SolrDispatchFilter.doFilter(SolrDispatchFilter.java:355)
   [junit4]   2> at org.apache.solr.ser

[...truncated too long message...]

zkCallback-2154-thread-2-processing-n:127.0.0.1:50346_solr) [n:127.0.0.1:50346_solr    ] o.a.s.c.c.ZkStateReader Updated live nodes from ZooKeeper... (6) -> (5)
   [junit4]   2> 1053512 INFO  (zkCallback-2155-thread-1-processing-n:127.0.0.1:50347_solr) [n:127.0.0.1:50347_solr    ] o.a.s.c.c.ZkStateReader Updated live nodes from ZooKeeper... (6) -> (5)
   [junit4]   2> 1053512 INFO  (zkCallback-2157-thread-2-processing-n:127.0.0.1:50352_solr) [n:127.0.0.1:50352_solr    ] o.a.s.c.c.ZkStateReader Updated live nodes from ZooKeeper... (6) -> (5)
   [junit4]   2> 1053513 INFO  (zkCallback-2152-thread-1-processing-n:127.0.0.1:50349_solr) [n:127.0.0.1:50349_solr    ] o.a.s.c.c.ZkStateReader Updated live nodes from ZooKeeper... (6) -> (5)
   [junit4]   2> 1053514 INFO  (jetty-closer-2126-thread-5) [    ] o.a.s.m.SolrMetricManager Closing metric reporters for registry=solr.cluster, tag=null
   [junit4]   2> 1053515 INFO  (jetty-closer-2126-thread-2) [    ] o.e.j.s.h.ContextHandler Stopped o.e.j.s.ServletContextHandler@39836857{/solr,null,UNAVAILABLE}
   [junit4]   2> 1053519 WARN  (zkCallback-2154-thread-2-processing-n:127.0.0.1:50346_solr) [n:127.0.0.1:50346_solr    ] o.a.s.c.c.ZkStateReader ZooKeeper watch triggered, but Solr cannot talk to ZK: [KeeperErrorCode = Session expired for /live_nodes]
   [junit4]   2> 1053520 INFO  (jetty-closer-2126-thread-5) [    ] o.e.j.s.h.ContextHandler Stopped o.e.j.s.ServletContextHandler@22a72363{/solr,null,UNAVAILABLE}
   [junit4]   2> 1053521 INFO  (zkCallback-2157-thread-2-processing-n:127.0.0.1:50352_solr) [n:127.0.0.1:50352_solr    ] o.a.s.c.c.ZkStateReader Updated live nodes from ZooKeeper... (5) -> (4)
   [junit4]   2> 1053522 INFO  (zkCallback-2152-thread-2-processing-n:127.0.0.1:50349_solr) [n:127.0.0.1:50349_solr    ] o.a.s.c.c.ZkStateReader Updated live nodes from ZooKeeper... (5) -> (4)
   [junit4]   2> 1053522 INFO  (zkCallback-2155-thread-2-processing-n:127.0.0.1:50347_solr) [n:127.0.0.1:50347_solr    ] o.a.s.c.c.ZkStateReader Updated live nodes from ZooKeeper... (5) -> (4)
   [junit4]   2> 1053522 INFO  (zkCallback-2147-thread-1-processing-n:127.0.0.1:50350_solr) [n:127.0.0.1:50350_solr    ] o.a.s.c.c.ZkStateReader Updated live nodes from ZooKeeper... (5) -> (4)
   [junit4]   2> 1053558 INFO  (jetty-closer-2126-thread-1) [    ] o.a.s.m.SolrMetricManager Closing metric reporters for registry=solr.jvm, tag=null
   [junit4]   2> 1053558 INFO  (jetty-closer-2126-thread-3) [    ] o.a.s.m.SolrMetricManager Closing metric reporters for registry=solr.jvm, tag=null
   [junit4]   2> 1053559 INFO  (jetty-closer-2126-thread-6) [    ] o.a.s.m.SolrMetricManager Closing metric reporters for registry=solr.jvm, tag=null
   [junit4]   2> 1053559 INFO  (jetty-closer-2126-thread-4) [    ] o.a.s.m.SolrMetricManager Closing metric reporters for registry=solr.jvm, tag=null
   [junit4]   2> 1053589 INFO  (jetty-closer-2126-thread-1) [    ] o.a.s.m.SolrMetricManager Closing metric reporters for registry=solr.jetty, tag=null
   [junit4]   2> 1053590 INFO  (jetty-closer-2126-thread-3) [    ] o.a.s.m.SolrMetricManager Closing metric reporters for registry=solr.jetty, tag=null
   [junit4]   2> 1053591 INFO  (jetty-closer-2126-thread-4) [    ] o.a.s.m.SolrMetricManager Closing metric reporters for registry=solr.jetty, tag=null
   [junit4]   2> 1053591 INFO  (jetty-closer-2126-thread-6) [    ] o.a.s.m.SolrMetricManager Closing metric reporters for registry=solr.jetty, tag=null
   [junit4]   2> 1053595 INFO  (jetty-closer-2126-thread-3) [    ] o.a.s.m.SolrMetricManager Closing metric reporters for registry=solr.cluster, tag=null
   [junit4]   2> 1053595 INFO  (jetty-closer-2126-thread-4) [    ] o.a.s.m.SolrMetricManager Closing metric reporters for registry=solr.cluster, tag=null
   [junit4]   2> 1053595 INFO  (jetty-closer-2126-thread-1) [    ] o.a.s.m.SolrMetricManager Closing metric reporters for registry=solr.cluster, tag=null
   [junit4]   2> 1053595 INFO  (jetty-closer-2126-thread-6) [    ] o.a.s.m.SolrMetricManager Closing metric reporters for registry=solr.cluster, tag=null
   [junit4]   2> 1053597 INFO  (jetty-closer-2126-thread-4) [    ] o.a.s.c.Overseer Overseer (id=97830681981354002-127.0.0.1:50352_solr-n_0000000000) closing
   [junit4]   2> 1053598 INFO  (OverseerStateUpdate-97830681981354002-127.0.0.1:50352_solr-n_0000000000) [n:127.0.0.1:50352_solr    ] o.a.s.c.Overseer Overseer Loop exiting : 127.0.0.1:50352_solr
   [junit4]   2> 1053600 WARN  (zkCallback-2152-thread-1-processing-n:127.0.0.1:50349_solr) [n:127.0.0.1:50349_solr    ] o.a.s.c.c.ZkStateReader ZooKeeper watch triggered, but Solr cannot talk to ZK: [KeeperErrorCode = Session expired for /live_nodes]
   [junit4]   2> 1053600 WARN  (zkCallback-2155-thread-2-processing-n:127.0.0.1:50347_solr) [n:127.0.0.1:50347_solr    ] o.a.s.c.c.ZkStateReader ZooKeeper watch triggered, but Solr cannot talk to ZK: [KeeperErrorCode = Session expired for /live_nodes]
   [junit4]   2> 1053600 WARN  (zkCallback-2147-thread-1-processing-n:127.0.0.1:50350_solr) [n:127.0.0.1:50350_solr    ] o.a.s.c.c.ZkStateReader ZooKeeper watch triggered, but Solr cannot talk to ZK: [KeeperErrorCode = Session expired for /live_nodes]
   [junit4]   2> 1053601 INFO  (zkCallback-2157-thread-2-processing-n:127.0.0.1:50352_solr) [n:127.0.0.1:50352_solr    ] o.a.s.c.c.ZkStateReader Updated live nodes from ZooKeeper... (4) -> (1)
   [junit4]   2> 1053601 INFO  (jetty-closer-2126-thread-1) [    ] o.e.j.s.h.ContextHandler Stopped o.e.j.s.ServletContextHandler@4409e4e8{/solr,null,UNAVAILABLE}
   [junit4]   2> 1053602 INFO  (jetty-closer-2126-thread-6) [    ] o.e.j.s.h.ContextHandler Stopped o.e.j.s.ServletContextHandler@205a637b{/solr,null,UNAVAILABLE}
   [junit4]   2> 1053602 INFO  (jetty-closer-2126-thread-3) [    ] o.e.j.s.h.ContextHandler Stopped o.e.j.s.ServletContextHandler@5a95bdd4{/solr,null,UNAVAILABLE}
   [junit4]   2> 1053607 WARN  (zkCallback-2157-thread-2-processing-n:127.0.0.1:50352_solr) [n:127.0.0.1:50352_solr    ] o.a.s.c.c.ZkStateReader ZooKeeper watch triggered, but Solr cannot talk to ZK: [KeeperErrorCode = Session expired for /live_nodes]
   [junit4]   2> 1053607 INFO  (jetty-closer-2126-thread-4) [    ] o.e.j.s.h.ContextHandler Stopped o.e.j.s.ServletContextHandler@1b381c55{/solr,null,UNAVAILABLE}
   [junit4]   2> 1053609 INFO  (SUITE-DeleteNodeTest-seed#[73C316FBEA9A9A4]-worker) [    ] o.a.s.c.ZkTestServer connecting to 127.0.0.1:50344 50344
   [junit4]   2> 1053617 INFO  (Thread-1377) [    ] o.a.s.c.ZkTestServer connecting to 127.0.0.1:50344 50344
   [junit4]   2> 1059255 WARN  (Thread-1377) [    ] o.a.s.c.ZkTestServer Watch limit violations:
   [junit4]   2> Maximum concurrent create/delete watches above limit:
   [junit4]   2>
   [junit4]   2> 7 /solr/aliases.json
   [junit4]   2> 7 /solr/clusterprops.json
   [junit4]   2> 6 /solr/security.json
   [junit4]   2>
   [junit4]   2> Maximum concurrent data watches above limit:
   [junit4]   2>
   [junit4]   2> 7 /solr/clusterstate.json
   [junit4]   2> 6 /solr/collections/deletenodetest_coll/state.json
   [junit4]   2> 2 /solr/overseer_elect/election/97830681981354002-127.0.0.1:50352_solr-n_0000000000
   [junit4]   2> 2 /solr/overseer_elect/election/97830681981353997-127.0.0.1:50350_solr-n_0000000003
   [junit4]   2>
   [junit4]   2> Maximum concurrent children watches above limit:
   [junit4]   2>
   [junit4]   2> 7 /solr/live_nodes
   [junit4]   2> 7 /solr/collections
   [junit4]   2>
   [junit4]   2> 1059256 INFO  (SUITE-DeleteNodeTest-seed#[73C316FBEA9A9A4]-worker) [    ] o.a.s.SolrTestCaseJ4 ###deleteCore
   [junit4]   2> NOTE: leaving temporary files on disk at: /Users/jenkins/workspace/Lucene-Solr-master-MacOSX/solr/build/solr-core/test/J1/temp/solr.cloud.DeleteNodeTest_73C316FBEA9A9A4-001
   [junit4]   2> NOTE: test params are: codec=Asserting(Lucene70): {}, docValues:{}, maxPointsInLeafNode=100, maxMBSortInHeap=6.180282920797088, sim=RandomSimilarity(queryNorm=false): {}, locale=vi, timezone=Etc/GMT-1
   [junit4]   2> NOTE: Mac OS X 10.11.6 x86_64/Oracle Corporation 1.8.0_121 (64-bit)/cpus=3,threads=1,free=214143328,total=490389504
   [junit4]   2> NOTE: All tests run in this JVM: [TermVectorComponentDistributedTest, TestManagedSchemaThreadSafety, CollectionsAPIDistributedZkTest, WrapperMergePolicyFactoryTest, SuggesterTSTTest, StatsComponentTest, TestUseDocValuesAsStored, TestSchemaManager, CachingDirectoryFactoryTest, TestBlendedInfixSuggestions, TestRangeQuery, CdcrVersionReplicationTest, TemplateUpdateProcessorTest, TestDFRSimilarityFactory, TestSolrCoreProperties, TestMinMaxOnMultiValuedField, TestShortCircuitedRequests, TestMultiWordSynonyms, HighlighterMaxOffsetTest, DOMUtilTest, CircularListTest, TestNumericTerms64, TestMiniSolrCloudClusterSSL, FieldMutatingUpdateProcessorTest, SolrCloudExampleTest, StatsReloadRaceTest, TestFoldingMultitermQuery, LeaderElectionIntegrationTest, BadComponentTest, TestBadConfig, DistributedTermsComponentTest, TestInPlaceUpdatesStandalone, TestFieldTypeCollectionResource, SaslZkACLProviderTest, ResponseLogComponentTest, TestSolrConfigHandlerCloud, SolrCoreMetricManagerTest, SolrIndexSplitterTest, TestFreeTextSuggestions, FullSolrCloudDistribCmdsTest, SpellPossibilityIteratorTest, TestExactSharedStatsCache, TestRebalanceLeaders, DistributedExpandComponentTest, TimeZoneUtilsTest, TestAuthenticationFramework, TestDocSet, TestCustomDocTransformer, TestCloudManagedSchema, TestFiltering, TestConfigSetsAPI, DeleteInactiveReplicaTest, TestComponentsName, TestMacros, TestWriterPerf, HdfsTlogReplayBufferedWhileIndexingTest, UpdateRequestProcessorFactoryTest, TestSolrCoreSnapshots, MetricsHandlerTest, ShardRoutingCustomTest, ShowFileRequestHandlerTest, MultiThreadedOCPTest, TestSolrDeletionPolicy2, TestDocBasedVersionConstraints, BigEndianAscendingWordSerializerTest, TestCollectionAPIs, TestQueryTypes, TestCoreDiscovery, DeleteNodeTest]
   [junit4] Completed [116/702 (1!)] on J1 in 40.11s, 1 test, 1 error <<< FAILURES!

[...truncated 45308 lines...]



---------------------------------------------------------------------
To unsubscribe, e-mail: [hidden email]
For additional commands, e-mail: [hidden email]
Reply | Threaded
Open this post in threaded view
|  
Report Content as Inappropriate

[JENKINS] Lucene-Solr-master-MacOSX () - Build # 3965 - Failure!

Policeman Jenkins Server-2
Build: https://jenkins.thetaphi.de/job/Lucene-Solr-master-MacOSX/3965/
Java:

No tests ran.

Build Log:
[...truncated 10 lines...]
ERROR: SEVERE ERROR occurs
org.jenkinsci.lib.envinject.EnvInjectException: Failed to evaluate the script
        at org.jenkinsci.plugins.envinject.service.EnvInjectEnvVars.executeGroovyScript(EnvInjectEnvVars.java:232)
        at org.jenkinsci.plugins.envinject.EnvInjectListener.setUpEnvironmentJobPropertyObject(EnvInjectListener.java:191)
        at org.jenkinsci.plugins.envinject.EnvInjectListener.setUpEnvironment(EnvInjectListener.java:47)
        at hudson.model.AbstractBuild$AbstractBuildExecution.createLauncher(AbstractBuild.java:572)
        at hudson.model.AbstractBuild$AbstractBuildExecution.run(AbstractBuild.java:492)
        at hudson.model.Run.execute(Run.java:1730)
        at hudson.model.FreeStyleBuild.run(FreeStyleBuild.java:43)
        at hudson.model.ResourceController.execute(ResourceController.java:97)
        at hudson.model.Executor.run(Executor.java:405)
Caused by: org.jenkinsci.plugins.scriptsecurity.scripts.UnapprovedUsageException: script not yet approved for use
        at org.jenkinsci.plugins.scriptsecurity.scripts.ScriptApproval.using(ScriptApproval.java:459)
        at org.jenkinsci.plugins.scriptsecurity.sandbox.groovy.SecureGroovyScript.evaluate(SecureGroovyScript.java:170)
        at org.jenkinsci.plugins.envinject.service.EnvInjectEnvVars.executeGroovyScript(EnvInjectEnvVars.java:230)
        ... 8 more
ERROR: Step ‘Archive the artifacts’ failed: no workspace for Lucene-Solr-master-MacOSX #3965
ERROR: Step ‘Scan for compiler warnings’ failed: no workspace for Lucene-Solr-master-MacOSX #3965
ERROR: Step ‘Publish JUnit test result report’ failed: no workspace for Lucene-Solr-master-MacOSX #3965
Email was triggered for: Failure - Any
Sending email for trigger: Failure - Any


---------------------------------------------------------------------
To unsubscribe, e-mail: [hidden email]
For additional commands, e-mail: [hidden email]
Reply | Threaded
Open this post in threaded view
|  
Report Content as Inappropriate

[JENKINS] Lucene-Solr-master-MacOSX () - Build # 3966 - Failure!

Policeman Jenkins Server-2
In reply to this post by Policeman Jenkins Server-2
Build: https://jenkins.thetaphi.de/job/Lucene-Solr-master-MacOSX/3966/
Java:

No tests ran.

Build Log:
[...truncated 11 lines...]
ERROR: SEVERE ERROR occurs
org.jenkinsci.lib.envinject.EnvInjectException: Cannot load file null from the master. Loading of files from the master is prohibited globally.
        at org.jenkinsci.plugins.envinject.util.EnvInjectExceptionFormatter.forProhibitedLoadFromMaster(EnvInjectExceptionFormatter.java:19)
        at org.jenkinsci.plugins.envinject.service.EnvInjectEnvVars.getEnvVarsPropertiesJobProperty(EnvInjectEnvVars.java:64)
        at org.jenkinsci.plugins.envinject.EnvInjectListener.setUpEnvironmentJobPropertyObject(EnvInjectListener.java:193)
        at org.jenkinsci.plugins.envinject.EnvInjectListener.setUpEnvironment(EnvInjectListener.java:47)
        at hudson.model.AbstractBuild$AbstractBuildExecution.createLauncher(AbstractBuild.java:572)
        at hudson.model.AbstractBuild$AbstractBuildExecution.run(AbstractBuild.java:492)
        at hudson.model.Run.execute(Run.java:1730)
        at hudson.model.FreeStyleBuild.run(FreeStyleBuild.java:43)
        at hudson.model.ResourceController.execute(ResourceController.java:97)
        at hudson.model.Executor.run(Executor.java:405)
ERROR: Step ‘Archive the artifacts’ failed: no workspace for Lucene-Solr-master-MacOSX #3966
ERROR: Step ‘Scan for compiler warnings’ failed: no workspace for Lucene-Solr-master-MacOSX #3966
ERROR: Step ‘Publish JUnit test result report’ failed: no workspace for Lucene-Solr-master-MacOSX #3966
Email was triggered for: Failure - Any
Sending email for trigger: Failure - Any


---------------------------------------------------------------------
To unsubscribe, e-mail: [hidden email]
For additional commands, e-mail: [hidden email]
Loading...