[JENKINS] Lucene-Solr-master-Solaris (64bit/jdk1.8.0) - Build # 1556 - Unstable!

Previous Topic Next Topic
 
classic Classic list List threaded Threaded
1 message Options
Reply | Threaded
Open this post in threaded view
|

[JENKINS] Lucene-Solr-master-Solaris (64bit/jdk1.8.0) - Build # 1556 - Unstable!

Policeman Jenkins Server-2
Build: https://jenkins.thetaphi.de/job/Lucene-Solr-master-Solaris/1556/
Java: 64bit/jdk1.8.0 -XX:+UseCompressedOops -XX:+UseG1GC

1 tests failed.
FAILED:  junit.framework.TestSuite.org.apache.solr.util.TestSolrCLIRunExample

Error Message:
ObjectTracker found 4 object(s) that were not released!!! [TransactionLog, NRTCachingDirectory, NRTCachingDirectory, NRTCachingDirectory] org.apache.solr.common.util.ObjectReleaseTracker$ObjectTrackerException: org.apache.solr.update.TransactionLog  at org.apache.solr.common.util.ObjectReleaseTracker.track(ObjectReleaseTracker.java:42)  at org.apache.solr.update.TransactionLog.<init>(TransactionLog.java:190)  at org.apache.solr.update.UpdateLog.newTransactionLog(UpdateLog.java:448)  at org.apache.solr.update.UpdateLog.ensureLog(UpdateLog.java:1261)  at org.apache.solr.update.UpdateLog.add(UpdateLog.java:534)  at org.apache.solr.update.UpdateLog.add(UpdateLog.java:519)  at org.apache.solr.update.DirectUpdateHandler2.doNormalUpdate(DirectUpdateHandler2.java:352)  at org.apache.solr.update.DirectUpdateHandler2.addDoc0(DirectUpdateHandler2.java:271)  at org.apache.solr.update.DirectUpdateHandler2.addDoc(DirectUpdateHandler2.java:221)  at org.apache.solr.update.processor.RunUpdateProcessor.processAdd(RunUpdateProcessorFactory.java:67)  at org.apache.solr.update.processor.UpdateRequestProcessor.processAdd(UpdateRequestProcessor.java:55)  at org.apache.solr.update.processor.DistributedUpdateProcessor.doLocalAdd(DistributedUpdateProcessor.java:910)  at org.apache.solr.update.processor.DistributedUpdateProcessor.versionAdd(DistributedUpdateProcessor.java:1121)  at org.apache.solr.update.processor.DistributedUpdateProcessor.processAdd(DistributedUpdateProcessor.java:616)  at org.apache.solr.update.processor.UpdateRequestProcessor.processAdd(UpdateRequestProcessor.java:55)  at org.apache.solr.update.processor.AddSchemaFieldsUpdateProcessorFactory$AddSchemaFieldsUpdateProcessor.processAdd(AddSchemaFieldsUpdateProcessorFactory.java:475)  at org.apache.solr.handler.loader.JavabinLoader$1.update(JavabinLoader.java:98)  at org.apache.solr.client.solrj.request.JavaBinUpdateRequestCodec$1.readOuterMostDocIterator(JavaBinUpdateRequestCodec.java:188)  at org.apache.solr.client.solrj.request.JavaBinUpdateRequestCodec$1.readIterator(JavaBinUpdateRequestCodec.java:144)  at org.apache.solr.common.util.JavaBinCodec.readObject(JavaBinCodec.java:311)  at org.apache.solr.common.util.JavaBinCodec.readVal(JavaBinCodec.java:256)  at org.apache.solr.client.solrj.request.JavaBinUpdateRequestCodec$1.readNamedList(JavaBinUpdateRequestCodec.java:130)  at org.apache.solr.common.util.JavaBinCodec.readObject(JavaBinCodec.java:276)  at org.apache.solr.common.util.JavaBinCodec.readVal(JavaBinCodec.java:256)  at org.apache.solr.common.util.JavaBinCodec.unmarshal(JavaBinCodec.java:178)  at org.apache.solr.client.solrj.request.JavaBinUpdateRequestCodec.unmarshal(JavaBinUpdateRequestCodec.java:195)  at org.apache.solr.handler.loader.JavabinLoader.parseAndLoadDocs(JavabinLoader.java:108)  at org.apache.solr.handler.loader.JavabinLoader.load(JavabinLoader.java:55)  at org.apache.solr.handler.UpdateRequestHandler$1.load(UpdateRequestHandler.java:97)  at org.apache.solr.handler.ContentStreamHandlerBase.handleRequestBody(ContentStreamHandlerBase.java:68)  at org.apache.solr.handler.RequestHandlerBase.handleRequest(RequestHandlerBase.java:177)  at org.apache.solr.core.SolrCore.execute(SolrCore.java:2503)  at org.apache.solr.servlet.HttpSolrCall.execute(HttpSolrCall.java:710)  at org.apache.solr.servlet.HttpSolrCall.call(HttpSolrCall.java:516)  at org.apache.solr.servlet.SolrDispatchFilter.doFilter(SolrDispatchFilter.java:382)  at org.apache.solr.servlet.SolrDispatchFilter.doFilter(SolrDispatchFilter.java:326)  at org.eclipse.jetty.servlet.ServletHandler$CachedChain.doFilter(ServletHandler.java:1759)  at org.apache.solr.client.solrj.embedded.JettySolrRunner$DebugFilter.doFilter(JettySolrRunner.java:139)  at org.eclipse.jetty.servlet.ServletHandler$CachedChain.doFilter(ServletHandler.java:1759)  at org.eclipse.jetty.servlet.ServletHandler.doHandle(ServletHandler.java:582)  at org.eclipse.jetty.server.session.SessionHandler.doHandle(SessionHandler.java:224)  at org.eclipse.jetty.server.handler.ContextHandler.doHandle(ContextHandler.java:1180)  at org.eclipse.jetty.servlet.ServletHandler.doScope(ServletHandler.java:512)  at org.eclipse.jetty.server.session.SessionHandler.doScope(SessionHandler.java:185)  at org.eclipse.jetty.server.handler.ContextHandler.doScope(ContextHandler.java:1112)  at org.eclipse.jetty.server.handler.ScopedHandler.handle(ScopedHandler.java:141)  at org.eclipse.jetty.server.handler.gzip.GzipHandler.handle(GzipHandler.java:426)  at org.eclipse.jetty.server.handler.HandlerWrapper.handle(HandlerWrapper.java:134)  at org.eclipse.jetty.server.Server.handle(Server.java:534)  at org.eclipse.jetty.server.HttpChannel.handle(HttpChannel.java:320)  at org.eclipse.jetty.server.HttpConnection.onFillable(HttpConnection.java:251)  at org.eclipse.jetty.io.AbstractConnection$ReadCallback.succeeded(AbstractConnection.java:283)  at org.eclipse.jetty.io.FillInterest.fillable(FillInterest.java:108)  at org.eclipse.jetty.io.SelectChannelEndPoint$2.run(SelectChannelEndPoint.java:93)  at org.eclipse.jetty.util.thread.strategy.ExecuteProduceConsume.executeProduceConsume(ExecuteProduceConsume.java:303)  at org.eclipse.jetty.util.thread.strategy.ExecuteProduceConsume.produceConsume(ExecuteProduceConsume.java:148)  at org.eclipse.jetty.util.thread.strategy.ExecuteProduceConsume.run(ExecuteProduceConsume.java:136)  at org.eclipse.jetty.util.thread.QueuedThreadPool.runJob(QueuedThreadPool.java:671)  at org.eclipse.jetty.util.thread.QueuedThreadPool$2.run(QueuedThreadPool.java:589)  at java.lang.Thread.run(Thread.java:748)  org.apache.solr.common.util.ObjectReleaseTracker$ObjectTrackerException: org.apache.lucene.store.NRTCachingDirectory  at org.apache.solr.common.util.ObjectReleaseTracker.track(ObjectReleaseTracker.java:42)  at org.apache.solr.core.CachingDirectoryFactory.get(CachingDirectoryFactory.java:348)  at org.apache.solr.core.SolrCore.getNewIndexDir(SolrCore.java:351)  at org.apache.solr.core.SolrCore.initIndex(SolrCore.java:729)  at org.apache.solr.core.SolrCore.<init>(SolrCore.java:954)  at org.apache.solr.core.SolrCore.<init>(SolrCore.java:863)  at org.apache.solr.core.CoreContainer.createFromDescriptor(CoreContainer.java:1041)  at org.apache.solr.core.CoreContainer.create(CoreContainer.java:952)  at org.apache.solr.handler.admin.CoreAdminOperation.lambda$static$0(CoreAdminOperation.java:91)  at org.apache.solr.handler.admin.CoreAdminOperation.execute(CoreAdminOperation.java:384)  at org.apache.solr.handler.admin.CoreAdminHandler$CallInfo.call(CoreAdminHandler.java:389)  at org.apache.solr.handler.admin.CoreAdminHandler.handleRequestBody(CoreAdminHandler.java:174)  at org.apache.solr.handler.RequestHandlerBase.handleRequest(RequestHandlerBase.java:177)  at org.apache.solr.servlet.HttpSolrCall.handleAdmin(HttpSolrCall.java:735)  at org.apache.solr.servlet.HttpSolrCall.handleAdminRequest(HttpSolrCall.java:716)  at org.apache.solr.servlet.HttpSolrCall.call(HttpSolrCall.java:497)  at org.apache.solr.servlet.SolrDispatchFilter.doFilter(SolrDispatchFilter.java:382)  at org.apache.solr.servlet.SolrDispatchFilter.doFilter(SolrDispatchFilter.java:326)  at org.eclipse.jetty.servlet.ServletHandler$CachedChain.doFilter(ServletHandler.java:1759)  at org.apache.solr.client.solrj.embedded.JettySolrRunner$DebugFilter.doFilter(JettySolrRunner.java:139)  at org.eclipse.jetty.servlet.ServletHandler$CachedChain.doFilter(ServletHandler.java:1759)  at org.eclipse.jetty.servlet.ServletHandler.doHandle(ServletHandler.java:582)  at org.eclipse.jetty.server.session.SessionHandler.doHandle(SessionHandler.java:224)  at org.eclipse.jetty.server.handler.ContextHandler.doHandle(ContextHandler.java:1180)  at org.eclipse.jetty.servlet.ServletHandler.doScope(ServletHandler.java:512)  at org.eclipse.jetty.server.session.SessionHandler.doScope(SessionHandler.java:185)  at org.eclipse.jetty.server.handler.ContextHandler.doScope(ContextHandler.java:1112)  at org.eclipse.jetty.server.handler.ScopedHandler.handle(ScopedHandler.java:141)  at org.eclipse.jetty.server.handler.gzip.GzipHandler.handle(GzipHandler.java:426)  at org.eclipse.jetty.server.handler.HandlerWrapper.handle(HandlerWrapper.java:134)  at org.eclipse.jetty.server.Server.handle(Server.java:534)  at org.eclipse.jetty.server.HttpChannel.handle(HttpChannel.java:320)  at org.eclipse.jetty.server.HttpConnection.onFillable(HttpConnection.java:251)  at org.eclipse.jetty.io.AbstractConnection$ReadCallback.succeeded(AbstractConnection.java:283)  at org.eclipse.jetty.io.FillInterest.fillable(FillInterest.java:108)  at org.eclipse.jetty.io.SelectChannelEndPoint$2.run(SelectChannelEndPoint.java:93)  at org.eclipse.jetty.util.thread.strategy.ExecuteProduceConsume.executeProduceConsume(ExecuteProduceConsume.java:303)  at org.eclipse.jetty.util.thread.strategy.ExecuteProduceConsume.produceConsume(ExecuteProduceConsume.java:148)  at org.eclipse.jetty.util.thread.strategy.ExecuteProduceConsume.run(ExecuteProduceConsume.java:136)  at org.eclipse.jetty.util.thread.QueuedThreadPool.runJob(QueuedThreadPool.java:671)  at org.eclipse.jetty.util.thread.QueuedThreadPool$2.run(QueuedThreadPool.java:589)  at java.lang.Thread.run(Thread.java:748)  org.apache.solr.common.util.ObjectReleaseTracker$ObjectTrackerException: org.apache.lucene.store.NRTCachingDirectory  at org.apache.solr.common.util.ObjectReleaseTracker.track(ObjectReleaseTracker.java:42)  at org.apache.solr.core.CachingDirectoryFactory.get(CachingDirectoryFactory.java:348)  at org.apache.solr.update.SolrIndexWriter.create(SolrIndexWriter.java:92)  at org.apache.solr.core.SolrCore.initIndex(SolrCore.java:761)  at org.apache.solr.core.SolrCore.<init>(SolrCore.java:954)  at org.apache.solr.core.SolrCore.<init>(SolrCore.java:863)  at org.apache.solr.core.CoreContainer.createFromDescriptor(CoreContainer.java:1041)  at org.apache.solr.core.CoreContainer.create(CoreContainer.java:952)  at org.apache.solr.handler.admin.CoreAdminOperation.lambda$static$0(CoreAdminOperation.java:91)  at org.apache.solr.handler.admin.CoreAdminOperation.execute(CoreAdminOperation.java:384)  at org.apache.solr.handler.admin.CoreAdminHandler$CallInfo.call(CoreAdminHandler.java:389)  at org.apache.solr.handler.admin.CoreAdminHandler.handleRequestBody(CoreAdminHandler.java:174)  at org.apache.solr.handler.RequestHandlerBase.handleRequest(RequestHandlerBase.java:177)  at org.apache.solr.servlet.HttpSolrCall.handleAdmin(HttpSolrCall.java:735)  at org.apache.solr.servlet.HttpSolrCall.handleAdminRequest(HttpSolrCall.java:716)  at org.apache.solr.servlet.HttpSolrCall.call(HttpSolrCall.java:497)  at org.apache.solr.servlet.SolrDispatchFilter.doFilter(SolrDispatchFilter.java:382)  at org.apache.solr.servlet.SolrDispatchFilter.doFilter(SolrDispatchFilter.java:326)  at org.eclipse.jetty.servlet.ServletHandler$CachedChain.doFilter(ServletHandler.java:1759)  at org.apache.solr.client.solrj.embedded.JettySolrRunner$DebugFilter.doFilter(JettySolrRunner.java:139)  at org.eclipse.jetty.servlet.ServletHandler$CachedChain.doFilter(ServletHandler.java:1759)  at org.eclipse.jetty.servlet.ServletHandler.doHandle(ServletHandler.java:582)  at org.eclipse.jetty.server.session.SessionHandler.doHandle(SessionHandler.java:224)  at org.eclipse.jetty.server.handler.ContextHandler.doHandle(ContextHandler.java:1180)  at org.eclipse.jetty.servlet.ServletHandler.doScope(ServletHandler.java:512)  at org.eclipse.jetty.server.session.SessionHandler.doScope(SessionHandler.java:185)  at org.eclipse.jetty.server.handler.ContextHandler.doScope(ContextHandler.java:1112)  at org.eclipse.jetty.server.handler.ScopedHandler.handle(ScopedHandler.java:141)  at org.eclipse.jetty.server.handler.gzip.GzipHandler.handle(GzipHandler.java:426)  at org.eclipse.jetty.server.handler.HandlerWrapper.handle(HandlerWrapper.java:134)  at org.eclipse.jetty.server.Server.handle(Server.java:534)  at org.eclipse.jetty.server.HttpChannel.handle(HttpChannel.java:320)  at org.eclipse.jetty.server.HttpConnection.onFillable(HttpConnection.java:251)  at org.eclipse.jetty.io.AbstractConnection$ReadCallback.succeeded(AbstractConnection.java:283)  at org.eclipse.jetty.io.FillInterest.fillable(FillInterest.java:108)  at org.eclipse.jetty.io.SelectChannelEndPoint$2.run(SelectChannelEndPoint.java:93)  at org.eclipse.jetty.util.thread.strategy.ExecuteProduceConsume.executeProduceConsume(ExecuteProduceConsume.java:303)  at org.eclipse.jetty.util.thread.strategy.ExecuteProduceConsume.produceConsume(ExecuteProduceConsume.java:148)  at org.eclipse.jetty.util.thread.strategy.ExecuteProduceConsume.run(ExecuteProduceConsume.java:136)  at org.eclipse.jetty.util.thread.QueuedThreadPool.runJob(QueuedThreadPool.java:671)  at org.eclipse.jetty.util.thread.QueuedThreadPool$2.run(QueuedThreadPool.java:589)  at java.lang.Thread.run(Thread.java:748)  org.apache.solr.common.util.ObjectReleaseTracker$ObjectTrackerException: org.apache.lucene.store.NRTCachingDirectory  at org.apache.solr.common.util.ObjectReleaseTracker.track(ObjectReleaseTracker.java:42)  at org.apache.solr.core.CachingDirectoryFactory.get(CachingDirectoryFactory.java:348)  at org.apache.solr.core.SolrCore.initSnapshotMetaDataManager(SolrCore.java:498)  at org.apache.solr.core.SolrCore.<init>(SolrCore.java:948)  at org.apache.solr.core.SolrCore.<init>(SolrCore.java:863)  at org.apache.solr.core.CoreContainer.createFromDescriptor(CoreContainer.java:1041)  at org.apache.solr.core.CoreContainer.create(CoreContainer.java:952)  at org.apache.solr.handler.admin.CoreAdminOperation.lambda$static$0(CoreAdminOperation.java:91)  at org.apache.solr.handler.admin.CoreAdminOperation.execute(CoreAdminOperation.java:384)  at org.apache.solr.handler.admin.CoreAdminHandler$CallInfo.call(CoreAdminHandler.java:389)  at org.apache.solr.handler.admin.CoreAdminHandler.handleRequestBody(CoreAdminHandler.java:174)  at org.apache.solr.handler.RequestHandlerBase.handleRequest(RequestHandlerBase.java:177)  at org.apache.solr.servlet.HttpSolrCall.handleAdmin(HttpSolrCall.java:735)  at org.apache.solr.servlet.HttpSolrCall.handleAdminRequest(HttpSolrCall.java:716)  at org.apache.solr.servlet.HttpSolrCall.call(HttpSolrCall.java:497)  at org.apache.solr.servlet.SolrDispatchFilter.doFilter(SolrDispatchFilter.java:382)  at org.apache.solr.servlet.SolrDispatchFilter.doFilter(SolrDispatchFilter.java:326)  at org.eclipse.jetty.servlet.ServletHandler$CachedChain.doFilter(ServletHandler.java:1759)  at org.apache.solr.client.solrj.embedded.JettySolrRunner$DebugFilter.doFilter(JettySolrRunner.java:139)  at org.eclipse.jetty.servlet.ServletHandler$CachedChain.doFilter(ServletHandler.java:1759)  at org.eclipse.jetty.servlet.ServletHandler.doHandle(ServletHandler.java:582)  at org.eclipse.jetty.server.session.SessionHandler.doHandle(SessionHandler.java:224)  at org.eclipse.jetty.server.handler.ContextHandler.doHandle(ContextHandler.java:1180)  at org.eclipse.jetty.servlet.ServletHandler.doScope(ServletHandler.java:512)  at org.eclipse.jetty.server.session.SessionHandler.doScope(SessionHandler.java:185)  at org.eclipse.jetty.server.handler.ContextHandler.doScope(ContextHandler.java:1112)  at org.eclipse.jetty.server.handler.ScopedHandler.handle(ScopedHandler.java:141)  at org.eclipse.jetty.server.handler.gzip.GzipHandler.handle(GzipHandler.java:426)  at org.eclipse.jetty.server.handler.HandlerWrapper.handle(HandlerWrapper.java:134)  at org.eclipse.jetty.server.Server.handle(Server.java:534)  at org.eclipse.jetty.server.HttpChannel.handle(HttpChannel.java:320)  at org.eclipse.jetty.server.HttpConnection.onFillable(HttpConnection.java:251)  at org.eclipse.jetty.io.AbstractConnection$ReadCallback.succeeded(AbstractConnection.java:283)  at org.eclipse.jetty.io.FillInterest.fillable(FillInterest.java:108)  at org.eclipse.jetty.io.SelectChannelEndPoint$2.run(SelectChannelEndPoint.java:93)  at org.eclipse.jetty.util.thread.strategy.ExecuteProduceConsume.executeProduceConsume(ExecuteProduceConsume.java:303)  at org.eclipse.jetty.util.thread.strategy.ExecuteProduceConsume.produceConsume(ExecuteProduceConsume.java:148)  at org.eclipse.jetty.util.thread.strategy.ExecuteProduceConsume.run(ExecuteProduceConsume.java:136)  at org.eclipse.jetty.util.thread.QueuedThreadPool.runJob(QueuedThreadPool.java:671)  at org.eclipse.jetty.util.thread.QueuedThreadPool$2.run(QueuedThreadPool.java:589)  at java.lang.Thread.run(Thread.java:748)  

Stack Trace:
java.lang.AssertionError: ObjectTracker found 4 object(s) that were not released!!! [TransactionLog, NRTCachingDirectory, NRTCachingDirectory, NRTCachingDirectory]
org.apache.solr.common.util.ObjectReleaseTracker$ObjectTrackerException: org.apache.solr.update.TransactionLog
        at org.apache.solr.common.util.ObjectReleaseTracker.track(ObjectReleaseTracker.java:42)
        at org.apache.solr.update.TransactionLog.<init>(TransactionLog.java:190)
        at org.apache.solr.update.UpdateLog.newTransactionLog(UpdateLog.java:448)
        at org.apache.solr.update.UpdateLog.ensureLog(UpdateLog.java:1261)
        at org.apache.solr.update.UpdateLog.add(UpdateLog.java:534)
        at org.apache.solr.update.UpdateLog.add(UpdateLog.java:519)
        at org.apache.solr.update.DirectUpdateHandler2.doNormalUpdate(DirectUpdateHandler2.java:352)
        at org.apache.solr.update.DirectUpdateHandler2.addDoc0(DirectUpdateHandler2.java:271)
        at org.apache.solr.update.DirectUpdateHandler2.addDoc(DirectUpdateHandler2.java:221)
        at org.apache.solr.update.processor.RunUpdateProcessor.processAdd(RunUpdateProcessorFactory.java:67)
        at org.apache.solr.update.processor.UpdateRequestProcessor.processAdd(UpdateRequestProcessor.java:55)
        at org.apache.solr.update.processor.DistributedUpdateProcessor.doLocalAdd(DistributedUpdateProcessor.java:910)
        at org.apache.solr.update.processor.DistributedUpdateProcessor.versionAdd(DistributedUpdateProcessor.java:1121)
        at org.apache.solr.update.processor.DistributedUpdateProcessor.processAdd(DistributedUpdateProcessor.java:616)
        at org.apache.solr.update.processor.UpdateRequestProcessor.processAdd(UpdateRequestProcessor.java:55)
        at org.apache.solr.update.processor.AddSchemaFieldsUpdateProcessorFactory$AddSchemaFieldsUpdateProcessor.processAdd(AddSchemaFieldsUpdateProcessorFactory.java:475)
        at org.apache.solr.handler.loader.JavabinLoader$1.update(JavabinLoader.java:98)
        at org.apache.solr.client.solrj.request.JavaBinUpdateRequestCodec$1.readOuterMostDocIterator(JavaBinUpdateRequestCodec.java:188)
        at org.apache.solr.client.solrj.request.JavaBinUpdateRequestCodec$1.readIterator(JavaBinUpdateRequestCodec.java:144)
        at org.apache.solr.common.util.JavaBinCodec.readObject(JavaBinCodec.java:311)
        at org.apache.solr.common.util.JavaBinCodec.readVal(JavaBinCodec.java:256)
        at org.apache.solr.client.solrj.request.JavaBinUpdateRequestCodec$1.readNamedList(JavaBinUpdateRequestCodec.java:130)
        at org.apache.solr.common.util.JavaBinCodec.readObject(JavaBinCodec.java:276)
        at org.apache.solr.common.util.JavaBinCodec.readVal(JavaBinCodec.java:256)
        at org.apache.solr.common.util.JavaBinCodec.unmarshal(JavaBinCodec.java:178)
        at org.apache.solr.client.solrj.request.JavaBinUpdateRequestCodec.unmarshal(JavaBinUpdateRequestCodec.java:195)
        at org.apache.solr.handler.loader.JavabinLoader.parseAndLoadDocs(JavabinLoader.java:108)
        at org.apache.solr.handler.loader.JavabinLoader.load(JavabinLoader.java:55)
        at org.apache.solr.handler.UpdateRequestHandler$1.load(UpdateRequestHandler.java:97)
        at org.apache.solr.handler.ContentStreamHandlerBase.handleRequestBody(ContentStreamHandlerBase.java:68)
        at org.apache.solr.handler.RequestHandlerBase.handleRequest(RequestHandlerBase.java:177)
        at org.apache.solr.core.SolrCore.execute(SolrCore.java:2503)
        at org.apache.solr.servlet.HttpSolrCall.execute(HttpSolrCall.java:710)
        at org.apache.solr.servlet.HttpSolrCall.call(HttpSolrCall.java:516)
        at org.apache.solr.servlet.SolrDispatchFilter.doFilter(SolrDispatchFilter.java:382)
        at org.apache.solr.servlet.SolrDispatchFilter.doFilter(SolrDispatchFilter.java:326)
        at org.eclipse.jetty.servlet.ServletHandler$CachedChain.doFilter(ServletHandler.java:1759)
        at org.apache.solr.client.solrj.embedded.JettySolrRunner$DebugFilter.doFilter(JettySolrRunner.java:139)
        at org.eclipse.jetty.servlet.ServletHandler$CachedChain.doFilter(ServletHandler.java:1759)
        at org.eclipse.jetty.servlet.ServletHandler.doHandle(ServletHandler.java:582)
        at org.eclipse.jetty.server.session.SessionHandler.doHandle(SessionHandler.java:224)
        at org.eclipse.jetty.server.handler.ContextHandler.doHandle(ContextHandler.java:1180)
        at org.eclipse.jetty.servlet.ServletHandler.doScope(ServletHandler.java:512)
        at org.eclipse.jetty.server.session.SessionHandler.doScope(SessionHandler.java:185)
        at org.eclipse.jetty.server.handler.ContextHandler.doScope(ContextHandler.java:1112)
        at org.eclipse.jetty.server.handler.ScopedHandler.handle(ScopedHandler.java:141)
        at org.eclipse.jetty.server.handler.gzip.GzipHandler.handle(GzipHandler.java:426)
        at org.eclipse.jetty.server.handler.HandlerWrapper.handle(HandlerWrapper.java:134)
        at org.eclipse.jetty.server.Server.handle(Server.java:534)
        at org.eclipse.jetty.server.HttpChannel.handle(HttpChannel.java:320)
        at org.eclipse.jetty.server.HttpConnection.onFillable(HttpConnection.java:251)
        at org.eclipse.jetty.io.AbstractConnection$ReadCallback.succeeded(AbstractConnection.java:283)
        at org.eclipse.jetty.io.FillInterest.fillable(FillInterest.java:108)
        at org.eclipse.jetty.io.SelectChannelEndPoint$2.run(SelectChannelEndPoint.java:93)
        at org.eclipse.jetty.util.thread.strategy.ExecuteProduceConsume.executeProduceConsume(ExecuteProduceConsume.java:303)
        at org.eclipse.jetty.util.thread.strategy.ExecuteProduceConsume.produceConsume(ExecuteProduceConsume.java:148)
        at org.eclipse.jetty.util.thread.strategy.ExecuteProduceConsume.run(ExecuteProduceConsume.java:136)
        at org.eclipse.jetty.util.thread.QueuedThreadPool.runJob(QueuedThreadPool.java:671)
        at org.eclipse.jetty.util.thread.QueuedThreadPool$2.run(QueuedThreadPool.java:589)
        at java.lang.Thread.run(Thread.java:748)

org.apache.solr.common.util.ObjectReleaseTracker$ObjectTrackerException: org.apache.lucene.store.NRTCachingDirectory
        at org.apache.solr.common.util.ObjectReleaseTracker.track(ObjectReleaseTracker.java:42)
        at org.apache.solr.core.CachingDirectoryFactory.get(CachingDirectoryFactory.java:348)
        at org.apache.solr.core.SolrCore.getNewIndexDir(SolrCore.java:351)
        at org.apache.solr.core.SolrCore.initIndex(SolrCore.java:729)
        at org.apache.solr.core.SolrCore.<init>(SolrCore.java:954)
        at org.apache.solr.core.SolrCore.<init>(SolrCore.java:863)
        at org.apache.solr.core.CoreContainer.createFromDescriptor(CoreContainer.java:1041)
        at org.apache.solr.core.CoreContainer.create(CoreContainer.java:952)
        at org.apache.solr.handler.admin.CoreAdminOperation.lambda$static$0(CoreAdminOperation.java:91)
        at org.apache.solr.handler.admin.CoreAdminOperation.execute(CoreAdminOperation.java:384)
        at org.apache.solr.handler.admin.CoreAdminHandler$CallInfo.call(CoreAdminHandler.java:389)
        at org.apache.solr.handler.admin.CoreAdminHandler.handleRequestBody(CoreAdminHandler.java:174)
        at org.apache.solr.handler.RequestHandlerBase.handleRequest(RequestHandlerBase.java:177)
        at org.apache.solr.servlet.HttpSolrCall.handleAdmin(HttpSolrCall.java:735)
        at org.apache.solr.servlet.HttpSolrCall.handleAdminRequest(HttpSolrCall.java:716)
        at org.apache.solr.servlet.HttpSolrCall.call(HttpSolrCall.java:497)
        at org.apache.solr.servlet.SolrDispatchFilter.doFilter(SolrDispatchFilter.java:382)
        at org.apache.solr.servlet.SolrDispatchFilter.doFilter(SolrDispatchFilter.java:326)
        at org.eclipse.jetty.servlet.ServletHandler$CachedChain.doFilter(ServletHandler.java:1759)
        at org.apache.solr.client.solrj.embedded.JettySolrRunner$DebugFilter.doFilter(JettySolrRunner.java:139)
        at org.eclipse.jetty.servlet.ServletHandler$CachedChain.doFilter(ServletHandler.java:1759)
        at org.eclipse.jetty.servlet.ServletHandler.doHandle(ServletHandler.java:582)
        at org.eclipse.jetty.server.session.SessionHandler.doHandle(SessionHandler.java:224)
        at org.eclipse.jetty.server.handler.ContextHandler.doHandle(ContextHandler.java:1180)
        at org.eclipse.jetty.servlet.ServletHandler.doScope(ServletHandler.java:512)
        at org.eclipse.jetty.server.session.SessionHandler.doScope(SessionHandler.java:185)
        at org.eclipse.jetty.server.handler.ContextHandler.doScope(ContextHandler.java:1112)
        at org.eclipse.jetty.server.handler.ScopedHandler.handle(ScopedHandler.java:141)
        at org.eclipse.jetty.server.handler.gzip.GzipHandler.handle(GzipHandler.java:426)
        at org.eclipse.jetty.server.handler.HandlerWrapper.handle(HandlerWrapper.java:134)
        at org.eclipse.jetty.server.Server.handle(Server.java:534)
        at org.eclipse.jetty.server.HttpChannel.handle(HttpChannel.java:320)
        at org.eclipse.jetty.server.HttpConnection.onFillable(HttpConnection.java:251)
        at org.eclipse.jetty.io.AbstractConnection$ReadCallback.succeeded(AbstractConnection.java:283)
        at org.eclipse.jetty.io.FillInterest.fillable(FillInterest.java:108)
        at org.eclipse.jetty.io.SelectChannelEndPoint$2.run(SelectChannelEndPoint.java:93)
        at org.eclipse.jetty.util.thread.strategy.ExecuteProduceConsume.executeProduceConsume(ExecuteProduceConsume.java:303)
        at org.eclipse.jetty.util.thread.strategy.ExecuteProduceConsume.produceConsume(ExecuteProduceConsume.java:148)
        at org.eclipse.jetty.util.thread.strategy.ExecuteProduceConsume.run(ExecuteProduceConsume.java:136)
        at org.eclipse.jetty.util.thread.QueuedThreadPool.runJob(QueuedThreadPool.java:671)
        at org.eclipse.jetty.util.thread.QueuedThreadPool$2.run(QueuedThreadPool.java:589)
        at java.lang.Thread.run(Thread.java:748)

org.apache.solr.common.util.ObjectReleaseTracker$ObjectTrackerException: org.apache.lucene.store.NRTCachingDirectory
        at org.apache.solr.common.util.ObjectReleaseTracker.track(ObjectReleaseTracker.java:42)
        at org.apache.solr.core.CachingDirectoryFactory.get(CachingDirectoryFactory.java:348)
        at org.apache.solr.update.SolrIndexWriter.create(SolrIndexWriter.java:92)
        at org.apache.solr.core.SolrCore.initIndex(SolrCore.java:761)
        at org.apache.solr.core.SolrCore.<init>(SolrCore.java:954)
        at org.apache.solr.core.SolrCore.<init>(SolrCore.java:863)
        at org.apache.solr.core.CoreContainer.createFromDescriptor(CoreContainer.java:1041)
        at org.apache.solr.core.CoreContainer.create(CoreContainer.java:952)
        at org.apache.solr.handler.admin.CoreAdminOperation.lambda$static$0(CoreAdminOperation.java:91)
        at org.apache.solr.handler.admin.CoreAdminOperation.execute(CoreAdminOperation.java:384)
        at org.apache.solr.handler.admin.CoreAdminHandler$CallInfo.call(CoreAdminHandler.java:389)
        at org.apache.solr.handler.admin.CoreAdminHandler.handleRequestBody(CoreAdminHandler.java:174)
        at org.apache.solr.handler.RequestHandlerBase.handleRequest(RequestHandlerBase.java:177)
        at org.apache.solr.servlet.HttpSolrCall.handleAdmin(HttpSolrCall.java:735)
        at org.apache.solr.servlet.HttpSolrCall.handleAdminRequest(HttpSolrCall.java:716)
        at org.apache.solr.servlet.HttpSolrCall.call(HttpSolrCall.java:497)
        at org.apache.solr.servlet.SolrDispatchFilter.doFilter(SolrDispatchFilter.java:382)
        at org.apache.solr.servlet.SolrDispatchFilter.doFilter(SolrDispatchFilter.java:326)
        at org.eclipse.jetty.servlet.ServletHandler$CachedChain.doFilter(ServletHandler.java:1759)
        at org.apache.solr.client.solrj.embedded.JettySolrRunner$DebugFilter.doFilter(JettySolrRunner.java:139)
        at org.eclipse.jetty.servlet.ServletHandler$CachedChain.doFilter(ServletHandler.java:1759)
        at org.eclipse.jetty.servlet.ServletHandler.doHandle(ServletHandler.java:582)
        at org.eclipse.jetty.server.session.SessionHandler.doHandle(SessionHandler.java:224)
        at org.eclipse.jetty.server.handler.ContextHandler.doHandle(ContextHandler.java:1180)
        at org.eclipse.jetty.servlet.ServletHandler.doScope(ServletHandler.java:512)
        at org.eclipse.jetty.server.session.SessionHandler.doScope(SessionHandler.java:185)
        at org.eclipse.jetty.server.handler.ContextHandler.doScope(ContextHandler.java:1112)
        at org.eclipse.jetty.server.handler.ScopedHandler.handle(ScopedHandler.java:141)
        at org.eclipse.jetty.server.handler.gzip.GzipHandler.handle(GzipHandler.java:426)
        at org.eclipse.jetty.server.handler.HandlerWrapper.handle(HandlerWrapper.java:134)
        at org.eclipse.jetty.server.Server.handle(Server.java:534)
        at org.eclipse.jetty.server.HttpChannel.handle(HttpChannel.java:320)
        at org.eclipse.jetty.server.HttpConnection.onFillable(HttpConnection.java:251)
        at org.eclipse.jetty.io.AbstractConnection$ReadCallback.succeeded(AbstractConnection.java:283)
        at org.eclipse.jetty.io.FillInterest.fillable(FillInterest.java:108)
        at org.eclipse.jetty.io.SelectChannelEndPoint$2.run(SelectChannelEndPoint.java:93)
        at org.eclipse.jetty.util.thread.strategy.ExecuteProduceConsume.executeProduceConsume(ExecuteProduceConsume.java:303)
        at org.eclipse.jetty.util.thread.strategy.ExecuteProduceConsume.produceConsume(ExecuteProduceConsume.java:148)
        at org.eclipse.jetty.util.thread.strategy.ExecuteProduceConsume.run(ExecuteProduceConsume.java:136)
        at org.eclipse.jetty.util.thread.QueuedThreadPool.runJob(QueuedThreadPool.java:671)
        at org.eclipse.jetty.util.thread.QueuedThreadPool$2.run(QueuedThreadPool.java:589)
        at java.lang.Thread.run(Thread.java:748)

org.apache.solr.common.util.ObjectReleaseTracker$ObjectTrackerException: org.apache.lucene.store.NRTCachingDirectory
        at org.apache.solr.common.util.ObjectReleaseTracker.track(ObjectReleaseTracker.java:42)
        at org.apache.solr.core.CachingDirectoryFactory.get(CachingDirectoryFactory.java:348)
        at org.apache.solr.core.SolrCore.initSnapshotMetaDataManager(SolrCore.java:498)
        at org.apache.solr.core.SolrCore.<init>(SolrCore.java:948)
        at org.apache.solr.core.SolrCore.<init>(SolrCore.java:863)
        at org.apache.solr.core.CoreContainer.createFromDescriptor(CoreContainer.java:1041)
        at org.apache.solr.core.CoreContainer.create(CoreContainer.java:952)
        at org.apache.solr.handler.admin.CoreAdminOperation.lambda$static$0(CoreAdminOperation.java:91)
        at org.apache.solr.handler.admin.CoreAdminOperation.execute(CoreAdminOperation.java:384)
        at org.apache.solr.handler.admin.CoreAdminHandler$CallInfo.call(CoreAdminHandler.java:389)
        at org.apache.solr.handler.admin.CoreAdminHandler.handleRequestBody(CoreAdminHandler.java:174)
        at org.apache.solr.handler.RequestHandlerBase.handleRequest(RequestHandlerBase.java:177)
        at org.apache.solr.servlet.HttpSolrCall.handleAdmin(HttpSolrCall.java:735)
        at org.apache.solr.servlet.HttpSolrCall.handleAdminRequest(HttpSolrCall.java:716)
        at org.apache.solr.servlet.HttpSolrCall.call(HttpSolrCall.java:497)
        at org.apache.solr.servlet.SolrDispatchFilter.doFilter(SolrDispatchFilter.java:382)
        at org.apache.solr.servlet.SolrDispatchFilter.doFilter(SolrDispatchFilter.java:326)
        at org.eclipse.jetty.servlet.ServletHandler$CachedChain.doFilter(ServletHandler.java:1759)
        at org.apache.solr.client.solrj.embedded.JettySolrRunner$DebugFilter.doFilter(JettySolrRunner.java:139)
        at org.eclipse.jetty.servlet.ServletHandler$CachedChain.doFilter(ServletHandler.java:1759)
        at org.eclipse.jetty.servlet.ServletHandler.doHandle(ServletHandler.java:582)
        at org.eclipse.jetty.server.session.SessionHandler.doHandle(SessionHandler.java:224)
        at org.eclipse.jetty.server.handler.ContextHandler.doHandle(ContextHandler.java:1180)
        at org.eclipse.jetty.servlet.ServletHandler.doScope(ServletHandler.java:512)
        at org.eclipse.jetty.server.session.SessionHandler.doScope(SessionHandler.java:185)
        at org.eclipse.jetty.server.handler.ContextHandler.doScope(ContextHandler.java:1112)
        at org.eclipse.jetty.server.handler.ScopedHandler.handle(ScopedHandler.java:141)
        at org.eclipse.jetty.server.handler.gzip.GzipHandler.handle(GzipHandler.java:426)
        at org.eclipse.jetty.server.handler.HandlerWrapper.handle(HandlerWrapper.java:134)
        at org.eclipse.jetty.server.Server.handle(Server.java:534)
        at org.eclipse.jetty.server.HttpChannel.handle(HttpChannel.java:320)
        at org.eclipse.jetty.server.HttpConnection.onFillable(HttpConnection.java:251)
        at org.eclipse.jetty.io.AbstractConnection$ReadCallback.succeeded(AbstractConnection.java:283)
        at org.eclipse.jetty.io.FillInterest.fillable(FillInterest.java:108)
        at org.eclipse.jetty.io.SelectChannelEndPoint$2.run(SelectChannelEndPoint.java:93)
        at org.eclipse.jetty.util.thread.strategy.ExecuteProduceConsume.executeProduceConsume(ExecuteProduceConsume.java:303)
        at org.eclipse.jetty.util.thread.strategy.ExecuteProduceConsume.produceConsume(ExecuteProduceConsume.java:148)
        at org.eclipse.jetty.util.thread.strategy.ExecuteProduceConsume.run(ExecuteProduceConsume.java:136)
        at org.eclipse.jetty.util.thread.QueuedThreadPool.runJob(QueuedThreadPool.java:671)
        at org.eclipse.jetty.util.thread.QueuedThreadPool$2.run(QueuedThreadPool.java:589)
        at java.lang.Thread.run(Thread.java:748)


        at __randomizedtesting.SeedInfo.seed([51712189B4462C8E]:0)
        at org.junit.Assert.fail(Assert.java:93)
        at org.junit.Assert.assertTrue(Assert.java:43)
        at org.junit.Assert.assertNull(Assert.java:551)
        at org.apache.solr.SolrTestCaseJ4.teardownTestCases(SolrTestCaseJ4.java:298)
        at sun.reflect.GeneratedMethodAccessor58.invoke(Unknown Source)
        at sun.reflect.DelegatingMethodAccessorImpl.invoke(DelegatingMethodAccessorImpl.java:43)
        at java.lang.reflect.Method.invoke(Method.java:498)
        at com.carrotsearch.randomizedtesting.RandomizedRunner.invoke(RandomizedRunner.java:1737)
        at com.carrotsearch.randomizedtesting.RandomizedRunner$7.evaluate(RandomizedRunner.java:897)
        at com.carrotsearch.randomizedtesting.rules.StatementAdapter.evaluate(StatementAdapter.java:36)
        at com.carrotsearch.randomizedtesting.rules.SystemPropertiesRestoreRule$1.evaluate(SystemPropertiesRestoreRule.java:57)
        at org.apache.lucene.util.AbstractBeforeAfterRule$1.evaluate(AbstractBeforeAfterRule.java:45)
        at com.carrotsearch.randomizedtesting.rules.StatementAdapter.evaluate(StatementAdapter.java:36)
        at org.apache.lucene.util.TestRuleStoreClassName$1.evaluate(TestRuleStoreClassName.java:41)
        at com.carrotsearch.randomizedtesting.rules.NoShadowingOrOverridesOnMethodsRule$1.evaluate(NoShadowingOrOverridesOnMethodsRule.java:40)
        at com.carrotsearch.randomizedtesting.rules.NoShadowingOrOverridesOnMethodsRule$1.evaluate(NoShadowingOrOverridesOnMethodsRule.java:40)
        at com.carrotsearch.randomizedtesting.rules.StatementAdapter.evaluate(StatementAdapter.java:36)
        at com.carrotsearch.randomizedtesting.rules.StatementAdapter.evaluate(StatementAdapter.java:36)
        at com.carrotsearch.randomizedtesting.rules.StatementAdapter.evaluate(StatementAdapter.java:36)
        at org.apache.lucene.util.TestRuleAssertionsRequired$1.evaluate(TestRuleAssertionsRequired.java:53)
        at org.apache.lucene.util.TestRuleMarkFailure$1.evaluate(TestRuleMarkFailure.java:47)
        at org.apache.lucene.util.TestRuleIgnoreAfterMaxFailures$1.evaluate(TestRuleIgnoreAfterMaxFailures.java:64)
        at org.apache.lucene.util.TestRuleIgnoreTestSuites$1.evaluate(TestRuleIgnoreTestSuites.java:54)
        at com.carrotsearch.randomizedtesting.rules.StatementAdapter.evaluate(StatementAdapter.java:36)
        at com.carrotsearch.randomizedtesting.ThreadLeakControl$StatementRunner.run(ThreadLeakControl.java:368)
        at java.lang.Thread.run(Thread.java:748)




Build Log:
[...truncated 13987 lines...]
   [junit4] Suite: org.apache.solr.util.TestSolrCLIRunExample
   [junit4]   2> Creating dataDir: /export/home/jenkins/workspace/Lucene-Solr-master-Solaris/solr/build/solr-core/test/J0/temp/solr.util.TestSolrCLIRunExample_51712189B4462C8E-001/init-core-data-001
   [junit4]   2> 5023181 WARN  (SUITE-TestSolrCLIRunExample-seed#[51712189B4462C8E]-worker) [    ] o.a.s.SolrTestCaseJ4 startTrackingSearchers: numOpens=11 numCloses=11
   [junit4]   2> 5023181 INFO  (SUITE-TestSolrCLIRunExample-seed#[51712189B4462C8E]-worker) [    ] o.a.s.SolrTestCaseJ4 Using PointFields (NUMERIC_POINTS_SYSPROP=true) w/NUMERIC_DOCVALUES_SYSPROP=false
   [junit4]   2> 5023183 INFO  (SUITE-TestSolrCLIRunExample-seed#[51712189B4462C8E]-worker) [    ] o.a.s.SolrTestCaseJ4 Randomized ssl (false) and clientAuth (false) via: @org.apache.solr.SolrTestCaseJ4$SuppressSSL(bugUrl=https://issues.apache.org/jira/browse/SOLR-5776)
   [junit4]   2> 5023183 INFO  (SUITE-TestSolrCLIRunExample-seed#[51712189B4462C8E]-worker) [    ] o.a.s.SolrTestCaseJ4 SecureRandom sanity checks: test.solr.allowed.securerandom=null & java.security.egd=file:/dev/./urandom
   [junit4]   2> 5023186 INFO  (TEST-TestSolrCLIRunExample.testSchemalessExample-seed#[51712189B4462C8E]) [    ] o.a.s.SolrTestCaseJ4 ###Starting testSchemalessExample
   [junit4]   2> 5023187 INFO  (TEST-TestSolrCLIRunExample.testSchemalessExample-seed#[51712189B4462C8E]) [    ] o.a.s.u.TestSolrCLIRunExample Selected port 64900 to start schemaless example Solr instance on ...
   [junit4]   2> 5023243 INFO  (Thread-11976) [    ] o.e.j.s.Server jetty-9.3.20.v20170531
   [junit4]   2> 5023271 INFO  (Thread-11976) [    ] o.e.j.s.h.ContextHandler Started o.e.j.s.ServletContextHandler@5faada2c{/solr,null,AVAILABLE}
   [junit4]   2> 5023271 INFO  (Thread-11976) [    ] o.e.j.s.AbstractConnector Started ServerConnector@6481bbeb{HTTP/1.1,[http/1.1]}{127.0.0.1:64900}
   [junit4]   2> 5023271 INFO  (Thread-11976) [    ] o.e.j.s.Server Started @5029337ms
   [junit4]   2> 5023271 INFO  (Thread-11976) [    ] o.a.s.c.s.e.JettySolrRunner Jetty properties: {hostContext=/solr, hostPort=64900}
   [junit4]   2> 5023272 ERROR (Thread-11976) [    ] o.a.s.u.StartupLoggingUtils Missing Java Option solr.log.dir. Logging may be missing or incomplete.
   [junit4]   2> 5023272 INFO  (Thread-11976) [    ] o.a.s.s.SolrDispatchFilter  ___      _       Welcome to Apache Solr? version 8.0.0
   [junit4]   2> 5023272 INFO  (Thread-11976) [    ] o.a.s.s.SolrDispatchFilter / __| ___| |_ _   Starting in standalone mode on port 64900
   [junit4]   2> 5023272 INFO  (Thread-11976) [    ] o.a.s.s.SolrDispatchFilter \__ \/ _ \ | '_|  Install dir: null
   [junit4]   2> 5023272 INFO  (Thread-11976) [    ] o.a.s.s.SolrDispatchFilter |___/\___/_|_|    Start time: 2017-12-07T00:45:35.712Z
   [junit4]   2> 5023272 INFO  (Thread-11976) [    ] o.a.s.c.SolrXmlConfig Loading container configuration from /export/home/jenkins/workspace/Lucene-Solr-master-Solaris/solr/build/solr-core/test/J0/temp/solr.util.TestSolrCLIRunExample_51712189B4462C8E-001/tempDir-001/schemaless/solr/solr.xml
   [junit4]   2> 5023279 INFO  (Thread-11976) [    ] o.a.s.c.SolrXmlConfig MBean server found: com.sun.jmx.mbeanserver.JmxMBeanServer@6963c534, but no JMX reporters were configured - adding default JMX reporter.
   [junit4]   2> 5023333 INFO  (Thread-11976) [    ] o.a.s.m.r.SolrJmxReporter JMX monitoring for 'solr.node' (registry 'solr.node') enabled at server: com.sun.jmx.mbeanserver.JmxMBeanServer@6963c534
   [junit4]   2> 5023341 INFO  (Thread-11976) [    ] o.a.s.m.r.SolrJmxReporter JMX monitoring for 'solr.jvm' (registry 'solr.jvm') enabled at server: com.sun.jmx.mbeanserver.JmxMBeanServer@6963c534
   [junit4]   2> 5023341 INFO  (Thread-11976) [    ] o.a.s.m.r.SolrJmxReporter JMX monitoring for 'solr.jetty' (registry 'solr.jetty') enabled at server: com.sun.jmx.mbeanserver.JmxMBeanServer@6963c534
   [junit4]   2> 5023342 INFO  (Thread-11976) [    ] o.a.s.c.CorePropertiesLocator Found 0 core definitions underneath /export/home/jenkins/workspace/Lucene-Solr-master-Solaris/solr/build/solr-core/test/J0/temp/solr.util.TestSolrCLIRunExample_51712189B4462C8E-001/tempDir-001/schemaless/solr
   [junit4]   2> 5023467 INFO  (qtp890539521-43203) [    ] o.a.s.s.HttpSolrCall [admin] webapp=null path=/admin/info/system params={wt=json} status=0 QTime=114
   [junit4]   2> 5023474 INFO  (qtp890539521-43206) [    ] o.a.s.c.TransientSolrCoreCacheDefault Allocating transient cache for 2147483647 transient cores
   [junit4]   2> 5023474 INFO  (qtp890539521-43206) [    ] o.a.s.s.HttpSolrCall [admin] webapp=null path=/admin/cores params={core=gettingstarted&action=STATUS&wt=json} status=0 QTime=0
   [junit4]   2> 5023696 WARN  (qtp890539521-43198) [    x:gettingstarted] o.a.s.c.SolrConfig Couldn't add files from /export/home/jenkins/workspace/Lucene-Solr-master-Solaris/solr/build/solr-core/test/J0/temp/solr.util.TestSolrCLIRunExample_51712189B4462C8E-001/tempDir-001/schemaless/solr/gettingstarted/../../../../contrib/extraction/lib filtered by .*\.jar to classpath: /export/home/jenkins/workspace/Lucene-Solr-master-Solaris/solr/build/solr-core/test/J0/temp/solr.util.TestSolrCLIRunExample_51712189B4462C8E-001/tempDir-001/schemaless/solr/gettingstarted/../../../../contrib/extraction/lib
   [junit4]   2> 5023697 WARN  (qtp890539521-43198) [    x:gettingstarted] o.a.s.c.SolrConfig Couldn't add files from /export/home/jenkins/workspace/Lucene-Solr-master-Solaris/solr/build/solr-core/test/J0/temp/solr.util.TestSolrCLIRunExample_51712189B4462C8E-001/tempDir-001/schemaless/solr/gettingstarted/../../../../dist filtered by solr-cell-\d.*\.jar to classpath: /export/home/jenkins/workspace/Lucene-Solr-master-Solaris/solr/build/solr-core/test/J0/temp/solr.util.TestSolrCLIRunExample_51712189B4462C8E-001/tempDir-001/schemaless/solr/gettingstarted/../../../../dist
   [junit4]   2> 5023697 WARN  (qtp890539521-43198) [    x:gettingstarted] o.a.s.c.SolrConfig Couldn't add files from /export/home/jenkins/workspace/Lucene-Solr-master-Solaris/solr/build/solr-core/test/J0/temp/solr.util.TestSolrCLIRunExample_51712189B4462C8E-001/tempDir-001/schemaless/solr/gettingstarted/../../../../contrib/clustering/lib filtered by .*\.jar to classpath: /export/home/jenkins/workspace/Lucene-Solr-master-Solaris/solr/build/solr-core/test/J0/temp/solr.util.TestSolrCLIRunExample_51712189B4462C8E-001/tempDir-001/schemaless/solr/gettingstarted/../../../../contrib/clustering/lib
   [junit4]   2> 5023697 WARN  (qtp890539521-43198) [    x:gettingstarted] o.a.s.c.SolrConfig Couldn't add files from /export/home/jenkins/workspace/Lucene-Solr-master-Solaris/solr/build/solr-core/test/J0/temp/solr.util.TestSolrCLIRunExample_51712189B4462C8E-001/tempDir-001/schemaless/solr/gettingstarted/../../../../dist filtered by solr-clustering-\d.*\.jar to classpath: /export/home/jenkins/workspace/Lucene-Solr-master-Solaris/solr/build/solr-core/test/J0/temp/solr.util.TestSolrCLIRunExample_51712189B4462C8E-001/tempDir-001/schemaless/solr/gettingstarted/../../../../dist
   [junit4]   2> 5023697 WARN  (qtp890539521-43198) [    x:gettingstarted] o.a.s.c.SolrConfig Couldn't add files from /export/home/jenkins/workspace/Lucene-Solr-master-Solaris/solr/build/solr-core/test/J0/temp/solr.util.TestSolrCLIRunExample_51712189B4462C8E-001/tempDir-001/schemaless/solr/gettingstarted/../../../../contrib/langid/lib filtered by .*\.jar to classpath: /export/home/jenkins/workspace/Lucene-Solr-master-Solaris/solr/build/solr-core/test/J0/temp/solr.util.TestSolrCLIRunExample_51712189B4462C8E-001/tempDir-001/schemaless/solr/gettingstarted/../../../../contrib/langid/lib
   [junit4]   2> 5023698 WARN  (qtp890539521-43198) [    x:gettingstarted] o.a.s.c.SolrConfig Couldn't add files from /export/home/jenkins/workspace/Lucene-Solr-master-Solaris/solr/build/solr-core/test/J0/temp/solr.util.TestSolrCLIRunExample_51712189B4462C8E-001/tempDir-001/schemaless/solr/gettingstarted/../../../../dist filtered by solr-langid-\d.*\.jar to classpath: /export/home/jenkins/workspace/Lucene-Solr-master-Solaris/solr/build/solr-core/test/J0/temp/solr.util.TestSolrCLIRunExample_51712189B4462C8E-001/tempDir-001/schemaless/solr/gettingstarted/../../../../dist
   [junit4]   2> 5023698 WARN  (qtp890539521-43198) [    x:gettingstarted] o.a.s.c.SolrConfig Couldn't add files from /export/home/jenkins/workspace/Lucene-Solr-master-Solaris/solr/build/solr-core/test/J0/temp/solr.util.TestSolrCLIRunExample_51712189B4462C8E-001/tempDir-001/schemaless/solr/gettingstarted/../../../../contrib/velocity/lib filtered by .*\.jar to classpath: /export/home/jenkins/workspace/Lucene-Solr-master-Solaris/solr/build/solr-core/test/J0/temp/solr.util.TestSolrCLIRunExample_51712189B4462C8E-001/tempDir-001/schemaless/solr/gettingstarted/../../../../contrib/velocity/lib
   [junit4]   2> 5023698 WARN  (qtp890539521-43198) [    x:gettingstarted] o.a.s.c.SolrConfig Couldn't add files from /export/home/jenkins/workspace/Lucene-Solr-master-Solaris/solr/build/solr-core/test/J0/temp/solr.util.TestSolrCLIRunExample_51712189B4462C8E-001/tempDir-001/schemaless/solr/gettingstarted/../../../../dist filtered by solr-velocity-\d.*\.jar to classpath: /export/home/jenkins/workspace/Lucene-Solr-master-Solaris/solr/build/solr-core/test/J0/temp/solr.util.TestSolrCLIRunExample_51712189B4462C8E-001/tempDir-001/schemaless/solr/gettingstarted/../../../../dist
   [junit4]   2> 5024283 ERROR (Thread-11989) [    ] o.a.s.u.StartupLoggingUtils Missing Java Option solr.log.dir. Logging may be missing or incomplete.
   [junit4]   2> 5024485 WARN  (coreLoadExecutor-14736-thread-1) [    x:gettingstarted] o.a.s.c.SolrConfig Couldn't add files from /export/home/jenkins/workspace/Lucene-Solr-master-Solaris/solr/build/solr-core/test/J0/temp/solr.util.TestSolrCLIRunExample_51712189B4462C8E-001/tempDir-001/schemaless/solr/gettingstarted/../../../../contrib/extraction/lib filtered by .*\.jar to classpath: /export/home/jenkins/workspace/Lucene-Solr-master-Solaris/solr/build/solr-core/test/J0/temp/solr.util.TestSolrCLIRunExample_51712189B4462C8E-001/tempDir-001/schemaless/solr/gettingstarted/../../../../contrib/extraction/lib
   [junit4]   2> 5024485 WARN  (coreLoadExecutor-14736-thread-1) [    x:gettingstarted] o.a.s.c.SolrConfig Couldn't add files from /export/home/jenkins/workspace/Lucene-Solr-master-Solaris/solr/build/solr-core/test/J0/temp/solr.util.TestSolrCLIRunExample_51712189B4462C8E-001/tempDir-001/schemaless/solr/gettingstarted/../../../../dist filtered by solr-cell-\d.*\.jar to classpath: /export/home/jenkins/workspace/Lucene-Solr-master-Solaris/solr/build/solr-core/test/J0/temp/solr.util.TestSolrCLIRunExample_51712189B4462C8E-001/tempDir-001/schemaless/solr/gettingstarted/../../../../dist
   [junit4]   2> 5024486 WARN  (coreLoadExecutor-14736-thread-1) [    x:gettingstarted] o.a.s.c.SolrConfig Couldn't add files from /export/home/jenkins/workspace/Lucene-Solr-master-Solaris/solr/build/solr-core/test/J0/temp/solr.util.TestSolrCLIRunExample_51712189B4462C8E-001/tempDir-001/schemaless/solr/gettingstarted/../../../../contrib/clustering/lib filtered by .*\.jar to classpath: /export/home/jenkins/workspace/Lucene-Solr-master-Solaris/solr/build/solr-core/test/J0/temp/solr.util.TestSolrCLIRunExample_51712189B4462C8E-001/tempDir-001/schemaless/solr/gettingstarted/../../../../contrib/clustering/lib
   [junit4]   2> 5024486 WARN  (coreLoadExecutor-14736-thread-1) [    x:gettingstarted] o.a.s.c.SolrConfig Couldn't add files from /export/home/jenkins/workspace/Lucene-Solr-master-Solaris/solr/build/solr-core/test/J0/temp/solr.util.TestSolrCLIRunExample_51712189B4462C8E-001/tempDir-001/schemaless/solr/gettingstarted/../../../../dist filtered by solr-clustering-\d.*\.jar to classpath: /export/home/jenkins/workspace/Lucene-Solr-master-Solaris/solr/build/solr-core/test/J0/temp/solr.util.TestSolrCLIRunExample_51712189B4462C8E-001/tempDir-001/schemaless/solr/gettingstarted/../../../../dist
   [junit4]   2> 5024486 WARN  (coreLoadExecutor-14736-thread-1) [    x:gettingstarted] o.a.s.c.SolrConfig Couldn't add files from /export/home/jenkins/workspace/Lucene-Solr-master-Solaris/solr/build/solr-core/test/J0/temp/solr.util.TestSolrCLIRunExample_51712189B4462C8E-001/tempDir-001/schemaless/solr/gettingstarted/../../../../contrib/langid/lib filtered by .*\.jar to classpath: /export/home/jenkins/workspace/Lucene-Solr-master-Solaris/solr/build/solr-core/test/J0/temp/solr.util.TestSolrCLIRunExample_51712189B4462C8E-001/tempDir-001/schemaless/solr/gettingstarted/../../../../contrib/langid/lib
   [junit4]   2> 5024486 WARN  (coreLoadExecutor-14736-thread-1) [    x:gettingstarted] o.a.s.c.SolrConfig Couldn't add files from /export/home/jenkins/workspace/Lucene-Solr-master-Solaris/solr/build/solr-core/test/J0/temp/solr.util.TestSolrCLIRunExample_51712189B4462C8E-001/tempDir-001/schemaless/solr/gettingstarted/../../../../dist filtered by solr-langid-\d.*\.jar to classpath: /export/home/jenkins/workspace/Lucene-Solr-master-Solaris/solr/build/solr-core/test/J0/temp/solr.util.TestSolrCLIRunExample_51712189B4462C8E-001/tempDir-001/schemaless/solr/gettingstarted/../../../../dist
   [junit4]   2> 5024487 WARN  (coreLoadExecutor-14736-thread-1) [    x:gettingstarted] o.a.s.c.SolrConfig Couldn't add files from /export/home/jenkins/workspace/Lucene-Solr-master-Solaris/solr/build/solr-core/test/J0/temp/solr.util.TestSolrCLIRunExample_51712189B4462C8E-001/tempDir-001/schemaless/solr/gettingstarted/../../../../contrib/velocity/lib filtered by .*\.jar to classpath: /export/home/jenkins/workspace/Lucene-Solr-master-Solaris/solr/build/solr-core/test/J0/temp/solr.util.TestSolrCLIRunExample_51712189B4462C8E-001/tempDir-001/schemaless/solr/gettingstarted/../../../../contrib/velocity/lib
   [junit4]   2> 5024487 WARN  (coreLoadExecutor-14736-thread-1) [    x:gettingstarted] o.a.s.c.SolrConfig Couldn't add files from /export/home/jenkins/workspace/Lucene-Solr-master-Solaris/solr/build/solr-core/test/J0/temp/solr.util.TestSolrCLIRunExample_51712189B4462C8E-001/tempDir-001/schemaless/solr/gettingstarted/../../../../dist filtered by solr-velocity-\d.*\.jar to classpath: /export/home/jenkins/workspace/Lucene-Solr-master-Solaris/solr/build/solr-core/test/J0/temp/solr.util.TestSolrCLIRunExample_51712189B4462C8E-001/tempDir-001/schemaless/solr/gettingstarted/../../../../dist
   [junit4]   2> 5029545 ERROR (Thread-11999) [    ] o.a.z.s.ZooKeeperServer ZKShutdownHandler is not registered, so ZooKeeper server won't take any action on ERROR or SHUTDOWN server state changes
   [junit4]   2> 5029661 ERROR (jetty-launcher-9835-thread-1) [    ] o.a.s.u.StartupLoggingUtils Missing Java Option solr.log.dir. Logging may be missing or incomplete.
   [junit4]   2> 5030892 WARN  (NIOServerCxn.Factory:0.0.0.0/0.0.0.0:0) [    ] o.a.z.s.NIOServerCnxn caught end of stream exception
   [junit4]   2> EndOfStreamException: Unable to read additional data from client sessionid 0x1602e6f6ae10004, likely client has closed socket
   [junit4]   2> at org.apache.zookeeper.server.NIOServerCnxn.doIO(NIOServerCnxn.java:239)
   [junit4]   2> at org.apache.zookeeper.server.NIOServerCnxnFactory.run(NIOServerCnxnFactory.java:203)
   [junit4]   2> at java.lang.Thread.run(Thread.java:748)
   [junit4]   2> 5030967 WARN  (NIOServerCxn.Factory:0.0.0.0/0.0.0.0:0) [    ] o.a.z.s.NIOServerCnxn caught end of stream exception
   [junit4]   2> EndOfStreamException: Unable to read additional data from client sessionid 0x1602e6f6ae10005, likely client has closed socket
   [junit4]   2> at org.apache.zookeeper.server.NIOServerCnxn.doIO(NIOServerCnxn.java:239)
   [junit4]   2> at org.apache.zookeeper.server.NIOServerCnxnFactory.run(NIOServerCnxnFactory.java:203)
   [junit4]   2> at java.lang.Thread.run(Thread.java:748)
   [junit4]   2> 5031661 WARN  (OverseerThreadFactory-14751-thread-1-processing-n:localhost:55354_solr) [n:localhost:55354_solr    ] o.a.s.c.CreateCollectionCmd Specified number of replicas of 2 on collection testCloudExamplePrompt is higher than the number of Solr instances currently live or live and part of your createNodeSet(1). It's unusual to run two replica of the same slice on the same Solr-instance.
   [junit4]   2> 5033089 WARN  (qtp1517104550-43262) [n:localhost:55354_solr c:testCloudExamplePrompt s:shard1 r:core_node3 x:testCloudExamplePrompt_shard1_replica_n1] o.a.s.c.SolrConfig Couldn't add files from /export/home/jenkins/workspace/Lucene-Solr-master-Solaris/solr/build/solr-core/test/J0/temp/solr.util.TestSolrCLIRunExample_51712189B4462C8E-001/tempDir-003/node1/testCloudExamplePrompt_shard1_replica_n1/../../../../contrib/extraction/lib filtered by .*\.jar to classpath: /export/home/jenkins/workspace/Lucene-Solr-master-Solaris/solr/build/solr-core/test/J0/temp/solr.util.TestSolrCLIRunExample_51712189B4462C8E-001/tempDir-003/node1/testCloudExamplePrompt_shard1_replica_n1/../../../../contrib/extraction/lib
   [junit4]   2> 5033089 WARN  (qtp1517104550-43262) [n:localhost:55354_solr c:testCloudExamplePrompt s:shard1 r:core_node3 x:testCloudExamplePrompt_shard1_replica_n1] o.a.s.c.SolrConfig Couldn't add files from /export/home/jenkins/workspace/Lucene-Solr-master-Solaris/solr/build/solr-core/test/J0/temp/solr.util.TestSolrCLIRunExample_51712189B4462C8E-001/tempDir-003/node1/testCloudExamplePrompt_shard1_replica_n1/../../../../dist filtered by solr-cell-\d.*\.jar to classpath: /export/home/jenkins/workspace/Lucene-Solr-master-Solaris/solr/build/solr-core/test/J0/temp/solr.util.TestSolrCLIRunExample_51712189B4462C8E-001/tempDir-003/node1/testCloudExamplePrompt_shard1_replica_n1/../../../../dist
   [junit4]   2> 5033094 WARN  (qtp1517104550-43262) [n:localhost:55354_solr c:testCloudExamplePrompt s:shard1 r:core_node3 x:testCloudExamplePrompt_shard1_replica_n1] o.a.s.c.SolrConfig Couldn't add files from /export/home/jenkins/workspace/Lucene-Solr-master-Solaris/solr/build/solr-core/test/J0/temp/solr.util.TestSolrCLIRunExample_51712189B4462C8E-001/tempDir-003/node1/testCloudExamplePrompt_shard1_replica_n1/../../../../contrib/clustering/lib filtered by .*\.jar to classpath: /export/home/jenkins/workspace/Lucene-Solr-master-Solaris/solr/build/solr-core/test/J0/temp/solr.util.TestSolrCLIRunExample_51712189B4462C8E-001/tempDir-003/node1/testCloudExamplePrompt_shard1_replica_n1/../../../../contrib/clustering/lib
   [junit4]   2> 5033094 WARN  (qtp1517104550-43262) [n:localhost:55354_solr c:testCloudExamplePrompt s:shard1 r:core_node3 x:testCloudExamplePrompt_shard1_replica_n1] o.a.s.c.SolrConfig Couldn't add files from /export/home/jenkins/workspace/Lucene-Solr-master-Solaris/solr/build/solr-core/test/J0/temp/solr.util.TestSolrCLIRunExample_51712189B4462C8E-001/tempDir-003/node1/testCloudExamplePrompt_shard1_replica_n1/../../../../dist filtered by solr-clustering-\d.*\.jar to classpath: /export/home/jenkins/workspace/Lucene-Solr-master-Solaris/solr/build/solr-core/test/J0/temp/solr.util.TestSolrCLIRunExample_51712189B4462C8E-001/tempDir-003/node1/testCloudExamplePrompt_shard1_replica_n1/../../../../dist
   [junit4]   2> 5033094 WARN  (qtp1517104550-43262) [n:localhost:55354_solr c:testCloudExamplePrompt s:shard1 r:core_node3 x:testCloudExamplePrompt_shard1_replica_n1] o.a.s.c.SolrConfig Couldn't add files from /export/home/jenkins/workspace/Lucene-Solr-master-Solaris/solr/build/solr-core/test/J0/temp/solr.util.TestSolrCLIRunExample_51712189B4462C8E-001/tempDir-003/node1/testCloudExamplePrompt_shard1_replica_n1/../../../../contrib/langid/lib filtered by .*\.jar to classpath: /export/home/jenkins/workspace/Lucene-Solr-master-Solaris/solr/build/solr-core/test/J0/temp/solr.util.TestSolrCLIRunExample_51712189B4462C8E-001/tempDir-003/node1/testCloudExamplePrompt_shard1_replica_n1/../../../../contrib/langid/lib
   [junit4]   2> 5033094 WARN  (qtp1517104550-43262) [n:localhost:55354_solr c:testCloudExamplePrompt s:shard1 r:core_node3 x:testCloudExamplePrompt_shard1_replica_n1] o.a.s.c.SolrConfig Couldn't add files from /export/home/jenkins/workspace/Lucene-Solr-master-Solaris/solr/build/solr-core/test/J0/temp/solr.util.TestSolrCLIRunExample_51712189B4462C8E-001/tempDir-003/node1/testCloudExamplePrompt_shard1_replica_n1/../../../../dist filtered by solr-langid-\d.*\.jar to classpath: /export/home/jenkins/workspace/Lucene-Solr-master-Solaris/solr/build/solr-core/test/J0/temp/solr.util.TestSolrCLIRunExample_51712189B4462C8E-001/tempDir-003/node1/testCloudExamplePrompt_shard1_replica_n1/../../../../dist
   [junit4]   2> 5033095 WARN  (qtp1517104550-43262) [n:localhost:55354_solr c:testCloudExamplePrompt s:shard1 r:core_node3 x:testCloudExamplePrompt_shard1_replica_n1] o.a.s.c.SolrConfig Couldn't add files from /export/home/jenkins/workspace/Lucene-Solr-master-Solaris/solr/build/solr-core/test/J0/temp/solr.util.TestSolrCLIRunExample_51712189B4462C8E-001/tempDir-003/node1/testCloudExamplePrompt_shard1_replica_n1/../../../../contrib/velocity/lib filtered by .*\.jar to classpath: /export/home/jenkins/workspace/Lucene-Solr-master-Solaris/solr/build/solr-core/test/J0/temp/solr.util.TestSolrCLIRunExample_51712189B4462C8E-001/tempDir-003/node1/testCloudExamplePrompt_shard1_replica_n1/../../../../contrib/velocity/lib
   [junit4]   2> 5033095 WARN  (qtp1517104550-43262) [n:localhost:55354_solr c:testCloudExamplePrompt s:shard1 r:core_node3 x:testCloudExamplePrompt_shard1_replica_n1] o.a.s.c.SolrConfig Couldn't add files from /export/home/jenkins/workspace/Lucene-Solr-master-Solaris/solr/build/solr-core/test/J0/temp/solr.util.TestSolrCLIRunExample_51712189B4462C8E-001/tempDir-003/node1/testCloudExamplePrompt_shard1_replica_n1/../../../../dist filtered by solr-velocity-\d.*\.jar to classpath: /export/home/jenkins/workspace/Lucene-Solr-master-Solaris/solr/build/solr-core/test/J0/temp/solr.util.TestSolrCLIRunExample_51712189B4462C8E-001/tempDir-003/node1/testCloudExamplePrompt_shard1_replica_n1/../../../../dist
   [junit4]   2> 5033113 WARN  (qtp1517104550-43261) [n:localhost:55354_solr c:testCloudExamplePrompt s:shard2 r:core_node7 x:testCloudExamplePrompt_shard2_replica_n4] o.a.s.c.SolrConfig Couldn't add files from /export/home/jenkins/workspace/Lucene-Solr-master-Solaris/solr/build/solr-core/test/J0/temp/solr.util.TestSolrCLIRunExample_51712189B4462C8E-001/tempDir-003/node1/testCloudExamplePrompt_shard2_replica_n4/../../../../contrib/extraction/lib filtered by .*\.jar to classpath: /export/home/jenkins/workspace/Lucene-Solr-master-Solaris/solr/build/solr-core/test/J0/temp/solr.util.TestSolrCLIRunExample_51712189B4462C8E-001/tempDir-003/node1/testCloudExamplePrompt_shard2_replica_n4/../../../../contrib/extraction/lib
   [junit4]   2> 5033119 WARN  (qtp1517104550-43255) [n:localhost:55354_solr c:testCloudExamplePrompt s:shard1 r:core_node5 x:testCloudExamplePrompt_shard1_replica_n2] o.a.s.c.SolrConfig Couldn't add files from /export/home/jenkins/workspace/Lucene-Solr-master-Solaris/solr/build/solr-core/test/J0/temp/solr.util.TestSolrCLIRunExample_51712189B4462C8E-001/tempDir-003/node1/testCloudExamplePrompt_shard1_replica_n2/../../../../contrib/extraction/lib filtered by .*\.jar to classpath: /export/home/jenkins/workspace/Lucene-Solr-master-Solaris/solr/build/solr-core/test/J0/temp/solr.util.TestSolrCLIRunExample_51712189B4462C8E-001/tempDir-003/node1/testCloudExamplePrompt_shard1_replica_n2/../../../../contrib/extraction/lib
   [junit4]   2> 5033120 WARN  (qtp1517104550-43255) [n:localhost:55354_solr c:testCloudExamplePrompt s:shard1 r:core_node5 x:testCloudExamplePrompt_shard1_replica_n2] o.a.s.c.SolrConfig Couldn't add files from /export/home/jenkins/workspace/Lucene-Solr-master-Solaris/solr/build/solr-core/test/J0/temp/solr.util.TestSolrCLIRunExample_51712189B4462C8E-001/tempDir-003/node1/testCloudExamplePrompt_shard1_replica_n2/../../../../dist filtered by solr-cell-\d.*\.jar to classpath: /export/home/jenkins/workspace/Lucene-Solr-master-Solaris/solr/build/solr-core/test/J0/temp/solr.util.TestSolrCLIRunExample_51712189B4462C8E-001/tempDir-003/node1/testCloudExamplePrompt_shard1_replica_n2/../../../../dist
   [junit4]   2> 5033120 WARN  (qtp1517104550-43255) [n:localhost:55354_solr c:testCloudExamplePrompt s:shard1 r:core_node5 x:testCloudExamplePrompt_shard1_replica_n2] o.a.s.c.SolrConfig Couldn't add files from /export/home/jenkins/workspace/Lucene-Solr-master-Solaris/solr/build/solr-core/test/J0/temp/solr.util.TestSolrCLIRunExample_51712189B4462C8E-001/tempDir-003/node1/testCloudExamplePrompt_shard1_replica_n2/../../../../contrib/clustering/lib filtered by .*\.jar to classpath: /export/home/jenkins/workspace/Lucene-Solr-master-Solaris/solr/build/solr-core/test/J0/temp/solr.util.TestSolrCLIRunExample_51712189B4462C8E-001/tempDir-003/node1/testCloudExamplePrompt_shard1_replica_n2/../../../../contrib/clustering/lib
   [junit4]   2> 5033120 WARN  (qtp1517104550-43255) [n:localhost:55354_solr c:testCloudExamplePrompt s:shard1 r:core_node5 x:testCloudExamplePrompt_shard1_replica_n2] o.a.s.c.SolrConfig Couldn't add files from /export/home/jenkins/workspace/Lucene-Solr-master-Solaris/solr/build/solr-core/test/J0/temp/solr.util.TestSolrCLIRunExample_51712189B4462C8E-001/tempDir-003/node1/testCloudExamplePrompt_shard1_replica_n2/../../../../dist filtered by solr-clustering-\d.*\.jar to classpath: /export/home/jenkins/workspace/Lucene-Solr-master-Solaris/solr/build/solr-core/test/J0/temp/solr.util.TestSolrCLIRunExample_51712189B4462C8E-001/tempDir-003/node1/testCloudExamplePrompt_shard1_replica_n2/../../../../dist
   [junit4]   2> 5033120 WARN  (qtp1517104550-43258) [n:localhost:55354_solr c:testCloudExamplePrompt s:shard2 r:core_node8 x:testCloudExamplePrompt_shard2_replica_n6] o.a.s.c.SolrConfig Couldn't add files from /export/home/jenkins/workspace/Lucene-Solr-master-Solaris/solr/build/solr-core/test/J0/temp/solr.util.TestSolrCLIRunExample_51712189B4462C8E-001/tempDir-003/node1/testCloudExamplePrompt_shard2_replica_n6/../../../../contrib/extraction/lib filtered by .*\.jar to classpath: /export/home/jenkins/workspace/Lucene-Solr-master-Solaris/solr/build/solr-core/test/J0/temp/solr.util.TestSolrCLIRunExample_51712189B4462C8E-001/tempDir-003/node1/testCloudExamplePrompt_shard2_replica_n6/../../../../contrib/extraction/lib
   [junit4]   2> 5033120 WARN  (qtp1517104550-43255) [n:localhost:55354_solr c:testCloudExamplePrompt s:shard1 r:core_node5 x:testCloudExamplePrompt_shard1_replica_n2] o.a.s.c.SolrConfig Couldn't add files from /export/home/jenkins/workspace/Lucene-Solr-master-Solaris/solr/build/solr-core/test/J0/temp/solr.util.TestSolrCLIRunExample_51712189B4462C8E-001/tempDir-003/node1/testCloudExamplePrompt_shard1_replica_n2/../../../../contrib/langid/lib filtered by .*\.jar to classpath: /export/home/jenkins/workspace/Lucene-Solr-master-Solaris/solr/build/solr-core/test/J0/temp/solr.util.TestSolrCLIRunExample_51712189B4462C8E-001/tempDir-003/node1/testCloudExamplePrompt_shard1_replica_n2/../../../../contrib/langid/lib
   [junit4]   2> 5033120 WARN  (qtp1517104550-43258) [n:localhost:55354_solr c:testCloudExamplePrompt s:shard2 r:core_node8 x:testCloudExamplePrompt_shard2_replica_n6] o.a.s.c.SolrConfig Couldn't add files from /export/home/jenkins/workspace/Lucene-Solr-master-Solaris/solr/build/solr-core/test/J0/temp/solr.util.TestSolrCLIRunExample_51712189B4462C8E-001/tempDir-003/node1/testCloudExamplePrompt_shard2_replica_n6/../../../../dist filtered by solr-cell-\d.*\.jar to classpath: /export/home/jenkins/workspace/Lucene-Solr-master-Solaris/solr/build/solr-core/test/J0/temp/solr.util.TestSolrCLIRunExample_51712189B4462C8E-001/tempDir-003/node1/testCloudExamplePrompt_shard2_replica_n6/../../../../dist
   [junit4]   2> 5033121 WARN  (qtp1517104550-43255) [n:localhost:55354_solr c:testCloudExamplePrompt s:shard1 r:core_node5 x:testCloudExamplePrompt_shard1_replica_n2] o.a.s.c.SolrConfig Couldn't add files from /export/home/jenkins/workspace/Lucene-Solr-master-Solaris/solr/build/solr-core/test/J0/temp/solr.util.TestSolrCLIRunExample_51712189B4462C8E-001/tempDir-003/node1/testCloudExamplePrompt_shard1_replica_n2/../../../../dist filtered by solr-langid-\d.*\.jar to classpath: /export/home/jenkins/workspace/Lucene-Solr-master-Solaris/solr/build/solr-core/test/J0/temp/solr.util.TestSolrCLIRunExample_51712189B4462C8E-001/tempDir-003/node1/testCloudExamplePrompt_shard1_replica_n2/../../../../dist
   [junit4]   2> 5033121 WARN  (qtp1517104550-43258) [n:localhost:55354_solr c:testCloudExamplePrompt s:shard2 r:core_node8 x:testCloudExamplePrompt_shard2_replica_n6] o.a.s.c.SolrConfig Couldn't add files from /export/home/jenkins/workspace/Lucene-Solr-master-Solaris/solr/build/solr-core/test/J0/temp/solr.util.TestSolrCLIRunExample_51712189B4462C8E-001/tempDir-003/node1/testCloudExamplePrompt_shard2_replica_n6/../../../../contrib/clustering/lib filtered by .*\.jar to classpath: /export/home/jenkins/workspace/Lucene-Solr-master-Solaris/solr/build/solr-core/test/J0/temp/solr.util.TestSolrCLIRunExample_51712189B4462C8E-001/tempDir-003/node1/testCloudExamplePrompt_shard2_replica_n6/../../../../contrib/clustering/lib
   [junit4]   2> 5033121 WARN  (qtp1517104550-43255) [n:localhost:55354_solr c:testCloudExamplePrompt s:shard1 r:core_node5 x:testCloudExamplePrompt_shard1_replica_n2] o.a.s.c.SolrConfig Couldn't add files from /export/home/jenkins/workspace/Lucene-Solr-master-Solaris/solr/build/solr-core/test/J0/temp/solr.util.TestSolrCLIRunExample_51712189B4462C8E-001/tempDir-003/node1/testCloudExamplePrompt_shard1_replica_n2/../../../../contrib/velocity/lib filtered by .*\.jar to classpath: /export/home/jenkins/workspace/Lucene-Solr-master-Solaris/solr/build/solr-core/test/J0/temp/solr.util.TestSolrCLIRunExample_51712189B4462C8E-001/tempDir-003/node1/testCloudExamplePrompt_shard1_replica_n2/../../../../contrib/velocity/lib
   [junit4]   2> 5033121 WARN  (qtp1517104550-43258) [n:localhost:55354_solr c:testCloudExamplePrompt s:shard2 r:core_node8 x:testCloudExamplePrompt_shard2_replica_n6] o.a.s.c.SolrConfig Couldn't add files from /export/home/jenkins/workspace/Lucene-Solr-master-Solaris/solr/build/solr-core/test/J0/temp/solr.util.TestSolrCLIRunExample_51712189B4462C8E-001/tempDir-003/node1/testCloudExamplePrompt_shard2_replica_n6/../../../../dist filtered by solr-clustering-\d.*\.jar to classpath: /export/home/jenkins/workspace/Lucene-Solr-master-Solaris/solr/build/solr-core/test/J0/temp/solr.util.TestSolrCLIRunExample_51712189B4462C8E-001/tempDir-003/node1/testCloudExamplePrompt_shard2_replica_n6/../../../../dist
   [junit4]   2> 5033121 WARN  (qtp1517104550-43255) [n:localhost:55354_solr c:testCloudExamplePrompt s:shard1 r:core_node5 x:testCloudExamplePrompt_shard1_replica_n2] o.a.s.c.SolrConfig Couldn't add files from /export/home/jenkins/workspace/Lucene-Solr-master-Solaris/solr/build/solr-core/test/J0/temp/solr.util.TestSolrCLIRunExample_51712189B4462C8E-001/tempDir-003/node1/testCloudExamplePrompt_shard1_replica_n2/../../../../dist filtered by solr-velocity-\d.*\.jar to classpath: /export/home/jenkins/workspace/Lucene-Solr-master-Solaris/solr/build/solr-core/test/J0/temp/solr.util.TestSolrCLIRunExample_51712189B4462C8E-001/tempDir-003/node1/testCloudExamplePrompt_shard1_replica_n2/../../../../dist
   [junit4]   2> 5033121 WARN  (qtp1517104550-43258) [n:localhost:55354_solr c:testCloudExamplePrompt s:shard2 r:core_node8 x:testCloudExamplePrompt_shard2_replica_n6] o.a.s.c.SolrConfig Couldn't add files from /export/home/jenkins/workspace/Lucene-Solr-master-Solaris/solr/build/solr-core/test/J0/temp/solr.util.TestSolrCLIRunExample_51712189B4462C8E-001/tempDir-003/node1/testCloudExamplePrompt_shard2_replica_n6/../../../../contrib/langid/lib filtered by .*\.jar to classpath: /export/home/jenkins/workspace/Lucene-Solr-master-Solaris/solr/build/solr-core/test/J0/temp/solr.util.TestSolrCLIRunExample_51712189B4462C8E-001/tempDir-003/node1/testCloudExamplePrompt_shard2_replica_n6/../../../../contrib/langid/lib
   [junit4]   2> 5033121 WARN  (qtp1517104550-43258) [n:localhost:55354_solr c:testCloudExamplePrompt s:shard2 r:core_node8 x:testCloudExamplePrompt_shard2_replica_n6] o.a.s.c.SolrConfig Couldn't add files from /export/home/jenkins/workspace/Lucene-Solr-master-Solaris/solr/build/solr-core/test/J0/temp/solr.util.TestSolrCLIRunExample_51712189B4462C8E-001/tempDir-003/node1/testCloudExamplePrompt_shard2_replica_n6/../../../../dist filtered by solr-langid-\d.*\.jar to classpath: /export/home/jenkins/workspace/Lucene-Solr-master-Solaris/solr/build/solr-core/test/J0/temp/solr.util.TestSolrCLIRunExample_51712189B4462C8E-001/tempDir-003/node1/testCloudExamplePrompt_shard2_replica_n6/../../../../dist
   [junit4]   2> 5033122 WARN  (qtp1517104550-43258) [n:localhost:55354_solr c:testCloudExamplePrompt s:shard2 r:core_node8 x:testCloudExamplePrompt_shard2_replica_n6] o.a.s.c.SolrConfig Couldn't add files from /export/home/jenkins/workspace/Lucene-Solr-master-Solaris/solr/build/solr-core/test/J0/temp/solr.util.TestSolrCLIRunExample_51712189B4462C8E-001/tempDir-003/node1/testCloudExamplePrompt_shard2_replica_n6/../../../../contrib/velocity/lib filtered by .*\.jar to classpath: /export/home/jenkins/workspace/Lucene-Solr-master-Solaris/solr/build/solr-core/test/J0/temp/solr.util.TestSolrCLIRunExample_51712189B4462C8E-001/tempDir-003/node1/testCloudExamplePrompt_shard2_replica_n6/../../../../contrib/velocity/lib
   [junit4]   2> 5033122 WARN  (qtp1517104550-43258) [n:localhost:55354_solr c:testCloudExamplePrompt s:shard2 r:core_node8 x:testCloudExamplePrompt_shard2_replica_n6] o.a.s.c.SolrConfig Couldn't add files from /export/home/jenkins/workspace/Lucene-Solr-master-Solaris/solr/build/solr-core/test/J0/temp/solr.util.TestSolrCLIRunExample_51712189B4462C8E-001/tempDir-003/node1/testCloudExamplePrompt_shard2_replica_n6/../../../../dist filtered by solr-velocity-\d.*\.jar to classpath: /export/home/jenkins/workspace/Lucene-Solr-master-Solaris/solr/build/solr-core/test/J0/temp/solr.util.TestSolrCLIRunExample_51712189B4462C8E-001/tempDir-003/node1/testCloudExamplePrompt_shard2_replica_n6/../../../../dist
   [junit4]   2> 5033161 WARN  (qtp1517104550-43261) [n:localhost:55354_solr c:testCloudExamplePrompt s:shard2 r:core_node7 x:testCloudExamplePrompt_shard2_replica_n4] o.a.s.c.SolrConfig Couldn't add files from /export/home/jenkins/workspace/Lucene-Solr-master-Solaris/solr/build/solr-core/test/J0/temp/solr.util.TestSolrCLIRunExample_51712189B4462C8E-001/tempDir-003/node1/testCloudExamplePrompt_shard2_replica_n4/../../../../dist filtered by solr-cell-\d.*\.jar to classpath: /export/home/jenkins/workspace/Lucene-Solr-master-Solaris/solr/build/solr-core/test/J0/temp/solr.util.TestSolrCLIRunExample_51712189B4462C8E-001/tempDir-003/node1/testCloudExamplePrompt_shard2_replica_n4/../../../../dist
   [junit4]   2> 5033162 WARN  (qtp1517104550-43261) [n:localhost:55354_solr c:testCloudExamplePrompt s:shard2 r:core_node7 x:testCloudExamplePrompt_shard2_replica_n4] o.a.s.c.SolrConfig Couldn't add files from /export/home/jenkins/workspace/Lucene-Solr-master-Solaris/solr/build/solr-core/test/J0/temp/solr.util.TestSolrCLIRunExample_51712189B4462C8E-001/tempDir-003/node1/testCloudExamplePrompt_shard2_replica_n4/../../../../contrib/clustering/lib filtered by .*\.jar to classpath: /export/home/jenkins/workspace/Lucene-Solr-master-Solaris/solr/build/solr-core/test/J0/temp/solr.util.TestSolrCLIRunExample_51712189B4462C8E-001/tempDir-003/node1/testCloudExamplePrompt_shard2_replica_n4/../../../../contrib/clustering/lib
   [junit4]   2> 5033162 WARN  (qtp1517104550-43261) [n:localhost:55354_solr c:testCloudExamplePrompt s:shard2 r:core_node7 x:testCloudExamplePrompt_shard2_replica_n4] o.a.s.c.SolrConfig Couldn't add files from /export/home/jenkins/workspace/Lucene-Solr-master-Solaris/solr/build/solr-core/test/J0/temp/solr.util.TestSolrCLIRunExample_51712189B4462C8E-001/tempDir-003/node1/testCloudExamplePrompt_shard2_replica_n4/../../../../dist filtered by solr-clustering-\d.*\.jar to classpath: /export/home/jenkins/workspace/Lucene-Solr-master-Solaris/solr/build/solr-core/test/J0/temp/solr.util.TestSolrCLIRunExample_51712189B4462C8E-001/tempDir-003/node1/testCloudExamplePrompt_shard2_replica_n4/../../../../dist
   [junit4]   2> 5033163 WARN  (qtp1517104550-43261) [n:localhost:55354_solr c:testCloudExamplePrompt s:shard2 r:core_node7 x:testCloudExamplePrompt_shard2_replica_n4] o.a.s.c.SolrConfig Couldn't add files from /export/home/jenkins/workspace/Lucene-Solr-master-Solaris/solr/build/solr-core/test/J0/temp/solr.util.TestSolrCLIRunExample_51712189B4462C8E-001/tempDir-003/node1/testCloudExamplePrompt_shard2_replica_n4/../../../../contrib/langid/lib filtered by .*\.jar to classpath: /export/home/jenkins/workspace/Lucene-Solr-master-Solaris/solr/build/solr-core/test/J0/temp/solr.util.TestSolrCLIRunExample_51712189B4462C8E-001/tempDir-003/node1/testCloudExamplePrompt_shard2_replica_n4/../../../../contrib/langid/lib
   [junit4]   2> 5033163 WARN  (qtp1517104550-43261) [n:localhost:55354_solr c:testCloudExamplePrompt s:shard2 r:core_node7 x:testCloudExamplePrompt_shard2_replica_n4] o.a.s.c.SolrConfig Couldn't add files from /export/home/jenkins/workspace/Lucene-Solr-master-Solaris/solr/build/solr-core/test/J0/temp/solr.util.TestSolrCLIRunExample_51712189B4462C8E-001/tempDir-003/node1/testCloudExamplePrompt_shard2_replica_n4/../../../../dist filtered by solr-langid-\d.*\.jar to classpath: /export/home/jenkins/workspace/Lucene-Solr-master-Solaris/solr/build/solr-core/test/J0/temp/solr.util.TestSolrCLIRunExample_51712189B4462C8E-001/tempDir-003/node1/testCloudExamplePrompt_shard2_replica_n4/../../../../dist
   [junit4]   2> 5033163 WARN  (qtp1517104550-43261) [n:localhost:55354_solr c:testCloudExamplePrompt s:shard2 r:core_node7 x:testCloudExamplePrompt_shard2_replica_n4] o.a.s.c.SolrConfig Couldn't add files from /export/home/jenkins/workspace/Lucene-Solr-master-Solaris/solr/build/solr-core/test/J0/temp/solr.util.TestSolrCLIRunExample_51712189B4462C8E-001/tempDir-003/node1/testCloudExamplePrompt_shard2_replica_n4/../../../../contrib/velocity/lib filtered by .*\.jar to classpath: /export/home/jenkins/workspace/Lucene-Solr-master-Solaris/solr/build/solr-core/test/J0/temp/solr.util.TestSolrCLIRunExample_51712189B4462C8E-001/tempDir-003/node1/testCloudExamplePrompt_shard2_replica_n4/../../../../contrib/velocity/lib
   [junit4]   2> 5033163 WARN  (qtp1517104550-43261) [n:localhost:55354_solr c:testCloudExamplePrompt s:shard2 r:core_node7 x:testCloudExamplePrompt_shard2_replica_n4] o.a.s.c.SolrConfig Couldn't add files from /export/home/jenkins/workspace/Lucene-Solr-master-Solaris/solr/build/solr-core/test/J0/temp/solr.util.TestSolrCLIRunExample_51712189B4462C8E-001/tempDir-003/node1/testCloudExamplePrompt_shard2_replica_n4/../../../../dist filtered by solr-velocity-\d.*\.jar to classpath: /export/home/jenkins/workspace/Lucene-Solr-master-Solaris/solr/build/solr-core/test/J0/temp/solr.util.TestSolrCLIRunExample_51712189B4462C8E-001/tempDir-003/node1/testCloudExamplePrompt_shard2_replica_n4/../../../../dist
   [junit4]   2> 5036822 WARN  (Thread-12011) [n:localhost:55354_solr    ] o.a.s.c.SolrConfig Couldn't add files from /export/home/jenkins/workspace/Lucene-Solr-master-Solaris/solr/build/solr-core/test/J0/temp/solr.util.TestSolrCLIRunExample_51712189B4462C8E-001/tempDir-003/node1/testCloudExamplePrompt_shard1_replica_n2/../../../../contrib/extraction/lib filtered by .*\.jar to classpath: /export/home/jenkins/workspace/Lucene-Solr-master-Solaris/solr/build/solr-core/test/J0/temp/solr.util.TestSolrCLIRunExample_51712189B4462C8E-001/tempDir-003/node1/testCloudExamplePrompt_shard1_replica_n2/../../../../contrib/extraction/lib
   [junit4]   2> 5036822 WARN  (Thread-12011) [n:localhost:55354_solr    ] o.a.s.c.SolrConfig Couldn't add files from /export/home/jenkins/workspace/Lucene-Solr-master-Solaris/solr/build/solr-core/test/J0/temp/solr.util.TestSolrCLIRunExample_51712189B4462C8E-001/tempDir-003/node1/testCloudExamplePrompt_shard1_replica_n2/../../../../dist filtered by solr-cell-\d.*\.jar to classpath: /export/home/jenkins/workspace/Lucene-Solr-master-Solaris/solr/build/solr-core/test/J0/temp/solr.util.TestSolrCLIRunExample_51712189B4462C8E-001/tempDir-003/node1/testCloudExamplePrompt_shard1_replica_n2/../../../../dist
   [junit4]   2> 5036822 WARN  (Thread-12011) [n:localhost:55354_solr    ] o.a.s.c.SolrConfig Couldn't add files from /export/home/jenkins/workspace/Lucene-Solr-master-Solaris/solr/build/solr-core/test/J0/temp/solr.util.TestSolrCLIRunExample_51712189B4462C8E-001/tempDir-003/node1/testCloudExamplePrompt_shard1_replica_n2/../../../../contrib/clustering/lib filtered by .*\.jar to classpath: /export/home/jenkins/workspace/Lucene-Solr-master-Solaris/solr/build/solr-core/test/J0/temp/solr.util.TestSolrCLIRunExample_51712189B4462C8E-001/tempDir-003/node1/testCloudExamplePrompt_shard1_replica_n2/../../../../contrib/clustering/lib
   [junit4]   2> 5036823 WARN  (Thread-12011) [n:localhost:55354_solr    ] o.a.s.c.SolrConfig Couldn't add files from /export/home/jenkins/workspace/Lucene-Solr-master-Solaris/solr/build/solr-core/test/J0/temp/solr.util.TestSolrCLIRunExample_51712189B4462C8E-001/tempDir-003/node1/testCloudExamplePrompt_shard1_replica_n2/../../../../dist filtered by solr-clustering-\d.*\.jar to classpath: /export/home/jenkins/workspace/Lucene-Solr-master-Solaris/solr/build/solr-core/test/J0/temp/solr.util.TestSolrCLIRunExample_51712189B4462C8E-001/tempDir-003/node1/testCloudExamplePrompt_shard1_replica_n2/../../../../dist
   [junit4]   2> 5036823 WARN  (Thread-12011) [n:localhost:55354_solr    ] o.a.s.c.SolrConfig Couldn't add files from /export/home/jenkins/workspace/Lucene-Solr-master-Solaris/solr/build/solr-core/test/J0/temp/solr.util.TestSolrCLIRunExample_51712189B4462C8E-001/tempDir-003/node1/testCloudExamplePrompt_shard1_replica_n2/../../../../contrib/langid/lib filtered by .*\.jar to classpath: /export/home/jenkins/workspace/Lucene-Solr-master-Solaris/solr/build/solr-core/test/J0/temp/solr.util.TestSolrCLIRunExample_51712189B4462C8E-001/tempDir-003/node1/testCloudExamplePrompt_shard1_replica_n2/../../../../contrib/langid/lib
   [junit4]   2> 5036823 WARN  (Thread-12011) [n:localhost:55354_solr    ] o.a.s.c.SolrConfig Couldn't add files from /export/home/jenkins/workspace/Lucene-Solr-master-Solaris/solr/build/solr-core/test/J0/temp/solr.util.TestSolrCLIRunExample_51712189B4462C8E-001/tempDir-003/node1/testCloudExamplePrompt_shard1_replica_n2/../../../../dist filtered by solr-langid-\d.*\.jar to classpath: /export/home/jenkins/workspace/Lucene-Solr-master-Solaris/solr/build/solr-core/test/J0/temp/solr.util.TestSolrCLIRunExample_51712189B4462C8E-001/tempDir-003/node1/testCloudExamplePrompt_shard1_replica_n2/../../../../dist
   [junit4]   2> 5036824 WARN  (Thread-12011) [n:localhost:55354_solr    ] o.a.s.c.SolrConfig Couldn't add files from /export/home/jenkins/workspace/Lucene-Solr-master-Solaris/solr/build/solr-core/test/J0/temp/solr.util.TestSolrCLIRunExample_51712189B4462C8E-001/tempDir-003/node1/testCloudExamplePrompt_shard1_replica_n2/../../../../contrib/velocity/lib filtered by .*\.jar to classpath: /export/home/jenkins/workspace/Lucene-Solr-master-Solaris/solr/build/solr-core/test/J0/temp/solr.util.TestSolrCLIRunExample_51712189B4462C8E-001/tempDir-003/node1/testCloudExamplePrompt_shard1_replica_n2/../../../../contrib/velocity/lib
   [junit4]   2> 5036824 WARN  (Thread-12011) [n:localhost:55354_solr    ] o.a.s.c.SolrConfig Couldn't add files from /export/home/jenkins/workspace/Lucene-Solr-master-Solaris/solr/build/solr-core/test/J0/temp/solr.util.TestSolrCLIRunExample_51712189B4462C8E-001/tempDir-003/node1/testCloudExamplePrompt_shard1_replica_n2/../../../../dist filtered by solr-velocity-\d.*\.jar to classpath: /export/home/jenkins/workspace/Lucene-Solr-master-Solaris/solr/build/solr-core/test/J0/temp/solr.util.TestSolrCLIRunExample_51712189B4462C8E-001/tempDir-003/node1/testCloudExamplePrompt_shard1_replica_n2/../../../../dist
   [junit4]   2> 5036938 WARN  (SolrConfigHandler-refreshconf) [n:localhost:55354_solr c:testCloudExamplePrompt s:shard2 r:core_node7 x:testCloudExamplePrompt_shard2_replica_n4] o.a.s.c.SolrConfig Couldn't add files from /export/home/jenkins/workspace/Lucene-Solr-master-Solaris/solr/build/solr-core/test/J0/temp/solr.util.TestSolrCLIRunExample_51712189B4462C8E-001/tempDir-003/node1/testCloudExamplePrompt_shard2_replica_n4/../../../../contrib/extraction/lib filtered by .*\.jar to classpath: /export/home/jenkins/workspace/Lucene-Solr-master-Solaris/solr/build/solr-core/test/J0/temp/solr.util.TestSolrCLIRunExample_51712189B4462C8E-001/tempDir-003/node1/testCloudExamplePrompt_shard2_replica_n4/../../../../contrib/extraction/lib
   [junit4]   2> 5036938 WARN  (SolrConfigHandler-refreshconf) [n:localhost:55354_solr c:testCloudExamplePrompt s:shard2 r:core_node7 x:testCloudExamplePrompt_shard2_replica_n4] o.a.s.c.SolrConfig Couldn't add files from /export/home/jenkins/workspace/Lucene-Solr-master-Solaris/solr/build/solr-core/test/J0/temp/solr.util.TestSolrCLIRunExample_51712189B4462C8E-001/tempDir-003/node1/testCloudExamplePrompt_shard2_replica_n4/../../../../dist filtered by solr-cell-\d.*\.jar to classpath: /export/home/jenkins/workspace/Lucene-Solr-master-Solaris/solr/build/solr-core/test/J0/temp/solr.util.TestSolrCLIRunExample_51712189B4462C8E-001/tempDir-003/node1/testCloudExamplePrompt_shard2_replica_n4/../../../../dist
   [junit4]   2> 5036939 WARN  (SolrConfigHandler-refreshconf) [n:localhost:55354_solr c:testCloudExamplePrompt s:shard2 r:core_node7 x:testCloudExamplePrompt_shard2_replica_n4] o.a.s.c.SolrConfig Couldn't add files from /export/home/jenkins/workspace/Lucene-Solr-master-Solaris/solr/build/solr-core/test/J0/temp/solr.util.TestSolrCLIRunExample_51712189B4462C8E-001/tempDir-003/node1/testCloudExamplePrompt_shard2_replica_n4/../../../../contrib/clustering/lib filtered by .*\.jar to classpath: /export/home/jenkins/workspace/Lucene-Solr-master-Solaris/solr/build/solr-core/test/J0/temp/solr.util.TestSolrCLIRunExample_51712189B4462C8E-001/tempDir-003/node1/testCloudExamplePrompt_shard2_replica_n4/../../../../contrib/clustering/lib
   [junit4]   2> 5036939 WARN  (SolrConfigHandler-refreshconf) [n:localhost:55354_solr c:testCloudExamplePrompt s:shard2 r:core_node7 x:testCloudExamplePrompt_shard2_replica_n4] o.a.s.c.SolrConfig Couldn't add files from /export/home/jenkins/workspace/Lucene-Solr-master-Solaris/solr/build/solr-core/test/J0/temp/solr.util.TestSolrCLIRunExample_51712189B4462C8E-001/tempDir-003/node1/testCloudExamplePrompt_shard2_replica_n4/../../../../dist filtered by solr-clustering-\d.*\.jar to classpath: /export/home/jenkins/workspace/Lucene-Solr-master-Solaris/solr/build/solr-core/test/J0/temp/solr.util.TestSolrCLIRunExample_51712189B4462C8E-001/tempDir-003/node1/testCloudExamplePrompt_shard2_replica_n4/../../../../dist
   [junit4]   2> 5036939 WARN  (SolrConfigHandler-refreshconf) [n:localhost:55354_solr c:testCloudExamplePrompt s:shard2 r:core_node7 x:testCloudExamplePrompt_shard2_replica_n4] o.a.s.c.SolrConfig Couldn't add files from /export/home/jenkins/workspace/Lucene-Solr-master-Solaris/solr/build/solr-core/test/J0/temp/solr.util.TestSolrCLIRunExample_51712189B4462C8E-001/tempDir-003/node1/testCloudExamplePrompt_shard2_replica_n4/../../../../contrib/langid/lib filtered by .*\.jar to classpath: /export/home/jenkins/workspace/Lucene-Solr-master-Solaris/solr/build/solr-core/test/J0/temp/solr.util.TestSolrCLIRunExample_51712189B4462C8E-001/tempDir-003/node1/testCloudExamplePrompt_shard2_replica_n4/../../../../contrib/langid/lib
   [junit4]   2> 5036939 WARN  (SolrConfigHandler-refreshconf) [n:localhost:55354_solr c:testCloudExamplePrompt s:shard2 r:core_node7 x:testCloudExamplePrompt_shard2_replica_n4] o.a.s.c.SolrConfig Couldn't add files from /export/home/jenkins/workspace/Lucene-Solr-master-Solaris/solr/build/solr-core/test/J0/temp/solr.util.TestSolrCLIRunExample_51712189B4462C8E-001/tempDir-003/node1/testCloudExamplePrompt_shard2_replica_n4/../../../../dist filtered by solr-langid-\d.*\.jar to classpath: /export/home/jenkins/workspace/Lucene-Solr-master-Solaris/solr/build/solr-core/test/J0/temp/solr.util.TestSolrCLIRunExample_51712189B4462C8E-001/tempDir-003/node1/testCloudExamplePrompt_shard2_replica_n4/../../../../dist
   [junit4]   2> 5036939 WARN  (SolrConfigHandler-refreshconf) [n:localhost:55354_solr c:testCloudExamplePrompt s:shard2 r:core_node7 x:testCloudExamplePrompt_shard2_replica_n4] o.a.s.c.SolrConfig Couldn't add files from /export/home/jenkins/workspace/Lucene-Solr-master-Solaris/solr/build/solr-core/test/J0/temp/solr.util.TestSolrCLIRunExample_51712189B4462C8E-001/tempDir-003/node1/testCloudExamplePrompt_shard2_replica_n4/../../../../contrib/velocity/lib filtered by .*\.jar to classpath: /export/home/jenkins/workspace/Lucene-Solr-master-Solaris/solr/build/solr-core/test/J0/temp/solr.util.TestSolrCLIRunExample_51712189B4462C8E-001/tempDir-003/node1/testCloudExamplePrompt_shard2_replica_n4/../../../../contrib/velocity/lib
   [junit4]   2> 5036939 WARN  (SolrConfigHandler-refreshconf) [n:localhost:55354_solr c:testCloudExamplePrompt s:shard2 r:core_node7 x:testCloudExamplePrompt_shard2_replica_n4] o.a.s.c.SolrConfig Couldn't add files from /export/home/jenkins/workspace/Lucene-Solr-master-Solaris/solr/build/solr-core/test/J0/temp/solr.util.TestSolrCLIRunExample_51712189B4462C8E-001/tempDir-003/node1/testCloudExamplePrompt_shard2_replica_n4/../../../../dist filtered by solr-velocity-\d.*\.jar to classpath: /export/home/jenkins/workspace/Lucene-Solr-master-Solaris/solr/build/solr-core/test/J0/temp/solr.util.TestSolrCLIRunExample_51712189B4462C8E-001/tempDir-003/node1/testCloudExamplePrompt_shard2_replica_n4/../../../../dist
   [junit4]   2> 5036940 WARN  (SolrConfigHandler-refreshconf) [n:localhost:55354_solr c:testCloudExamplePrompt s:shard2 r:core_node8 x:testCloudExamplePrompt_shard2_replica_n6] o.a.s.c.SolrConfig Couldn't add files from /export/home/jenkins/workspace/Lucene-Solr-master-Solaris/solr/build/solr-core/test/J0/temp/solr.util.TestSolrCLIRunExample_51712189B4462C8E-001/tempDir-003/node1/testCloudExamplePrompt_shard2_replica_n6/../../../../contrib/extraction/lib filtered by .*\.jar to classpath: /export/home/jenkins/workspace/Lucene-Solr-master-Solaris/solr/build/solr-core/test/J0/temp/solr.util.TestSolrCLIRunExample_51712189B4462C8E-001/tempDir-003/node1/testCloudExamplePrompt_shard2_replica_n6/../../../../contrib/extraction/lib
   [junit4]   2> 5036940 WARN  (SolrConfigHandler-refreshconf) [n:localhost:55354_solr c:testCloudExamplePrompt s:shard2 r:core_node8 x:testCloudExamplePrompt_shard2_replica_n6] o.a.s.c.SolrConfig Couldn't add files from /export/home/jenkins/workspace/Lucene-Solr-master-Solaris/solr/build/solr-core/test/J0/temp/solr.util.TestSolrCLIRunExample_51712189B4462C8E-001/tempDir-003/node1/testCloudExamplePrompt_shard2_replica_n6/../../../../dist filtered by solr-cell-\d.*\.jar to classpath: /export/home/jenkins/workspace/Lucene-Solr-master-Solaris/solr/build/solr-core/test/J0/temp/solr.util.TestSolrCLIRunExample_51712189B4462C8E-001/tempDir-003/node1/testCloudExamplePrompt_shard2_replica_n6/../../../../dist
   [junit4]   2> 5036940 WARN  (SolrConfigHandler-refreshconf) [n:localhost:55354_solr c:testCloudExamplePrompt s:shard1 r:core_node3 x:testCloudExamplePrompt_shard1_replica_n1] o.a.s.c.SolrConfig Couldn't add files from /export/home/jenkins/workspace/Lucene-Solr-master-Solaris/solr/build/solr-core/test/J0/temp/solr.util.TestSolrCLIRunExample_51712189B4462C8E-001/tempDir-003/node1/testCloudExamplePrompt_shard1_replica_n1/../../../../contrib/extraction/lib filtered by .*\.jar to classpath: /export/home/jenkins/workspace/Lucene-Solr-master-Solaris/solr/build/solr-core/test/J0/temp/solr.util.TestSolrCLIRunExample_51712189B4462C8E-001/tempDir-003/node1/testCloudExamplePrompt_shard1_replica_n1/../../../../contrib/extraction/lib
   [junit4]   2> 5036940 WARN  (SolrConfigHandler-refreshconf) [n:localhost:55354_solr c:testCloudExamplePrompt s:shard2 r:core_node8 x:testCloudExamplePrompt_shard2_replica_n6] o.a.s.c.SolrConfig Couldn't add files from /export/home/jenkins/workspace/Lucene-Solr-master-Solaris/solr/build/solr-core/test/J0/temp/solr.util.TestSolrCLIRunExample_51712189B4462C8E-001/tempDir-003/node1/testCloudExamplePrompt_shard2_replica_n6/../../../../contrib/clustering/lib filtered by .*\.jar to classpath: /export/home/jenkins/workspace/Lucene-Solr-master-Solaris/solr/build/solr-core/test/J0/temp/solr.util.TestSolrCLIRunExample_51712189B4462C8E-001/tempDir-003/node1/testCloudExamplePrompt_shard2_replica_n6/../../../../contrib/clustering/lib
   [junit4]   2> 5036940 WARN  (SolrConfigHandler-refreshconf) [n:localhost:55354_solr c:testCloudExamplePrompt s:shard1 r:core_node3 x:testCloudExamplePrompt_shard1_replica_n1] o.a.s.c.SolrConfig Couldn't add files from /export/home/jenkins/workspace/Lucene-Solr-master-Solaris/solr/build/solr-core/test/J0/temp/solr.util.TestSolrCLIRunExample_51712189B4462C8E-001/tempDir-003/node1/testCloudExamplePrompt_shard1_replica_n1/../../../../dist filtered by solr-cell-\d.*\.jar to classpath: /export/home/jenkins/workspace/Lucene-Solr-master-Solaris/solr/build/solr-core/test/J0/temp/solr.util.TestSolrCLIRunExample_51712189B4462C8E-001/tempDir-003/node1/testCloudExamplePrompt_shard1_replica_n1/../../../../dist
   [junit4]   2> 5036940 WARN  (SolrConfigHandler-refreshconf) [n:localhost:55354_solr c:testCloudExamplePrompt s:shard2 r:core_node8 x:testCloudExamplePrompt_shard2_replica_n6] o.a.s.c.SolrConfig Couldn't add files from /export/home/jenkins/workspace/Lucene-Solr-master-Solaris/solr/build/solr-core/test/J0/temp/solr.util.TestSolrCLIRunExample_51712189B4462C8E-001/tempDir-003/node1/testCloudExamplePrompt_shard2_replica_n6/../../../../dist filtered by solr-clustering-\d.*\.jar to classpath: /export/home/jenkins/workspace/Lucene-Solr-master-Solaris/solr/build/solr-core/test/J0/temp/solr.util.TestSolrCLIRunExample_51712189B4462C8E-001/tempDir-003/node1/testCloudExamplePrompt_shard2_replica_n6/../../../../dist
   [junit4]   2> 5036941 WARN  (SolrConfigHandler-refreshconf) [n:localhost:55354_solr c:testCloudExamplePrompt s:shard1 r:core_node3 x:testCloudExamplePrompt_shard1_replica_n1] o.a.s.c.SolrConfig Couldn't add files from /export/home/jenkins/workspace/Lucene-Solr-master-Solaris/solr/build/solr-core/test/J0/temp/solr.util.TestSolrCLIRunExample_51712189B4462C8E-001/tempDir-003/node1/testCloudExamplePrompt_shard1_replica_n1/../../../../contrib/clustering/lib filtered by .*\.jar to classpath: /export/home/jenkins/workspace/Lucene-Solr-master-Solaris/solr/build/solr-core/test/J0/temp/solr.util.TestSolrCLIRunExample_51712189B4462C8E-001/tempDir-0

[...truncated too long message...]

  [junit4]    > at org.eclipse.jetty.server.HttpConnection.onFillable(HttpConnection.java:251)
   [junit4]    > at org.eclipse.jetty.io.AbstractConnection$ReadCallback.succeeded(AbstractConnection.java:283)
   [junit4]    > at org.eclipse.jetty.io.FillInterest.fillable(FillInterest.java:108)
   [junit4]    > at org.eclipse.jetty.io.SelectChannelEndPoint$2.run(SelectChannelEndPoint.java:93)
   [junit4]    > at org.eclipse.jetty.util.thread.strategy.ExecuteProduceConsume.executeProduceConsume(ExecuteProduceConsume.java:303)
   [junit4]    > at org.eclipse.jetty.util.thread.strategy.ExecuteProduceConsume.produceConsume(ExecuteProduceConsume.java:148)
   [junit4]    > at org.eclipse.jetty.util.thread.strategy.ExecuteProduceConsume.run(ExecuteProduceConsume.java:136)
   [junit4]    > at org.eclipse.jetty.util.thread.QueuedThreadPool.runJob(QueuedThreadPool.java:671)
   [junit4]    > at org.eclipse.jetty.util.thread.QueuedThreadPool$2.run(QueuedThreadPool.java:589)
   [junit4]    > at java.lang.Thread.run(Thread.java:748)
   [junit4]    > org.apache.solr.common.util.ObjectReleaseTracker$ObjectTrackerException: org.apache.lucene.store.NRTCachingDirectory
   [junit4]    > at org.apache.solr.common.util.ObjectReleaseTracker.track(ObjectReleaseTracker.java:42)
   [junit4]    > at org.apache.solr.core.CachingDirectoryFactory.get(CachingDirectoryFactory.java:348)
   [junit4]    > at org.apache.solr.update.SolrIndexWriter.create(SolrIndexWriter.java:92)
   [junit4]    > at org.apache.solr.core.SolrCore.initIndex(SolrCore.java:761)
   [junit4]    > at org.apache.solr.core.SolrCore.<init>(SolrCore.java:954)
   [junit4]    > at org.apache.solr.core.SolrCore.<init>(SolrCore.java:863)
   [junit4]    > at org.apache.solr.core.CoreContainer.createFromDescriptor(CoreContainer.java:1041)
   [junit4]    > at org.apache.solr.core.CoreContainer.create(CoreContainer.java:952)
   [junit4]    > at org.apache.solr.handler.admin.CoreAdminOperation.lambda$static$0(CoreAdminOperation.java:91)
   [junit4]    > at org.apache.solr.handler.admin.CoreAdminOperation.execute(CoreAdminOperation.java:384)
   [junit4]    > at org.apache.solr.handler.admin.CoreAdminHandler$CallInfo.call(CoreAdminHandler.java:389)
   [junit4]    > at org.apache.solr.handler.admin.CoreAdminHandler.handleRequestBody(CoreAdminHandler.java:174)
   [junit4]    > at org.apache.solr.handler.RequestHandlerBase.handleRequest(RequestHandlerBase.java:177)
   [junit4]    > at org.apache.solr.servlet.HttpSolrCall.handleAdmin(HttpSolrCall.java:735)
   [junit4]    > at org.apache.solr.servlet.HttpSolrCall.handleAdminRequest(HttpSolrCall.java:716)
   [junit4]    > at org.apache.solr.servlet.HttpSolrCall.call(HttpSolrCall.java:497)
   [junit4]    > at org.apache.solr.servlet.SolrDispatchFilter.doFilter(SolrDispatchFilter.java:382)
   [junit4]    > at org.apache.solr.servlet.SolrDispatchFilter.doFilter(SolrDispatchFilter.java:326)
   [junit4]    > at org.eclipse.jetty.servlet.ServletHandler$CachedChain.doFilter(ServletHandler.java:1759)
   [junit4]    > at org.apache.solr.client.solrj.embedded.JettySolrRunner$DebugFilter.doFilter(JettySolrRunner.java:139)
   [junit4]    > at org.eclipse.jetty.servlet.ServletHandler$CachedChain.doFilter(ServletHandler.java:1759)
   [junit4]    > at org.eclipse.jetty.servlet.ServletHandler.doHandle(ServletHandler.java:582)
   [junit4]    > at org.eclipse.jetty.server.session.SessionHandler.doHandle(SessionHandler.java:224)
   [junit4]    > at org.eclipse.jetty.server.handler.ContextHandler.doHandle(ContextHandler.java:1180)
   [junit4]    > at org.eclipse.jetty.servlet.ServletHandler.doScope(ServletHandler.java:512)
   [junit4]    > at org.eclipse.jetty.server.session.SessionHandler.doScope(SessionHandler.java:185)
   [junit4]    > at org.eclipse.jetty.server.handler.ContextHandler.doScope(ContextHandler.java:1112)
   [junit4]    > at org.eclipse.jetty.server.handler.ScopedHandler.handle(ScopedHandler.java:141)
   [junit4]    > at org.eclipse.jetty.server.handler.gzip.GzipHandler.handle(GzipHandler.java:426)
   [junit4]    > at org.eclipse.jetty.server.handler.HandlerWrapper.handle(HandlerWrapper.java:134)
   [junit4]    > at org.eclipse.jetty.server.Server.handle(Server.java:534)
   [junit4]    > at org.eclipse.jetty.server.HttpChannel.handle(HttpChannel.java:320)
   [junit4]    > at org.eclipse.jetty.server.HttpConnection.onFillable(HttpConnection.java:251)
   [junit4]    > at org.eclipse.jetty.io.AbstractConnection$ReadCallback.succeeded(AbstractConnection.java:283)
   [junit4]    > at org.eclipse.jetty.io.FillInterest.fillable(FillInterest.java:108)
   [junit4]    > at org.eclipse.jetty.io.SelectChannelEndPoint$2.run(SelectChannelEndPoint.java:93)
   [junit4]    > at org.eclipse.jetty.util.thread.strategy.ExecuteProduceConsume.executeProduceConsume(ExecuteProduceConsume.java:303)
   [junit4]    > at org.eclipse.jetty.util.thread.strategy.ExecuteProduceConsume.produceConsume(ExecuteProduceConsume.java:148)
   [junit4]    > at org.eclipse.jetty.util.thread.strategy.ExecuteProduceConsume.run(ExecuteProduceConsume.java:136)
   [junit4]    > at org.eclipse.jetty.util.thread.QueuedThreadPool.runJob(QueuedThreadPool.java:671)
   [junit4]    > at org.eclipse.jetty.util.thread.QueuedThreadPool$2.run(QueuedThreadPool.java:589)
   [junit4]    > at java.lang.Thread.run(Thread.java:748)
   [junit4]    > org.apache.solr.common.util.ObjectReleaseTracker$ObjectTrackerException: org.apache.lucene.store.NRTCachingDirectory
   [junit4]    > at org.apache.solr.common.util.ObjectReleaseTracker.track(ObjectReleaseTracker.java:42)
   [junit4]    > at org.apache.solr.core.CachingDirectoryFactory.get(CachingDirectoryFactory.java:348)
   [junit4]    > at org.apache.solr.core.SolrCore.initSnapshotMetaDataManager(SolrCore.java:498)
   [junit4]    > at org.apache.solr.core.SolrCore.<init>(SolrCore.java:948)
   [junit4]    > at org.apache.solr.core.SolrCore.<init>(SolrCore.java:863)
   [junit4]    > at org.apache.solr.core.CoreContainer.createFromDescriptor(CoreContainer.java:1041)
   [junit4]    > at org.apache.solr.core.CoreContainer.create(CoreContainer.java:952)
   [junit4]    > at org.apache.solr.handler.admin.CoreAdminOperation.lambda$static$0(CoreAdminOperation.java:91)
   [junit4]    > at org.apache.solr.handler.admin.CoreAdminOperation.execute(CoreAdminOperation.java:384)
   [junit4]    > at org.apache.solr.handler.admin.CoreAdminHandler$CallInfo.call(CoreAdminHandler.java:389)
   [junit4]    > at org.apache.solr.handler.admin.CoreAdminHandler.handleRequestBody(CoreAdminHandler.java:174)
   [junit4]    > at org.apache.solr.handler.RequestHandlerBase.handleRequest(RequestHandlerBase.java:177)
   [junit4]    > at org.apache.solr.servlet.HttpSolrCall.handleAdmin(HttpSolrCall.java:735)
   [junit4]    > at org.apache.solr.servlet.HttpSolrCall.handleAdminRequest(HttpSolrCall.java:716)
   [junit4]    > at org.apache.solr.servlet.HttpSolrCall.call(HttpSolrCall.java:497)
   [junit4]    > at org.apache.solr.servlet.SolrDispatchFilter.doFilter(SolrDispatchFilter.java:382)
   [junit4]    > at org.apache.solr.servlet.SolrDispatchFilter.doFilter(SolrDispatchFilter.java:326)
   [junit4]    > at org.eclipse.jetty.servlet.ServletHandler$CachedChain.doFilter(ServletHandler.java:1759)
   [junit4]    > at org.apache.solr.client.solrj.embedded.JettySolrRunner$DebugFilter.doFilter(JettySolrRunner.java:139)
   [junit4]    > at org.eclipse.jetty.servlet.ServletHandler$CachedChain.doFilter(ServletHandler.java:1759)
   [junit4]    > at org.eclipse.jetty.servlet.ServletHandler.doHandle(ServletHandler.java:582)
   [junit4]    > at org.eclipse.jetty.server.session.SessionHandler.doHandle(SessionHandler.java:224)
   [junit4]    > at org.eclipse.jetty.server.handler.ContextHandler.doHandle(ContextHandler.java:1180)
   [junit4]    > at org.eclipse.jetty.servlet.ServletHandler.doScope(ServletHandler.java:512)
   [junit4]    > at org.eclipse.jetty.server.session.SessionHandler.doScope(SessionHandler.java:185)
   [junit4]    > at org.eclipse.jetty.server.handler.ContextHandler.doScope(ContextHandler.java:1112)
   [junit4]    > at org.eclipse.jetty.server.handler.ScopedHandler.handle(ScopedHandler.java:141)
   [junit4]    > at org.eclipse.jetty.server.handler.gzip.GzipHandler.handle(GzipHandler.java:426)
   [junit4]    > at org.eclipse.jetty.server.handler.HandlerWrapper.handle(HandlerWrapper.java:134)
   [junit4]    > at org.eclipse.jetty.server.Server.handle(Server.java:534)
   [junit4]    > at org.eclipse.jetty.server.HttpChannel.handle(HttpChannel.java:320)
   [junit4]    > at org.eclipse.jetty.server.HttpConnection.onFillable(HttpConnection.java:251)
   [junit4]    > at org.eclipse.jetty.io.AbstractConnection$ReadCallback.succeeded(AbstractConnection.java:283)
   [junit4]    > at org.eclipse.jetty.io.FillInterest.fillable(FillInterest.java:108)
   [junit4]    > at org.eclipse.jetty.io.SelectChannelEndPoint$2.run(SelectChannelEndPoint.java:93)
   [junit4]    > at org.eclipse.jetty.util.thread.strategy.ExecuteProduceConsume.executeProduceConsume(ExecuteProduceConsume.java:303)
   [junit4]    > at org.eclipse.jetty.util.thread.strategy.ExecuteProduceConsume.produceConsume(ExecuteProduceConsume.java:148)
   [junit4]    > at org.eclipse.jetty.util.thread.strategy.ExecuteProduceConsume.run(ExecuteProduceConsume.java:136)
   [junit4]    > at org.eclipse.jetty.util.thread.QueuedThreadPool.runJob(QueuedThreadPool.java:671)
   [junit4]    > at org.eclipse.jetty.util.thread.QueuedThreadPool$2.run(QueuedThreadPool.java:589)
   [junit4]    > at java.lang.Thread.run(Thread.java:748)
   [junit4]    > at __randomizedtesting.SeedInfo.seed([51712189B4462C8E]:0)
   [junit4]    > at org.apache.solr.SolrTestCaseJ4.teardownTestCases(SolrTestCaseJ4.java:298)
   [junit4]    > at java.lang.Thread.run(Thread.java:748)
   [junit4] Completed [739/752 (1!)] on J0 in 65.81s, 5 tests, 1 failure <<< FAILURES!

[...truncated 47346 lines...]


---------------------------------------------------------------------
To unsubscribe, e-mail: [hidden email]
For additional commands, e-mail: [hidden email]