[JENKINS] Lucene-Solr-master-Solaris (64bit/jdk1.8.0) - Build # 1964 - Unstable!

Previous Topic Next Topic
 
classic Classic list List threaded Threaded
1 message Options
Reply | Threaded
Open this post in threaded view
|

[JENKINS] Lucene-Solr-master-Solaris (64bit/jdk1.8.0) - Build # 1964 - Unstable!

Policeman Jenkins Server-2
Build: https://jenkins.thetaphi.de/job/Lucene-Solr-master-Solaris/1964/
Java: 64bit/jdk1.8.0 -XX:-UseCompressedOops -XX:+UseParallelGC

2 tests failed.
FAILED:  org.apache.lucene.TestMergeSchedulerExternal.testSubclassConcurrentMergeScheduler

Error Message:


Stack Trace:
java.lang.AssertionError
        at __randomizedtesting.SeedInfo.seed([D44C2E3F6D3C85EA:53CD9392691CFFEE]:0)
        at org.junit.Assert.fail(Assert.java:92)
        at org.junit.Assert.assertTrue(Assert.java:43)
        at org.junit.Assert.assertTrue(Assert.java:54)
        at org.apache.lucene.TestMergeSchedulerExternal.testSubclassConcurrentMergeScheduler(TestMergeSchedulerExternal.java:147)
        at sun.reflect.NativeMethodAccessorImpl.invoke0(Native Method)
        at sun.reflect.NativeMethodAccessorImpl.invoke(NativeMethodAccessorImpl.java:62)
        at sun.reflect.DelegatingMethodAccessorImpl.invoke(DelegatingMethodAccessorImpl.java:43)
        at java.lang.reflect.Method.invoke(Method.java:498)
        at com.carrotsearch.randomizedtesting.RandomizedRunner.invoke(RandomizedRunner.java:1737)
        at com.carrotsearch.randomizedtesting.RandomizedRunner$8.evaluate(RandomizedRunner.java:934)
        at com.carrotsearch.randomizedtesting.RandomizedRunner$9.evaluate(RandomizedRunner.java:970)
        at com.carrotsearch.randomizedtesting.RandomizedRunner$10.evaluate(RandomizedRunner.java:984)
        at org.apache.lucene.util.TestRuleSetupTeardownChained$1.evaluate(TestRuleSetupTeardownChained.java:49)
        at org.apache.lucene.util.AbstractBeforeAfterRule$1.evaluate(AbstractBeforeAfterRule.java:45)
        at org.apache.lucene.util.TestRuleThreadAndTestName$1.evaluate(TestRuleThreadAndTestName.java:48)
        at org.apache.lucene.util.TestRuleIgnoreAfterMaxFailures$1.evaluate(TestRuleIgnoreAfterMaxFailures.java:64)
        at org.apache.lucene.util.TestRuleMarkFailure$1.evaluate(TestRuleMarkFailure.java:47)
        at com.carrotsearch.randomizedtesting.rules.StatementAdapter.evaluate(StatementAdapter.java:36)
        at com.carrotsearch.randomizedtesting.ThreadLeakControl$StatementRunner.run(ThreadLeakControl.java:368)
        at com.carrotsearch.randomizedtesting.ThreadLeakControl.forkTimeoutingTask(ThreadLeakControl.java:817)
        at com.carrotsearch.randomizedtesting.ThreadLeakControl$3.evaluate(ThreadLeakControl.java:468)
        at com.carrotsearch.randomizedtesting.RandomizedRunner.runSingleTest(RandomizedRunner.java:943)
        at com.carrotsearch.randomizedtesting.RandomizedRunner$5.evaluate(RandomizedRunner.java:829)
        at com.carrotsearch.randomizedtesting.RandomizedRunner$6.evaluate(RandomizedRunner.java:879)
        at com.carrotsearch.randomizedtesting.RandomizedRunner$7.evaluate(RandomizedRunner.java:890)
        at org.apache.lucene.util.AbstractBeforeAfterRule$1.evaluate(AbstractBeforeAfterRule.java:45)
        at com.carrotsearch.randomizedtesting.rules.StatementAdapter.evaluate(StatementAdapter.java:36)
        at org.apache.lucene.util.TestRuleStoreClassName$1.evaluate(TestRuleStoreClassName.java:41)
        at com.carrotsearch.randomizedtesting.rules.NoShadowingOrOverridesOnMethodsRule$1.evaluate(NoShadowingOrOverridesOnMethodsRule.java:40)
        at com.carrotsearch.randomizedtesting.rules.NoShadowingOrOverridesOnMethodsRule$1.evaluate(NoShadowingOrOverridesOnMethodsRule.java:40)
        at com.carrotsearch.randomizedtesting.rules.StatementAdapter.evaluate(StatementAdapter.java:36)
        at com.carrotsearch.randomizedtesting.rules.StatementAdapter.evaluate(StatementAdapter.java:36)
        at com.carrotsearch.randomizedtesting.rules.StatementAdapter.evaluate(StatementAdapter.java:36)
        at org.apache.lucene.util.TestRuleAssertionsRequired$1.evaluate(TestRuleAssertionsRequired.java:53)
        at org.apache.lucene.util.TestRuleMarkFailure$1.evaluate(TestRuleMarkFailure.java:47)
        at org.apache.lucene.util.TestRuleIgnoreAfterMaxFailures$1.evaluate(TestRuleIgnoreAfterMaxFailures.java:64)
        at org.apache.lucene.util.TestRuleIgnoreTestSuites$1.evaluate(TestRuleIgnoreTestSuites.java:54)
        at com.carrotsearch.randomizedtesting.rules.StatementAdapter.evaluate(StatementAdapter.java:36)
        at com.carrotsearch.randomizedtesting.ThreadLeakControl$StatementRunner.run(ThreadLeakControl.java:368)
        at java.lang.Thread.run(Thread.java:748)


FAILED:  org.apache.solr.cloud.TestCloudRecovery.leaderRecoverFromLogOnStartupTest

Error Message:
expected:<4> but was:<0>

Stack Trace:
java.lang.AssertionError: expected:<4> but was:<0>
        at __randomizedtesting.SeedInfo.seed([8EC7254AEC57F37E:FA37C40FA873B4F1]:0)
        at org.junit.Assert.fail(Assert.java:93)
        at org.junit.Assert.failNotEquals(Assert.java:647)
        at org.junit.Assert.assertEquals(Assert.java:128)
        at org.junit.Assert.assertEquals(Assert.java:472)
        at org.junit.Assert.assertEquals(Assert.java:456)
        at org.apache.solr.cloud.TestCloudRecovery.leaderRecoverFromLogOnStartupTest(TestCloudRecovery.java:112)
        at sun.reflect.NativeMethodAccessorImpl.invoke0(Native Method)
        at sun.reflect.NativeMethodAccessorImpl.invoke(NativeMethodAccessorImpl.java:62)
        at sun.reflect.DelegatingMethodAccessorImpl.invoke(DelegatingMethodAccessorImpl.java:43)
        at java.lang.reflect.Method.invoke(Method.java:498)
        at com.carrotsearch.randomizedtesting.RandomizedRunner.invoke(RandomizedRunner.java:1737)
        at com.carrotsearch.randomizedtesting.RandomizedRunner$8.evaluate(RandomizedRunner.java:934)
        at com.carrotsearch.randomizedtesting.RandomizedRunner$9.evaluate(RandomizedRunner.java:970)
        at com.carrotsearch.randomizedtesting.RandomizedRunner$10.evaluate(RandomizedRunner.java:984)
        at com.carrotsearch.randomizedtesting.rules.SystemPropertiesRestoreRule$1.evaluate(SystemPropertiesRestoreRule.java:57)
        at org.apache.lucene.util.TestRuleSetupTeardownChained$1.evaluate(TestRuleSetupTeardownChained.java:49)
        at org.apache.lucene.util.AbstractBeforeAfterRule$1.evaluate(AbstractBeforeAfterRule.java:45)
        at org.apache.lucene.util.TestRuleThreadAndTestName$1.evaluate(TestRuleThreadAndTestName.java:48)
        at org.apache.lucene.util.TestRuleIgnoreAfterMaxFailures$1.evaluate(TestRuleIgnoreAfterMaxFailures.java:64)
        at org.apache.lucene.util.TestRuleMarkFailure$1.evaluate(TestRuleMarkFailure.java:47)
        at com.carrotsearch.randomizedtesting.rules.StatementAdapter.evaluate(StatementAdapter.java:36)
        at com.carrotsearch.randomizedtesting.ThreadLeakControl$StatementRunner.run(ThreadLeakControl.java:368)
        at com.carrotsearch.randomizedtesting.ThreadLeakControl.forkTimeoutingTask(ThreadLeakControl.java:817)
        at com.carrotsearch.randomizedtesting.ThreadLeakControl$3.evaluate(ThreadLeakControl.java:468)
        at com.carrotsearch.randomizedtesting.RandomizedRunner.runSingleTest(RandomizedRunner.java:943)
        at com.carrotsearch.randomizedtesting.RandomizedRunner$5.evaluate(RandomizedRunner.java:829)
        at com.carrotsearch.randomizedtesting.RandomizedRunner$6.evaluate(RandomizedRunner.java:879)
        at com.carrotsearch.randomizedtesting.RandomizedRunner$7.evaluate(RandomizedRunner.java:890)
        at com.carrotsearch.randomizedtesting.rules.StatementAdapter.evaluate(StatementAdapter.java:36)
        at com.carrotsearch.randomizedtesting.rules.SystemPropertiesRestoreRule$1.evaluate(SystemPropertiesRestoreRule.java:57)
        at org.apache.lucene.util.AbstractBeforeAfterRule$1.evaluate(AbstractBeforeAfterRule.java:45)
        at com.carrotsearch.randomizedtesting.rules.StatementAdapter.evaluate(StatementAdapter.java:36)
        at org.apache.lucene.util.TestRuleStoreClassName$1.evaluate(TestRuleStoreClassName.java:41)
        at com.carrotsearch.randomizedtesting.rules.NoShadowingOrOverridesOnMethodsRule$1.evaluate(NoShadowingOrOverridesOnMethodsRule.java:40)
        at com.carrotsearch.randomizedtesting.rules.NoShadowingOrOverridesOnMethodsRule$1.evaluate(NoShadowingOrOverridesOnMethodsRule.java:40)
        at com.carrotsearch.randomizedtesting.rules.StatementAdapter.evaluate(StatementAdapter.java:36)
        at com.carrotsearch.randomizedtesting.rules.StatementAdapter.evaluate(StatementAdapter.java:36)
        at com.carrotsearch.randomizedtesting.rules.StatementAdapter.evaluate(StatementAdapter.java:36)
        at org.apache.lucene.util.TestRuleAssertionsRequired$1.evaluate(TestRuleAssertionsRequired.java:53)
        at org.apache.lucene.util.TestRuleMarkFailure$1.evaluate(TestRuleMarkFailure.java:47)
        at org.apache.lucene.util.TestRuleIgnoreAfterMaxFailures$1.evaluate(TestRuleIgnoreAfterMaxFailures.java:64)
        at org.apache.lucene.util.TestRuleIgnoreTestSuites$1.evaluate(TestRuleIgnoreTestSuites.java:54)
        at com.carrotsearch.randomizedtesting.rules.StatementAdapter.evaluate(StatementAdapter.java:36)
        at com.carrotsearch.randomizedtesting.ThreadLeakControl$StatementRunner.run(ThreadLeakControl.java:368)
        at java.lang.Thread.run(Thread.java:748)




Build Log:
[...truncated 1012 lines...]
   [junit4] Suite: org.apache.lucene.TestMergeSchedulerExternal
   [junit4]   1> TEST FAILED; IW infoStream output:
   [junit4]   1> IFD 100 [2018-07-12T00:16:14.399Z; TEST-TestMergeSchedulerExternal.testSubclassConcurrentMergeScheduler-seed#[D44C2E3F6D3C85EA]]: init: current segments file is "segments"; deletionPolicy=org.apache.lucene.index.KeepOnlyLastCommitDeletionPolicy@770ed2ba
   [junit4]   1> IFD 100 [2018-07-12T00:16:14.399Z; TEST-TestMergeSchedulerExternal.testSubclassConcurrentMergeScheduler-seed#[D44C2E3F6D3C85EA]]: now checkpoint "" [0 segments ; isCommit = false]
   [junit4]   1> IFD 100 [2018-07-12T00:16:14.399Z; TEST-TestMergeSchedulerExternal.testSubclassConcurrentMergeScheduler-seed#[D44C2E3F6D3C85EA]]: 0 msec to checkpoint
   [junit4]   1> IW 100 [2018-07-12T00:16:14.399Z; TEST-TestMergeSchedulerExternal.testSubclassConcurrentMergeScheduler-seed#[D44C2E3F6D3C85EA]]: init: create=true reader=null
   [junit4]   1> IW 100 [2018-07-12T00:16:14.399Z; TEST-TestMergeSchedulerExternal.testSubclassConcurrentMergeScheduler-seed#[D44C2E3F6D3C85EA]]:
   [junit4]   1> dir=MockDirectoryWrapper(RAMDirectory@168dfa24 lockFactory=org.apache.lucene.store.SingleInstanceLockFactory@6dce1f2a)
   [junit4]   1> index=
   [junit4]   1> version=8.0.0
   [junit4]   1> analyzer=org.apache.lucene.analysis.MockAnalyzer
   [junit4]   1> ramBufferSizeMB=-1.0
   [junit4]   1> maxBufferedDocs=2
   [junit4]   1> mergedSegmentWarmer=null
   [junit4]   1> delPolicy=org.apache.lucene.index.KeepOnlyLastCommitDeletionPolicy
   [junit4]   1> commit=null
   [junit4]   1> openMode=CREATE_OR_APPEND
   [junit4]   1> similarity=org.apache.lucene.search.similarities.AssertingSimilarity
   [junit4]   1> mergeScheduler=MyMergeScheduler: maxThreadCount=-1, maxMergeCount=-1, ioThrottle=true
   [junit4]   1> codec=Asserting(Lucene70): {}, docValues:{}, maxPointsInLeafNode=1111, maxMBSortInHeap=6.355380898031095
   [junit4]   1> infoStream=org.apache.lucene.util.PrintStreamInfoStream
   [junit4]   1> mergePolicy=[LogByteSizeMergePolicy: minMergeSize=1677721, mergeFactor=31, maxMergeSize=2147483648, maxMergeSizeForForcedMerge=9223372036854775807, calibrateSizeByDeletes=false, maxMergeDocs=2147483647, maxCFSSegmentSizeMB=8.796093022207999E12, noCFSRatio=0.7132313784864815]
   [junit4]   1> indexerThreadPool=org.apache.lucene.index.DocumentsWriterPerThreadPool@13ff6eae
   [junit4]   1> readerPooling=false
   [junit4]   1> perThreadHardLimitMB=1945
   [junit4]   1> useCompoundFile=false
   [junit4]   1> commitOnClose=true
   [junit4]   1> indexSort=null
   [junit4]   1> checkPendingFlushOnUpdate=true
   [junit4]   1> softDeletesField=null
   [junit4]   1> writer=org.apache.lucene.index.IndexWriter@6adaea2f
   [junit4]   1>
   [junit4]   1> IW 100 [2018-07-12T00:16:14.399Z; TEST-TestMergeSchedulerExternal.testSubclassConcurrentMergeScheduler-seed#[D44C2E3F6D3C85EA]]: MMapDirectory.UNMAP_SUPPORTED=true
   [junit4]   1> DWPT 100 [2018-07-12T00:16:14.401Z; TEST-TestMergeSchedulerExternal.testSubclassConcurrentMergeScheduler-seed#[D44C2E3F6D3C85EA]]: flush postings as segment _0 numDocs=2
   [junit4]   1> IW 100 [2018-07-12T00:16:14.401Z; TEST-TestMergeSchedulerExternal.testSubclassConcurrentMergeScheduler-seed#[D44C2E3F6D3C85EA]]: 0 msec to write norms
   [junit4]   1> IW 100 [2018-07-12T00:16:14.401Z; TEST-TestMergeSchedulerExternal.testSubclassConcurrentMergeScheduler-seed#[D44C2E3F6D3C85EA]]: 0 msec to write docValues
   [junit4]   1> IW 100 [2018-07-12T00:16:14.401Z; TEST-TestMergeSchedulerExternal.testSubclassConcurrentMergeScheduler-seed#[D44C2E3F6D3C85EA]]: 0 msec to write points
   [junit4]   1> IW 100 [2018-07-12T00:16:14.404Z; TEST-TestMergeSchedulerExternal.testSubclassConcurrentMergeScheduler-seed#[D44C2E3F6D3C85EA]]: 3 msec to finish stored fields
   [junit4]   1> IW 100 [2018-07-12T00:16:14.413Z; TEST-TestMergeSchedulerExternal.testSubclassConcurrentMergeScheduler-seed#[D44C2E3F6D3C85EA]]: 9 msec to write postings and finish vectors
   [junit4]   1> IW 100 [2018-07-12T00:16:14.416Z; TEST-TestMergeSchedulerExternal.testSubclassConcurrentMergeScheduler-seed#[D44C2E3F6D3C85EA]]: 2 msec to write fieldInfos
   [junit4]   1> DWPT 100 [2018-07-12T00:16:14.416Z; TEST-TestMergeSchedulerExternal.testSubclassConcurrentMergeScheduler-seed#[D44C2E3F6D3C85EA]]: new segment has 0 deleted docs
   [junit4]   1> DWPT 100 [2018-07-12T00:16:14.416Z; TEST-TestMergeSchedulerExternal.testSubclassConcurrentMergeScheduler-seed#[D44C2E3F6D3C85EA]]: new segment has 0 soft-deleted docs
   [junit4]   1> DWPT 100 [2018-07-12T00:16:14.416Z; TEST-TestMergeSchedulerExternal.testSubclassConcurrentMergeScheduler-seed#[D44C2E3F6D3C85EA]]: new segment has no vectors; no norms; no docValues; no prox; no freqs
   [junit4]   1> DWPT 100 [2018-07-12T00:16:14.416Z; TEST-TestMergeSchedulerExternal.testSubclassConcurrentMergeScheduler-seed#[D44C2E3F6D3C85EA]]: flushedFiles=[_0_Direct_0.doc, _0_Direct_0.tim, _0_Direct_0.tip, _0.fdx, _0.fdt, _0.fnm]
   [junit4]   1> DWPT 100 [2018-07-12T00:16:14.416Z; TEST-TestMergeSchedulerExternal.testSubclassConcurrentMergeScheduler-seed#[D44C2E3F6D3C85EA]]: flushed codec=Asserting(Lucene70): {id=PostingsFormat(name=Direct)}, docValues:{}, maxPointsInLeafNode=1111, maxMBSortInHeap=6.355380898031095
   [junit4]   1> DWPT 100 [2018-07-12T00:16:14.416Z; TEST-TestMergeSchedulerExternal.testSubclassConcurrentMergeScheduler-seed#[D44C2E3F6D3C85EA]]: flushed: segment=_0 ramUsed=0.071 MB newFlushedSize=0.001 MB docs/MB=3,070.501
   [junit4]   1> DWPT 100 [2018-07-12T00:16:14.421Z; TEST-TestMergeSchedulerExternal.testSubclassConcurrentMergeScheduler-seed#[D44C2E3F6D3C85EA]]: flush time 20.063079 msec
   [junit4]   1> IW 100 [2018-07-12T00:16:14.421Z; TEST-TestMergeSchedulerExternal.testSubclassConcurrentMergeScheduler-seed#[D44C2E3F6D3C85EA]]: publishFlushedSegment seg-private updates=null
   [junit4]   1> IW 100 [2018-07-12T00:16:14.421Z; TEST-TestMergeSchedulerExternal.testSubclassConcurrentMergeScheduler-seed#[D44C2E3F6D3C85EA]]: publishFlushedSegment _0(8.0.0):C2
   [junit4]   1> BD 100 [2018-07-12T00:16:14.421Z; TEST-TestMergeSchedulerExternal.testSubclassConcurrentMergeScheduler-seed#[D44C2E3F6D3C85EA]]: finished packet delGen=1 now completedDelGen=1
   [junit4]   1> IW 100 [2018-07-12T00:16:14.421Z; TEST-TestMergeSchedulerExternal.testSubclassConcurrentMergeScheduler-seed#[D44C2E3F6D3C85EA]]: publish sets newSegment delGen=1 seg=_0(8.0.0):C2
   [junit4]   1> IFD 100 [2018-07-12T00:16:14.421Z; TEST-TestMergeSchedulerExternal.testSubclassConcurrentMergeScheduler-seed#[D44C2E3F6D3C85EA]]: now checkpoint "_0(8.0.0):C2" [1 segments ; isCommit = false]
   [junit4]   1> IFD 100 [2018-07-12T00:16:14.421Z; TEST-TestMergeSchedulerExternal.testSubclassConcurrentMergeScheduler-seed#[D44C2E3F6D3C85EA]]: 0 msec to checkpoint
   [junit4]   1> MP 100 [2018-07-12T00:16:14.421Z; TEST-TestMergeSchedulerExternal.testSubclassConcurrentMergeScheduler-seed#[D44C2E3F6D3C85EA]]: findMerges: 1 segments
   [junit4]   1> MP 100 [2018-07-12T00:16:14.421Z; TEST-TestMergeSchedulerExternal.testSubclassConcurrentMergeScheduler-seed#[D44C2E3F6D3C85EA]]: seg=_0(8.0.0):C2 level=3.0449314 size=0.001 MB
   [junit4]   1> MP 100 [2018-07-12T00:16:14.421Z; TEST-TestMergeSchedulerExternal.testSubclassConcurrentMergeScheduler-seed#[D44C2E3F6D3C85EA]]:   level -1.0 to 3.0449314: 1 segments
   [junit4]   1> MS 100 [2018-07-12T00:16:14.421Z; TEST-TestMergeSchedulerExternal.testSubclassConcurrentMergeScheduler-seed#[D44C2E3F6D3C85EA]]: initDynamicDefaults spins=false maxThreadCount=1 maxMergeCount=6
   [junit4]   1> MS 100 [2018-07-12T00:16:14.421Z; TEST-TestMergeSchedulerExternal.testSubclassConcurrentMergeScheduler-seed#[D44C2E3F6D3C85EA]]: now merge
   [junit4]   1> MS 100 [2018-07-12T00:16:14.421Z; TEST-TestMergeSchedulerExternal.testSubclassConcurrentMergeScheduler-seed#[D44C2E3F6D3C85EA]]:   index: _0(8.0.0):C2
   [junit4]   1> MS 100 [2018-07-12T00:16:14.421Z; TEST-TestMergeSchedulerExternal.testSubclassConcurrentMergeScheduler-seed#[D44C2E3F6D3C85EA]]:   no more merges pending; now return
   [junit4]   1> DWPT 100 [2018-07-12T00:16:14.423Z; TEST-TestMergeSchedulerExternal.testSubclassConcurrentMergeScheduler-seed#[D44C2E3F6D3C85EA]]: flush postings as segment _1 numDocs=2
   [junit4]   1> IW 100 [2018-07-12T00:16:14.423Z; TEST-TestMergeSchedulerExternal.testSubclassConcurrentMergeScheduler-seed#[D44C2E3F6D3C85EA]]: 0 msec to write norms
   [junit4]   1> IW 100 [2018-07-12T00:16:14.423Z; TEST-TestMergeSchedulerExternal.testSubclassConcurrentMergeScheduler-seed#[D44C2E3F6D3C85EA]]: 0 msec to write docValues
   [junit4]   1> IW 100 [2018-07-12T00:16:14.423Z; TEST-TestMergeSchedulerExternal.testSubclassConcurrentMergeScheduler-seed#[D44C2E3F6D3C85EA]]: 0 msec to write points
   [junit4]   1> IW 100 [2018-07-12T00:16:14.425Z; TEST-TestMergeSchedulerExternal.testSubclassConcurrentMergeScheduler-seed#[D44C2E3F6D3C85EA]]: 2 msec to finish stored fields
   [junit4]   1> IW 100 [2018-07-12T00:16:14.435Z; TEST-TestMergeSchedulerExternal.testSubclassConcurrentMergeScheduler-seed#[D44C2E3F6D3C85EA]]: 9 msec to write postings and finish vectors
   [junit4]   1> IW 100 [2018-07-12T00:16:14.437Z; TEST-TestMergeSchedulerExternal.testSubclassConcurrentMergeScheduler-seed#[D44C2E3F6D3C85EA]]: 2 msec to write fieldInfos
   [junit4]   1> DWPT 100 [2018-07-12T00:16:14.437Z; TEST-TestMergeSchedulerExternal.testSubclassConcurrentMergeScheduler-seed#[D44C2E3F6D3C85EA]]: new segment has 0 deleted docs
   [junit4]   1> DWPT 100 [2018-07-12T00:16:14.437Z; TEST-TestMergeSchedulerExternal.testSubclassConcurrentMergeScheduler-seed#[D44C2E3F6D3C85EA]]: new segment has 0 soft-deleted docs
   [junit4]   1> DWPT 100 [2018-07-12T00:16:14.437Z; TEST-TestMergeSchedulerExternal.testSubclassConcurrentMergeScheduler-seed#[D44C2E3F6D3C85EA]]: new segment has no vectors; no norms; no docValues; no prox; no freqs
   [junit4]   1> DWPT 100 [2018-07-12T00:16:14.437Z; TEST-TestMergeSchedulerExternal.testSubclassConcurrentMergeScheduler-seed#[D44C2E3F6D3C85EA]]: flushedFiles=[_1.fdx, _1_Direct_0.tip, _1.fnm, _1_Direct_0.doc, _1_Direct_0.tim, _1.fdt]
   [junit4]   1> DWPT 100 [2018-07-12T00:16:14.437Z; TEST-TestMergeSchedulerExternal.testSubclassConcurrentMergeScheduler-seed#[D44C2E3F6D3C85EA]]: flushed codec=Asserting(Lucene70): {id=PostingsFormat(name=Direct)}, docValues:{}, maxPointsInLeafNode=1111, maxMBSortInHeap=6.355380898031095
   [junit4]   1> DWPT 100 [2018-07-12T00:16:14.437Z; TEST-TestMergeSchedulerExternal.testSubclassConcurrentMergeScheduler-seed#[D44C2E3F6D3C85EA]]: flushed: segment=_1 ramUsed=0.071 MB newFlushedSize=0.001 MB docs/MB=3,070.501
   [junit4]   1> DWPT 100 [2018-07-12T00:16:14.442Z; TEST-TestMergeSchedulerExternal.testSubclassConcurrentMergeScheduler-seed#[D44C2E3F6D3C85EA]]: flush time 19.001175 msec
   [junit4]   1> IW 100 [2018-07-12T00:16:14.442Z; TEST-TestMergeSchedulerExternal.testSubclassConcurrentMergeScheduler-seed#[D44C2E3F6D3C85EA]]: publishFlushedSegment seg-private updates=null
   [junit4]   1> IW 100 [2018-07-12T00:16:14.442Z; TEST-TestMergeSchedulerExternal.testSubclassConcurrentMergeScheduler-seed#[D44C2E3F6D3C85EA]]: publishFlushedSegment _1(8.0.0):C2
   [junit4]   1> BD 100 [2018-07-12T00:16:14.442Z; TEST-TestMergeSchedulerExternal.testSubclassConcurrentMergeScheduler-seed#[D44C2E3F6D3C85EA]]: finished packet delGen=2 now completedDelGen=2
   [junit4]   1> IW 100 [2018-07-12T00:16:14.442Z; TEST-TestMergeSchedulerExternal.testSubclassConcurrentMergeScheduler-seed#[D44C2E3F6D3C85EA]]: publish sets newSegment delGen=2 seg=_1(8.0.0):C2
   [junit4]   1> IFD 100 [2018-07-12T00:16:14.442Z; TEST-TestMergeSchedulerExternal.testSubclassConcurrentMergeScheduler-seed#[D44C2E3F6D3C85EA]]: now checkpoint "_0(8.0.0):C2 _1(8.0.0):C2" [2 segments ; isCommit = false]
   [junit4]   1> IFD 100 [2018-07-12T00:16:14.442Z; TEST-TestMergeSchedulerExternal.testSubclassConcurrentMergeScheduler-seed#[D44C2E3F6D3C85EA]]: 0 msec to checkpoint
   [junit4]   1> MP 100 [2018-07-12T00:16:14.442Z; TEST-TestMergeSchedulerExternal.testSubclassConcurrentMergeScheduler-seed#[D44C2E3F6D3C85EA]]: findMerges: 2 segments
   [junit4]   1> MP 100 [2018-07-12T00:16:14.442Z; TEST-TestMergeSchedulerExternal.testSubclassConcurrentMergeScheduler-seed#[D44C2E3F6D3C85EA]]: seg=_0(8.0.0):C2 level=3.0449314 size=0.001 MB
   [junit4]   1> MP 100 [2018-07-12T00:16:14.442Z; TEST-TestMergeSchedulerExternal.testSubclassConcurrentMergeScheduler-seed#[D44C2E3F6D3C85EA]]: seg=_1(8.0.0):C2 level=3.0449314 size=0.001 MB
   [junit4]   1> MP 100 [2018-07-12T00:16:14.442Z; TEST-TestMergeSchedulerExternal.testSubclassConcurrentMergeScheduler-seed#[D44C2E3F6D3C85EA]]:   level -1.0 to 3.0449314: 2 segments
   [junit4]   1> MS 100 [2018-07-12T00:16:14.442Z; TEST-TestMergeSchedulerExternal.testSubclassConcurrentMergeScheduler-seed#[D44C2E3F6D3C85EA]]: now merge
   [junit4]   1> MS 100 [2018-07-12T00:16:14.442Z; TEST-TestMergeSchedulerExternal.testSubclassConcurrentMergeScheduler-seed#[D44C2E3F6D3C85EA]]:   index: _0(8.0.0):C2 _1(8.0.0):C2
   [junit4]   1> MS 100 [2018-07-12T00:16:14.442Z; TEST-TestMergeSchedulerExternal.testSubclassConcurrentMergeScheduler-seed#[D44C2E3F6D3C85EA]]:   no more merges pending; now return
   [junit4]   1> DWPT 100 [2018-07-12T00:16:14.443Z; TEST-TestMergeSchedulerExternal.testSubclassConcurrentMergeScheduler-seed#[D44C2E3F6D3C85EA]]: flush postings as segment _2 numDocs=2
   [junit4]   1> IW 100 [2018-07-12T00:16:14.443Z; TEST-TestMergeSchedulerExternal.testSubclassConcurrentMergeScheduler-seed#[D44C2E3F6D3C85EA]]: 0 msec to write norms
   [junit4]   1> IW 100 [2018-07-12T00:16:14.443Z; TEST-TestMergeSchedulerExternal.testSubclassConcurrentMergeScheduler-seed#[D44C2E3F6D3C85EA]]: 0 msec to write docValues
   [junit4]   1> IW 100 [2018-07-12T00:16:14.443Z; TEST-TestMergeSchedulerExternal.testSubclassConcurrentMergeScheduler-seed#[D44C2E3F6D3C85EA]]: 0 msec to write points
   [junit4]   1> IW 100 [2018-07-12T00:16:14.447Z; TEST-TestMergeSchedulerExternal.testSubclassConcurrentMergeScheduler-seed#[D44C2E3F6D3C85EA]]: 3 msec to finish stored fields
   [junit4]   1> IW 100 [2018-07-12T00:16:14.455Z; TEST-TestMergeSchedulerExternal.testSubclassConcurrentMergeScheduler-seed#[D44C2E3F6D3C85EA]]: 8 msec to write postings and finish vectors
   [junit4]   1> IW 100 [2018-07-12T00:16:14.458Z; TEST-TestMergeSchedulerExternal.testSubclassConcurrentMergeScheduler-seed#[D44C2E3F6D3C85EA]]: 3 msec to write fieldInfos
   [junit4]   1> DWPT 100 [2018-07-12T00:16:14.458Z; TEST-TestMergeSchedulerExternal.testSubclassConcurrentMergeScheduler-seed#[D44C2E3F6D3C85EA]]: new segment has 0 deleted docs
   [junit4]   1> DWPT 100 [2018-07-12T00:16:14.458Z; TEST-TestMergeSchedulerExternal.testSubclassConcurrentMergeScheduler-seed#[D44C2E3F6D3C85EA]]: new segment has 0 soft-deleted docs
   [junit4]   1> DWPT 100 [2018-07-12T00:16:14.458Z; TEST-TestMergeSchedulerExternal.testSubclassConcurrentMergeScheduler-seed#[D44C2E3F6D3C85EA]]: new segment has no vectors; no norms; no docValues; no prox; no freqs
   [junit4]   1> DWPT 100 [2018-07-12T00:16:14.458Z; TEST-TestMergeSchedulerExternal.testSubclassConcurrentMergeScheduler-seed#[D44C2E3F6D3C85EA]]: flushedFiles=[_2.fdt, _2.fnm, _2.fdx, _2_Direct_0.doc, _2_Direct_0.tim, _2_Direct_0.tip]
   [junit4]   1> DWPT 100 [2018-07-12T00:16:14.458Z; TEST-TestMergeSchedulerExternal.testSubclassConcurrentMergeScheduler-seed#[D44C2E3F6D3C85EA]]: flushed codec=Asserting(Lucene70): {id=PostingsFormat(name=Direct)}, docValues:{}, maxPointsInLeafNode=1111, maxMBSortInHeap=6.355380898031095
   [junit4]   1> DWPT 100 [2018-07-12T00:16:14.458Z; TEST-TestMergeSchedulerExternal.testSubclassConcurrentMergeScheduler-seed#[D44C2E3F6D3C85EA]]: flushed: segment=_2 ramUsed=0.071 MB newFlushedSize=0.001 MB docs/MB=3,070.501
   [junit4]   1> DWPT 100 [2018-07-12T00:16:14.463Z; TEST-TestMergeSchedulerExternal.testSubclassConcurrentMergeScheduler-seed#[D44C2E3F6D3C85EA]]: flush time 19.753696 msec
   [junit4]   1> IW 100 [2018-07-12T00:16:14.463Z; TEST-TestMergeSchedulerExternal.testSubclassConcurrentMergeScheduler-seed#[D44C2E3F6D3C85EA]]: publishFlushedSegment seg-private updates=null
   [junit4]   1> IW 100 [2018-07-12T00:16:14.463Z; TEST-TestMergeSchedulerExternal.testSubclassConcurrentMergeScheduler-seed#[D44C2E3F6D3C85EA]]: publishFlushedSegment _2(8.0.0):C2
   [junit4]   1> BD 100 [2018-07-12T00:16:14.463Z; TEST-TestMergeSchedulerExternal.testSubclassConcurrentMergeScheduler-seed#[D44C2E3F6D3C85EA]]: finished packet delGen=3 now completedDelGen=3
   [junit4]   1> IW 100 [2018-07-12T00:16:14.463Z; TEST-TestMergeSchedulerExternal.testSubclassConcurrentMergeScheduler-seed#[D44C2E3F6D3C85EA]]: publish sets newSegment delGen=3 seg=_2(8.0.0):C2
   [junit4]   1> IFD 100 [2018-07-12T00:16:14.463Z; TEST-TestMergeSchedulerExternal.testSubclassConcurrentMergeScheduler-seed#[D44C2E3F6D3C85EA]]: now checkpoint "_0(8.0.0):C2 _1(8.0.0):C2 _2(8.0.0):C2" [3 segments ; isCommit = false]
   [junit4]   1> IFD 100 [2018-07-12T00:16:14.463Z; TEST-TestMergeSchedulerExternal.testSubclassConcurrentMergeScheduler-seed#[D44C2E3F6D3C85EA]]: 0 msec to checkpoint
   [junit4]   1> MP 100 [2018-07-12T00:16:14.463Z; TEST-TestMergeSchedulerExternal.testSubclassConcurrentMergeScheduler-seed#[D44C2E3F6D3C85EA]]: findMerges: 3 segments
   [junit4]   1> MP 100 [2018-07-12T00:16:14.463Z; TEST-TestMergeSchedulerExternal.testSubclassConcurrentMergeScheduler-seed#[D44C2E3F6D3C85EA]]: seg=_0(8.0.0):C2 level=3.0449314 size=0.001 MB
   [junit4]   1> MP 100 [2018-07-12T00:16:14.463Z; TEST-TestMergeSchedulerExternal.testSubclassConcurrentMergeScheduler-seed#[D44C2E3F6D3C85EA]]: seg=_1(8.0.0):C2 level=3.0449314 size=0.001 MB
   [junit4]   1> MP 100 [2018-07-12T00:16:14.463Z; TEST-TestMergeSchedulerExternal.testSubclassConcurrentMergeScheduler-seed#[D44C2E3F6D3C85EA]]: seg=_2(8.0.0):C2 level=3.0449314 size=0.001 MB
   [junit4]   1> MP 100 [2018-07-12T00:16:14.463Z; TEST-TestMergeSchedulerExternal.testSubclassConcurrentMergeScheduler-seed#[D44C2E3F6D3C85EA]]:   level -1.0 to 3.0449314: 3 segments
   [junit4]   1> MS 100 [2018-07-12T00:16:14.463Z; TEST-TestMergeSchedulerExternal.testSubclassConcurrentMergeScheduler-seed#[D44C2E3F6D3C85EA]]: now merge
   [junit4]   1> MS 100 [2018-07-12T00:16:14.463Z; TEST-TestMergeSchedulerExternal.testSubclassConcurrentMergeScheduler-seed#[D44C2E3F6D3C85EA]]:   index: _0(8.0.0):C2 _1(8.0.0):C2 _2(8.0.0):C2
   [junit4]   1> MS 100 [2018-07-12T00:16:14.463Z; TEST-TestMergeSchedulerExternal.testSubclassConcurrentMergeScheduler-seed#[D44C2E3F6D3C85EA]]:   no more merges pending; now return
   [junit4]   1> DWPT 100 [2018-07-12T00:16:14.465Z; TEST-TestMergeSchedulerExternal.testSubclassConcurrentMergeScheduler-seed#[D44C2E3F6D3C85EA]]: flush postings as segment _3 numDocs=2
   [junit4]   1> IW 100 [2018-07-12T00:16:14.465Z; TEST-TestMergeSchedulerExternal.testSubclassConcurrentMergeScheduler-seed#[D44C2E3F6D3C85EA]]: 0 msec to write norms
   [junit4]   1> IW 100 [2018-07-12T00:16:14.465Z; TEST-TestMergeSchedulerExternal.testSubclassConcurrentMergeScheduler-seed#[D44C2E3F6D3C85EA]]: 0 msec to write docValues
   [junit4]   1> IW 100 [2018-07-12T00:16:14.465Z; TEST-TestMergeSchedulerExternal.testSubclassConcurrentMergeScheduler-seed#[D44C2E3F6D3C85EA]]: 0 msec to write points
   [junit4]   1> IW 100 [2018-07-12T00:16:14.467Z; TEST-TestMergeSchedulerExternal.testSubclassConcurrentMergeScheduler-seed#[D44C2E3F6D3C85EA]]: 2 msec to finish stored fields
   [junit4]   1> IW 100 [2018-07-12T00:16:14.476Z; TEST-TestMergeSchedulerExternal.testSubclassConcurrentMergeScheduler-seed#[D44C2E3F6D3C85EA]]: 9 msec to write postings and finish vectors
   [junit4]   1> IW 100 [2018-07-12T00:16:14.479Z; TEST-TestMergeSchedulerExternal.testSubclassConcurrentMergeScheduler-seed#[D44C2E3F6D3C85EA]]: 2 msec to write fieldInfos
   [junit4]   1> DWPT 100 [2018-07-12T00:16:14.479Z; TEST-TestMergeSchedulerExternal.testSubclassConcurrentMergeScheduler-seed#[D44C2E3F6D3C85EA]]: new segment has 0 deleted docs
   [junit4]   1> DWPT 100 [2018-07-12T00:16:14.479Z; TEST-TestMergeSchedulerExternal.testSubclassConcurrentMergeScheduler-seed#[D44C2E3F6D3C85EA]]: new segment has 0 soft-deleted docs
   [junit4]   1> DWPT 100 [2018-07-12T00:16:14.479Z; TEST-TestMergeSchedulerExternal.testSubclassConcurrentMergeScheduler-seed#[D44C2E3F6D3C85EA]]: new segment has no vectors; no norms; no docValues; no prox; no freqs
   [junit4]   1> DWPT 100 [2018-07-12T00:16:14.479Z; TEST-TestMergeSchedulerExternal.testSubclassConcurrentMergeScheduler-seed#[D44C2E3F6D3C85EA]]: flushedFiles=[_3.fdx, _3_Direct_0.tim, _3_Direct_0.doc, _3_Direct_0.tip, _3.fnm, _3.fdt]
   [junit4]   1> DWPT 100 [2018-07-12T00:16:14.479Z; TEST-TestMergeSchedulerExternal.testSubclassConcurrentMergeScheduler-seed#[D44C2E3F6D3C85EA]]: flushed codec=Asserting(Lucene70): {id=PostingsFormat(name=Direct)}, docValues:{}, maxPointsInLeafNode=1111, maxMBSortInHeap=6.355380898031095
   [junit4]   1> DWPT 100 [2018-07-12T00:16:14.479Z; TEST-TestMergeSchedulerExternal.testSubclassConcurrentMergeScheduler-seed#[D44C2E3F6D3C85EA]]: flushed: segment=_3 ramUsed=0.071 MB newFlushedSize=0.001 MB docs/MB=3,070.501
   [junit4]   1> DWPT 100 [2018-07-12T00:16:14.484Z; TEST-TestMergeSchedulerExternal.testSubclassConcurrentMergeScheduler-seed#[D44C2E3F6D3C85EA]]: flush time 19.305186 msec
   [junit4]   1> IW 100 [2018-07-12T00:16:14.484Z; TEST-TestMergeSchedulerExternal.testSubclassConcurrentMergeScheduler-seed#[D44C2E3F6D3C85EA]]: publishFlushedSegment seg-private updates=null
   [junit4]   1> IW 100 [2018-07-12T00:16:14.484Z; TEST-TestMergeSchedulerExternal.testSubclassConcurrentMergeScheduler-seed#[D44C2E3F6D3C85EA]]: publishFlushedSegment _3(8.0.0):C2
   [junit4]   1> BD 100 [2018-07-12T00:16:14.484Z; TEST-TestMergeSchedulerExternal.testSubclassConcurrentMergeScheduler-seed#[D44C2E3F6D3C85EA]]: finished packet delGen=4 now completedDelGen=4
   [junit4]   1> IW 100 [2018-07-12T00:16:14.484Z; TEST-TestMergeSchedulerExternal.testSubclassConcurrentMergeScheduler-seed#[D44C2E3F6D3C85EA]]: publish sets newSegment delGen=4 seg=_3(8.0.0):C2
   [junit4]   1> IFD 100 [2018-07-12T00:16:14.484Z; TEST-TestMergeSchedulerExternal.testSubclassConcurrentMergeScheduler-seed#[D44C2E3F6D3C85EA]]: now checkpoint "_0(8.0.0):C2 _1(8.0.0):C2 _2(8.0.0):C2 _3(8.0.0):C2" [4 segments ; isCommit = false]
   [junit4]   1> IFD 100 [2018-07-12T00:16:14.484Z; TEST-TestMergeSchedulerExternal.testSubclassConcurrentMergeScheduler-seed#[D44C2E3F6D3C85EA]]: 0 msec to checkpoint
   [junit4]   1> MP 100 [2018-07-12T00:16:14.484Z; TEST-TestMergeSchedulerExternal.testSubclassConcurrentMergeScheduler-seed#[D44C2E3F6D3C85EA]]: findMerges: 4 segments
   [junit4]   1> MP 100 [2018-07-12T00:16:14.484Z; TEST-TestMergeSchedulerExternal.testSubclassConcurrentMergeScheduler-seed#[D44C2E3F6D3C85EA]]: seg=_0(8.0.0):C2 level=3.0449314 size=0.001 MB
   [junit4]   1> MP 100 [2018-07-12T00:16:14.484Z; TEST-TestMergeSchedulerExternal.testSubclassConcurrentMergeScheduler-seed#[D44C2E3F6D3C85EA]]: seg=_1(8.0.0):C2 level=3.0449314 size=0.001 MB
   [junit4]   1> MP 100 [2018-07-12T00:16:14.484Z; TEST-TestMergeSchedulerExternal.testSubclassConcurrentMergeScheduler-seed#[D44C2E3F6D3C85EA]]: seg=_2(8.0.0):C2 level=3.0449314 size=0.001 MB
   [junit4]   1> MP 100 [2018-07-12T00:16:14.484Z; TEST-TestMergeSchedulerExternal.testSubclassConcurrentMergeScheduler-seed#[D44C2E3F6D3C85EA]]: seg=_3(8.0.0):C2 level=3.0449314 size=0.001 MB
   [junit4]   1> MP 100 [2018-07-12T00:16:14.484Z; TEST-TestMergeSchedulerExternal.testSubclassConcurrentMergeScheduler-seed#[D44C2E3F6D3C85EA]]:   level -1.0 to 3.0449314: 4 segments
   [junit4]   1> MS 100 [2018-07-12T00:16:14.484Z; TEST-TestMergeSchedulerExternal.testSubclassConcurrentMergeScheduler-seed#[D44C2E3F6D3C85EA]]: now merge
   [junit4]   1> MS 100 [2018-07-12T00:16:14.484Z; TEST-TestMergeSchedulerExternal.testSubclassConcurrentMergeScheduler-seed#[D44C2E3F6D3C85EA]]:   index: _0(8.0.0):C2 _1(8.0.0):C2 _2(8.0.0):C2 _3(8.0.0):C2
   [junit4]   1> MS 100 [2018-07-12T00:16:14.484Z; TEST-TestMergeSchedulerExternal.testSubclassConcurrentMergeScheduler-seed#[D44C2E3F6D3C85EA]]:   no more merges pending; now return
   [junit4]   1> DWPT 100 [2018-07-12T00:16:14.487Z; TEST-TestMergeSchedulerExternal.testSubclassConcurrentMergeScheduler-seed#[D44C2E3F6D3C85EA]]: flush postings as segment _4 numDocs=2
   [junit4]   1> IW 100 [2018-07-12T00:16:14.487Z; TEST-TestMergeSchedulerExternal.testSubclassConcurrentMergeScheduler-seed#[D44C2E3F6D3C85EA]]: 0 msec to write norms
   [junit4]   1> IW 100 [2018-07-12T00:16:14.487Z; TEST-TestMergeSchedulerExternal.testSubclassConcurrentMergeScheduler-seed#[D44C2E3F6D3C85EA]]: 0 msec to write docValues
   [junit4]   1> IW 100 [2018-07-12T00:16:14.487Z; TEST-TestMergeSchedulerExternal.testSubclassConcurrentMergeScheduler-seed#[D44C2E3F6D3C85EA]]: 0 msec to write points
   [junit4]   1> IW 100 [2018-07-12T00:16:14.488Z; TEST-TestMergeSchedulerExternal.testSubclassConcurrentMergeScheduler-seed#[D44C2E3F6D3C85EA]]: 1 msec to finish stored fields
   [junit4]   1> IW 100 [2018-07-12T00:16:14.497Z; TEST-TestMergeSchedulerExternal.testSubclassConcurrentMergeScheduler-seed#[D44C2E3F6D3C85EA]]: 8 msec to write postings and finish vectors
   [junit4]   1> IW 100 [2018-07-12T00:16:14.497Z; TEST-TestMergeSchedulerExternal.testSubclassConcurrentMergeScheduler-seed#[D44C2E3F6D3C85EA]]: 0 msec to write fieldInfos
   [junit4]   1> DWPT 100 [2018-07-12T00:16:14.497Z; TEST-TestMergeSchedulerExternal.testSubclassConcurrentMergeScheduler-seed#[D44C2E3F6D3C85EA]]: new segment has 0 deleted docs
   [junit4]   1> DWPT 100 [2018-07-12T00:16:14.497Z; TEST-TestMergeSchedulerExternal.testSubclassConcurrentMergeScheduler-seed#[D44C2E3F6D3C85EA]]: new segment has 0 soft-deleted docs
   [junit4]   1> DWPT 100 [2018-07-12T00:16:14.497Z; TEST-TestMergeSchedulerExternal.testSubclassConcurrentMergeScheduler-seed#[D44C2E3F6D3C85EA]]: new segment has no vectors; no norms; no docValues; no prox; no freqs
   [junit4]   1> DWPT 100 [2018-07-12T00:16:14.497Z; TEST-TestMergeSchedulerExternal.testSubclassConcurrentMergeScheduler-seed#[D44C2E3F6D3C85EA]]: flushedFiles=[_4.fdt, _4.fnm, _4_Direct_0.doc, _4_Direct_0.tim, _4_Direct_0.tip, _4.fdx]
   [junit4]   1> DWPT 100 [2018-07-12T00:16:14.497Z; TEST-TestMergeSchedulerExternal.testSubclassConcurrentMergeScheduler-seed#[D44C2E3F6D3C85EA]]: flushed codec=Asserting(Lucene70): {id=PostingsFormat(name=Direct)}, docValues:{}, maxPointsInLeafNode=1111, maxMBSortInHeap=6.355380898031095
   [junit4]   1> DWPT 100 [2018-07-12T00:16:14.497Z; TEST-TestMergeSchedulerExternal.testSubclassConcurrentMergeScheduler-seed#[D44C2E3F6D3C85EA]]: flushed: segment=_4 ramUsed=0.071 MB newFlushedSize=0.001 MB docs/MB=3,070.501
   [junit4]   1> DWPT 100 [2018-07-12T00:16:14.506Z; TEST-TestMergeSchedulerExternal.testSubclassConcurrentMergeScheduler-seed#[D44C2E3F6D3C85EA]]: flush time 19.679166 msec
   [junit4]   1> IW 100 [2018-07-12T00:16:14.506Z; TEST-TestMergeSchedulerExternal.testSubclassConcurrentMergeScheduler-seed#[D44C2E3F6D3C85EA]]: publishFlushedSegment seg-private updates=null
   [junit4]   1> IW 100 [2018-07-12T00:16:14.506Z; TEST-TestMergeSchedulerExternal.testSubclassConcurrentMergeScheduler-seed#[D44C2E3F6D3C85EA]]: publishFlushedSegment _4(8.0.0):C2
   [junit4]   1> BD 100 [2018-07-12T00:16:14.506Z; TEST-TestMergeSchedulerExternal.testSubclassConcurrentMergeScheduler-seed#[D44C2E3F6D3C85EA]]: finished packet delGen=5 now completedDelGen=5
   [junit4]   1> IW 100 [2018-07-12T00:16:14.506Z; TEST-TestMergeSchedulerExternal.testSubclassConcurrentMergeScheduler-seed#[D44C2E3F6D3C85EA]]: publish sets newSegment delGen=5 seg=_4(8.0.0):C2
   [junit4]   1> IFD 100 [2018-07-12T00:16:14.506Z; TEST-TestMergeSchedulerExternal.testSubclassConcurrentMergeScheduler-seed#[D44C2E3F6D3C85EA]]: now checkpoint "_0(8.0.0):C2 _1(8.0.0):C2 _2(8.0.0):C2 _3(8.0.0):C2 _4(8.0.0):C2" [5 segments ; isCommit = false]
   [junit4]   1> IFD 100 [2018-07-12T00:16:14.506Z; TEST-TestMergeSchedulerExternal.testSubclassConcurrentMergeScheduler-seed#[D44C2E3F6D3C85EA]]: 0 msec to checkpoint
   [junit4]   1> MP 100 [2018-07-12T00:16:14.506Z; TEST-TestMergeSchedulerExternal.testSubclassConcurrentMergeScheduler-seed#[D44C2E3F6D3C85EA]]: findMerges: 5 segments
   [junit4]   1> MP 100 [2018-07-12T00:16:14.506Z; TEST-TestMergeSchedulerExternal.testSubclassConcurrentMergeScheduler-seed#[D44C2E3F6D3C85EA]]: seg=_0(8.0.0):C2 level=3.0449314 size=0.001 MB
   [junit4]   1> MP 100 [2018-07-12T00:16:14.506Z; TEST-TestMergeSchedulerExternal.testSubclassConcurrentMergeScheduler-seed#[D44C2E3F6D3C85EA]]: seg=_1(8.0.0):C2 level=3.0449314 size=0.001 MB
   [junit4]   1> MP 100 [2018-07-12T00:16:14.506Z; TEST-TestMergeSchedulerExternal.testSubclassConcurrentMergeScheduler-seed#[D44C2E3F6D3C85EA]]: seg=_2(8.0.0):C2 level=3.0449314 size=0.001 MB
   [junit4]   1> MP 100 [2018-07-12T00:16:14.506Z; TEST-TestMergeSchedulerExternal.testSubclassConcurrentMergeScheduler-seed#[D44C2E3F6D3C85EA]]: seg=_3(8.0.0):C2 level=3.0449314 size=0.001 MB
   [junit4]   1> MP 100 [2018-07-12T00:16:14.506Z; TEST-TestMergeSchedulerExternal.testSubclassConcurrentMergeScheduler-seed#[D44C2E3F6D3C85EA]]: seg=_4(8.0.0):C2 level=3.0449314 size=0.001 MB
   [junit4]   1> MP 100 [2018-07-12T00:16:14.506Z; TEST-TestMergeSchedulerExternal.testSubclassConcurrentMergeScheduler-seed#[D44C2E3F6D3C85EA]]:   level -1.0 to 3.0449314: 5 segments
   [junit4]   1> MS 100 [2018-07-12T00:16:14.506Z; TEST-TestMergeSchedulerExternal.testSubclassConcurrentMergeScheduler-seed#[D44C2E3F6D3C85EA]]: now merge
   [junit4]   1> MS 100 [2018-07-12T00:16:14.506Z; TEST-TestMergeSchedulerExternal.testSubclassConcurrentMergeScheduler-seed#[D44C2E3F6D3C85EA]]:   index: _0(8.0.0):C2 _1(8.0.0):C2 _2(8.0.0):C2 _3(8.0.0):C2 _4(8.0.0):C2
   [junit4]   1> MS 100 [2018-07-12T00:16:14.506Z; TEST-TestMergeSchedulerExternal.testSubclassConcurrentMergeScheduler-seed#[D44C2E3F6D3C85EA]]:   no more merges pending; now return
   [junit4]   1> DWPT 100 [2018-07-12T00:16:14.508Z; TEST-TestMergeSchedulerExternal.testSubclassConcurrentMergeScheduler-seed#[D44C2E3F6D3C85EA]]: flush postings as segment _5 numDocs=2
   [junit4]   1> IW 100 [2018-07-12T00:16:14.508Z; TEST-TestMergeSchedulerExternal.testSubclassConcurrentMergeScheduler-seed#[D44C2E3F6D3C85EA]]: 0 msec to write norms
   [junit4]   1> IW 100 [2018-07-12T00:16:14.508Z; TEST-TestMergeSchedulerExternal.testSubclassConcurrentMergeScheduler-seed#[D44C2E3F6D3C85EA]]: 0 msec to write docValues
   [junit4]   1> IW 100 [2018-07-12T00:16:14.508Z; TEST-TestMergeSchedulerExternal.testSubclassConcurrentMergeScheduler-seed#[D44C2E3F6D3C85EA]]: 0 msec to write points
   [junit4]   1> IW 100 [2018-07-12T00:16:14.510Z; TEST-TestMergeSchedulerExternal.testSubclassConcurrentMergeScheduler-seed#[D44C2E3F6D3C85EA]]: 2 msec to finish stored fields
   [junit4]   1> IW 100 [2018-07-12T00:16:14.521Z; TEST-TestMergeSchedulerExternal.testSubclassConcurrentMergeScheduler-seed#[D44C2E3F6D3C85EA]]: 10 msec to write postings and finish vectors
   [junit4]   1> IW 100 [2018-07-12T00:16:14.523Z; TEST-TestMergeSchedulerExternal.testSubclassConcurrentMergeScheduler-seed#[D44C2E3F6D3C85EA]]: 2 msec to write fieldInfos
   [junit4]   1> DWPT 100 [2018-07-12T00:16:14.523Z; TEST-TestMergeSchedulerExternal.testSubclassConcurrentMergeScheduler-seed#[D44C2E3F6D3C85EA]]: new segment has 0 deleted docs
   [junit4]   1> DWPT 100 [2018-07-12T00:16:14.523Z; TEST-TestMergeSchedulerExternal.testSubclassConcurrentMergeScheduler-seed#[D44C2E3F6D3C85EA]]: new segment has 0 soft-deleted docs
   [junit4]   1> DWPT 100 [2018-07-12T00:16:14.523Z; TEST-TestMergeSchedulerExternal.testSubclassConcurrentMergeScheduler-seed#[D44C2E3F6D3C85EA]]: new segment has no vectors; no norms; no docValues; no prox; no freqs
   [junit4]   1> DWPT 100 [2018-07-12T00:16:14.523Z; TEST-TestMergeSchedulerExternal.testSubclassConcurrentMergeScheduler-seed#[D44C2E3F6D3C85EA]]: flushedFiles=[_5.fnm, _5.fdt, _5_Direct_0.tip, _5_Direct_0.doc, _5_Direct_0.tim, _5.fdx]
   [junit4]   1> DWPT 100 [2018-07-12T00:16:14.523Z; TEST-TestMergeSchedulerExternal.testSubclassConcurrentMergeScheduler-seed#[D44C2E3F6D3C85EA]]: flushed codec=Asserting(Lucene70): {id=PostingsFormat(name=Direct)}, docValues:{}, maxPointsInLeafNode=1111, maxMBSortInHeap=6.355380898031095
   [junit4]   1> DWPT 100 [2018-07-12T00:16:14.523Z; TEST-TestMergeSchedulerExternal.testSubclassConcurrentMergeScheduler-seed#[D44C2E3F6D3C85EA]]: flushed: segment=_5 ramUsed=0.071 MB newFlushedSize=0.001 MB docs/MB=3,070.501
   [junit4]   1> DWPT 100 [2018-07-12T00:16:14.528Z; TEST-TestMergeSchedulerExternal.testSubclassConcurrentMergeScheduler-seed#[D44C2E3F6D3C85EA]]: flush time 19.974201 msec
   [junit4]   1> IW 100 [2018-07-12T00:16:14.528Z; TEST-TestMergeSchedulerExternal.testSubclassConcurrentMergeScheduler-seed#[D44C2E3F6D3C85EA]]: publishFlushedSegment seg-private updates=null
   [junit4]   1> IW 100 [2018-07-12T00:16:14.528Z; TEST-TestMergeSchedulerExternal.testSubclassConcurrentMergeScheduler-seed#[D44C2E3F6D3C85EA]]: publishFlushedSegment _5(8.0.0):C2
   [junit4]   1> BD 100 [2018-07-12T00:16:14.528Z; TEST-TestMergeSchedulerExternal.testSubclassConcurrentMergeScheduler-seed#[D44C2E3F6D3C85EA]]: finished packet delGen=6 now completedDelGen=6
   [junit4]   1> IW 100 [2018-07-12T00:16:14.528Z; TEST-TestMergeSchedulerExternal.testSubclassConcurrentMergeScheduler-seed#[D44C2E3F6D3C85EA]]: publish sets newSegment delGen=6 seg=_5(8.0.0):C2
   [junit4]   1> IFD 100 [2018-07-12T00:16:14.528Z; TEST-TestMergeSchedulerExternal.testSubclassConcurrentMergeScheduler-seed#[D44C2E3F6D3C85EA]]: now checkpoint "_0(8.0.0):C2 _1(8.0.0):C2 _2(8.0.0):C2 _3(8.0.0):C2 _4(8.0.0):C2 _5(8.0.0):C2" [6 segments ; isCommit = false]
   [junit4]   1> IFD 100 [2018-07-12T00:16:14.528Z; TEST-TestMergeSchedulerExternal.testSubclassConcurrentMergeScheduler-seed#[D44C2E3F6D3C85EA]]: 0 msec to checkpoint
   [junit4]   1> MP 100 [2018-07-12T00:16:14.528Z; TEST-TestMergeSchedulerExternal.testSubclassConcurrentMergeScheduler-seed#[D44C2E3F6D3C85EA]]: findMerges: 6 segments
   [junit4]   1> MP 100 [2018-07-12T00:16:14.528Z; TEST-TestMergeSchedulerExternal.testSubclassConcurrentMergeScheduler-seed#[D44C2E3F6D3C85EA]]: seg=_0(8.0.0):C2 level=3.0449314 size=0.001 MB
   [junit4]   1> MP 100 [2018-07-12T00:16:14.528Z; TEST-TestMergeSchedulerExternal.testSubclassConcurrentMergeScheduler-seed#[D44C2E3F6D3C85EA]]: seg=_1(8.0.0):C2 level=3.0449314 size=0.001 MB
   [junit4]   1> MP 100 [2018-07-12T00:16:14.528Z; TEST-TestMergeSchedulerExternal.testSubclassConcurrentMergeScheduler-seed#[D44C2E3F6D3C85EA]]: seg=_2(8.0.0):C2 level=3.0449314 size=0.001 MB
   [junit4]   1> MP 100 [2018-07-12T00:16:14.528Z; TEST-TestMergeSchedulerExternal.testSubclassConcurrentMergeScheduler-seed#[D44C2E3F6D3C85EA]]: seg=_3(8.0.0):C2 level=3.0449314 size=0.001 MB
   [junit4]   1> MP 100 [2018-07-12T00:16:14.528Z; TEST-TestMergeSchedulerExternal.testSubclassConcurrentMergeScheduler-seed#[D44C2E3F6D3C85EA]]: seg=_4(8.0.0):C2 level=3.0449314 size=0.001 MB
   [junit4]   1> MP 100 [2018-07-12T00:16:14.528Z; TEST-TestMergeSchedulerExternal.testSubclassConcurrentMergeScheduler-seed#[D44C2E3F6D3C85EA]]: seg=_5(8.0.0):C2 level=3.0449314 size=0.001 MB
   [junit4]   1> MP 100 [2018-07-12T00:16:14.528Z; TEST-TestMergeSchedulerExternal.testSubclassConcurrentMergeScheduler-seed#[D44C2E3F6D3C85EA]]:   level -1.0 to 3.0449314: 6 segments
   [junit4]   1> MS 100 [2018-07-12T00:16:14.528Z; TEST-TestMergeSchedulerExternal.testSubclassConcurrentMergeScheduler-seed#[D44C2E3F6D3C85EA]]: now merge
   [junit4]   1> MS 100 [2018-07-12T00:16:14.528Z; TEST-TestMergeSchedulerExternal.testSubclassConcurrentMergeScheduler-seed#[D44C2E3F6D3C85EA]]:   index: _0(8.0.0):C2 _1(8.0.0):C2 _2(8.0.0):C2 _3(8.0.0):C2 _4(8.0.0):C2 _5(8.0.0):C2
   [junit4]   1> MS 100 [2018-07-12T00:16:14.528Z; TEST-TestMergeSchedulerExternal.testSubclassConcurrentMergeScheduler-seed#[D44C2E3F6D3C85EA]]:   no more merges pending; now return
   [junit4]   1> DWPT 100 [2018-07-12T00:16:14.530Z; TEST-TestMergeSchedulerExternal.testSubclassConcurrentMergeScheduler-seed#[D44C2E3F6D3C85EA]]: flush postings as segment _6 numDocs=2
   [junit4]   1> IW 100 [2018-07-12T00:16:14.530Z; TEST-TestMergeSchedulerExternal.testSubclassConcurrentMergeScheduler-seed#[D44C2E3F6D3C85EA]]: 0 msec to write norms
   [junit4]   1> IW 100 [2018-07-12T00:16:14.530Z; TEST-TestMergeSchedulerExternal.testSubclassConcurrentMergeScheduler-seed#[D44C2E3F6D3C85EA]]: 0 msec to write docValues
   [junit4]   1> IW 100 [2018-07-12T00:16:14.530Z; TEST-TestMergeSchedulerExternal.testSubclassConcurrentMergeScheduler-seed#[D44C2E3F6D3C85EA]]: 0 msec to write points
   [junit4]   1> IW 100 [2018-07-12T00:16:14.532Z; TEST-TestMergeSchedulerExternal.testSubclassConcurrentMergeScheduler-seed#[D44C2E3F6D3C85EA]]: 2 msec to finish stored fields
   [junit4]   1> IW 100 [2018-07-12T00:16:14.543Z; TEST-TestMergeSchedulerExternal.testSubclassConcurrentMergeScheduler-seed#[D44C2E3F6D3C85EA]]: 10 msec to write postings and finish vectors
   [junit4]   1> IW 100 [2018-07-12T00:16:14.545Z; TEST-TestMergeSchedulerExternal.testSubclassConcurrentMergeScheduler-seed#[D44C2E3F6D3C85EA]]: 2 msec to write fieldInfos
   [junit4]   1> DWPT 100 [2018-07-12T00:16:14.545Z; TEST-TestMergeSchedulerExternal.testSubclassConcurrentMergeScheduler-seed#[D44C2E3F6D3C85EA]]: new segment has 0 deleted docs
   [junit4]   1> DWPT 100 [2018-07-12T00:16:14.545Z; TEST-TestMergeSchedulerExternal.testSubclassConcurrentMergeScheduler-seed#[D44C2E3F6D3C85EA]]: new segment has 0 soft-deleted docs
   [junit4]   1> DWPT 100 [2018-07-12T00:16:14.545Z; TEST-TestMergeSchedulerExternal.testSubclassConcurrentMergeScheduler-seed#[D44C2E3F6D3C85EA]]: new segment has no vectors; no norms; no docValues; no prox; no freqs
   [junit4]   1> DWPT 100 [2018-07-12T00:16:14.545Z; TEST-TestMergeSchedulerExternal.testSubclassConcurrentMergeScheduler-seed#[D44C2E3F6D3C85EA]]: flushedFiles=[_6.fdt, _6.fnm, _6.fdx, _6_Direct_0.doc, _6_Direct_0.tim, _6_Direct_0.tip]
   [junit4]   1> DWPT 100 [2018-07-12T00:16:14.545Z; TEST-TestMergeSchedulerExternal.testSubclassConcurrentMergeScheduler-seed#[D44C2E3F6D3C85EA]]: flushed codec=Asserting(Lucene70): {id=PostingsFormat(name=Direct)}, docValues:{}, maxPointsInLeafNode=1111, maxMBSortInHeap=6.355380898031095
   [junit4]   1> DWPT 100 [2018-07-12T00:16:14.545Z; TEST-TestMergeSchedulerExternal.testSubclassConcurrentMergeScheduler-seed#[D44C2E3F6D3C85EA]]: flushed: segment=_6 ramUsed=0.071 MB newFlushedSize=0.001 MB docs/MB=3,070.501
   [junit4]   1> DWPT 100 [2018-07-12T00:16:14.550Z; TEST-TestMergeSchedulerExternal.testSubclassConcurrentMergeScheduler-seed#[D44C2E3F6D3C85EA]]: flush time 20.464798 msec
   [junit4]   1> IW 100 [2018-07-12T00:16:14.550Z; TEST-TestMergeSchedulerExternal.testSubclassConcurrentMergeScheduler-seed#[D44C2E3F6D3C85EA]]: publishFlushedSegment seg-private updates=null
   [junit4]   1> IW 100 [2018-07-12T00:16:14.550Z; TEST-TestMergeSchedulerExternal.testSubclassConcurrentMergeScheduler-seed#[D44C2E3F6D3C85EA]]: publishFlushedSegment _6(8.0.0):C2
   [junit4]   1> BD 100 [2018-07-12T00:16:14.550Z; TEST-TestMergeSchedulerExternal.testSubclassConcurrentMergeScheduler-seed#[D44C2E3F6D3C85EA]]: finished packet delGen=7 now completedDelGen=7
   [junit4]   1> IW 100 [2018-07-12T00:16:14.550Z; TEST-TestMergeSchedulerExternal.testSubclassConcurrentMergeScheduler-seed#[D44C2E3F6D3C85EA]]: publish sets newSegment delGen=7 seg=_6(8.0.0):C2
   [junit4]   1> IFD 100 [2018-07-12T00:16:14.550Z; TEST-TestMergeSchedulerExternal.testSubclassConcurrentMergeScheduler-seed#[D44C2E3F6D3C85EA]]: now checkpoint "_0(8.0.0):C2 _1(8.0.0):C2 _2(8.0.0):C2 _3(8.0.0):C2 _4(8.0.0):C2 _5(8.0.0):C2 _6(8.0.0):C2" [7 segments ; isCommit = false]
   [junit4]   1> IFD 100 [2018-07-12T00:16:14.551Z; TEST-TestMergeSchedulerExternal.testSubclassConcurrentMergeScheduler-seed#[D44C2E3F6D3C85EA]]: 0 msec to checkpoint
   [junit4]   1> MP 100 [2018-07-12T00:16:14.551Z; TEST-TestMergeSchedulerExternal.testSubclassConcurrentMergeScheduler-seed#[D44C2E3F6D3C85EA]]: findMerges: 7 segments
   [junit4]   1> MP 100 [2018-07-12T00:16:14.551Z; TEST-TestMergeSchedulerExternal.testSubclassConcurrentMergeScheduler-seed#[D44C2E3F6D3C85EA]]: seg=_0(8.0.0):C2 level=3.0449314 size=0.001 MB
   [junit4]   1> MP 100 [2018-07-12T00:16:14.551Z; TEST-TestMergeSchedulerExternal.testSubclassConcurrentMergeScheduler-seed#[D44C2E3F6D3C85EA]]: seg=_1(8.0.0):C2 level=3.0449314 size=0.001 MB
   [junit4]   1> MP 100 [2018-07-12T00:16:14.551Z; TEST-TestMergeSchedulerExternal.testSubclassConcurrentMergeScheduler-seed#[D44C2E3F6D3C85EA]]: seg=_2(8.0.0):C2 level=3.0449314 size=0.001 MB
   [junit4]   1> MP 100 [2018-07-12T00:16:14.551Z; TEST-TestMergeSchedulerExternal.testSubclassConcurrentMergeScheduler-seed#[D44C2E3F6D3C85EA]]: seg=_3(8.0.0):C2 level=3.0449314 size=0.001 MB
   [junit4]   1> MP 100 [2018-07-12T00:16:14.551Z; TEST-TestMergeSchedulerExternal.testSubclassConcurrentMergeScheduler-seed#[D44C2E3F6D3C85EA]]: seg=_4(8.0.0):C2 level=3.0449314 size=0.001 MB
   [junit4]   1> MP 100 [2018-07-12T00:16:14.551Z; TEST-TestMergeSchedulerExternal.testSubclassConcurrentMergeScheduler-seed#[D44C2E3F6D3C85EA]]: seg=_5(8.0.0):C2 level=3.0449314 size=0.001 MB
   [junit4]   1> MP 100 [2018-07-12T00:16:14.551Z; TEST-TestMergeSchedulerExternal.testSubclassConcurrentMergeScheduler-seed#[D44C2E3F6D3C85EA]]: seg=_6(8.0.0):C2 level=3.0449314 size=0.001 MB
   [junit4]   1> MP 100 [2018-07-12T00:16:14.551Z; TEST-TestMergeSchedulerExternal.testSubclassConcurrentMergeScheduler-seed#[D44C2E3F6D3C85EA]]:   level -1.0 to 3.0449314: 7 segments
   [junit4]   1> MS 100 [2018-07-12T00:16:14.551Z; TEST-TestMergeSchedulerExternal.testSubclassConcurrentMergeScheduler-seed#[D44C2E3F6D3C85EA]]: now merge
   [junit4]   1> MS 100 [2018-07-12T00:16:14.551Z; TEST-TestMergeSchedulerExternal.testSubclassConcurrentMergeScheduler-seed#[D44C2E3F6D3C85EA]]:   index: _0(8.0.0):C2 _1(8.0.0):C2 _2(8.0.0):C2 _3(8.0.0):C2 _4(8.0.0):C2 _5(8.0.0):C2 _6(8.0.0):C2
   [junit4]   1> MS 100 [2018-07-12T00:16:14.551Z; TEST-TestMergeSchedulerExternal.testSubclassConcurrentMergeScheduler-seed#[D44C2E3F6D3C85EA]]:   no more merges pending; now return
   [junit4]   1> DWPT 100 [2018-07-12T00:16:14.552Z; TEST-TestMergeSchedulerExternal.testSubclassConcurrentMergeScheduler-seed#[D44C2E3F6D3C85EA]]: flush postings as segment _7 numDocs=2
   [junit4]   1> IW 100 [2018-07-12T00:16:14.552Z; TEST-TestMergeSchedulerExternal.testSubclassConcurrentMergeScheduler-seed#[D44C2E3F6D3C85EA]]: 0 msec to write norms
   [junit4]   1> IW 100 [2018-07-12T00:16:14.552Z; TEST-TestMergeSchedulerExternal.testSubclassConcurrentMergeScheduler-seed#[D44C2E3F6D3C85EA]]: 0 msec to write docValues
   [junit4]   1> IW 100 [2018-07-12T00:16:14.552Z; TEST-TestMergeSchedulerExternal.testSubclassConcurrentMergeScheduler-seed#[D44C2E3F6D3C85EA]]: 0 msec to write points
   [junit4]   1> IW 100 [2018-07-12T00:16:14.554Z; TEST-TestMergeSchedulerExternal.testSubclassConcurrentMergeScheduler-seed#[D44C2E3F6D3C85EA]]: 1 msec to finish stored fields
   [junit4]   1> IW 100 [2018-07-12T00:16:14.564Z; TEST-TestMergeSchedulerExternal.testSubclassConcurrentMergeScheduler-seed#[D44C2E3F6D3C85EA]]: 9 msec to write postings and finish vectors
   [junit4]   1> IW 100 [2018-07-12T00:16:14.566Z; TEST-TestMergeSchedulerExternal.testSubclassConcurrentMergeScheduler-seed#[D44C2E3F6D3C85EA]]: 2 msec to write fieldInfos
   [junit4]   1> DWPT 100 [2018-07-12T00:16:14.566Z; TEST-TestMergeSchedulerExternal.testSubclassConcurrentMergeScheduler-seed#[D44C2E3F6D3C85EA]]: new segment has 0 deleted docs
   [junit4]   1> DWPT 100 [2018-07-12T00:16:14.566Z; TEST-TestMergeSchedulerExternal.testSubclassConcurrentMergeScheduler-seed#[D44C2E3F6D3C85EA]]: new segment has 0 soft-deleted docs
   [junit4]   1> DWPT 100 [2018-07-12T00:16:14.566Z; TEST-TestMergeSchedulerExternal.testSubclassConcurrentMergeScheduler-seed#[D44C2E3F6D3C85EA]]: new segment has no vectors; no norms; no docValues; no prox; no freqs
   [junit4]   1> DWPT 100 [2018-07-12T00:16:14.566Z; TEST-TestMergeSchedulerExternal.testSubclassConcurrentMergeScheduler-seed#[D44C2E3F6D3C85EA]]: flushedFiles=[_7.fnm, _7.fdt, _7_Direct_0.tim, _7_Direct_0.doc, _7_Direct_0.tip, _7.fdx]
   [junit4]   1> DWPT 100 [2018-07-12T00:16:14.566Z; TEST-TestMergeSchedulerExternal.testSubclassConcurrentMergeScheduler-seed#[D44C2E3F6D3C85EA]]: flushed codec=Asserting(Lucene70): {id=PostingsFormat(name=Direct)}, docValues:{}, maxPointsInLeafNode=1111, maxMBSortInHeap=6.355380898031095
   [junit4]   1> DWPT 100 [2018-07-12T00:16:14.566Z; TEST-TestMergeSchedulerExternal.testSubclassConcurrentMergeScheduler-seed#[D44C2E3F6D3C85EA]]: flushed: segment=_7 ramUsed=0.071 MB newFlushedSize=0.001 MB docs/MB=3,070.501
   [junit4]   1> DWPT 100 [2018-07-12T00:16:14.571Z; TEST-TestMergeSchedulerExternal.testSubclassConcurrentMergeScheduler-seed#[D44C2E3F6D3C85EA]]: flush time 18.291705 msec
   [junit4]   1> IW 100 [2018-07-12T00:16:14.571Z; TEST-TestMergeSchedulerExternal.testSubclassConcurrentMergeScheduler-seed#[D44C2E3F6D3C85EA]]: publishFlushedSegment seg-private updates=null
   [junit4]   1> IW 100 [2018-07-12T00:16:14.571Z; TEST-TestMergeSchedulerExternal.testSubclassConcurrentMergeScheduler-seed#[D44C2E3F6D3C85EA]]: publishFlushedSegment _7(8.0.0):C2
   [junit4]   1> BD 100 [2018-07-12T00:16:14.571Z; TEST-TestMergeSchedulerExternal.testSubclassConcurrentMergeScheduler-seed#[D44C2E3F6D3C85EA]]: finished packet delGen=8 now completedDelGen=8
   [junit4]   1> IW 100 [2018-07-12T00:16:14.571Z; TEST-TestMergeSchedulerExternal.testSubclassConcurrentMergeScheduler-seed#[D44C2E3F6D3C85EA]]: publish sets newSegment delGen=8 seg=_7(8.0.0):C2
   [junit4]   1> IFD 100 [2018-07-12T00:16:14.571Z; TEST-TestMergeSchedulerExternal.testSubclassConcurrentMergeScheduler-seed#[D44C2E3F6D3C85EA]]: now checkpoint "_0(8.0.0):C2 _1(8.0.0):C2 _2(8.0.0):C2 _3(8.0.0):C2 _4(8.0.0):C2 _5(8.0.0):C2 _6(8.0.0):C2 _7(8.0.0):C2" [8 segments ; isCommit = false]
   [junit4]   1> IFD 100 [2018-07-12T00:16:14.571Z; TEST-TestMergeSchedulerExternal.testSubclassConcurrentMergeScheduler-seed#[D44C2E3F6D3C85EA]]: 0 msec to checkpoint
   [junit4]   1> MP 100 [2018-07-12T00:16:14.571Z; TEST-TestMergeSchedulerExternal.testSubclassConcurrentMergeScheduler-seed#[D44C2E3F6D3C85EA]]: findMerges: 8 segments
   [junit4]   1> MP 100 [2018-07-12T00:16:14.571Z; TEST-TestMergeSchedulerExternal.testSubclassConcurrentMergeScheduler-seed#[D44C2E3F6D3C85EA]]: seg=_0(8.0.0):C2 level=3.0449314 size=0.001 MB
   [junit4]   1> MP 100 [2018-07-12T00:16:14.571Z; TEST-TestMergeSchedulerExternal.testSubclassConcurrentMergeScheduler-seed#[D44C2E3F6D3C85EA]]: seg=_1(8.0.0):C2 level=3.0449314 size=0.001 MB
   [junit4]   1> MP 100 [2018-07-12T00:16:14.571Z; TEST-TestMergeSchedulerExternal.testSubclassConcurrentMergeScheduler-seed#[D44C2E3F6D3C85EA]]: seg=_2(8.0.0):C2 level=3.0449314 size=0.001 MB
   [junit4]   1> MP 100 [2018-07-12T00:16:14.571Z; TEST-TestMergeSchedulerExternal.testSubclassConcurrentMergeScheduler-seed#[D44C2E3F6D3C85EA]]: seg=_3(8.0.0):C2 level=3.0449314 size=0.001 MB
   [junit4]   1> MP 100 [2018-07-12T00:16:14.571Z; TEST-TestMergeSchedulerExternal.testSubclassConcurrentMergeScheduler-seed#[D44C2E3F6D3C85EA]]: seg=_4(8.0.0):C2 level=3.0449314 size=0.001 MB
   [junit4]   1> MP 100 [2018-07-12T00:16:14.571Z; TEST-TestMergeSchedulerExternal.testSubclassConcurrentMergeScheduler-seed#[D44C2E3F6D3C85EA]]: seg=_5(8.0.0):C2 level=3.0449314 size=0.001 MB
   [junit4]   1> MP 100 [2018-07-12T00:16:14.571Z; TEST-TestMergeSchedulerExternal.testSubclassConcurrentMergeScheduler-seed#[D44C2E3F6D3C85EA]]: seg=_6(8.0.0):C2 level=3.0449314 size=0.001 MB
   [junit4]   1> MP 100 [2018-07-12T00:16:14.571Z; TEST-TestMergeSchedulerExternal.testSubclassConcurrentMergeScheduler-seed#[D44C2E3F6D3C85EA]]: seg=_7(8.0.0):C2 level=3.0449314 size=0.001 MB
   [junit4]   1> MP 100 [2018-07-12T00:16:14.571Z; TEST-TestMergeSchedulerExternal.testSubclassConcurrentMergeScheduler-seed#[D44C2E3F6D3C85EA]]:   level -1.0 to 3.0449314: 8 segments
   [junit4]   1> MS 100 [2018-07-12T00:16:14.571Z; TEST-TestMergeSchedulerExternal.testSubclassConcurrentMergeScheduler-seed#[D44C2E3F6D3C85EA]]: now merge
   [junit4]   1> MS 100 [2018-07-12T00:16:14.571Z; TEST-TestMergeSchedulerExternal.testSubclassConcurrentMergeScheduler-seed#[D44C2E3F6D3C85EA]]:   index: _0(8.0.0):C2 _1(8.0.0):C2 _2(8.0.0):C2 _3(8.0.0):C2 _4(8.0.0):C2 _5(8.0.0):C2 _6(8.0.0):C2 _7(8.0.0):C2
   [junit4]   1> MS 100 [2018-07-12T00:16:14.571Z; TEST-TestMergeSchedulerExternal.testSubclassConcurrentMergeScheduler-seed#[D44C2E3F6D3C85EA]]:   no more merges pending; now return
   [junit4]   1> DWPT 100 [2018-07-12T00:16:14.572Z; TEST-TestMergeSchedulerExternal.testSubclassConcurrentMergeScheduler-seed#[D44C2E3F6D3C85EA]]: flush postings as segment _8 numDocs=2
   [junit4]   1> IW 100 [2018-07-12T00:16:14.572Z; TEST-TestMergeSchedulerExternal.testSubclassConcurrentMergeScheduler-seed#[D44C2E3F6D3C85EA]]: 0 msec to write norms
   [junit4]   1> IW 100 [2018-07-12T00:16:14.572Z; TEST-TestMergeSchedulerExternal.testSubclassConcurrentMergeScheduler-seed#[D44C2E3F6D3C85EA]]: 0 msec to write docValues
   [junit4]   1> IW 100 [2018-07-12T00:16:14.572Z; TEST-TestMergeSchedulerExternal.testSubclassConcurrentMergeScheduler-seed#[D44C2E3F6D3C85EA]]: 0 msec to write points
   [junit4]   1> IW 100 [2018-07-12T00:16:14.575Z; TEST-TestMergeSchedulerExternal.testSubclassConcurrentMergeScheduler-seed#[D44C2E3F6D3C85EA]]: 2 msec to finish stored fields
   [junit4]   1> IW 100 [2018-07-12T00:16:14.587Z; TEST-TestMergeSchedulerExternal.testSubclassConcurrentMergeScheduler-seed#[D44C2E3F6D3C85EA]]: 11 msec to write postings and finish vectors
   [junit4]   1> IW 100 [2018-07-12T00:16:14.589Z; TEST-TestMergeSchedulerExternal.testSubclassConcurrentMergeScheduler-seed#[D44C2E3F6D3C85EA]]: 2 msec to write fieldInfos
   [junit4]   1> DWPT 100 [2018-07-12T00:16:14.589Z; TEST-TestMergeSchedulerExternal.testSubclassConcurrentMergeScheduler-seed#[D44C2E3F6D3C85EA]]: new segment has 0 deleted docs
   [junit4]   1> DWPT 100 [2018-07-12T00:16:14.589Z; TEST-TestMergeSchedulerExternal.testSubclassConcurrentMergeScheduler-seed#[D44C2E3F6D3C85EA]]: new segment has 0 soft-deleted docs
   [junit4]   1> DWPT 100 [2018-07-12T00:16:14.589Z; TEST-TestMergeSchedulerExternal.testSubclassConcurrentMergeScheduler-seed#[D44C2E3F6D3C85EA]]: new segment has no vectors; no norms; no docValues; no prox; no freqs
   [junit4]   1> DWPT 100 [2018-07-12T00:16:14.589Z; TEST-TestMergeSchedulerExternal.testSubclassConcurrentMergeScheduler-seed#[D44C2E3F6D3C85EA]]: flushedFiles=[_8.fdx, _8_Direct_0.doc, _8.fdt, _8.fnm, _8_Direct_0.tim, _8_Direct_0.tip]
   [junit4]   1> DWPT 100 [2018-07-12T00:16:14.589Z; TEST-TestMergeSchedulerExternal.testSubclassConcurrentMergeScheduler-seed#[D44C2E3F6D3C85EA]]: flushed codec=Asserting(Lucene70): {id=PostingsFormat(name=Direct)}, docValues:{}, maxPointsInLeafNode=1111, maxMBSortInHeap=6.355380898031095
   [junit4]   1> DWPT 100 [2018-07-12T00:16:14.589Z; TEST-TestMergeSchedulerExternal.testSubclassConcurrentMergeScheduler-seed#[D44C2E3F6D3C85EA]]: flushed: segment=_8 ramUsed=0.071 MB newFlushedSize=0.001 MB docs/MB=3,070.501
   [junit4]   1> DWPT 100 [2018-07-12T00:16:14.594Z; TEST-TestMergeSchedulerExternal.testSubclassConcurrentMergeScheduler-seed#[D44C2E3F6D3C85EA]]: flush time 21.933945 msec
   [junit4]   1> IW 100 [2018-07-12T00:16:14.594Z; TEST-TestMergeSchedulerExternal.testSubclassConcurrentMergeScheduler-seed#[D44C2E3F6D3C85EA]]: publishFlushedSegment seg-private updates=null
   [junit4]   1> IW 100 [2018-07-12T00:16:14.594Z; TEST-TestMergeSchedulerExternal.testSubclassConcurrentMergeScheduler-seed#[D44C2E3F6D3C85EA]]: publishFlushedSegment _8(8.0.0):C2
   [junit4]   1> BD 100 [2018-07-12T00:16:14.594Z; TEST-TestMergeSchedulerExternal.testSubclassConcurrentMergeScheduler-seed#[D44C2E3F6D3C85EA]]: finished packet delGen=9 now completedDelGen=9
   [junit4]   1> IW 100 [2018-07-12T00:16:14.594Z; TEST-TestMergeSchedulerExternal.testSubclassConcurrentMergeScheduler-seed#[D44C2E3F6D3C85EA]]: publish sets newSegment delGen=9 seg=_8(8.0.0):C2
   [junit4]   1> IFD 100 [2018-07-12T00:16:14.594Z; TEST-TestMergeSchedulerExternal.testSubclassConcurrentMergeScheduler-seed#[D44C2E3F6D3C85EA]]: now checkpoint "_0(8.0.0):C2 _1(8.0.0):C2 _2(8.0.0):C2 _3(8.0.0):C2 _4(8.0.0):C2 _5(8.0.0):C2 _6(8.0.0):C2 _7(8.0.0):C2 _8(8.0.0):C2" [9 segments ; isCommit = false]
   [junit4]   1> IFD 100 [2018-07-12T00:16:14.594Z; TEST-TestMergeSchedulerExternal.testSubclassConcurrentMergeScheduler-seed#[D44C2E3F6D3C85EA]]: 0 msec to checkpoint
   [junit4]   1> MP 100 [2018-07-12T00:16:14.594Z; TEST-TestMergeSchedulerExternal.testSubclassConcurrentMergeScheduler-seed#[D44C2E3F6D3C85EA]]: findMerges: 9 segments
   [junit4]   1> MP 100 [2018-07-12T00:16:14.595Z; TEST-TestMergeSchedulerExternal.testSubclassConcurrentMergeScheduler-seed#[D44C2E3F6D3C85EA]]: seg=_0(8.0.0):C2 level=3.0449314 size=0.001 MB
   [junit4]   1> MP 100 [2018-07-12T00:16:14.595Z; TEST-TestMergeSchedulerExternal.testSubclassConcurrentMergeScheduler-seed#[D44C2E3F6D3C85EA]]: seg=_1(8.0.0):C2 level=3.0449314 size=0.001 MB
   [junit4]   1> MP 100 [2018-07-12T00:16:14.595Z; TEST-TestMergeSchedulerExternal.testSubclassConcurrentMergeScheduler-seed#[D44C2E3F6D3C85EA]]: seg=_2(8.0.0):C2 level=3.0449314 size=0.001 MB
   [junit4]   1> MP 100 [2018-07-12T00:16:14.595Z; TEST-TestMergeSchedulerExternal.testSubclassConcurrentMergeScheduler-seed#[D44C2E3F6D3C85EA]]: seg=_3(8.0.0):C2 level=3.0449314 size=0.001 MB
   [junit4]   1> MP 100 [2018-07-12T00:16:14.595Z; TEST-TestMergeSchedulerExternal.testSubclassConcurrentMergeScheduler-seed#[D44C2E3F6D3C85EA]]: seg=_4(8.0.0):C2 level=3.0449314 size=0.001 MB
   [junit4]   1> MP 100 [2018-07-12T00:16:14.595Z; TEST-TestMergeSchedulerExternal.testSubclassConcurrentMergeScheduler-seed#[D44C2E3F6D3C85EA]]: seg=_5(8.0.0):C2 level=3.0449314 size=0.001 MB
   [junit4]   1> MP 100 [2018-07-12T00:16:14.595Z; TEST-TestMergeSchedulerExternal.testSubclassConcurrentMergeScheduler-seed#[D44C2E3F6D3C85EA]]: seg=_6(8.0.0):C2 level=3.0449314 size=0.001 MB
   [junit4]   1> MP 100 [2018-07-12T00:16:14.595Z; TEST-TestMergeSchedulerExternal.testSubclassConcurrentMergeScheduler-seed#[D44C2E3F6D3C85EA]]: seg=_7(8.0.0):C2 level=3.0449314 size=0.001 MB
   [junit4]   1> MP 100 [2018-07-12T00:16:14.595Z; TEST-TestMergeSchedulerExternal.testSubclassConcurrentMergeScheduler-seed#[D44C2E3F6D3C85EA]]: seg=_8(8.0.0):C2 level=3.0449314 size=0.001 MB
   [junit4]   1> MP 100 [2018-07-12T00:16:14.595Z; TEST-TestMergeSchedulerExternal.testSubclassConcurrentMergeScheduler-seed#[D44C2E3F6D3C85EA]]:   level -1.0 to 3.0449314: 9 segments
   [junit4]   1> MS 100 [2018-07-12T00:16:14.595Z; TEST-TestMergeSchedulerExternal.testSubclassConcurrentMergeScheduler-seed#[D44C2E3F6D3C85EA]]: now merge
   [junit4]   1> MS 100 [2018-07-12T00:16:14.595Z; TEST-TestMergeSchedulerExternal.testSubclassConcurrentMergeScheduler-seed#[D44C2E3F6D3C85EA]]:   index: _0(8.0.0):C2 _1(8.0.0):C2 _2(8.0.0):C2 _3(8.0.0):C2 _4(8.0.0):C2 _5(8.0.0):C2 _6(8.0.0):C2 _7(8.0.0):C2 _8(8.0.0):C2
   [junit4]   1> MS 100 [2018-07-12T00:16:14.595Z; TEST-TestMergeSchedulerExternal.testSubclassConcurrentMergeScheduler-seed#[D44C2E3F6D3C85EA]]:   no more merges pending; now return
   [junit4]   1> DWPT 100 [2018-07-12T00:16:14.596Z; TEST-TestMergeSchedulerExternal.testSubclassConcurrentMergeScheduler-seed#[D44C2E3F6D3C85EA]]: flush postings as segment _9 numDocs=2
   [junit4]   1> IW 100 [2018-07-12T00:16:14.596Z; TEST-TestMergeSchedulerExternal.testSubclassConcurrentMergeScheduler-seed#[D44C2E3F6D3C85EA]]: 0 msec to write norms
   [junit4]   1> IW 100 [2018-07-12T00:16:14.596Z; TEST-TestMergeSchedulerExternal.testSubclassConcurrentMergeScheduler-seed#[D44C2E3F6D3C85EA]]: 0 msec to write docValues
   [junit4]   1> IW 100 [2018-07-12T00:16:14.596Z; TEST-TestMergeSchedulerExternal.testSubclassConcurrentMergeScheduler-seed#[D44C2E3F6D3C85EA]]: 0 msec to write points
   [junit4]   1> IW 100 [2018-07-12T00:16:14.600Z; TEST-TestMergeSchedulerExternal.testSubclassConcurrentMergeScheduler-seed#[D44C2E3F6D3C85EA]]: 3 msec to finish stored fields
   [junit4]   1> IW 100 [2018-07-12T00:16:14.608Z; TEST-TestMergeSchedulerExternal.testSubclassConcurrentMergeScheduler-seed#[D44C2E3F6D3C85EA]]: 8 msec to write postings and finish vectors
   [junit4]   1> IW 100 [2018-07-12T00:16:14.611Z; TEST-TestMergeSchedulerExternal.testSubclassConcurrentMergeScheduler-seed#[D44C2E3F6D3C85EA]]: 2 msec to write fieldInfos
   [junit4]   1> DWPT 100 [2018-07-12T00:16:14.611Z; TEST-TestMergeSchedulerExternal.testSubclassConcurrentMergeScheduler-seed#[D44C2E3F6D3C85EA]]: new segment has 0 deleted docs
   [junit4]   1> DWPT 100 [2018-07-12T00:16:14.611Z; TEST-TestMergeSchedulerExternal.testSubclassConcurrentMergeScheduler-seed#[D44C2E3F6D3C85EA]]: new segment has 0 soft-deleted docs
   [junit4]   1> DWPT 100 [2018-07-12T00:16:14.611Z; TEST-TestMergeSchedulerExternal.testSubclassConcurrentMergeScheduler-seed#[D44C2E3F6D3C85EA]]: new segment has no vectors; no norms; no docValues; no prox; no freqs
   [junit4]   1> DWPT 100 [2018-07-12T00:16:14.611Z; TEST-TestMergeSchedulerExternal.testSubclassConcurrentMergeScheduler-seed#[D44C2E3F6D3C85EA]]: flushedFiles=[_9.fdx, _9_Direct_0.tip, _9.fdt, _9_Direct_0.doc, _9_Direct_0.tim, _9.fnm]
   [junit4]   1> DWPT 100 [2018-07-12T00:16:14.611Z; TEST-TestMergeSchedulerExternal.testSubclassConcurrentMergeScheduler-seed#[D44C2E3F6D3C85EA]]: flushed codec=Asserting(Lucene70): {id=PostingsFormat(name=Direct)}, docValues:{}, maxPointsInLeafNode=1111, maxMBSortInHeap=6.355380898031095
   [junit4]   1> DWPT 100 [2018-07-12T00:16:14.611Z; TEST-TestMergeSchedulerExternal.testSubclassConcurrentMergeScheduler-seed#[D44C2E3F6D3C85EA]]: flushed: segment=_9 ramUsed=0.071 MB newFlushedSize=0.001 MB docs/MB=3,070.501
   [junit4]   1> DWPT 100 [2018-07-12T00:16:14.617Z; TEST-TestMergeSchedulerExternal.testSubclassConcurrentMergeScheduler-seed#[D44C2E3F6D3C85EA]]: flush time 20.28152 msec
   [junit4]   1> IW 100 [2018-07-12T00:16:14.617Z; TEST-TestMergeSchedulerExternal.testSubclassConcurrentMergeScheduler-seed#[D44C2E3F6D3C85EA]]: publishFlushedSegment seg-private updates=null
   [junit4]   1> IW 100 [2018-07-12T00:16:14.617Z; TEST-TestMergeSchedulerExternal.testSubclassConcurrentMergeScheduler-seed#[D44C2E3F6D3C85EA]]: publishFlushedSegment _9(8.0.0):C2
   [junit4]   1> BD 100 [2018-07-12T00:16:14.617Z; TEST-TestMergeSchedulerExternal.testSubclassConcurrentMergeScheduler-seed#[D44C2E3F6D3C85EA]]: finished packet delGen=10 now completedDelGen=10
   [junit4]   1> IW 100 [2018-07-12T00:16:14.617Z; TEST-TestMergeSchedulerExternal.testSubclassConcurrentMergeScheduler-seed#[D44C2E3F6D3C85EA]]: publish sets newSegment delGen=10 seg=_9(8.0.0):C2
   [junit4]   1> IFD 100 [2018-07-12T00:16:14.617Z; TEST-TestMergeSchedulerExternal.testSubclassConcurrentMergeScheduler-seed#[D44C2E3F6D3C85EA]]: now checkpoint "_0(8.0.0):C2 _1(8.0.0):C2 _2(8.0.0):C2 _3(8.0.0):C2 _4(8.0.0):C2 _5(8.0.0):C2 _6(8.0.0):C2 _7(8.0.0):C2 _8(8.0.0):C2 _9(8.0.0):C2" [10 segments ; isCommit = false]
   [junit4]   1> IFD 100 [2018-07-12T00:16:14.617Z; TEST-TestMergeSchedulerExternal.testSubclassConcurrentMergeScheduler-seed#[D44C2E3F6D3C85EA]]: 0 msec to checkpoint
   [junit4]   1> MP 100 [2018-07-12T00:16:14.617Z; TEST-TestMergeSchedulerExternal.testSubclassConcurrentMergeScheduler-seed#[D44C2E3F6D3C85EA]]: findMerges: 10 segments
   [junit4]   1> MP 100 [2018-07-12T00:16:14.617Z; TEST-TestMergeSchedulerExternal.testSubclassConcurrentMergeScheduler-seed#[D44C2E3F6D3C85EA]]: seg=_0(8.0.0):C2 level=3.0449314 size=0.001 MB
   [junit4]   1> MP 100 [2018-07-12T00:16:14.617Z; TEST-TestMergeSchedulerExternal.testSubclassConcurrentMergeScheduler-seed#[D44C2E3F6D3C85EA]]: seg=_1(8.0.0):C2 level=3.0449314 size=0.001 MB
   [junit4]   1> MP 100 [2018-07-12T00:16:14.617Z; TEST-TestMergeSchedulerExternal.testSubclassConcurrentMergeScheduler-seed#[D44C2E3F6D3C85EA]]: seg=_2(8.0.0):C2 level=3.0449314 size=0.001 MB
   [junit4]   1> MP 100 [2018-07-12T00:16:14.617Z; TEST-TestMergeSchedulerExternal.testSubclassConcurrentMergeScheduler-seed#[D44C2E3F6D3C85EA]]: seg=_3(8.0.0):C2 level=3.0449314 size=0.001 MB
   [junit4]   1> MP 100 [2018-07-12T00:16:14.617Z; TEST-TestMergeSchedulerExternal.testSubclassConcurrentMergeScheduler-seed#[D44C2E3F6D3C85EA]]: seg=_4(8.0.0):C2 level=3.0449314 size=0.001 MB
   [junit4]   1> MP 100 [2018-07-12T00:16:14.617Z; TEST-TestMergeSchedulerExternal.testSubclassConcurrentMergeScheduler-seed#[D44C2E3F6D3C85EA]]: seg=_5(8.0.0):C2 level=3.0449314 size=0.001 MB
   [junit4]   1> MP 100 [2018-07-12T00:16:14.617Z; TEST-TestMergeSchedulerExternal.testSubclassConcurrentMergeScheduler-seed#[D44C2E3F6D3C85EA]]: seg=_6(8.0.0):C2 level=3.0449314 size=0.001 MB
   [junit4]   1> MP 100 [2018-07-12T00:16:14.617Z; TEST-TestMergeSchedulerExternal.testSubclassConcurrentMergeScheduler-seed#[D44C2E3F6D3C85EA]]: seg=_7(8.0.0):C2 level=3.0449314 size=0.001 MB
   [junit4]   1> MP 100 [2018-07-12T00:16:14.617Z; TEST-TestMergeSchedulerExternal.testSubclassConcurrentMergeScheduler-seed#[D44C2E3F6D3C85EA]]: seg=_8(8.0.0):C2 level=3.0449314 size=0.001 MB
   [junit4]   1> MP 100 [2018-07-12T00:16:14.617Z; TEST-TestMergeSchedulerExternal.testSubclassConcurrentMergeScheduler-seed#[D44C2E3F6D3C85EA]]: seg=_9(8.0.0):C2 level=3.0449314 size=0.001 MB
   [junit4]   1> MP 100 [2018-07-12T00:16:14.617Z; TEST-TestMergeSchedulerExternal.testSubclassConcurrentMergeScheduler-seed#[D44C2E3F6D3C85EA]]:   level -1.0 to 3.0449314: 10 segments
   [junit4]   1> MP 100 [2018-07-12T00:16:14.617Z; TEST-TestMergeSchedulerExternal.testSubclassConcurrentMergeScheduler-seed#[D44C2E3F6D3C85EA]]:   add merge=_0(8.0.0):C2 _1(8.0.0):C2 _2(8.0.0):C2 _3(8.0.0):C2 _4(8.0.0):C2 _5(8.0.0):C2 _6(8.0.0):C2 _7(8.0.0):C2 _8(8.0.0):C2 _9(8.0.0):C2 start=0 end=10
   [junit4]   1> IW 100 [2018-07-12T00:16:14.617Z; TEST-TestMergeSchedulerExternal.testSubclassConcurrentMergeScheduler-seed#[D44C2E3F6D3C85EA]]: add merge to pendingMerges: _0(8.0.0):C2 _1(8.0.0):C2 _2(8.0.0):C2 _3(8.0.0):C2 _4(8.0.0):C2 _5(8.0.0):C2 _6(8.0.0):C2 _7(8.0.0):C2 _8(8.0.0):C2 _9(8.0.0):C2 [total 1 pending]
   [junit4]   1> IW 100 [2018-07-12T00:16:14.617Z; TEST-TestMergeSchedulerExternal.testSubclassConcurrentMergeScheduler-seed#[D44C2E3F6D3C85EA]]: registerMerge merging= []
   [junit4]   1> IW 100 [2018-07-12T00:16:14.617Z; TEST-TestMergeSchedulerExternal.testSubclassConcurrentMergeScheduler-seed#[D44C2E3F6D3C85EA]]: registerMerge info=_0(8.0.0):C2
   [junit4]   1> IW 100 [2018-07-12T00:16:14.617Z; TEST-TestMergeSchedulerExternal.testSubclassConcurrentMergeScheduler-seed#[D44C2E3F6D3C85EA]]: registerMerge info=_1(8.0.0):C2
   [junit4]   1> IW 100 [2018-07-12T00:16:14.617Z; TEST-TestMergeSchedulerExternal.testSubclassConcurrentMergeScheduler-seed#[D44C2E3F6D3C85EA]]: registerMerge info=_2(8.0.0):C2
   [junit4]   1> IW 100 [2018-07-12T00:16:14.617Z; TEST-TestMergeSchedulerExternal.testSubclassConcurrentMergeScheduler-seed#[D44C2E3F6D3C85EA]]: registerMerge info=_3(8.0.0):C2
   [junit4]   1> IW 100 [2018-07-12T00:16:14.617Z; TEST-TestMergeSchedulerExternal.testSubclassConcurrentMergeScheduler-seed#[D44C2E3F6D3C85EA]]: registerMerge info=_4(8.0.0):C2
   [junit4]   1> IW 100 [2018-07-12T00:16:14.617Z; TEST-TestMergeSchedulerExternal.testSubclassConcurrentMergeScheduler-seed#[D44C2E3F6D3C85EA]]: registerMerge info=_5(8.0.0):C2
   [junit4]   1> IW 100 [2018-07-12T00:16:14.617Z; TEST-TestMergeSchedulerExternal.testSubclassConcurrentMergeScheduler-seed#[D44C2E3F6D3C85EA]]: registerMerge info=_6(8.0.0):C2
   [junit4]   1> IW 100 [2018-07-12T00:16:14.617Z; TEST-TestMergeSchedulerExternal.testSubclassConcurrentMergeScheduler-seed#[D44C2E3F6D3C85EA]]: registerMerge info=_7(8.0.0):C2
   [junit4]   1> IW 100 [2018-07-12T00:16:14.617Z; TEST-TestMergeSchedulerExternal.testSubclassConcurrentMergeScheduler-seed#[D44C2E3F6D3C85EA]]: registerMerge info=_8(8.0.0):C2
   [junit4]   1> IW 100 [2018-07-12T00:16:14.617Z; TEST-TestMergeSchedulerExternal.testSubclassConcurrentMergeScheduler-seed#[D44C2E3F6D3C85EA]]: registerMerge info=_9(8.0.0):C2
   [junit4]   1> MS 100 [2018-07-12T00:16:14.617Z; TEST-TestMergeSchedulerExternal.testSubclassConcurrentMergeScheduler-seed#[D44C2E3F6D3C85EA]]: now merge
   [junit4]   1> MS 100 [2018-07-12T00:16:14.617Z; TEST-TestMergeSchedulerExternal.testSubclassConcurrentMergeScheduler-seed#[D44C2E3F6D3C85EA]]:   index: _0(8.0.0):C2 _1(8.0.0):C2 _2(8.0.0):C2 _3(8.0.0):C2 _4(8.0.0):C2 _5(8.0.0):C2 _6(8.0.0):C2 _7(8.0.0):C2 _8(8.0.0):C2 _9(8.0.0):C2
   [junit4]   1> MS 100 [2018-07-12T00:16:14.617Z; TEST-TestMergeSchedulerExternal.testSubclassConcurrentMergeScheduler-seed#[D44C2E3F6D3C85EA]]:   consider merge _0(8.0.0):C2 _1(8.0.0):C2 _2(8.0.0):C2 _3(8.0.0):C2 _4(8.0.0):C2 _5(8.0.0):C2 _6(8.0.0):C2 _7(8.0.0):C2 _8(8.0.0):C2 _9(8.0.0):C2
   [junit4]   1> MS 100 [2018-07-12T00:16:14.617Z; TEST-TestMergeSchedulerExternal.testSubclassConcurrentMergeScheduler-seed#[D44C2E3F6D3C85EA]]:     launch new thread [MyMergeThread]
   [junit4]   1> MS 100 [2018-07-12T00:16:14.617Z; TEST-TestMergeSchedulerExternal.testSubclassConcurrentMergeScheduler-seed#[D44C2E3F6D3C85EA]]: updateMergeThreads ioThrottle=true targetMBPerSec=20.0 MB/sec
   [junit4]   1> merge thread MyMergeThread estSize=0.0 MB (written=0.0 MB) runTime=0.0s (stopped=0.0s, paused=0.0s) rate=unlimited
   [junit4]   1>   leave running at Infinity MB/sec
   [junit4]   1> MS 100 [2018-07-12T00:16:14.617Z; MyMergeThread]:   merge thread: start
   [junit4]   1> BD 100 [2018-07-12T00:16:14.618Z; MyMergeThread]: waitApplyForMerge: 0 packets, 10 merging segments
   [junit4]   1> BD 100 [2018-07-12T00:16:14.618Z; MyMergeThread]: waitApply: no deletes to apply
   [junit4]   1> IW 100 [2018-07-12T00:16:14.618Z; MyMergeThread]: now apply deletes for 10 merging segments
   [junit4]   1> IW 100 [2018-07-12T00:16:14.618Z; MyMergeThread]: merge seg=_a _0(8.0.0):C2 _1(8.0.0):C2 _2(8.0.0):C2 _3(8.0.0):C2 _4(8.0.0):C2 _5(8.0.0):C2 _6(8.0.0):C2 _7(8.0.0):C2 _8(8.0.0):C2 _9(8.0.0):C2
   [junit4]   1> IW 100 [2018-07-12T00:16:14.619Z; MyMergeThread]: now merge
   [junit4]   1>   merge=_0(8.0.0):C2 _1(8.0.0):C2 _2(8.0.0):C2 _3(8.0.0):C2 _4(8.0.0):C2 _5(8.0.0):C2 _6(8.0.0):C2 _7(8.0.0):C2 _8(8.0.0):C2 _9(8.0.0):C2
   [junit4]   1>   index=_0(8.0.0):C2 _1(8.0.0):C2 _2(8.0.0):C2 _3(8.0.0):C2 _4(8.0.0):C2 _5(8.0.0):C2 _6(8.0.0):C2 _7(8.0.0):C2 _8(8.0.0):C2 _9(8.0.0):C2
   [junit4]   1> IW 100 [2018-07-12T00:16:14.619Z; MyMergeThread]: merging _0(8.0.0):C2 _1(8.0.0):C2 _2(8.0.0):C2 _3(8.0.0):C2 _4(8.0.0):C2 _5(8.0.0):C2 _6(8.0.0):C2 _7(8.0.0):C2 _8(8.0.0):C2 _9(8.0.0):C2
   [junit4]   1> IW 100 [2018-07-12T00:16:14.619Z; MyMergeThread]: TEST: now throw exc:
   [junit4]   1> java.io.IOException: now failing during merge
   [junit4]   1> at org.apache.lucene.TestMergeSchedulerExternal$FailOnlyOnMerge.eval(TestMergeSchedulerExternal.java:95)
   [junit4]   1> at org.apache.lucene.store.MockDirectoryWrapper.maybeThrowDeterministicException(MockDirectoryWrapper.java:1022)
   [junit4]   1> at org.apache.lucene.store.MockDirectoryWrapper.openInput(MockDirectoryWrapper.java:743)
   [junit4]   1> at org.apache.lucene.store.Directory.openChecksumInput(Directory.java:121)
   [junit4]   1> at org.apache.lucene.store.MockDirectoryWrapper.openChecksumInput(MockDirectoryWrapper.java:1072)
   [junit4]   1> at org.apache.lucene.codecs.lucene60.Lucene60FieldInfosFormat.read(Lucene60FieldInfosFormat.java:113)
   [junit4]   1> at org.apache.lucene.index.SegmentCoreReaders.<init>(SegmentCoreReaders.java:108)
   [junit4]   1> at org.apache.lucene.index.SegmentReader.<init>(SegmentReader.java:82)
   [junit4]   1> at org.apache.lucene.index.ReadersAndUpdates.getReader(ReadersAndUpdates.java:172)
   [junit4]   1> at org.apache.lucene.index.ReadersAndUpdates.getReaderForMerge(ReadersAndUpdates.java:705)
   [junit4]   1> at org.apache.lucene.index.IndexWriter.mergeMiddle(IndexWriter.java:4372)
   [junit4]   1> at org.apache.lucene.index.IndexWriter.merge(IndexWriter.java:4060)
   [junit4]   1> at org.apache.lucene.index.ConcurrentMergeScheduler.doMerge(ConcurrentMergeScheduler.java:625)
   [junit4]   1> at org.apache.lucene.TestMergeSchedulerExternal$MyMergeScheduler.doMerge(TestMergeSchedulerExternal.java:85)
   [junit4]   1> at org.apache.lucene.index.ConcurrentMergeScheduler$MergeThread.run(ConcurrentMergeScheduler.java:662)
   [junit4]   1>
   [junit4]   1> IW 100 [2018-07-12T00:16:14.619Z; MyMergeThread]: handleMergeException: merge=_0(8.0.0):C2 _1(8.0.0):C2 _2(8.0.0):C2 _3(8.0.0):C2 _4(8.0.0):C2 _5(8.0.0):C2 _6(8.0.0):C2 _7(8.0.0):C2 _8(8.0.0):C2 _9(8.0.0):C2 exc=java.io.IOException: now failing during merge
   [junit4]   1> IW 100 [2018-07-12T00:16:14.619Z; MyMergeThread]: hit exception during merge
   [junit4]   1> IW 100 [2018-07-12T00:16:14.619Z; MyMergeThread]: hit tragic IOException inside merge
   [junit4]   1> IW 100 [2018-07-12T00:16:14.619Z; MyMergeThread]: rollback
   [junit4]   1> IW 100 [2018-07-12T00:16:14.619Z; MyMergeThread]: all running merges have aborted
   [junit4]   1> IW 100 [2018-07-12T00:16:14.619Z; MyMergeThread]: rollback: done finish merges
   [junit4]   1> MS 100 [2018-07-12T00:16:14.617Z; TEST-TestMergeSchedulerExternal.testSubclassConcurrentMergeScheduler-seed#[D44C2E3F6D3C85EA]]:   no more merges pending; now return
   [junit4]   1> DW 100 [2018-07-12T00:16:14.620Z; MyMergeThread]: abort
   [junit4]   1> DW 100 [2018-07-12T00:16:14.620Z; MyMergeThread]: done abort success=true
   [junit4]   1> IW 100 [2018-07-12T00:16:14.620Z; MyMergeThread]: rollback: infos=
   [junit4]   1> IW 100 [2018-07-12T00:16:14.622Z; MyMergeThread]: TEST: now handleMergeException
   [junit4]   1> MS 100 [2018-07-12T00:16:14.622Z; MyMergeThread]: updateMergeThreads ioThrottle=true targetMBPerSec=20.0 MB/sec
   [junit4]   1>
   [junit4]   2> NOTE: reproduce with: ant test  -Dtestcase=TestMergeSchedulerExternal -Dtests.method=testSubclassConcurrentMergeScheduler -Dtests.seed=D44C2E3F6D3C85EA -Dtests.slow=true -Dtests.locale=ar-KW -Dtests.timezone=SystemV/YST9 -Dtests.asserts=true -Dtests.file.encoding=ISO-8859-1
   [junit4] FAILURE 0.24s J0 | TestMergeSchedulerExternal.testSubclassConcurrentMergeScheduler <<<
   [junit4]    > Throwable #1: java.lang.AssertionError
   [junit4]    > at __randomizedtesting.SeedInfo.seed([D44C2E3F6D3C85EA:53CD9392691CFFEE]:0)
   [junit4]    > at org.apache.lucene.TestMergeSchedulerExternal.testSubclassConcurrentMergeScheduler(TestMergeSchedulerExternal.java:147)
   [junit4]    > at java.lang.Thread.run(Thread.java:748)
   [junit4]   2> NOTE: test params are: codec=Asserting(Lucene70): {id=PostingsFormat(name=Direct)}, docValues:{}, maxPointsInLeafNode=1111, maxMBSortInHeap=6.355380898031095, sim=Asserting(org.apache.lucene.search.similarities.AssertingSimilarity@6c70cf4b), locale=ar-KW, timezone=SystemV/YST9
   [junit4]   2> NOTE: SunOS 5.11 amd64/Oracle Corporation 1.8.0_172 (64-bit)/cpus=3,threads=1,free=207131024,total=234881024
   [junit4]   2> NOTE: All tests run in this JVM: [TestStressIndexing, TestDocument, TestOneMergeWrappingMergePolicy, TestSimilarity, TestSpans, TestMultiFields, TestIndexReaderClose, TestSwappedIndexFiles, TestSimpleExplanationsWithFillerDocs, TestAllFilesCheckIndexHeader, TestStressAdvance, TestBasics, TestOmitPositions, TestCloseableThreadLocal, TestNumericUtils, TestPolygon, TestConsistentFieldNumbers, TestLSBRadixSorter, TestDocIdSetBuilder, TestPointQueries, TestPackedInts, TestDocIdSetIterator, TestArrayUtil, TestDirectMonotonic, TestMultiPhraseEnum, TestAtomicUpdate, TestIntroSorter, TestAssertions, TestNumericDocValuesUpdates, TestSpanNotQuery, TestFlushByRamOrCountsPolicy, TestReaderClosed, TestIntRangeFieldQueries, TestSearchWithThreads, TestSpanBoostQuery, TestNoDeletionPolicy, Test2BPostingsBytes, TestMixedDocValuesUpdates, TestIndexManyDocuments, TestSpanSearchEquivalence, TestFixedBitDocIdSet, TestPrefixCodedTerms, TestDuelingCodecsAtNight, TestLucene70SegmentInfoFormat, TestCodecs, TestBufferedChecksum, TestBagOfPostings, TestParallelCompositeReader, TestCachingCollector, TestIndexWriterDelete, TestExternalCodecs, TestSingleInstanceLockFactory, Test2BPositions, TestSimpleExplanations, TestSimilarity2, TestRecyclingIntBlockAllocator, TestBlockPostingsFormat3, TestPackedTokenAttributeImpl, TestPerSegmentDeletes, TestBM25Similarity, TestLongsRef, TestTermStates, TestRAMDirectory, TestDocCount, TestTrackingDirectoryWrapper, TestBlockMaxConjunction, TestPhrasePrefixQuery, TestTermsEnum, TestIndexWriterMergePolicy, TestIndexWriterCommit, TestControlledRealTimeReopenThread, TestNeverDelete, TestUTF32ToUTF8, TestIntBlockPool, TestTermVectorsReader, TestMathUtil, TestSloppyPhraseQuery, TestSameScoresWithThreads, TestCustomTermFreq, TestStringHelper, TestBytesRefAttImpl, TestCharacterUtils, TestSort, TestIndexWriterLockRelease, TestSloppyMath, TestIntRange, TestNormsFieldExistsQuery, TestDirectoryReaderReopen, TestLMDirichletSimilarity, TestBytesStore, TestNRTCachingDirectory, TestTermdocPerf, TestPayloads, TestTwoPhaseCommitTool, Test2BSortedDocValuesOrds, TestLucene50CompoundFormat, TestTransactions, TestTermScorer, TestGeoEncodingUtils, TestBooleanQueryVisitSubscorers, TestFilterMergePolicy, TestBoolean2ScorerSupplier, TestPointValues, TestSpanExplanationsOfNonMatches, TestDoubleValuesSource, TestIndexWriterExceptions, TestDeterminism, TestSimpleFSDirectory, TestApproximationSearchEquivalence, TestCharArraySet, TestIndexWriterThreadsToSegments, TestExitableDirectoryReader, TestLongValuesSource, TestGraphTokenStreamFiniteStrings, TestAxiomaticF1LOG, TestDemoParallelLeafReader, TestDocsAndPositions, TestConjunctions, TestBinaryTerms, TestIOUtils, TestSearch, TestBooleanScorer, TestNoMergeScheduler, TestIndexWriterOutOfFileDescriptors, TestMergeSchedulerExternal]
   [junit4] Completed [229/497 (1!)] on J0 in 0.25s, 2 tests, 1 failure <<< FAILURES!

[...truncated 11519 lines...]
   [junit4] Suite: org.apache.solr.cloud.TestCloudRecovery
   [junit4]   2> 483691 INFO  (SUITE-TestCloudRecovery-seed#[8EC7254AEC57F37E]-worker) [    ] o.a.s.SolrTestCaseJ4 SecureRandom sanity checks: test.solr.allowed.securerandom=null & java.security.egd=file:/dev/./urandom
   [junit4]   2> Creating dataDir: /export/home/jenkins/workspace/Lucene-Solr-master-Solaris/solr/build/solr-core/test/J0/temp/solr.cloud.TestCloudRecovery_8EC7254AEC57F37E-001/init-core-data-001
   [junit4]   2> 483692 INFO  (SUITE-TestCloudRecovery-seed#[8EC7254AEC57F37E]-worker) [    ] o.a.s.SolrTestCaseJ4 Using PointFields (NUMERIC_POINTS_SYSPROP=true) w/NUMERIC_DOCVALUES_SYSPROP=true
   [junit4]   2> 483692 INFO  (SUITE-TestCloudRecovery-seed#[8EC7254AEC57F37E]-worker) [    ] o.a.s.SolrTestCaseJ4 Randomized ssl (false) and clientAuth (true) via: @org.apache.solr.util.RandomizeSSL(reason=, value=NaN, ssl=NaN, clientAuth=NaN)
   [junit4]   2> 483693 INFO  (SUITE-TestCloudRecovery-seed#[8EC7254AEC57F37E]-worker) [    ] o.a.s.c.MiniSolrCloudCluster Starting cluster of 2 servers in /export/home/jenkins/workspace/Lucene-Solr-master-Solaris/solr/build/solr-core/test/J0/temp/solr.cloud.TestCloudRecovery_8EC7254AEC57F37E-001/tempDir-001
   [junit4]   2> 483693 INFO  (SUITE-TestCloudRecovery-seed#[8EC7254AEC57F37E]-worker) [    ] o.a.s.c.ZkTestServer STARTING ZK TEST SERVER
   [junit4]   2> 483693 INFO  (Thread-1093) [    ] o.a.s.c.ZkTestServer client port:0.0.0.0/0.0.0.0:0
   [junit4]   2> 483693 INFO  (Thread-1093) [    ] o.a.s.c.ZkTestServer Starting server
   [junit4]   2> 483695 ERROR (Thread-1093) [    ] o.a.z.s.ZooKeeperServer ZKShutdownHandler is not registered, so ZooKeeper server won't take any action on ERROR or SHUTDOWN server state changes
   [junit4]   2> 483793 INFO  (SUITE-TestCloudRecovery-seed#[8EC7254AEC57F37E]-worker) [    ] o.a.s.c.ZkTestServer start zk server on port:62685
   [junit4]   2> 483796 INFO  (zkConnectionManagerCallback-1362-thread-1) [    ] o.a.s.c.c.ConnectionManager zkClient has connected
   [junit4]   2> 483799 INFO  (jetty-launcher-1359-thread-1) [    ] o.e.j.s.Server jetty-9.4.11.v20180605; built: 2018-06-05T18:24:03.829Z; git: d5fc0523cfa96bfebfbda19606cad384d772f04c; jvm 1.8.0_172-b11
   [junit4]   2> 483800 INFO  (jetty-launcher-1359-thread-1) [    ] o.e.j.s.session DefaultSessionIdManager workerName=node0
   [junit4]   2> 483800 INFO  (jetty-launcher-1359-thread-1) [    ] o.e.j.s.session No SessionScavenger set, using defaults
   [junit4]   2> 483800 INFO  (jetty-launcher-1359-thread-1) [    ] o.e.j.s.session node0 Scavenging every 660000ms
   [junit4]   2> 483800 INFO  (jetty-launcher-1359-thread-2) [    ] o.e.j.s.Server jetty-9.4.11.v20180605; built: 2018-06-05T18:24:03.829Z; git: d5fc0523cfa96bfebfbda19606cad384d772f04c; jvm 1.8.0_172-b11
   [junit4]   2> 483800 INFO  (jetty-launcher-1359-thread-1) [    ] o.e.j.s.h.ContextHandler Started o.e.j.s.ServletContextHandler@3d870f9e{/solr,null,AVAILABLE}
   [junit4]   2> 483801 INFO  (jetty-launcher-1359-thread-2) [    ] o.e.j.s.session DefaultSessionIdManager workerName=node0
   [junit4]   2> 483801 INFO  (jetty-launcher-1359-thread-2) [    ] o.e.j.s.session No SessionScavenger set, using defaults
   [junit4]   2> 483801 INFO  (jetty-launcher-1359-thread-2) [    ] o.e.j.s.session node0 Scavenging every 600000ms
   [junit4]   2> 483802 INFO  (jetty-launcher-1359-thread-1) [    ] o.e.j.s.AbstractConnector Started ServerConnector@4d966b89{HTTP/1.1,[http/1.1]}{127.0.0.1:34153}
   [junit4]   2> 483802 INFO  (jetty-launcher-1359-thread-1) [    ] o.e.j.s.Server Started @484122ms
   [junit4]   2> 483802 INFO  (jetty-launcher-1359-thread-1) [    ] o.a.s.c.s.e.JettySolrRunner Jetty properties: {hostContext=/solr, hostPort=34153}
   [junit4]   2> 483802 INFO  (jetty-launcher-1359-thread-2) [    ] o.e.j.s.h.ContextHandler Started o.e.j.s.ServletContextHandler@51866e55{/solr,null,AVAILABLE}
   [junit4]   2> 483802 ERROR (jetty-launcher-1359-thread-1) [    ] o.a.s.u.StartupLoggingUtils Missing Java Option solr.log.dir. Logging may be missing or incomplete.
   [junit4]   2> 483802 INFO  (jetty-launcher-1359-thread-1) [    ] o.a.s.s.SolrDispatchFilter Using logger factory org.apache.logging.slf4j.Log4jLoggerFactory
   [junit4]   2> 483802 INFO  (jetty-launcher-1359-thread-1) [    ] o.a.s.s.SolrDispatchFilter  ___      _       Welcome to Apache Solr™ version 8.0.0
   [junit4]   2> 483802 INFO  (jetty-launcher-1359-thread-1) [    ] o.a.s.s.SolrDispatchFilter / __| ___| |_ _   Starting in cloud mode on port null
   [junit4]   2> 483802 INFO  (jetty-launcher-1359-thread-1) [    ] o.a.s.s.SolrDispatchFilter \__ \/ _ \ | '_|  Install dir: null
   [junit4]   2> 483802 INFO  (jetty-launcher-1359-thread-1) [    ] o.a.s.s.SolrDispatchFilter |___/\___/_|_|    Start time: 2018-07-12T00:40:40Z
   [junit4]   2> 483802 INFO  (jetty-launcher-1359-thread-2) [    ] o.e.j.s.AbstractConnector Started ServerConnector@4ce3ba02{HTTP/1.1,[http/1.1]}{127.0.0.1:34253}
   [junit4]   2> 483802 INFO  (jetty-launcher-1359-thread-2) [    ] o.e.j.s.Server Started @484123ms
   [junit4]   2> 483802 INFO  (jetty-launcher-1359-thread-2) [    ] o.a.s.c.s.e.JettySolrRunner Jetty properties: {hostContext=/solr, hostPort=34253}
   [junit4]   2> 483802 ERROR (jetty-launcher-1359-thread-2) [    ] o.a.s.u.StartupLoggingUtils Missing Java Option solr.log.dir. Logging may be missing or incomplete.
   [junit4]   2> 483802 INFO  (jetty-launcher-1359-thread-2) [    ] o.a.s.s.SolrDispatchFilter Using logger factory org.apache.logging.slf4j.Log4jLoggerFactory
   [junit4]   2> 483802 INFO  (jetty-launcher-1359-thread-2) [    ] o.a.s.s.SolrDispatchFilter  ___      _       Welcome to Apache Solr™ version 8.0.0
   [junit4]   2> 483802 INFO  (jetty-launcher-1359-thread-2) [    ] o.a.s.s.SolrDispatchFilter / __| ___| |_ _   Starting in cloud mode on port null
   [junit4]   2> 483803 INFO  (jetty-launcher-1359-thread-2) [    ] o.a.s.s.SolrDispatchFilter \__ \/ _ \ | '_|  Install dir: null
   [junit4]   2> 483803 INFO  (jetty-launcher-1359-thread-2) [    ] o.a.s.s.SolrDispatchFilter |___/\___/_|_|    Start time: 2018-07-12T00:40:40.001Z
   [junit4]   2> 483809 INFO  (zkConnectionManagerCallback-1366-thread-1) [    ] o.a.s.c.c.ConnectionManager zkClient has connected
   [junit4]   2> 483809 INFO  (zkConnectionManagerCallback-1364-thread-1) [    ] o.a.s.c.c.ConnectionManager zkClient has connected
   [junit4]   2> 483809 INFO  (jetty-launcher-1359-thread-2) [    ] o.a.s.s.SolrDispatchFilter solr.xml found in ZooKeeper. Loading...
   [junit4]   2> 483810 INFO  (jetty-launcher-1359-thread-1) [    ] o.a.s.s.SolrDispatchFilter solr.xml found in ZooKeeper. Loading...
   [junit4]   2> 484054 INFO  (jetty-launcher-1359-thread-2) [    ] o.a.s.c.ZkContainer Zookeeper client=127.0.0.1:62685/solr
   [junit4]   2> 484056 INFO  (zkConnectionManagerCallback-1370-thread-1) [    ] o.a.s.c.c.ConnectionManager zkClient has connected
   [junit4]   2> 484058 INFO  (zkConnectionManagerCallback-1372-thread-1) [    ] o.a.s.c.c.ConnectionManager zkClient has connected
   [junit4]   2> 484140 INFO  (jetty-launcher-1359-thread-2) [n:127.0.0.1:34253_solr    ] o.a.s.c.Overseer Overseer (id=null) closing
   [junit4]   2> 484140 INFO  (jetty-launcher-1359-thread-2) [n:127.0.0.1:34253_solr    ] o.a.s.c.OverseerElectionContext I am go

[...truncated too long message...]

gs=-XX:-UseCompressedOops -XX:+UseParallelGC" -Dtests.seed=D44C2E3F6D3C85EA -Dtests.slow=true -Dtests.locale=ar-KW -Dtests.timezone=SystemV/YST9 -Dtests.asserts=true -Dtests.file.encoding=ISO-8859-1
Buildfile: /export/home/jenkins/workspace/Lucene-Solr-master-Solaris/lucene/core/build.xml

-clover.disable:

ivy-configure:
[ivy:configure] :: Apache Ivy 2.4.0 - 20141213170938 :: http://ant.apache.org/ivy/ ::
[ivy:configure] :: loading settings :: file = /export/home/jenkins/workspace/Lucene-Solr-master-Solaris/lucene/top-level-ivy-settings.xml

install-junit4-taskdef:

ivy-availability-check:
[loadresource] Do not set property disallowed.ivy.jars.list as its length is 0.

-ivy-fail-disallowed-ivy-version:

ivy-fail:

resolve-groovy:
[ivy:cachepath] :: resolving dependencies :: org.codehaus.groovy#groovy-all-caller;working
[ivy:cachepath] confs: [default]
[ivy:cachepath] found org.codehaus.groovy#groovy-all;2.4.15 in public
[ivy:cachepath] :: resolution report :: resolve 11ms :: artifacts dl 1ms
        ---------------------------------------------------------------------
        |                  |            modules            ||   artifacts   |
        |       conf       | number| search|dwnlded|evicted|| number|dwnlded|
        ---------------------------------------------------------------------
        |      default     |   1   |   0   |   0   |   0   ||   1   |   0   |
        ---------------------------------------------------------------------

-init-totals:

-test:
    [mkdir] Created dir: /export/home/jenkins/workspace/Lucene-Solr-master-Solaris/lucene/build/core/test
[junit4:pickseed] Seed property 'tests.seed' already defined: D44C2E3F6D3C85EA
    [mkdir] Created dir: /export/home/jenkins/workspace/Lucene-Solr-master-Solaris/lucene/build/core/test/temp
   [junit4] <JUnit4> says kaixo! Master seed: D44C2E3F6D3C85EA
   [junit4] Executing 5 suites with 2 JVMs.
   [junit4]
   [junit4] Started J1 PID(9972@serv1-vm3).
   [junit4] Started J0 PID(9973@serv1-vm3).
   [junit4] Suite: org.apache.lucene.TestMergeSchedulerExternal
   [junit4] OK      0.25s J1 | TestMergeSchedulerExternal.testCustomMergeScheduler
   [junit4] OK      0.46s J1 | TestMergeSchedulerExternal.testSubclassConcurrentMergeScheduler
   [junit4] Completed [1/5] on J1 in 1.11s, 2 tests
   [junit4]
   [junit4] Suite: org.apache.lucene.TestMergeSchedulerExternal
   [junit4] OK      0.27s J0 | TestMergeSchedulerExternal.testCustomMergeScheduler
   [junit4] OK      0.39s J0 | TestMergeSchedulerExternal.testSubclassConcurrentMergeScheduler
   [junit4] Completed [2/5] on J0 in 1.06s, 2 tests
   [junit4]
   [junit4] Duplicate suite name used with XML reports: org.apache.lucene.TestMergeSchedulerExternal. This may confuse tools that process XML reports. Set 'ignoreDuplicateSuites' to true to skip this message.
   [junit4] Suite: org.apache.lucene.TestMergeSchedulerExternal
   [junit4] OK      0.01s J0 | TestMergeSchedulerExternal.testCustomMergeScheduler
   [junit4] OK      0.33s J0 | TestMergeSchedulerExternal.testSubclassConcurrentMergeScheduler
   [junit4] Completed [3/5] on J0 in 0.35s, 2 tests
   [junit4]
   [junit4] Suite: org.apache.lucene.TestMergeSchedulerExternal
   [junit4] OK      0.01s J1 | TestMergeSchedulerExternal.testCustomMergeScheduler
   [junit4] OK      0.26s J1 | TestMergeSchedulerExternal.testSubclassConcurrentMergeScheduler
   [junit4] Completed [4/5] on J1 in 0.27s, 2 tests
   [junit4]
   [junit4] Suite: org.apache.lucene.TestMergeSchedulerExternal
   [junit4] OK      0.01s J0 | TestMergeSchedulerExternal.testCustomMergeScheduler
   [junit4] OK      0.22s J0 | TestMergeSchedulerExternal.testSubclassConcurrentMergeScheduler
   [junit4] Completed [5/5] on J0 in 0.23s, 2 tests
   [junit4]
   [junit4] JVM J0:     0.66 ..     2.78 =     2.12s
   [junit4] JVM J1:     0.65 ..     2.77 =     2.12s
   [junit4] Execution time total: 2.78 sec.
   [junit4] Tests summary: 5 suites, 10 tests
   [junit4] Could not remove temporary path: /export/home/jenkins/workspace/Lucene-Solr-master-Solaris/lucene/build/core/test/J0 (java.nio.file.DirectoryNotEmptyException: Remaining files: [/export/home/jenkins/workspace/Lucene-Solr-master-Solaris/lucene/build/core/test/J0/temp])
   [junit4] Could not remove temporary path: /export/home/jenkins/workspace/Lucene-Solr-master-Solaris/lucene/build/core/test/J1 (java.nio.file.DirectoryNotEmptyException: Remaining files: [/export/home/jenkins/workspace/Lucene-Solr-master-Solaris/lucene/build/core/test/J1/temp])
     [echo] 5 slowest tests:
[junit4:tophints] 121.21s | org.apache.lucene.index.TestUpgradeIndexMergePolicy
[junit4:tophints]  72.72s | org.apache.lucene.codecs.lucene70.TestLucene70DocValuesFormat
[junit4:tophints]  15.87s | org.apache.lucene.index.TestIndexingSequenceNumbers
[junit4:tophints]  14.59s | org.apache.lucene.codecs.perfield.TestPerFieldDocValuesFormat
[junit4:tophints]  13.52s | org.apache.lucene.codecs.lucene50.TestLucene50CompoundFormat

-check-totals:

test-nocompile:

BUILD SUCCESSFUL
Total time: 5 seconds
[repro] Failures:
[repro]   0/5 failed: org.apache.lucene.TestMergeSchedulerExternal
[repro]   0/5 failed: org.apache.solr.cloud.TestCloudRecovery
[repro] Exiting with code 0
+ mv lucene/build lucene/build.repro
+ mv solr/build solr/build.repro
+ mv lucene/build.orig lucene/build
+ mv solr/build.orig solr/build
Archiving artifacts
Setting ANT_1_8_2_HOME=/export/home/jenkins/tools/hudson.tasks.Ant_AntInstallation/ANT_1.8.2
java.lang.InterruptedException: no matches found within 10000
        at hudson.FilePath$ValidateAntFileMask.hasMatch(FilePath.java:2843)
        at hudson.FilePath$ValidateAntFileMask.invoke(FilePath.java:2722)
        at hudson.FilePath$ValidateAntFileMask.invoke(FilePath.java:2703)
        at hudson.FilePath$FileCallableWrapper.call(FilePath.java:3082)
Also:   hudson.remoting.Channel$CallSiteStackTrace: Remote call to Solaris VBOX
                at hudson.remoting.Channel.attachCallSiteStackTrace(Channel.java:1741)
                at hudson.remoting.UserRequest$ExceptionResponse.retrieve(UserRequest.java:357)
                at hudson.remoting.Channel.call(Channel.java:955)
                at hudson.FilePath.act(FilePath.java:1089)
                at hudson.FilePath.act(FilePath.java:1078)
                at hudson.FilePath.validateAntFileMask(FilePath.java:2701)
                at hudson.tasks.ArtifactArchiver.perform(ArtifactArchiver.java:243)
                at hudson.tasks.BuildStepCompatibilityLayer.perform(BuildStepCompatibilityLayer.java:81)
                at hudson.tasks.BuildStepMonitor$1.perform(BuildStepMonitor.java:20)
                at hudson.model.AbstractBuild$AbstractBuildExecution.perform(AbstractBuild.java:744)
                at hudson.model.AbstractBuild$AbstractBuildExecution.performAllBuildSteps(AbstractBuild.java:690)
                at hudson.model.Build$BuildExecution.post2(Build.java:186)
                at hudson.model.AbstractBuild$AbstractBuildExecution.post(AbstractBuild.java:635)
                at hudson.model.Run.execute(Run.java:1840)
                at hudson.model.FreeStyleBuild.run(FreeStyleBuild.java:43)
                at hudson.model.ResourceController.execute(ResourceController.java:97)
                at hudson.model.Executor.run(Executor.java:429)
Caused: hudson.FilePath$TunneledInterruptedException
        at hudson.FilePath$FileCallableWrapper.call(FilePath.java:3084)
        at hudson.remoting.UserRequest.perform(UserRequest.java:212)
        at hudson.remoting.UserRequest.perform(UserRequest.java:54)
        at hudson.remoting.Request$2.run(Request.java:369)
        at hudson.remoting.InterceptingExecutorService$1.call(InterceptingExecutorService.java:72)
        at java.util.concurrent.FutureTask.run(FutureTask.java:266)
        at java.util.concurrent.ThreadPoolExecutor.runWorker(ThreadPoolExecutor.java:1149)
        at java.util.concurrent.ThreadPoolExecutor$Worker.run(ThreadPoolExecutor.java:624)
        at java.lang.Thread.run(Thread.java:748)
Caused: java.lang.InterruptedException: java.lang.InterruptedException: no matches found within 10000
        at hudson.FilePath.act(FilePath.java:1091)
        at hudson.FilePath.act(FilePath.java:1078)
        at hudson.FilePath.validateAntFileMask(FilePath.java:2701)
        at hudson.tasks.ArtifactArchiver.perform(ArtifactArchiver.java:243)
        at hudson.tasks.BuildStepCompatibilityLayer.perform(BuildStepCompatibilityLayer.java:81)
        at hudson.tasks.BuildStepMonitor$1.perform(BuildStepMonitor.java:20)
        at hudson.model.AbstractBuild$AbstractBuildExecution.perform(AbstractBuild.java:744)
        at hudson.model.AbstractBuild$AbstractBuildExecution.performAllBuildSteps(AbstractBuild.java:690)
        at hudson.model.Build$BuildExecution.post2(Build.java:186)
        at hudson.model.AbstractBuild$AbstractBuildExecution.post(AbstractBuild.java:635)
        at hudson.model.Run.execute(Run.java:1840)
        at hudson.model.FreeStyleBuild.run(FreeStyleBuild.java:43)
        at hudson.model.ResourceController.execute(ResourceController.java:97)
        at hudson.model.Executor.run(Executor.java:429)
No artifacts found that match the file pattern "**/*.events,heapdumps/**,**/*_pid*.log". Configuration error?
[WARNINGS] Parsing warnings in console log with parser Java Compiler (javac)
Setting ANT_1_8_2_HOME=/export/home/jenkins/tools/hudson.tasks.Ant_AntInstallation/ANT_1.8.2
Setting ANT_1_8_2_HOME=/export/home/jenkins/tools/hudson.tasks.Ant_AntInstallation/ANT_1.8.2
<Git Blamer> Using GitBlamer to create author and commit information for all warnings.
<Git Blamer> GIT_COMMIT=fe180bbd59ef45679f3cffa252fff0aa069b7427, workspace=/export/home/jenkins/workspace/Lucene-Solr-master-Solaris
[WARNINGS] Computing warning deltas based on reference build #1963
Recording test results
Setting ANT_1_8_2_HOME=/export/home/jenkins/tools/hudson.tasks.Ant_AntInstallation/ANT_1.8.2
Build step 'Publish JUnit test result report' changed build result to UNSTABLE
Email was triggered for: Unstable (Test Failures)
Sending email for trigger: Unstable (Test Failures)
Setting ANT_1_8_2_HOME=/export/home/jenkins/tools/hudson.tasks.Ant_AntInstallation/ANT_1.8.2
Setting ANT_1_8_2_HOME=/export/home/jenkins/tools/hudson.tasks.Ant_AntInstallation/ANT_1.8.2
Setting ANT_1_8_2_HOME=/export/home/jenkins/tools/hudson.tasks.Ant_AntInstallation/ANT_1.8.2
Setting ANT_1_8_2_HOME=/export/home/jenkins/tools/hudson.tasks.Ant_AntInstallation/ANT_1.8.2


---------------------------------------------------------------------
To unsubscribe, e-mail: [hidden email]
For additional commands, e-mail: [hidden email]