Quantcast

[JENKINS] Lucene-Solr-master-Windows (32bit/jdk1.8.0_121) - Build # 6463 - Unstable!

Previous Topic Next Topic
 
classic Classic list List threaded Threaded
1 message Options
Reply | Threaded
Open this post in threaded view
|  
Report Content as Inappropriate

[JENKINS] Lucene-Solr-master-Windows (32bit/jdk1.8.0_121) - Build # 6463 - Unstable!

Policeman Jenkins Server-2
Build: https://jenkins.thetaphi.de/job/Lucene-Solr-master-Windows/6463/
Java: 32bit/jdk1.8.0_121 -client -XX:+UseConcMarkSweepGC

2 tests failed.
FAILED:  org.apache.solr.cloud.TestLeaderElectionZkExpiry.testLeaderElectionWithZkExpiry

Error Message:


Stack Trace:
java.lang.AssertionError
        at __randomizedtesting.SeedInfo.seed([F3D7E8490E6FAD5D:2508C9133872BEC5]:0)
        at org.junit.Assert.fail(Assert.java:92)
        at org.junit.Assert.assertTrue(Assert.java:43)
        at org.junit.Assert.assertTrue(Assert.java:54)
        at org.apache.solr.cloud.TestLeaderElectionZkExpiry.testLeaderElectionWithZkExpiry(TestLeaderElectionZkExpiry.java:97)
        at sun.reflect.NativeMethodAccessorImpl.invoke0(Native Method)
        at sun.reflect.NativeMethodAccessorImpl.invoke(NativeMethodAccessorImpl.java:62)
        at sun.reflect.DelegatingMethodAccessorImpl.invoke(DelegatingMethodAccessorImpl.java:43)
        at java.lang.reflect.Method.invoke(Method.java:498)
        at com.carrotsearch.randomizedtesting.RandomizedRunner.invoke(RandomizedRunner.java:1713)
        at com.carrotsearch.randomizedtesting.RandomizedRunner$8.evaluate(RandomizedRunner.java:907)
        at com.carrotsearch.randomizedtesting.RandomizedRunner$9.evaluate(RandomizedRunner.java:943)
        at com.carrotsearch.randomizedtesting.RandomizedRunner$10.evaluate(RandomizedRunner.java:957)
        at com.carrotsearch.randomizedtesting.rules.SystemPropertiesRestoreRule$1.evaluate(SystemPropertiesRestoreRule.java:57)
        at org.apache.lucene.util.TestRuleSetupTeardownChained$1.evaluate(TestRuleSetupTeardownChained.java:49)
        at org.apache.lucene.util.AbstractBeforeAfterRule$1.evaluate(AbstractBeforeAfterRule.java:45)
        at org.apache.lucene.util.TestRuleThreadAndTestName$1.evaluate(TestRuleThreadAndTestName.java:48)
        at org.apache.lucene.util.TestRuleIgnoreAfterMaxFailures$1.evaluate(TestRuleIgnoreAfterMaxFailures.java:64)
        at org.apache.lucene.util.TestRuleMarkFailure$1.evaluate(TestRuleMarkFailure.java:47)
        at com.carrotsearch.randomizedtesting.rules.StatementAdapter.evaluate(StatementAdapter.java:36)
        at com.carrotsearch.randomizedtesting.ThreadLeakControl$StatementRunner.run(ThreadLeakControl.java:368)
        at com.carrotsearch.randomizedtesting.ThreadLeakControl.forkTimeoutingTask(ThreadLeakControl.java:817)
        at com.carrotsearch.randomizedtesting.ThreadLeakControl$3.evaluate(ThreadLeakControl.java:468)
        at com.carrotsearch.randomizedtesting.RandomizedRunner.runSingleTest(RandomizedRunner.java:916)
        at com.carrotsearch.randomizedtesting.RandomizedRunner$5.evaluate(RandomizedRunner.java:802)
        at com.carrotsearch.randomizedtesting.RandomizedRunner$6.evaluate(RandomizedRunner.java:852)
        at com.carrotsearch.randomizedtesting.RandomizedRunner$7.evaluate(RandomizedRunner.java:863)
        at com.carrotsearch.randomizedtesting.rules.StatementAdapter.evaluate(StatementAdapter.java:36)
        at com.carrotsearch.randomizedtesting.rules.SystemPropertiesRestoreRule$1.evaluate(SystemPropertiesRestoreRule.java:57)
        at org.apache.lucene.util.AbstractBeforeAfterRule$1.evaluate(AbstractBeforeAfterRule.java:45)
        at com.carrotsearch.randomizedtesting.rules.StatementAdapter.evaluate(StatementAdapter.java:36)
        at org.apache.lucene.util.TestRuleStoreClassName$1.evaluate(TestRuleStoreClassName.java:41)
        at com.carrotsearch.randomizedtesting.rules.NoShadowingOrOverridesOnMethodsRule$1.evaluate(NoShadowingOrOverridesOnMethodsRule.java:40)
        at com.carrotsearch.randomizedtesting.rules.NoShadowingOrOverridesOnMethodsRule$1.evaluate(NoShadowingOrOverridesOnMethodsRule.java:40)
        at com.carrotsearch.randomizedtesting.rules.StatementAdapter.evaluate(StatementAdapter.java:36)
        at com.carrotsearch.randomizedtesting.rules.StatementAdapter.evaluate(StatementAdapter.java:36)
        at com.carrotsearch.randomizedtesting.rules.StatementAdapter.evaluate(StatementAdapter.java:36)
        at org.apache.lucene.util.TestRuleAssertionsRequired$1.evaluate(TestRuleAssertionsRequired.java:53)
        at org.apache.lucene.util.TestRuleMarkFailure$1.evaluate(TestRuleMarkFailure.java:47)
        at org.apache.lucene.util.TestRuleIgnoreAfterMaxFailures$1.evaluate(TestRuleIgnoreAfterMaxFailures.java:64)
        at org.apache.lucene.util.TestRuleIgnoreTestSuites$1.evaluate(TestRuleIgnoreTestSuites.java:54)
        at com.carrotsearch.randomizedtesting.rules.StatementAdapter.evaluate(StatementAdapter.java:36)
        at com.carrotsearch.randomizedtesting.ThreadLeakControl$StatementRunner.run(ThreadLeakControl.java:368)
        at java.lang.Thread.run(Thread.java:745)


FAILED:  junit.framework.TestSuite.org.apache.solr.schema.TestCloudSchemaless

Error Message:
Could not remove the following files (in the order of attempts):    C:\Users\jenkins\workspace\Lucene-Solr-master-Windows\solr\build\solr-core\test\J0\temp\solr.schema.TestCloudSchemaless_F3D7E8490E6FAD5D-001\shard-8-001\cores\collection1\data: java.nio.file.DirectoryNotEmptyException: C:\Users\jenkins\workspace\Lucene-Solr-master-Windows\solr\build\solr-core\test\J0\temp\solr.schema.TestCloudSchemaless_F3D7E8490E6FAD5D-001\shard-8-001\cores\collection1\data    C:\Users\jenkins\workspace\Lucene-Solr-master-Windows\solr\build\solr-core\test\J0\temp\solr.schema.TestCloudSchemaless_F3D7E8490E6FAD5D-001\shard-8-001\cores\collection1: java.nio.file.DirectoryNotEmptyException: C:\Users\jenkins\workspace\Lucene-Solr-master-Windows\solr\build\solr-core\test\J0\temp\solr.schema.TestCloudSchemaless_F3D7E8490E6FAD5D-001\shard-8-001\cores\collection1    C:\Users\jenkins\workspace\Lucene-Solr-master-Windows\solr\build\solr-core\test\J0\temp\solr.schema.TestCloudSchemaless_F3D7E8490E6FAD5D-001\shard-8-001\cores: java.nio.file.DirectoryNotEmptyException: C:\Users\jenkins\workspace\Lucene-Solr-master-Windows\solr\build\solr-core\test\J0\temp\solr.schema.TestCloudSchemaless_F3D7E8490E6FAD5D-001\shard-8-001\cores    C:\Users\jenkins\workspace\Lucene-Solr-master-Windows\solr\build\solr-core\test\J0\temp\solr.schema.TestCloudSchemaless_F3D7E8490E6FAD5D-001\shard-8-001: java.nio.file.DirectoryNotEmptyException: C:\Users\jenkins\workspace\Lucene-Solr-master-Windows\solr\build\solr-core\test\J0\temp\solr.schema.TestCloudSchemaless_F3D7E8490E6FAD5D-001\shard-8-001

Stack Trace:
java.io.IOException: Could not remove the following files (in the order of attempts):
   C:\Users\jenkins\workspace\Lucene-Solr-master-Windows\solr\build\solr-core\test\J0\temp\solr.schema.TestCloudSchemaless_F3D7E8490E6FAD5D-001\shard-8-001\cores\collection1\data: java.nio.file.DirectoryNotEmptyException: C:\Users\jenkins\workspace\Lucene-Solr-master-Windows\solr\build\solr-core\test\J0\temp\solr.schema.TestCloudSchemaless_F3D7E8490E6FAD5D-001\shard-8-001\cores\collection1\data
   C:\Users\jenkins\workspace\Lucene-Solr-master-Windows\solr\build\solr-core\test\J0\temp\solr.schema.TestCloudSchemaless_F3D7E8490E6FAD5D-001\shard-8-001\cores\collection1: java.nio.file.DirectoryNotEmptyException: C:\Users\jenkins\workspace\Lucene-Solr-master-Windows\solr\build\solr-core\test\J0\temp\solr.schema.TestCloudSchemaless_F3D7E8490E6FAD5D-001\shard-8-001\cores\collection1
   C:\Users\jenkins\workspace\Lucene-Solr-master-Windows\solr\build\solr-core\test\J0\temp\solr.schema.TestCloudSchemaless_F3D7E8490E6FAD5D-001\shard-8-001\cores: java.nio.file.DirectoryNotEmptyException: C:\Users\jenkins\workspace\Lucene-Solr-master-Windows\solr\build\solr-core\test\J0\temp\solr.schema.TestCloudSchemaless_F3D7E8490E6FAD5D-001\shard-8-001\cores
   C:\Users\jenkins\workspace\Lucene-Solr-master-Windows\solr\build\solr-core\test\J0\temp\solr.schema.TestCloudSchemaless_F3D7E8490E6FAD5D-001\shard-8-001: java.nio.file.DirectoryNotEmptyException: C:\Users\jenkins\workspace\Lucene-Solr-master-Windows\solr\build\solr-core\test\J0\temp\solr.schema.TestCloudSchemaless_F3D7E8490E6FAD5D-001\shard-8-001

        at __randomizedtesting.SeedInfo.seed([F3D7E8490E6FAD5D]:0)
        at org.apache.lucene.util.IOUtils.rm(IOUtils.java:323)
        at org.apache.lucene.util.TestRuleTemporaryFilesCleanup.afterAlways(TestRuleTemporaryFilesCleanup.java:216)
        at com.carrotsearch.randomizedtesting.rules.TestRuleAdapter$1.afterAlways(TestRuleAdapter.java:31)
        at com.carrotsearch.randomizedtesting.rules.StatementAdapter.evaluate(StatementAdapter.java:43)
        at com.carrotsearch.randomizedtesting.rules.StatementAdapter.evaluate(StatementAdapter.java:36)
        at org.apache.lucene.util.TestRuleAssertionsRequired$1.evaluate(TestRuleAssertionsRequired.java:53)
        at org.apache.lucene.util.TestRuleMarkFailure$1.evaluate(TestRuleMarkFailure.java:47)
        at org.apache.lucene.util.TestRuleIgnoreAfterMaxFailures$1.evaluate(TestRuleIgnoreAfterMaxFailures.java:64)
        at org.apache.lucene.util.TestRuleIgnoreTestSuites$1.evaluate(TestRuleIgnoreTestSuites.java:54)
        at com.carrotsearch.randomizedtesting.rules.StatementAdapter.evaluate(StatementAdapter.java:36)
        at com.carrotsearch.randomizedtesting.ThreadLeakControl$StatementRunner.run(ThreadLeakControl.java:368)
        at java.lang.Thread.run(Thread.java:745)




Build Log:
[...truncated 10926 lines...]
   [junit4] Suite: org.apache.solr.schema.TestCloudSchemaless
   [junit4]   2> Creating dataDir: C:\Users\jenkins\workspace\Lucene-Solr-master-Windows\solr\build\solr-core\test\J0\temp\solr.schema.TestCloudSchemaless_F3D7E8490E6FAD5D-001\init-core-data-001
   [junit4]   2> 111651 WARN  (SUITE-TestCloudSchemaless-seed#[F3D7E8490E6FAD5D]-worker) [    ] o.a.s.SolrTestCaseJ4 startTrackingSearchers: numOpens=45 numCloses=45
   [junit4]   2> 111651 INFO  (SUITE-TestCloudSchemaless-seed#[F3D7E8490E6FAD5D]-worker) [    ] o.a.s.SolrTestCaseJ4 Using PointFields
   [junit4]   2> 111663 INFO  (SUITE-TestCloudSchemaless-seed#[F3D7E8490E6FAD5D]-worker) [    ] o.a.s.SolrTestCaseJ4 Randomized ssl (false) and clientAuth (false) via: @org.apache.solr.SolrTestCaseJ4$SuppressSSL(bugUrl=https://issues.apache.org/jira/browse/SOLR-5776)
   [junit4]   2> 111663 INFO  (SUITE-TestCloudSchemaless-seed#[F3D7E8490E6FAD5D]-worker) [    ] o.a.s.BaseDistributedSearchTestCase Setting hostContext system property: /_fj/
   [junit4]   2> 111668 INFO  (TEST-TestCloudSchemaless.test-seed#[F3D7E8490E6FAD5D]) [    ] o.a.s.c.ZkTestServer STARTING ZK TEST SERVER
   [junit4]   2> 111668 INFO  (Thread-97) [    ] o.a.s.c.ZkTestServer client port:0.0.0.0/0.0.0.0:0
   [junit4]   2> 111668 INFO  (Thread-97) [    ] o.a.s.c.ZkTestServer Starting server
   [junit4]   2> 111768 INFO  (TEST-TestCloudSchemaless.test-seed#[F3D7E8490E6FAD5D]) [    ] o.a.s.c.ZkTestServer start zk server on port:50702
   [junit4]   2> 111822 INFO  (TEST-TestCloudSchemaless.test-seed#[F3D7E8490E6FAD5D]) [    ] o.a.s.c.AbstractZkTestCase put C:\Users\jenkins\workspace\Lucene-Solr-master-Windows\solr\core\src\test-files\solr\collection1\conf\solrconfig-schemaless.xml to /configs/conf1/solrconfig.xml
   [junit4]   2> 111829 INFO  (TEST-TestCloudSchemaless.test-seed#[F3D7E8490E6FAD5D]) [    ] o.a.s.c.AbstractZkTestCase put C:\Users\jenkins\workspace\Lucene-Solr-master-Windows\solr\core\src\test-files\solr\collection1\conf\schema-add-schema-fields-update-processor.xml to /configs/conf1/schema.xml
   [junit4]   2> 111833 INFO  (TEST-TestCloudSchemaless.test-seed#[F3D7E8490E6FAD5D]) [    ] o.a.s.c.AbstractZkTestCase put C:\Users\jenkins\workspace\Lucene-Solr-master-Windows\solr\core\src\test-files\solr\collection1\conf\solrconfig.snippet.randomindexconfig.xml to /configs/conf1/solrconfig.snippet.randomindexconfig.xml
   [junit4]   2> 111837 INFO  (TEST-TestCloudSchemaless.test-seed#[F3D7E8490E6FAD5D]) [    ] o.a.s.c.AbstractZkTestCase put C:\Users\jenkins\workspace\Lucene-Solr-master-Windows\solr\core\src\test-files\solr\collection1\conf\stopwords.txt to /configs/conf1/stopwords.txt
   [junit4]   2> 111842 INFO  (TEST-TestCloudSchemaless.test-seed#[F3D7E8490E6FAD5D]) [    ] o.a.s.c.AbstractZkTestCase put C:\Users\jenkins\workspace\Lucene-Solr-master-Windows\solr\core\src\test-files\solr\collection1\conf\protwords.txt to /configs/conf1/protwords.txt
   [junit4]   2> 111847 INFO  (TEST-TestCloudSchemaless.test-seed#[F3D7E8490E6FAD5D]) [    ] o.a.s.c.AbstractZkTestCase put C:\Users\jenkins\workspace\Lucene-Solr-master-Windows\solr\core\src\test-files\solr\collection1\conf\currency.xml to /configs/conf1/currency.xml
   [junit4]   2> 111851 INFO  (TEST-TestCloudSchemaless.test-seed#[F3D7E8490E6FAD5D]) [    ] o.a.s.c.AbstractZkTestCase put C:\Users\jenkins\workspace\Lucene-Solr-master-Windows\solr\core\src\test-files\solr\collection1\conf\enumsConfig.xml to /configs/conf1/enumsConfig.xml
   [junit4]   2> 111855 INFO  (TEST-TestCloudSchemaless.test-seed#[F3D7E8490E6FAD5D]) [    ] o.a.s.c.AbstractZkTestCase put C:\Users\jenkins\workspace\Lucene-Solr-master-Windows\solr\core\src\test-files\solr\collection1\conf\open-exchange-rates.json to /configs/conf1/open-exchange-rates.json
   [junit4]   2> 111860 INFO  (TEST-TestCloudSchemaless.test-seed#[F3D7E8490E6FAD5D]) [    ] o.a.s.c.AbstractZkTestCase put C:\Users\jenkins\workspace\Lucene-Solr-master-Windows\solr\core\src\test-files\solr\collection1\conf\mapping-ISOLatin1Accent.txt to /configs/conf1/mapping-ISOLatin1Accent.txt
   [junit4]   2> 111866 INFO  (TEST-TestCloudSchemaless.test-seed#[F3D7E8490E6FAD5D]) [    ] o.a.s.c.AbstractZkTestCase put C:\Users\jenkins\workspace\Lucene-Solr-master-Windows\solr\core\src\test-files\solr\collection1\conf\old_synonyms.txt to /configs/conf1/old_synonyms.txt
   [junit4]   2> 111870 INFO  (TEST-TestCloudSchemaless.test-seed#[F3D7E8490E6FAD5D]) [    ] o.a.s.c.AbstractZkTestCase put C:\Users\jenkins\workspace\Lucene-Solr-master-Windows\solr\core\src\test-files\solr\collection1\conf\synonyms.txt to /configs/conf1/synonyms.txt
   [junit4]   2> 111876 WARN  (NIOServerCxn.Factory:0.0.0.0/0.0.0.0:0) [    ] o.a.z.s.NIOServerCnxn caught end of stream exception
   [junit4]   2> EndOfStreamException: Unable to read additional data from client sessionid 0x15aecd1a75e0001, likely client has closed socket
   [junit4]   2> at org.apache.zookeeper.server.NIOServerCnxn.doIO(NIOServerCnxn.java:228)
   [junit4]   2> at org.apache.zookeeper.server.NIOServerCnxnFactory.run(NIOServerCnxnFactory.java:208)
   [junit4]   2> at java.lang.Thread.run(Thread.java:745)
   [junit4]   2> 112615 INFO  (TEST-TestCloudSchemaless.test-seed#[F3D7E8490E6FAD5D]) [    ] o.a.s.SolrTestCaseJ4 Writing core.properties file to C:\Users\jenkins\workspace\Lucene-Solr-master-Windows\solr\build\solr-core\test\J0\temp\solr.schema.TestCloudSchemaless_F3D7E8490E6FAD5D-001\control-001\cores\collection1
   [junit4]   2> 112625 INFO  (TEST-TestCloudSchemaless.test-seed#[F3D7E8490E6FAD5D]) [    ] o.e.j.s.Server jetty-9.3.14.v20161028
   [junit4]   2> 112626 INFO  (TEST-TestCloudSchemaless.test-seed#[F3D7E8490E6FAD5D]) [    ] o.e.j.s.h.ContextHandler Started o.e.j.s.ServletContextHandler@b70c6d{/_fj,null,AVAILABLE}
   [junit4]   2> 112632 INFO  (TEST-TestCloudSchemaless.test-seed#[F3D7E8490E6FAD5D]) [    ] o.e.j.s.AbstractConnector Started ServerConnector@1895d2{HTTP/1.1,[http/1.1]}{127.0.0.1:50709}
   [junit4]   2> 112632 INFO  (TEST-TestCloudSchemaless.test-seed#[F3D7E8490E6FAD5D]) [    ] o.e.j.s.Server Started @117408ms
   [junit4]   2> 112632 INFO  (TEST-TestCloudSchemaless.test-seed#[F3D7E8490E6FAD5D]) [    ] o.a.s.c.s.e.JettySolrRunner Jetty properties: {solr.data.dir=C:\Users\jenkins\workspace\Lucene-Solr-master-Windows\solr\build\solr-core\test\J0\temp\solr.schema.TestCloudSchemaless_F3D7E8490E6FAD5D-001\tempDir-001/control/data, hostContext=/_fj, hostPort=50709, coreRootDirectory=C:\Users\jenkins\workspace\Lucene-Solr-master-Windows\solr\build\solr-core\test\J0\temp\solr.schema.TestCloudSchemaless_F3D7E8490E6FAD5D-001\control-001\cores}
   [junit4]   2> 112632 ERROR (TEST-TestCloudSchemaless.test-seed#[F3D7E8490E6FAD5D]) [    ] o.a.s.s.StartupLoggingUtils Missing Java Option solr.log.dir. Logging may be missing or incomplete.
   [junit4]   2> 112633 INFO  (TEST-TestCloudSchemaless.test-seed#[F3D7E8490E6FAD5D]) [    ] o.a.s.s.SolrDispatchFilter  ___      _       Welcome to Apache Solr? version 7.0.0
   [junit4]   2> 112634 INFO  (TEST-TestCloudSchemaless.test-seed#[F3D7E8490E6FAD5D]) [    ] o.a.s.s.SolrDispatchFilter / __| ___| |_ _   Starting in cloud mode on port null
   [junit4]   2> 112634 INFO  (TEST-TestCloudSchemaless.test-seed#[F3D7E8490E6FAD5D]) [    ] o.a.s.s.SolrDispatchFilter \__ \/ _ \ | '_|  Install dir: null
   [junit4]   2> 112634 INFO  (TEST-TestCloudSchemaless.test-seed#[F3D7E8490E6FAD5D]) [    ] o.a.s.s.SolrDispatchFilter |___/\___/_|_|    Start time: 2017-03-20T17:44:08.222Z
   [junit4]   2> 112647 INFO  (TEST-TestCloudSchemaless.test-seed#[F3D7E8490E6FAD5D]) [    ] o.a.s.s.SolrDispatchFilter Loading solr.xml from SolrHome (not found in ZooKeeper)
   [junit4]   2> 112647 INFO  (TEST-TestCloudSchemaless.test-seed#[F3D7E8490E6FAD5D]) [    ] o.a.s.c.SolrXmlConfig Loading container configuration from C:\Users\jenkins\workspace\Lucene-Solr-master-Windows\solr\build\solr-core\test\J0\temp\solr.schema.TestCloudSchemaless_F3D7E8490E6FAD5D-001\control-001\solr.xml
   [junit4]   2> 112676 INFO  (TEST-TestCloudSchemaless.test-seed#[F3D7E8490E6FAD5D]) [    ] o.a.s.c.ZkContainer Zookeeper client=127.0.0.1:50702/solr
   [junit4]   2> 112682 WARN  (NIOServerCxn.Factory:0.0.0.0/0.0.0.0:0) [    ] o.a.z.s.NIOServerCnxn caught end of stream exception
   [junit4]   2> EndOfStreamException: Unable to read additional data from client sessionid 0x15aecd1a75e0003, likely client has closed socket
   [junit4]   2> at org.apache.zookeeper.server.NIOServerCnxn.doIO(NIOServerCnxn.java:228)
   [junit4]   2> at org.apache.zookeeper.server.NIOServerCnxnFactory.run(NIOServerCnxnFactory.java:208)
   [junit4]   2> at java.lang.Thread.run(Thread.java:745)
   [junit4]   2> 112736 INFO  (TEST-TestCloudSchemaless.test-seed#[F3D7E8490E6FAD5D]) [n:127.0.0.1:50709__fj    ] o.a.s.c.Overseer Overseer (id=null) closing
   [junit4]   2> 112737 INFO  (TEST-TestCloudSchemaless.test-seed#[F3D7E8490E6FAD5D]) [n:127.0.0.1:50709__fj    ] o.a.s.c.OverseerElectionContext I am going to be the leader 127.0.0.1:50709__fj
   [junit4]   2> 112741 INFO  (TEST-TestCloudSchemaless.test-seed#[F3D7E8490E6FAD5D]) [n:127.0.0.1:50709__fj    ] o.a.s.c.Overseer Overseer (id=97650727142162436-127.0.0.1:50709__fj-n_0000000000) starting
   [junit4]   2> 112761 INFO  (TEST-TestCloudSchemaless.test-seed#[F3D7E8490E6FAD5D]) [n:127.0.0.1:50709__fj    ] o.a.s.c.ZkController Register node as live in ZooKeeper:/live_nodes/127.0.0.1:50709__fj
   [junit4]   2> 112766 INFO  (zkCallback-83-thread-1-processing-n:127.0.0.1:50709__fj) [n:127.0.0.1:50709__fj    ] o.a.s.c.c.ZkStateReader Updated live nodes from ZooKeeper... (0) -> (1)
   [junit4]   2> 113231 INFO  (TEST-TestCloudSchemaless.test-seed#[F3D7E8490E6FAD5D]) [n:127.0.0.1:50709__fj    ] o.a.s.c.CorePropertiesLocator Found 1 core definitions underneath C:\Users\jenkins\workspace\Lucene-Solr-master-Windows\solr\build\solr-core\test\J0\temp\solr.schema.TestCloudSchemaless_F3D7E8490E6FAD5D-001\control-001\cores
   [junit4]   2> 113232 INFO  (TEST-TestCloudSchemaless.test-seed#[F3D7E8490E6FAD5D]) [n:127.0.0.1:50709__fj    ] o.a.s.c.CorePropertiesLocator Cores are: [collection1]
   [junit4]   2> 113245 INFO  (OverseerStateUpdate-97650727142162436-127.0.0.1:50709__fj-n_0000000000) [n:127.0.0.1:50709__fj    ] o.a.s.c.o.ReplicaMutator Assigning new node to shard shard=shard1
   [junit4]   2> 114303 WARN  (coreLoadExecutor-282-thread-1-processing-n:127.0.0.1:50709__fj) [n:127.0.0.1:50709__fj c:control_collection   x:collection1] o.a.s.c.Config Beginning with Solr 5.5, <mergePolicy> is deprecated, use <mergePolicyFactory> instead.
   [junit4]   2> 114308 INFO  (coreLoadExecutor-282-thread-1-processing-n:127.0.0.1:50709__fj) [n:127.0.0.1:50709__fj c:control_collection   x:collection1] o.a.s.c.SolrConfig Using Lucene MatchVersion: 7.0.0
   [junit4]   2> 114342 INFO  (coreLoadExecutor-282-thread-1-processing-n:127.0.0.1:50709__fj) [n:127.0.0.1:50709__fj c:control_collection   x:collection1] o.a.s.s.ManagedIndexSchemaFactory The schema is configured as managed, but managed schema resource managed-schema not found - loading non-managed schema schema.xml instead
   [junit4]   2> 114363 INFO  (coreLoadExecutor-282-thread-1-processing-n:127.0.0.1:50709__fj) [n:127.0.0.1:50709__fj c:control_collection   x:collection1] o.a.s.s.IndexSchema [collection1] Schema name=add-schema-fields-update-processor
   [junit4]   2> 114387 INFO  (coreLoadExecutor-282-thread-1-processing-n:127.0.0.1:50709__fj) [n:127.0.0.1:50709__fj c:control_collection   x:collection1] o.a.s.s.IndexSchema Loaded schema add-schema-fields-update-processor/1.6 with uniqueid field id
   [junit4]   2> 114405 INFO  (coreLoadExecutor-282-thread-1-processing-n:127.0.0.1:50709__fj) [n:127.0.0.1:50709__fj c:control_collection   x:collection1] o.a.s.s.ManagedIndexSchema Created and persisted managed schema znode at /configs/conf1/managed-schema
   [junit4]   2> 114413 INFO  (coreLoadExecutor-282-thread-1-processing-n:127.0.0.1:50709__fj) [n:127.0.0.1:50709__fj c:control_collection   x:collection1] o.a.s.s.ManagedIndexSchemaFactory After upgrading to managed schema in ZooKeeper, renamed the non-managed schema /configs/conf1/schema.xml to /configs/conf1/schema.xml.bak
   [junit4]   2> 114421 INFO  (coreLoadExecutor-282-thread-1-processing-n:127.0.0.1:50709__fj) [n:127.0.0.1:50709__fj c:control_collection   x:collection1] o.a.s.c.CoreContainer Creating SolrCore 'collection1' using configuration from collection control_collection
   [junit4]   2> 114421 INFO  (coreLoadExecutor-282-thread-1-processing-n:127.0.0.1:50709__fj) [n:127.0.0.1:50709__fj c:control_collection   x:collection1] o.a.s.c.SolrCore solr.RecoveryStrategy.Builder
   [junit4]   2> 114422 INFO  (coreLoadExecutor-282-thread-1-processing-n:127.0.0.1:50709__fj) [n:127.0.0.1:50709__fj c:control_collection   x:collection1] o.a.s.c.SolrCore [[collection1] ] Opening new SolrCore at [C:\Users\jenkins\workspace\Lucene-Solr-master-Windows\solr\build\solr-core\test\J0\temp\solr.schema.TestCloudSchemaless_F3D7E8490E6FAD5D-001\control-001\cores\collection1], dataDir=[C:\Users\jenkins\workspace\Lucene-Solr-master-Windows\solr\build\solr-core\test\J0\temp\solr.schema.TestCloudSchemaless_F3D7E8490E6FAD5D-001\control-001\cores\collection1\data\]
   [junit4]   2> 114492 INFO  (coreLoadExecutor-282-thread-1-processing-n:127.0.0.1:50709__fj) [n:127.0.0.1:50709__fj c:control_collection   x:collection1] o.a.s.u.RandomMergePolicy RandomMergePolicy wrapping class org.apache.lucene.index.TieredMergePolicy: [TieredMergePolicy: maxMergeAtOnce=40, maxMergeAtOnceExplicit=30, maxMergedSegmentMB=66.6318359375, floorSegmentMB=2.13671875, forceMergeDeletesPctAllowed=25.541559388605638, segmentsPerTier=25.0, maxCFSSegmentSizeMB=8.796093022207999E12, noCFSRatio=0.5540389569270155
   [junit4]   2> 115428 INFO  (coreLoadExecutor-282-thread-1-processing-n:127.0.0.1:50709__fj) [n:127.0.0.1:50709__fj c:control_collection   x:collection1] o.a.s.u.UpdateHandler Using UpdateLog implementation: org.apache.solr.update.UpdateLog
   [junit4]   2> 115428 INFO  (coreLoadExecutor-282-thread-1-processing-n:127.0.0.1:50709__fj) [n:127.0.0.1:50709__fj c:control_collection   x:collection1] o.a.s.u.UpdateLog Initializing UpdateLog: dataDir= defaultSyncLevel=FLUSH numRecordsToKeep=100 maxNumLogsToKeep=10 numVersionBuckets=65536
   [junit4]   2> 115431 INFO  (coreLoadExecutor-282-thread-1-processing-n:127.0.0.1:50709__fj) [n:127.0.0.1:50709__fj c:control_collection   x:collection1] o.a.s.u.CommitTracker Hard AutoCommit: disabled
   [junit4]   2> 115431 INFO  (coreLoadExecutor-282-thread-1-processing-n:127.0.0.1:50709__fj) [n:127.0.0.1:50709__fj c:control_collection   x:collection1] o.a.s.u.CommitTracker Soft AutoCommit: disabled
   [junit4]   2> 115434 INFO  (coreLoadExecutor-282-thread-1-processing-n:127.0.0.1:50709__fj) [n:127.0.0.1:50709__fj c:control_collection   x:collection1] o.a.s.u.RandomMergePolicy RandomMergePolicy wrapping class org.apache.lucene.index.TieredMergePolicy: [TieredMergePolicy: maxMergeAtOnce=15, maxMergeAtOnceExplicit=35, maxMergedSegmentMB=8.3115234375, floorSegmentMB=2.046875, forceMergeDeletesPctAllowed=27.659850238359954, segmentsPerTier=30.0, maxCFSSegmentSizeMB=8.796093022207999E12, noCFSRatio=0.16400509765949814
   [junit4]   2> 115436 INFO  (coreLoadExecutor-282-thread-1-processing-n:127.0.0.1:50709__fj) [n:127.0.0.1:50709__fj c:control_collection   x:collection1] o.a.s.s.SolrIndexSearcher Opening [Searcher@1a43963[collection1] main]
   [junit4]   2> 115438 INFO  (coreLoadExecutor-282-thread-1-processing-n:127.0.0.1:50709__fj) [n:127.0.0.1:50709__fj c:control_collection   x:collection1] o.a.s.r.ManagedResourceStorage Configured ZooKeeperStorageIO with znodeBase: /configs/conf1
   [junit4]   2> 115440 INFO  (coreLoadExecutor-282-thread-1-processing-n:127.0.0.1:50709__fj) [n:127.0.0.1:50709__fj c:control_collection   x:collection1] o.a.s.r.ManagedResourceStorage Loaded null at path _rest_managed.json using ZooKeeperStorageIO:path=/configs/conf1
   [junit4]   2> 115452 INFO  (coreLoadExecutor-282-thread-1-processing-n:127.0.0.1:50709__fj) [n:127.0.0.1:50709__fj c:control_collection   x:collection1] o.a.s.s.ZkIndexSchemaReader Creating ZooKeeper watch for the managed schema at /configs/conf1/managed-schema
   [junit4]   2> 115456 INFO  (coreLoadExecutor-282-thread-1-processing-n:127.0.0.1:50709__fj) [n:127.0.0.1:50709__fj c:control_collection   x:collection1] o.a.s.s.ZkIndexSchemaReader Current schema version 0 is already the latest
   [junit4]   2> 115459 INFO  (coreLoadExecutor-282-thread-1-processing-n:127.0.0.1:50709__fj) [n:127.0.0.1:50709__fj c:control_collection   x:collection1] o.a.s.h.ReplicationHandler Commits will be reserved for  10000
   [junit4]   2> 115459 INFO  (searcherExecutor-283-thread-1-processing-n:127.0.0.1:50709__fj x:collection1 c:control_collection) [n:127.0.0.1:50709__fj c:control_collection   x:collection1] o.a.s.c.SolrCore [collection1] Registered new searcher Searcher@1a43963[collection1] main{ExitableDirectoryReader(UninvertingDirectoryReader())}
   [junit4]   2> 115460 INFO  (coreLoadExecutor-282-thread-1-processing-n:127.0.0.1:50709__fj) [n:127.0.0.1:50709__fj c:control_collection   x:collection1] o.a.s.u.UpdateLog Could not find max version in index or recent updates, using new clock 1562411638244507648
   [junit4]   2> 115477 INFO  (coreZkRegister-275-thread-1-processing-n:127.0.0.1:50709__fj x:collection1 c:control_collection) [n:127.0.0.1:50709__fj c:control_collection s:shard1 r:core_node1 x:collection1] o.a.s.c.ShardLeaderElectionContext Enough replicas found to continue.
   [junit4]   2> 115477 INFO  (coreZkRegister-275-thread-1-processing-n:127.0.0.1:50709__fj x:collection1 c:control_collection) [n:127.0.0.1:50709__fj c:control_collection s:shard1 r:core_node1 x:collection1] o.a.s.c.ShardLeaderElectionContext I may be the new leader - try and sync
   [junit4]   2> 115477 INFO  (coreZkRegister-275-thread-1-processing-n:127.0.0.1:50709__fj x:collection1 c:control_collection) [n:127.0.0.1:50709__fj c:control_collection s:shard1 r:core_node1 x:collection1] o.a.s.c.SyncStrategy Sync replicas to http://127.0.0.1:50709/_fj/collection1/
   [junit4]   2> 115477 INFO  (coreZkRegister-275-thread-1-processing-n:127.0.0.1:50709__fj x:collection1 c:control_collection) [n:127.0.0.1:50709__fj c:control_collection s:shard1 r:core_node1 x:collection1] o.a.s.c.SyncStrategy Sync Success - now sync replicas to me
   [junit4]   2> 115477 INFO  (coreZkRegister-275-thread-1-processing-n:127.0.0.1:50709__fj x:collection1 c:control_collection) [n:127.0.0.1:50709__fj c:control_collection s:shard1 r:core_node1 x:collection1] o.a.s.c.SyncStrategy http://127.0.0.1:50709/_fj/collection1/ has no replicas
   [junit4]   2> 115477 INFO  (coreZkRegister-275-thread-1-processing-n:127.0.0.1:50709__fj x:collection1 c:control_collection) [n:127.0.0.1:50709__fj c:control_collection s:shard1 r:core_node1 x:collection1] o.a.s.c.ShardLeaderElectionContext Found all replicas participating in election, clear LIR
   [junit4]   2> 115496 INFO  (coreZkRegister-275-thread-1-processing-n:127.0.0.1:50709__fj x:collection1 c:control_collection) [n:127.0.0.1:50709__fj c:control_collection s:shard1 r:core_node1 x:collection1] o.a.s.c.ShardLeaderElectionContext I am the new leader: http://127.0.0.1:50709/_fj/collection1/ shard1
   [junit4]   2> 115649 INFO  (coreZkRegister-275-thread-1-processing-n:127.0.0.1:50709__fj x:collection1 c:control_collection) [n:127.0.0.1:50709__fj c:control_collection s:shard1 r:core_node1 x:collection1] o.a.s.c.ZkController I am the leader, no recovery necessary
   [junit4]   2> 115878 INFO  (TEST-TestCloudSchemaless.test-seed#[F3D7E8490E6FAD5D]) [    ] o.a.s.c.c.ZkStateReader Updated live nodes from ZooKeeper... (0) -> (1)
   [junit4]   2> 115880 INFO  (TEST-TestCloudSchemaless.test-seed#[F3D7E8490E6FAD5D]) [    ] o.a.s.c.s.i.ZkClientClusterStateProvider Cluster at 127.0.0.1:50702/solr ready
   [junit4]   2> 115880 INFO  (TEST-TestCloudSchemaless.test-seed#[F3D7E8490E6FAD5D]) [    ] o.a.s.c.ChaosMonkey monkey: init - expire sessions:false cause connection loss:false
   [junit4]   2> 116725 INFO  (TEST-TestCloudSchemaless.test-seed#[F3D7E8490E6FAD5D]) [    ] o.a.s.SolrTestCaseJ4 Writing core.properties file to C:\Users\jenkins\workspace\Lucene-Solr-master-Windows\solr\build\solr-core\test\J0\temp\solr.schema.TestCloudSchemaless_F3D7E8490E6FAD5D-001\shard-1-001\cores\collection1
   [junit4]   2> 116730 INFO  (TEST-TestCloudSchemaless.test-seed#[F3D7E8490E6FAD5D]) [    ] o.a.s.c.AbstractFullDistribZkTestBase create jetty 1 in directory C:\Users\jenkins\workspace\Lucene-Solr-master-Windows\solr\build\solr-core\test\J0\temp\solr.schema.TestCloudSchemaless_F3D7E8490E6FAD5D-001\shard-1-001
   [junit4]   2> 116731 INFO  (TEST-TestCloudSchemaless.test-seed#[F3D7E8490E6FAD5D]) [    ] o.e.j.s.Server jetty-9.3.14.v20161028
   [junit4]   2> 116733 INFO  (TEST-TestCloudSchemaless.test-seed#[F3D7E8490E6FAD5D]) [    ] o.e.j.s.h.ContextHandler Started o.e.j.s.ServletContextHandler@5f1568{/_fj,null,AVAILABLE}
   [junit4]   2> 116736 INFO  (TEST-TestCloudSchemaless.test-seed#[F3D7E8490E6FAD5D]) [    ] o.e.j.s.AbstractConnector Started ServerConnector@1a4994e{HTTP/1.1,[http/1.1]}{127.0.0.1:50725}
   [junit4]   2> 116736 INFO  (TEST-TestCloudSchemaless.test-seed#[F3D7E8490E6FAD5D]) [    ] o.e.j.s.Server Started @121512ms
   [junit4]   2> 116736 INFO  (TEST-TestCloudSchemaless.test-seed#[F3D7E8490E6FAD5D]) [    ] o.a.s.c.s.e.JettySolrRunner Jetty properties: {solr.data.dir=C:\Users\jenkins\workspace\Lucene-Solr-master-Windows\solr\build\solr-core\test\J0\temp\solr.schema.TestCloudSchemaless_F3D7E8490E6FAD5D-001\tempDir-001/jetty1, solrconfig=solrconfig.xml, hostContext=/_fj, hostPort=50725, coreRootDirectory=C:\Users\jenkins\workspace\Lucene-Solr-master-Windows\solr\build\solr-core\test\J0\..\..\..\..\..\..\..\..\..\Users\jenkins\workspace\Lucene-Solr-master-Windows\solr\build\solr-core\test\J0\temp\solr.schema.TestCloudSchemaless_F3D7E8490E6FAD5D-001\shard-1-001\cores}
   [junit4]   2> 116736 ERROR (TEST-TestCloudSchemaless.test-seed#[F3D7E8490E6FAD5D]) [    ] o.a.s.s.StartupLoggingUtils Missing Java Option solr.log.dir. Logging may be missing or incomplete.
   [junit4]   2> 116737 INFO  (TEST-TestCloudSchemaless.test-seed#[F3D7E8490E6FAD5D]) [    ] o.a.s.s.SolrDispatchFilter  ___      _       Welcome to Apache Solr? version 7.0.0
   [junit4]   2> 116737 INFO  (TEST-TestCloudSchemaless.test-seed#[F3D7E8490E6FAD5D]) [    ] o.a.s.s.SolrDispatchFilter / __| ___| |_ _   Starting in cloud mode on port null
   [junit4]   2> 116737 INFO  (TEST-TestCloudSchemaless.test-seed#[F3D7E8490E6FAD5D]) [    ] o.a.s.s.SolrDispatchFilter \__ \/ _ \ | '_|  Install dir: null
   [junit4]   2> 116737 INFO  (TEST-TestCloudSchemaless.test-seed#[F3D7E8490E6FAD5D]) [    ] o.a.s.s.SolrDispatchFilter |___/\___/_|_|    Start time: 2017-03-20T17:44:12.325Z
   [junit4]   2> 116745 INFO  (TEST-TestCloudSchemaless.test-seed#[F3D7E8490E6FAD5D]) [    ] o.a.s.s.SolrDispatchFilter Loading solr.xml from SolrHome (not found in ZooKeeper)
   [junit4]   2> 116745 WARN  (NIOServerCxn.Factory:0.0.0.0/0.0.0.0:0) [    ] o.a.z.s.NIOServerCnxn caught end of stream exception
   [junit4]   2> EndOfStreamException: Unable to read additional data from client sessionid 0x15aecd1a75e0006, likely client has closed socket
   [junit4]   2> at org.apache.zookeeper.server.NIOServerCnxn.doIO(NIOServerCnxn.java:228)
   [junit4]   2> at org.apache.zookeeper.server.NIOServerCnxnFactory.run(NIOServerCnxnFactory.java:208)
   [junit4]   2> at java.lang.Thread.run(Thread.java:745)
   [junit4]   2> 116745 INFO  (TEST-TestCloudSchemaless.test-seed#[F3D7E8490E6FAD5D]) [    ] o.a.s.c.SolrXmlConfig Loading container configuration from C:\Users\jenkins\workspace\Lucene-Solr-master-Windows\solr\build\solr-core\test\J0\temp\solr.schema.TestCloudSchemaless_F3D7E8490E6FAD5D-001\shard-1-001\solr.xml
   [junit4]   2> 116784 INFO  (TEST-TestCloudSchemaless.test-seed#[F3D7E8490E6FAD5D]) [    ] o.a.s.c.ZkContainer Zookeeper client=127.0.0.1:50702/solr
   [junit4]   2> 116815 INFO  (TEST-TestCloudSchemaless.test-seed#[F3D7E8490E6FAD5D]) [n:127.0.0.1:50725__fj    ] o.a.s.c.c.ZkStateReader Updated live nodes from ZooKeeper... (0) -> (1)
   [junit4]   2> 116823 INFO  (TEST-TestCloudSchemaless.test-seed#[F3D7E8490E6FAD5D]) [n:127.0.0.1:50725__fj    ] o.a.s.c.Overseer Overseer (id=null) closing
   [junit4]   2> 116828 INFO  (TEST-TestCloudSchemaless.test-seed#[F3D7E8490E6FAD5D]) [n:127.0.0.1:50725__fj    ] o.a.s.c.ZkController Register node as live in ZooKeeper:/live_nodes/127.0.0.1:50725__fj
   [junit4]   2> 116832 INFO  (zkCallback-87-thread-1) [    ] o.a.s.c.c.ZkStateReader Updated live nodes from ZooKeeper... (1) -> (2)
   [junit4]   2> 116833 INFO  (zkCallback-83-thread-2-processing-n:127.0.0.1:50709__fj) [n:127.0.0.1:50709__fj    ] o.a.s.c.c.ZkStateReader Updated live nodes from ZooKeeper... (1) -> (2)
   [junit4]   2> 116834 INFO  (zkCallback-92-thread-1-processing-n:127.0.0.1:50725__fj) [n:127.0.0.1:50725__fj    ] o.a.s.c.c.ZkStateReader Updated live nodes from ZooKeeper... (1) -> (2)
   [junit4]   2> 117229 INFO  (TEST-TestCloudSchemaless.test-seed#[F3D7E8490E6FAD5D]) [n:127.0.0.1:50725__fj    ] o.a.s.c.CorePropertiesLocator Found 1 core definitions underneath C:\Users\jenkins\workspace\Lucene-Solr-master-Windows\solr\build\solr-core\test\J0\..\..\..\..\..\..\..\..\..\Users\jenkins\workspace\Lucene-Solr-master-Windows\solr\build\solr-core\test\J0\temp\solr.schema.TestCloudSchemaless_F3D7E8490E6FAD5D-001\shard-1-001\cores
   [junit4]   2> 117229 INFO  (TEST-TestCloudSchemaless.test-seed#[F3D7E8490E6FAD5D]) [n:127.0.0.1:50725__fj    ] o.a.s.c.CorePropertiesLocator Cores are: [collection1]
   [junit4]   2> 117238 INFO  (OverseerStateUpdate-97650727142162436-127.0.0.1:50709__fj-n_0000000000) [n:127.0.0.1:50709__fj    ] o.a.s.c.o.ReplicaMutator Assigning new node to shard shard=shard2
   [junit4]   2> 118301 WARN  (coreLoadExecutor-293-thread-1-processing-n:127.0.0.1:50725__fj) [n:127.0.0.1:50725__fj c:collection1   x:collection1] o.a.s.c.Config Beginning with Solr 5.5, <mergePolicy> is deprecated, use <mergePolicyFactory> instead.
   [junit4]   2> 118303 INFO  (coreLoadExecutor-293-thread-1-processing-n:127.0.0.1:50725__fj) [n:127.0.0.1:50725__fj c:collection1   x:collection1] o.a.s.c.SolrConfig Using Lucene MatchVersion: 7.0.0
   [junit4]   2> 118343 INFO  (coreLoadExecutor-293-thread-1-processing-n:127.0.0.1:50725__fj) [n:127.0.0.1:50725__fj c:collection1   x:collection1] o.a.s.s.IndexSchema [collection1] Schema name=add-schema-fields-update-processor
   [junit4]   2> 118371 INFO  (coreLoadExecutor-293-thread-1-processing-n:127.0.0.1:50725__fj) [n:127.0.0.1:50725__fj c:collection1   x:collection1] o.a.s.s.IndexSchema Loaded schema add-schema-fields-update-processor/1.6 with uniqueid field id
   [junit4]   2> 118379 INFO  (coreLoadExecutor-293-thread-1-processing-n:127.0.0.1:50725__fj) [n:127.0.0.1:50725__fj c:collection1   x:collection1] o.a.s.c.CoreContainer Creating SolrCore 'collection1' using configuration from collection collection1
   [junit4]   2> 118380 INFO  (coreLoadExecutor-293-thread-1-processing-n:127.0.0.1:50725__fj) [n:127.0.0.1:50725__fj c:collection1   x:collection1] o.a.s.c.SolrCore solr.RecoveryStrategy.Builder
   [junit4]   2> 118380 INFO  (coreLoadExecutor-293-thread-1-processing-n:127.0.0.1:50725__fj) [n:127.0.0.1:50725__fj c:collection1   x:collection1] o.a.s.c.SolrCore [[collection1] ] Opening new SolrCore at [C:\Users\jenkins\workspace\Lucene-Solr-master-Windows\solr\build\solr-core\test\J0\temp\solr.schema.TestCloudSchemaless_F3D7E8490E6FAD5D-001\shard-1-001\cores\collection1], dataDir=[C:\Users\jenkins\workspace\Lucene-Solr-master-Windows\solr\build\solr-core\test\J0\..\..\..\..\..\..\..\..\..\Users\jenkins\workspace\Lucene-Solr-master-Windows\solr\build\solr-core\test\J0\temp\solr.schema.TestCloudSchemaless_F3D7E8490E6FAD5D-001\shard-1-001\cores\collection1\data\]
   [junit4]   2> 118393 INFO  (coreLoadExecutor-293-thread-1-processing-n:127.0.0.1:50725__fj) [n:127.0.0.1:50725__fj c:collection1   x:collection1] o.a.s.u.RandomMergePolicy RandomMergePolicy wrapping class org.apache.lucene.index.TieredMergePolicy: [TieredMergePolicy: maxMergeAtOnce=40, maxMergeAtOnceExplicit=30, maxMergedSegmentMB=66.6318359375, floorSegmentMB=2.13671875, forceMergeDeletesPctAllowed=25.541559388605638, segmentsPerTier=25.0, maxCFSSegmentSizeMB=8.796093022207999E12, noCFSRatio=0.5540389569270155
   [junit4]   2> 118609 INFO  (coreLoadExecutor-293-thread-1-processing-n:127.0.0.1:50725__fj) [n:127.0.0.1:50725__fj c:collection1   x:collection1] o.a.s.u.UpdateHandler Using UpdateLog implementation: org.apache.solr.update.UpdateLog
   [junit4]   2> 118609 INFO  (coreLoadExecutor-293-thread-1-processing-n:127.0.0.1:50725__fj) [n:127.0.0.1:50725__fj c:collection1   x:collection1] o.a.s.u.UpdateLog Initializing UpdateLog: dataDir= defaultSyncLevel=FLUSH numRecordsToKeep=100 maxNumLogsToKeep=10 numVersionBuckets=65536
   [junit4]   2> 118612 INFO  (coreLoadExecutor-293-thread-1-processing-n:127.0.0.1:50725__fj) [n:127.0.0.1:50725__fj c:collection1   x:collection1] o.a.s.u.CommitTracker Hard AutoCommit: disabled
   [junit4]   2> 118612 INFO  (coreLoadExecutor-293-thread-1-processing-n:127.0.0.1:50725__fj) [n:127.0.0.1:50725__fj c:collection1   x:collection1] o.a.s.u.CommitTracker Soft AutoCommit: disabled
   [junit4]   2> 118613 INFO  (coreLoadExecutor-293-thread-1-processing-n:127.0.0.1:50725__fj) [n:127.0.0.1:50725__fj c:collection1   x:collection1] o.a.s.u.RandomMergePolicy RandomMergePolicy wrapping class org.apache.lucene.index.TieredMergePolicy: [TieredMergePolicy: maxMergeAtOnce=15, maxMergeAtOnceExplicit=35, maxMergedSegmentMB=8.3115234375, floorSegmentMB=2.046875, forceMergeDeletesPctAllowed=27.659850238359954, segmentsPerTier=30.0, maxCFSSegmentSizeMB=8.796093022207999E12, noCFSRatio=0.16400509765949814
   [junit4]   2> 118614 INFO  (coreLoadExecutor-293-thread-1-processing-n:127.0.0.1:50725__fj) [n:127.0.0.1:50725__fj c:collection1   x:collection1] o.a.s.s.SolrIndexSearcher Opening [Searcher@2d1389[collection1] main]
   [junit4]   2> 118617 INFO  (coreLoadExecutor-293-thread-1-processing-n:127.0.0.1:50725__fj) [n:127.0.0.1:50725__fj c:collection1   x:collection1] o.a.s.r.ManagedResourceStorage Configured ZooKeeperStorageIO with znodeBase: /configs/conf1
   [junit4]   2> 118618 INFO  (coreLoadExecutor-293-thread-1-processing-n:127.0.0.1:50725__fj) [n:127.0.0.1:50725__fj c:collection1   x:collection1] o.a.s.r.ManagedResourceStorage Loaded null at path _rest_managed.json using ZooKeeperStorageIO:path=/configs/conf1
   [junit4]   2> 118618 INFO  (coreLoadExecutor-293-thread-1-processing-n:127.0.0.1:50725__fj) [n:127.0.0.1:50725__fj c:collection1   x:collection1] o.a.s.s.ZkIndexSchemaReader Creating ZooKeeper watch for the managed schema at /configs/conf1/managed-schema
   [junit4]   2> 118620 INFO  (coreLoadExecutor-293-thread-1-processing-n:127.0.0.1:50725__fj) [n:127.0.0.1:50725__fj c:collection1   x:collection1] o.a.s.s.ZkIndexSchemaReader Current schema version 0 is already the latest
   [junit4]   2> 118620 INFO  (coreLoadExecutor-293-thread-1-processing-n:127.0.0.1:50725__fj) [n:127.0.0.1:50725__fj c:collection1   x:collection1] o.a.s.h.ReplicationHandler Commits will be reserved for  10000
   [junit4]   2> 118620 INFO  (searcherExecutor-294-thread-1-processing-n:127.0.0.1:50725__fj x:collection1 c:collection1) [n:127.0.0.1:50725__fj c:collection1   x:collection1] o.a.s.c.SolrCore [collection1] Registered new searcher Searcher@2d1389[collection1] main{ExitableDirectoryReader(UninvertingDirectoryReader())}
   [junit4]   2> 118621 INFO  (coreLoadExecutor-293-thread-1-processing-n:127.0.0.1:50725__fj) [n:127.0.0.1:50725__fj c:collection1   x:collection1] o.a.s.u.UpdateLog Could not find max version in index or recent updates, using new clock 1562411641559056384
   [junit4]   2> 118636 INFO  (coreZkRegister-288-thread-1-processing-n:127.0.0.1:50725__fj x:collection1 c:collection1) [n:127.0.0.1:50725__fj c:collection1 s:shard2 r:core_node1 x:collection1] o.a.s.c.ShardLeaderElectionContext Enough replicas found to continue.
   [junit4]   2> 118636 INFO  (coreZkRegister-288-thread-1-processing-n:127.0.0.1:50725__fj x:collection1 c:collection1) [n:127.0.0.1:50725__fj c:collection1 s:shard2 r:core_node1 x:collection1] o.a.s.c.ShardLeaderElectionContext I may be the new leader - try and sync
   [junit4]   2> 118636 INFO  (coreZkRegister-288-thread-1-processing-n:127.0.0.1:50725__fj x:collection1 c:collection1) [n:127.0.0.1:50725__fj c:collection1 s:shard2 r:core_node1 x:collection1] o.a.s.c.SyncStrategy Sync replicas to http://127.0.0.1:50725/_fj/collection1/
   [junit4]   2> 118636 INFO  (coreZkRegister-288-thread-1-processing-n:127.0.0.1:50725__fj x:collection1 c:collection1) [n:127.0.0.1:50725__fj c:collection1 s:shard2 r:core_node1 x:collection1] o.a.s.c.SyncStrategy Sync Success - now sync replicas to me
   [junit4]   2> 118636 INFO  (coreZkRegister-288-thread-1-processing-n:127.0.0.1:50725__fj x:collection1 c:collection1) [n:127.0.0.1:50725__fj c:collection1 s:shard2 r:core_node1 x:collection1] o.a.s.c.SyncStrategy http://127.0.0.1:50725/_fj/collection1/ has no replicas
   [junit4]   2> 118636 INFO  (coreZkRegister-288-thread-1-processing-n:127.0.0.1:50725__fj x:collection1 c:collection1) [n:127.0.0.1:50725__fj c:collection1 s:shard2 r:core_node1 x:collection1] o.a.s.c.ShardLeaderElectionContext Found all replicas participating in election, clear LIR
   [junit4]   2> 118646 INFO  (coreZkRegister-288-thread-1-processing-n:127.0.0.1:50725__fj x:collection1 c:collection1) [n:127.0.0.1:50725__fj c:collection1 s:shard2 r:core_node1 x:collection1] o.a.s.c.ShardLeaderElectionContext I am the new leader: http://127.0.0.1:50725/_fj/collection1/ shard2
   [junit4]   2> 118799 INFO  (coreZkRegister-288-thread-1-processing-n:127.0.0.1:50725__fj x:collection1 c:collection1) [n:127.0.0.1:50725__fj c:collection1 s:shard2 r:core_node1 x:collection1] o.a.s.c.ZkController I am the leader, no recovery necessary
   [junit4]   2> 119645 INFO  (TEST-TestCloudSchemaless.test-seed#[F3D7E8490E6FAD5D]) [    ] o.a.s.SolrTestCaseJ4 Writing core.properties file to C:\Users\jenkins\workspace\Lucene-Solr-master-Windows\solr\build\solr-core\test\J0\temp\solr.schema.TestCloudSchemaless_F3D7E8490E6FAD5D-001\shard-2-001\cores\collection1
   [junit4]   2> 119648 INFO  (TEST-TestCloudSchemaless.test-seed#[F3D7E8490E6FAD5D]) [    ] o.a.s.c.AbstractFullDistribZkTestBase create jetty 2 in directory C:\Users\jenkins\workspace\Lucene-Solr-master-Windows\solr\build\solr-core\test\J0\temp\solr.schema.TestCloudSchemaless_F3D7E8490E6FAD5D-001\shard-2-001
   [junit4]   2> 119649 INFO  (TEST-TestCloudSchemaless.test-seed#[F3D7E8490E6FAD5D]) [    ] o.e.j.s.Server jetty-9.3.14.v20161028
   [junit4]   2> 119650 INFO  (TEST-TestCloudSchemaless.test-seed#[F3D7E8490E6FAD5D]) [    ] o.e.j.s.h.ContextHandler Started o.e.j.s.ServletContextHandler@2853d4{/_fj,null,AVAILABLE}
   [junit4]   2> 119653 INFO  (TEST-TestCloudSchemaless.test-seed#[F3D7E8490E6FAD5D]) [    ] o.e.j.s.AbstractConnector Started ServerConnector@45190d{HTTP/1.1,[http/1.1]}{127.0.0.1:50737}
   [junit4]   2> 119653 INFO  (TEST-TestCloudSchemaless.test-seed#[F3D7E8490E6FAD5D]) [    ] o.e.j.s.Server Started @124429ms
   [junit4]   2> 119653 INFO  (TEST-TestCloudSchemaless.test-seed#[F3D7E8490E6FAD5D]) [    ] o.a.s.c.s.e.JettySolrRunner Jetty properties: {solr.data.dir=C:\Users\jenkins\workspace\Lucene-Solr-master-Windows\solr\build\solr-core\test\J0\temp\solr.schema.TestCloudSchemaless_F3D7E8490E6FAD5D-001\tempDir-001/jetty2, solrconfig=solrconfig.xml, hostContext=/_fj, hostPort=50737, coreRootDirectory=C:\Users\jenkins\workspace\Lucene-Solr-master-Windows\solr\build\solr-core\test\J0\temp\solr.schema.TestCloudSchemaless_F3D7E8490E6FAD5D-001\shard-2-001\cores}
   [junit4]   2> 119653 ERROR (TEST-TestCloudSchemaless.test-seed#[F3D7E8490E6FAD5D]) [    ] o.a.s.s.StartupLoggingUtils Missing Java Option solr.log.dir. Logging may be missing or incomplete.
   [junit4]   2> 119654 INFO  (TEST-TestCloudSchemaless.test-seed#[F3D7E8490E6FAD5D]) [    ] o.a.s.s.SolrDispatchFilter  ___      _       Welcome to Apache Solr? version 7.0.0
   [junit4]   2> 119654 INFO  (TEST-TestCloudSchemaless.test-seed#[F3D7E8490E6FAD5D]) [    ] o.a.s.s.SolrDispatchFilter / __| ___| |_ _   Starting in cloud mode on port null
   [junit4]   2> 119654 INFO  (TEST-TestCloudSchemaless.test-seed#[F3D7E8490E6FAD5D]) [    ] o.a.s.s.SolrDispatchFilter \__ \/ _ \ | '_|  Install dir: null
   [junit4]   2> 119654 INFO  (TEST-TestCloudSchemaless.test-seed#[F3D7E8490E6FAD5D]) [    ] o.a.s.s.SolrDispatchFilter |___/\___/_|_|    Start time: 2017-03-20T17:44:15.242Z
   [junit4]   2> 119667 WARN  (NIOServerCxn.Factory:0.0.0.0/0.0.0.0:0) [    ] o.a.z.s.NIOServerCnxn caught end of stream exception
   [junit4]   2> EndOfStreamException: Unable to read additional data from client sessionid 0x15aecd1a75e0009, likely client has closed socket
   [junit4]   2> at org.apache.zookeeper.server.NIOServerCnxn.doIO(NIOServerCnxn.java:228)
   [junit4]   2> at org.apache.zookeeper.server.NIOServerCnxnFactory.run(NIOServerCnxnFactory.java:208)
   [junit4]   2> at java.lang.Thread.run(Thread.java:745)
   [junit4]   2> 119667 INFO  (TEST-TestCloudSchemaless.test-seed#[F3D7E8490E6FAD5D]) [    ] o.a.s.s.SolrDispatchFilter Loading solr.xml from SolrHome (not found in ZooKeeper)
   [junit4]   2> 119668 INFO  (TEST-TestCloudSchemaless.test-seed#[F3D7E8490E6FAD5D]) [    ] o.a.s.c.SolrXmlConfig Loading container configuration from C:\Users\jenkins\workspace\Lucene-Solr-master-Windows\solr\build\solr-core\test\J0\temp\solr.schema.TestCloudSchemaless_F3D7E8490E6FAD5D-001\shard-2-001\solr.xml
   [junit4]   2> 119696 INFO  (TEST-TestCloudSchemaless.test-seed#[F3D7E8490E6FAD5D]) [    ] o.a.s.c.ZkContainer Zookeeper client=127.0.0.1:50702/solr
   [junit4]   2> 119702 WARN  (NIOServerCxn.Factory:0.0.0.0/0.0.0.0:0) [    ] o.a.z.s.NIOServerCnxn caught end of stream exception
   [junit4]   2> EndOfStreamException: Unable to read additional data from client sessionid 0x15aecd1a75e000a, likely client has closed socket
   [junit4]   2> at org.apache.zookeeper.server.NIOServerCnxn.doIO(NIOServerCnxn.java:228)
   [junit4]   2> at org.apache.zookeeper.server.NIOServerCnxnFactory.run(NIOServerCnxnFactory.java:208)
   [junit4]   2> at java.lang.Thread.run(Thread.java:745)
   [junit4]   2> 119720 INFO  (TEST-TestCloudSchemaless.test-seed#[F3D7E8490E6FAD5D]) [n:127.0.0.1:50737__fj    ] o.a.s.c.c.ZkStateReader Updated live nodes from ZooKeeper... (0) -> (2)
   [junit4]   2> 119726 INFO  (TEST-TestCloudSchemaless.test-seed#[F3D7E8490E6FAD5D]) [n:127.0.0.1:50737__fj    ] o.a.s.c.Overseer Overseer (id=null) closing
   [junit4]   2> 119731 INFO  (TEST-TestCloudSchemaless.test-seed#[F3D7E8490E6FAD5D]) [n:127.0.0.1:50737__fj    ] o.a.s.c.ZkController Register node as live in ZooKeeper:/live_nodes/127.0.0.1:50737__fj
   [junit4]   2> 119733 INFO  (zkCallback-83-thread-3-processing-n:127.0.0.1:50709__fj) [n:127.0.0.1:50709__fj    ] o.a.s.c.c.ZkStateReader Updated live nodes from ZooKeeper... (2) -> (3)
   [junit4]   2> 119734 INFO  (zkCallback-87-thread-1) [    ] o.a.s.c.c.ZkStateReader Updated live nodes from ZooKeeper... (2) -> (3)
   [junit4]   2> 119734 INFO  (zkCallback-92-thread-1-processing-n:127.0.0.1:50725__fj) [n:127.0.0.1:50725__fj    ] o.a.s.c.c.ZkStateReader Updated live nodes from ZooKeeper... (2) -> (3)
   [junit4]   2> 119735 INFO  (zkCallback-98-thread-1-processing-n:127.0.0.1:50737__fj) [n:127.0.0.1:50737__fj    ] o.a.s.c.c.ZkStateReader Updated live nodes from ZooKeeper... (2) -> (3)
   [junit4]   2> 120237 INFO  (TEST-TestCloudSchemaless.test-seed#[F3D7E8490E6FAD5D]) [n:127.0.0.1:50737__fj    ] o.a.s.c.CorePropertiesLocator Found 1 core definitions underneath C:\Users\jenkins\workspace\Lucene-Solr-master-Windows\solr\build\solr-core\test\J0\temp\solr.schema.TestCloudSchemaless_F3D7E8490E6FAD5D-001\shard-2-001\cores
   [junit4]   2> 120237 INFO  (TEST-TestCloudSchemaless.test-seed#[F3D7E8490E6FAD5D]) [n:127.0.0.1:50737__fj    ] o.a.s.c.CorePropertiesLocator Cores are: [collection1]
   [junit4]   2> 120247 INFO  (OverseerStateUpdate-97650727142162436-127.0.0.1:50709__fj-n_0000000000) [n:127.0.0.1:50709__fj    ] o.a.s.c.o.ReplicaMutator Assigning new node to shard shard=shard3
   [junit4]   2> 121301 WARN  (coreLoadExecutor-304-thread-1-processing-n:127.0.0.1:50737__fj) [n:127.0.0.1:50737__fj c:collection1   x:collection1] o.a.s.c.Config Beginning with Solr 5.5, <mergePolicy> is deprecated, use <mergePolicyFactory> instead.
   [junit4]   2> 121303 INFO  (coreLoadExecutor-304-thread-1-processing-n:127.0.0.1:50737__fj) [n:127.0.0.1:50737__fj c:collection1   x:collection1] o.a.s.c.SolrConfig Using Lucene MatchVersion: 7.0.0
   [junit4]   2> 121337 INFO  (coreLoadExecutor-304-thread-1-processing-n:127.0.0.1:50737__fj) [n:127.0.0.1:50737__fj c:collection1   x:collection1] o.a.s.s.IndexSchema [collection1] Schema name=add-schema-fields-update-processor
   [junit4]   2> 121368 INFO  (coreLoadExecutor-304-thread-1-processing-n:127.0.0.1:50737__fj) [n:127.0.0.1:50737__fj c:collection1   x:collection1] o.a.s.s.IndexSchema Loaded schema add-schema-fields-update-processor/1.6 with uniqueid field id
   [junit4]   2> 121407 INFO  (coreLoadExecutor-304-thread-1-processing-n:127.0.0.1:50737__fj) [n:127.0.0.1:50737__fj c:collection1   x:collection1] o.a.s.c.CoreContainer Creating SolrCore 'collection1' using configuration from collection collection1
   [junit4]   2> 121408 INFO  (coreLoadExecutor-304-thread-1-processing-n:127.0.0.1:50737__fj) [n:127.0.0.1:50737__fj c:collection1   x:collection1] o.a.s.c.SolrCore solr.RecoveryStrategy.Builder
   [junit4]   2> 121408 INFO  (coreLoadExecutor-304-thread-1-processing-n:127.0.0.1:50737__fj) [n:127.0.0.1:50737__fj c:collection1   x:collection1] o.a.s.c.SolrCore [[collection1] ] Opening new SolrCore at [C:\Users\jenkins\workspace\Lucene-Solr-master-Windows\solr\build\solr-core\test\J0\temp\solr.schema.TestCloudSchemaless_F3D7E8490E6FAD5D-001\shard-2-001\cores\collection1], dataDir=[C:\Users\jenkins\workspace\Lucene-Solr-master-Windows\solr\build\solr-core\test\J0\temp\solr.schema.TestCloudSchemaless_F3D7E8490E6FAD5D-001\shard-2-001\cores\collection1\data\]
   [junit4]   2> 121420 INFO  (coreLoadExecutor-304-thread-1-processing-n:127.0.0.1:50737__fj) [n:127.0.0.1:50737__fj c:collection1   x:collection1] o.a.s.u.RandomMergePolicy RandomMergePolicy wrapping class org.apache.lucene.index.TieredMergePolicy: [TieredMergePolicy: maxMergeAtOnce=40, maxMergeAtOnceExplicit=30, maxMergedSegmentMB=66.6318359375, floorSegmentMB=2.13671875, forceMergeDeletesPctAllowed=25.541559388605638, segmentsPerTier=25.0, maxCFSSegmentSizeMB=8.796093022207999E12, noCFSRatio=0.5540389569270155
   [junit4]   2> 121621 INFO  (coreLoadExecutor-304-thread-1-processing-n:127.0.0.1:50737__fj) [n:127.0.0.1:50737__fj c:collection1   x:collection1] o.a.s.u.UpdateHandler Using UpdateLog implementation: org.apache.solr.update.UpdateLog
   [junit4]   2> 121621 INFO  (coreLoadExecutor-304-thread-1-processing-n:127.0.0.1:50737__fj) [n:127.0.0.1:50737__fj c:collection1   x:collection1] o.a.s.u.UpdateLog Initializing UpdateLog: dataDir= defaultSyncLevel=FLUSH numRecordsToKeep=100 maxNumLogsToKeep=10 numVersionBuckets=65536
   [junit4]   2> 121624 INFO  (coreLoadExecutor-304-thread-1-processing-n:127.0.0.1:50737__fj) [n:127.0.0.1:50737__fj c:collection1   x:collection1] o.a.s.u.CommitTracker Hard AutoCommit: disabled
   [junit4]   2> 121624 INFO  (coreLoadExecutor-304-thread-1-processing-n:127.0.0.1:50737__fj) [n:127.0.0.1:50737__fj c:collection1   x:collection1] o.a.s.u.CommitTracker Soft AutoCommit: disabled
   [junit4]   2> 121625 INFO  (coreLoadExecutor-304-thread-1-processing-n:127.0.0.1:50737__fj) [n:127.0.0.1:50737__fj c:collection1   x:collection1] o.a.s.u.RandomMergePolicy RandomMergePolicy wrapping class org.apache.lucene.index.TieredMergePolicy: [TieredMergePolicy: maxMergeAtOnce=15, maxMergeAtOnceExplicit=35, maxMergedSegmentMB=8.3115234375, floorSegmentMB=2.046875, forceMergeDeletesPctAllowed=27.659850238359954, segmentsPerTier=30.0, maxCFSSegmentSizeMB=8.796093022207999E12, noCFSRatio=0.16400509765949814
   [junit4]   2> 121626 INFO  (coreLoadExecutor-304-thread-1-processing-n:127.0.0.1:50737__fj) [n:127.0.0.1:50737__fj c:collection1   x:collection1] o.a.s.s.SolrIndexSearcher Opening [Searcher@1a45cb4[collection1] main]
   [junit4]   2> 121631 INFO  (coreLoadExecutor-304-thread-1-processing-n:127.0.0.1:50737__fj) [n:127.0.0.1:50737__fj c:collection1   x:collection1] o.a.s.r.ManagedResourceStorage Configured ZooKeeperStorageIO with znodeBase: /configs/conf1
   [junit4]   2> 121632 INFO  (coreLoadExecutor-304-thread-1-processing-n:127.0.0.1:50737__fj) [n:127.0.0.1:50737__fj c:collection1   x:collection1] o.a.s.r.ManagedResourceStorage Loaded null at path _rest_managed.json using ZooKeeperStorageIO:path=/configs/conf1
   [junit4]   2> 121632 INFO  (coreLoadExecutor-304-thread-1-processing-n:127.0.0.1:50737__fj) [n:127.0.0.1:50737__fj c:collection1   x:collection1] o.a.s.s.ZkIndexSchemaReader Creating ZooKeeper watch for the managed schema at /configs/conf1/managed-schema
   [junit4]   2> 121634 INFO  (coreLoadExecutor-304-thread-1-processing-n:127.0.0.1:50737__fj) [n:127.0.0.1:50737__fj c:collection1   x:collection1] o.a.s.s.ZkIndexSchemaReader Current schema version 0 is already the latest
   [junit4]   2> 121634 INFO  (coreLoadExecutor-304-thread-1-processing-n:127.0.0.1:50737__fj) [n:127.0.0.1:50737__fj c:collection1   x:collection1] o.a.s.h.ReplicationHandler Commits will be reserved for  10000
   [junit4]   2> 121634 INFO  (searcherExecutor-305-thread-1-processing-n:127.0.0.1:50737__fj x:collection1 c:collection1) [n:127.0.0.1:50737__fj c:collection1   x:collection1] o.a.s.c.SolrCore [collection1] Registered new searcher Searcher@1a45cb4[collection1] main{ExitableDirectoryReader(UninvertingDirectoryReader())}
   [junit4]   2> 121636 INFO  (coreLoadExecutor-304-thread-1-processing-n:127.0.0.1:50737__fj) [n:127.0.0.1:50737__fj c:collection1   x:collection1] o.a.s.u.UpdateLog Could not find max version in index or recent updates, using new clock 1562411644720513024
   [junit4]   2> 121648 INFO  (coreZkRegister-299-thread-1-processing-n:127.0.0.1:50737__fj x:collection1 c:collection1) [n:127.0.0.1:50737__fj c:collection1 s:shard3 r:core_node2 x:collection1] o.a.s.c.ShardLeaderElectionContext Enough replicas found to continue.
   [junit4]   2> 121649 INFO  (coreZkRegister-299-thread-1-processing-n:127.0.0.1:50737__fj x:collection1 c:collection1) [n:127.0.0.1:50737__fj c:collection1 s:shard3 r:core_node2 x:collection1] o.a.s.c.ShardLeaderElectionContext I may be the new leader - try and sync
   [junit4]   2> 121649 INFO  (coreZkRegister-299-thread-1-processing-n:127.0.0.1:50737__fj x:collection1 c:collection1) [n:127.0.0.1:50737__fj c:collection1 s:shard3 r:core_node2 x:collection1] o.a.s.c.SyncStrategy Sync replicas to http://127.0.0.1:50737/_fj/collection1/
   [junit4]   2> 121649 INFO  (coreZkRegister-299-thread-1-processing-n:127.0.0.1:50737__fj x:collection1 c:collection1) [n:127.0.0.1:50737__fj c:collection1 s:shard3 r:core_node2 x:collection1] o.a.s.c.SyncStrategy Sync Success - now sync replicas to me
   [junit4]   2> 121649 INFO  (coreZkRegister-299-thread-1-processing-n:127.0.0.1:50737__fj x:collection1 c:collection1) [n:127.0.0.1:50737__fj c:collection1 s:shard3 r:core_node2 x:collection1] o.a.s.c.SyncStrategy http://127.0.0.1:50737/_fj/collection1/ has no replicas
   [junit4]   2> 121649 INFO  (coreZkRegister-299-thread-1-processing-n:127.0.0.1:50737__fj x:collection1 c:collection1) [n:127.0.0.1:50737__fj c:collection1 s:shard3 r:core_node2 x:collection1] o.a.s.c.ShardLeaderElectionContext Found all replicas participating in election, clear LIR
   [junit4]   2> 121659 INFO  (coreZkRegister-299-thread-1-processing-n:127.0.0.1:50737__fj x:collection1 c:collection1) [n:127.0.0.1:50737__fj c:collection1 s:shard3 r:core_node2 x:collection1] o.a.s.c.ShardLeaderElectionContext I am the new leader: http://127.0.0.1:50737/_fj/collection1/ shard3
   [junit4]   2> 121812 INFO  (coreZkRegister-299-thread-1-processing-n:127.0.0.1:50737__fj x:collection1 c:collection1) [n:127.0.0.1:50737__fj c:collection1 s:shard3 r:core_node2 x:collection1] o.a.s.c.ZkController I am the leader, no recovery necessary
   [junit4]   2> 122593 INFO  (TEST-TestCloudSchemaless.test-seed#[F3D7E8490E6FAD5D]) [    ] o.a.s.SolrTestCaseJ4 Writing core.properties file to C:\Users\jenkins\workspace\Lucene-Solr-master-Windows\solr\build\solr-core\test\J0\temp\solr.schema.TestCloudSchemaless_F3D7E8490E6FAD5D-001\shard-3-001\cores\collection1
   [junit4]   2> 122596 INFO  (TEST-TestCloudSchemaless.test-seed#[F3D7E8490E6FAD5D]) [    ] o.a.s.c.AbstractFullDistribZkTestBase create jetty 3 in directory C:\Users\jenkins\workspace\Lucene-Solr-master-Windows\solr\build\solr-core\test\J0\temp\solr.schema.TestCloudSchemaless_F3D7E8490E6FAD5D-001\shard-3-001
   [junit4]   2> 122597 INFO  (TEST-TestCloudSchemaless.test-seed#[F3D7E8490E6FAD5D]) [    ] o.e.j.s.Server jetty-9.3.14.v20161028
   [junit4]   2> 122598 INFO  (TEST-TestCloudSchemaless.test-seed#[F3D7E8490E6FAD5D]) [    ] o.e.j.s.h.ContextHandler Started o.e.j.s.ServletContextHandler@1f4c21e{/_fj,null,AVAILABLE}
   [junit4]   2> 122600 INFO  (TEST-TestCloudSchemaless.test-seed#[F3D7E8490E6FAD5D]) [    ] o.e.j.s.AbstractConnector Started ServerConnector@1b978e7{HTTP/1.1,[http/1.1]}{127.0.0.1:50750}
   [junit4]   2> 122600 INFO  (TEST-TestCloudSchemaless.test-seed#[F3D7E8490E6FAD5D]) [    ] o.e.j.s.Server Started @127377ms
   [junit4]   2> 122600 INFO  (TEST-TestCloudSchemaless.test-seed#[F3D7E8490E6FAD5D]) [    ] o.a.s.c.s.e.JettySolrRunner Jetty properties: {solr.data.dir=C:\Users\jenkins\workspace\Lucene-Solr-master-Windows\solr\build\solr-core\test\J0\temp\solr.schema.TestCloudSchemaless_F3D7E8490E6FAD5D-001\tempDir-001/jetty3, solrconfig=solrconfig.xml, hostContext=/_fj, hostPort=50750, coreRootDirectory=C:\Users\jenkins\workspace\Lucene-Solr-master-Windows\solr\build\solr-core\test\J0\temp\solr.schema.TestCloudSchemaless_F3D7E8490E6FAD5D-001\shard-3-001\cores}
   [junit4]   2> 122600 ERROR (TEST-TestCloudSchemaless.test-seed#[F3D7E8490E6FAD5D]) [    ] o.a.s.s.StartupLoggingUtils Missing Java Option solr.log.dir. Logging may be missing or incomplete.
   [junit4]   2> 122601 INFO  (TEST-TestCloudSchemaless.test-seed#[F3D7E8490E6FAD5D]) [    ] o.a.s.s.SolrDispatchFilter  ___      _       Welcome to Apache Solr? version 7.0.0
   [junit4]   2> 122601 INFO  (TEST-TestCloudSchemaless.test-seed#[F3D7E8490E6FAD5D]) [    ] o.a.s.s.SolrDispatchFilter / __| ___| |_ _   Starting in cloud mode on port null
   [junit4]   2> 122601 INFO  (TEST-TestCloudSchemaless.test-seed#[F3D7E8490E6FAD5D]) [    ] o.a.s.s.SolrDispatchFilter \__ \/ _ \ | '_|  Install dir: null
   [junit4]   2> 122601 INFO  (TEST-TestCloudSchemaless.test-seed#[F3D7E8490E6FAD5D]) [    ] o.a.s.s.SolrDispatchFilter |___/\___/_|_|    Start time: 2017-03-20T17:44:18.189Z
   [junit4]   2> 122609 INFO  (TEST-TestCloudSchemaless.test-seed#[F3D7E8490E6FAD5D]) [    ] o.a.s.s.SolrDispatchFilter Loading solr.xml from SolrHome (not found in ZooKeeper)
   [junit4]   2> 122609 INFO  (TEST-TestCloudSchemaless.test-seed#[F3D7E8490E6FAD5D]) [    ] o.a.s.c.SolrXmlConfig Loading container configuration from C:\Users\jenkins\workspace\Lucene-Solr-master-Windows\solr\build\solr-core\test\J0\temp\solr.schema.TestCloudSchemaless_F3D7E8490E6FAD5D-001\shard-3-001\solr.xml
   [junit4]   2> 122643 INFO  (TEST-TestCloudSchemaless.test-seed#[F3D7E8490E6FAD5D]) [    ] o.a.s.c.ZkContainer Zookeeper client=127.0.0.1:50702/solr
   [junit4]   2> 122653 WARN  (NIOServerCxn.Factory:0.0.0.0/0.0.0.0:0) [    ] o.a.z.s.NIOServerCnxn caught end of stream exception
   [junit4]   2> EndOfStreamException: Unable to read additional data from client sessionid 0x15aecd1a75e000d, likely client has closed socket
   [junit4]   2> at org.apache.zookeeper.server.NIOServerCnxn.doIO(NIOServerCnxn.java:228)
   [junit4]   2> at org.apache.zookeeper.server.NIOServerCnxnFactory.run(NIOServerCnxnFactory.java:208)
   [junit4]   2> at java.lang.Thread.run(Thread.java:745)
   [junit4]   2> 122674 INFO  (TEST-TestCloudSchemaless.test-seed#[F3D7E8490E6FAD5D]) [n:127.0.0.1:50750__fj    ] o.a.s.c.c.ZkStateReader Updated live nodes from ZooKeeper... (0) -> (3)
   [junit4]   2> 122678 INFO  (TEST-TestCloudSchemaless.test-seed#[F3D7E8490E6FAD5D]) [n:127.0.0.1:50750__fj    ] o.a.s.c.Overseer Overseer (id=null) closing
   [junit4]   2> 122684 INFO  (TEST-TestCloudSchemaless.test-seed#[F3D7E8490E6FAD5D]) [n:127.0.0.1:50750__fj    ] o.a.s.c.ZkController Register node as live in ZooKeeper:/live_nodes/127.0.0.1:50750__fj
   [junit4]   2> 122688 INFO  (zkCallback-104-thread-1-processing-n:127.0.0.1:50750__fj) [n:127.0.0.1:50750__fj    ] o.a.s.c.c.ZkStateReader Updated live nodes from ZooKeeper... (3) -> (4)
   [junit4]   2> 122688 INFO  (zkCallback-83-thread-1-processing-n:127.0.0.1:50709__fj) [n:127.0.0.1:50709__fj    ] o.a.s.c.c.ZkStateReader Updated live nodes from ZooKeeper... (3) -> (4)
   [junit4]   2> 122688 INFO  (zkCallback-98-thread-1-processing-n:127.0.0.1:50737__fj) [n:127.0.0.1:50737__fj    ] o.a.s.c.c.ZkStateReader Updated live nodes from ZooKeeper... (3) -> (4)
   [junit4]   2> 122690 INFO  (zkCallback-87-thread-1) [    ] o.a.s.c.c.ZkStateReader Updated live nodes from ZooKeeper... (3) -> (4)
   [junit4]   2> 122690 INFO  (zkCallback-92-thread-1-processing-n:127.0.0.1:50725__fj) [n:127.0.0.1:50725__fj    ] o.a.s.c.c.ZkStateReader Updated live nodes from ZooKeeper... (3) -> (4)
   [junit4]   2> 123294 INFO  (TEST-TestCloudSchemaless.test-seed#[F3D7E8490E6FAD5D]) [n:127.0.0.1:50750__fj    ] o.a.s.c.CorePropertiesLocator Found 1 core definitions underneath C:\Users\jenkins\workspace\Lucene-Solr-master-Windows\solr\build\solr-core\test\J0\temp\solr.schema.TestCloudSchemaless_F3D7E8490E6FAD5D-001\shard-3-001\cores
   [junit4]   2> 123295 INFO  (TEST-TestCloudSchemaless.test-seed#[F3D7E8490E6FAD5D]) [n:127.0.0.1:50750__fj    ] o.a.s.c.CorePropertiesLocator Cores are: [collection1]
   [junit4]   2> 123344 INFO  (OverseerStateUpdate-97650727142162436-127.0.0.1:50709__fj-n_0000000000) [n:127.0.0.1:50709__fj    ] o.a.s.c.o.ReplicaMutator Assigning new node to shard shard=shard4
   [junit4]   2> 124380 WARN  (coreLoadExecutor-315-thread-1-processing-n:127.0.0.1:50750__fj) [n:127.0.0.1:50750__fj c:collection1   x:collection1] o.a.s.c.Config Beginning with Solr 5.5, <mergePolicy> is deprecated, use <mergePolicyFactory> instead.
   [junit4]   2> 124383 INFO  (coreLoadExecutor-315-thread-1-processing-n:127.0.0.1:50750__fj) [n:127.0.0.1:50750__fj c:collection1   x:collection1] o.a.s.c.SolrConfig Using Lucene MatchVersion: 7.0.0
   [junit4]   2> 124412 INFO  (coreLoadExecutor-315-thread-1-processing-n:127.0.0.1:50750__fj) [n:127.0.0.1:50750__fj c:collection1   x:collection1] o.a.s.s.IndexSchema [collection1] Schema name=add-schema-fields-update-processor
   [junit4]   2> 124434 INFO  (coreLoadExecutor-315-thread-1-processing-n:127.0.0.1:50750__fj) [n:127.0.0.1:50750__fj c:collection1   x:collection1] o.a.s.s.IndexSchema Loaded schema add-schema-fields-update-processor/1.6 with uniqueid field id
   [junit4]   2> 124442 INFO  (coreLoadExecutor-315-thread-1-processing-n:127.0.0.1:50750__fj) [n:127.0.0.1:50750__fj c:collection1   x:collection1] o.a.s.c.CoreContainer Creating SolrCore 'collection1' using configuration from collection collection1
   [junit4]   2> 124442 INFO  (coreLoadExecutor-315-thread-1-processing-n:127.0.0.1:50750__fj) [n:127.0.0.1:50750__fj c:collection1   x:collection1] o.a.s.c.SolrCore solr.RecoveryStrategy.Builder
   [junit4]   2> 124443 INFO  (coreLoadExecutor-315-thread-1-processing-n:127.0.0.1:50750__fj) [n:127.0.0.1:50750__fj c:collection1   x:collection1] o.a.s.c.SolrCore [[collection1] ] Opening new SolrCore at [C:\Users\jenkins\workspace\Lucene-Solr-master-Windows\solr\build\solr-core\test\J0\temp\solr.schema.TestCloudSchemaless_F3D7E8490E6FAD5D-001\shard-3-001\cores\collection1], dataDir=[C:\Users\jenkins\workspace\Lucene-Solr-master-Windows\solr\build\solr-core\test\J0\temp\solr.schema.TestCloudSchemaless_F3D7E8490E6FAD5D-001\shard-3-001\cores\collection1\data\]
   [junit4]   2> 124452 INFO  (coreLoadExecutor-315-thread-1-processing-n:127.0.0.1:50750__fj) [n:127.0.0.1:50750__fj c:collection1   x:collection1] o.a.s.u.RandomMergePolicy RandomMergePolicy wrapping class org.apache.lucene.index.TieredMergePolicy: [TieredMergePolicy: maxMergeAtOnce=40, maxMergeAtOnceExplicit=30, maxMergedSegmentMB=66.6318359375, floorSegmentMB=2.13671875, forceMergeDeletesPctAllowed=25.541559388605638, segmentsPerTier=25.0, maxCFSSegmentSizeMB=8.796093022207999E12, noCFSRatio=0.5540389569270155
   [junit4]   2> 124627 INFO  (coreLoadExecutor-315-thread-1-processing-n:127.0.0.1:50750__fj) [n:127.0.0.1:50750__fj c:collection1   x:collection1] o.a.s.u.UpdateHandler Using UpdateLog implementation: org.apache.solr.update.UpdateLog
   [junit4]   2> 124627 INFO  (coreLoadExecutor-315-thread-1-processing-n:127.0.0.1:50750__fj) [n:127.0.0.1:50750__fj c:collection1   x:collection1] o.a.s.u.UpdateLog Initializing UpdateLog: dataDir= defaultSyncLevel=FLUSH numRecordsToKeep=100 maxNumLogsToKeep=10 numVersionBuckets=65536
   [junit4]   2> 124629 INFO  (coreLoadExecutor-315-thread-1-processing-n:127.0.0.1:50750__fj) [n:127.0.0.1:50750__fj c:collection1   x:collection1] o.a.s.u.CommitTracker Hard AutoCommit: disabled
   [junit4]   2> 124629 INFO  (coreLoadExecutor-315-thread-1-processing-n:127.0.0.1:50750__fj) [n:127.0.0.1:50750__fj c:collection1   x:collection1] o.a.s.u.CommitTracker Soft AutoCommit: disabled
   [junit4]   2> 124630 INFO  (coreLoadExecutor-315-thread-1-processing-n:127.0.0.1:50750__fj) [n:127.0.0.1:50750__fj c:collection1   x:collection1] o.a.s.u.RandomMergePolicy RandomMergePolicy wrapping class org.apache.lucene.index.TieredMergePolicy: [TieredMergePolicy: maxMergeAtOnce=15, maxMergeAtOnceExplicit=35, maxMergedSegmentMB=8.3115234375, floorSegmentMB=2.046875, forceMergeDeletesPctAllowed=27.659850238359954, segmentsPerTier=30.0, maxCFSSegmentSizeMB=8.796093022207999E12, noCFSRatio=0.16400509765949814
   [junit4]   2> 124632 INFO  (coreLoadExecutor-315-thread-1-processing-n:127.0.0.1:50750__fj) [n:127.0.0.1:50750__fj c:collection1   x:collection1] o.a.s.s.SolrIndexSearcher Opening [Searcher@aa2042[collection1] main]
   [junit4]   2> 124634 INFO  (coreLoadExecutor-315-thread-1-processing-n:127.0.0.1:50750__fj) [n:127.0.0.1:50750__fj c:collection1   x:collection1] o.a.s.r.ManagedResourceStorage Configured ZooKeeperStorageIO with znodeBase: /configs/conf1
   [junit4]   2> 124635 INFO  (coreLoadExecutor-315-thread-1-processing-n:127.0.0.1:50750__fj) [n:127.0.0.1:50750__fj c:collection1   x:collection1] o.a.s.r.ManagedResourceStorage Loaded null at path _rest_managed.json using ZooKeeperStorageIO:path=/configs/conf1
   [junit4]   2> 124635 INFO  (coreLoadExecutor-315-thread-1-processing-n:127.0.0.1:50750__fj) [n:127.0.0.1:50750__fj c:collection1   x:collection1] o.a.s.s.ZkIndexSchemaReader Creating ZooKeeper watch for the managed schema at /configs/conf1/managed-schema
   [junit4]   2> 124644 INFO  (coreLoadExecutor-315-thread-1-processing-n:127.0.0.1:50750__fj) [n:127.0.0.1:50750__fj c:collection1   x:collection1] o.a.s.s.ZkIndexSchemaReader Current schema version 0 is already the latest
   [junit4]   2> 124645 INFO  (coreLoadExecutor-315-thread-1-processing-n:127.0.0.1:50750__fj) [n:127.0.0.1:50750__fj c:collection1   x:collection1] o.a.s.h.ReplicationHandler Commits will be reserved for  10000
   [junit4]   2> 124646 INFO  (searcherExecutor-316-thread-1-processing-n:127.0.0.1:50750__fj x:collection1 c:collection1) [n:127.0.0.1:50750__fj c:collection1   x:collection1] o.a.s.c.SolrCore [collection1] Registered new searcher Searcher@aa2042[collection1] main{ExitableDirectoryReader(UninvertingDirectoryReader())}
   [junit4]   2> 124646 INFO  (coreLoadExecutor-315-thread-1-processing-n:127.0.0.1:50750__fj) [n:127.0.0.1:50750__fj c:collection1   x:collection1] o.a.s.u.UpdateLog Could not find max version in index or recent updates, using new clock 1562411647876726784
   [junit4]   2> 124658 INFO  (coreZkRegister-310-thread-1-processing-n:127.0.0.1:50750__fj x:collection1 c:collection1) [n:127.0.0.1:50750__fj c:collection1 s:shard4 r:core_node3 x:collection1] o.a.s.c.ShardLeaderElectionContext Enough replicas found to continue.
   [junit4]   2> 124658 INFO  (coreZkRegister-310-thread-1-processing-n:127.0.0.1:50750__fj x:collection1 c:collection1) [n:127.0.0.1:50750__fj c:collection1 s:shard4 r:core_node3 x:collection1] o.a.s.c.ShardLeaderElectionContext I may be the new leader - try and sync
   [junit4]   2> 124658 INFO  (coreZkRegister-310-thread-1-processing-n:127.0.0.1:50750__fj x:collection1 c:collection1) [n:127.0.0.1:50750__fj c:collection1 s:shard4 r:core_node3 x:collection1] o.a.s.c.SyncStrategy Sync replicas to http://127.0.0.1:50750/_fj/collection1/
   [junit4]   2> 124658 INFO  (coreZkRegister-310-thread-1-processing-n:127.0.0.1:50750__fj x:collection1 c:collection1) [n:127.0.0.1:50750__fj c:collection1 s:shard4 r:core_node3 x:collection1] o.a.s.c.SyncStrategy Sync Success - now sync replicas to me
   [junit4]   2> 124658 INFO  (coreZkRegister-310-thread-1-processing-n:127.0.0.1:50750__fj x:collection1 c:collection1) [n:127.0.0.1:50750__fj c:collection1 s:shard4 r:core_node3 x:collection1] o.a.s.c.SyncStrategy http://127.0.0.1:50750/_fj/collection1/ has no replicas
   [junit4]   2> 124658 INFO  (coreZkRegister-310-thread-1-processing-n:127.0.0.1:50750__fj x:collection1 c:collection1) [n:127.0.0.1:50750__fj c:collection1 s:shard4 r:core_node3 x:collection1] o.a.s.c.ShardLeaderElectionContext Found all replicas participating in election, clear LIR
   [junit4]   2> 124665 INFO  (coreZkRegister-310-thread-1-processing-n:127.0.0.1:50750__fj x:collection1 c:collection1) [n:127.0.0.1:50750__fj c:collection1 s:shard4 r:core_node3 x:collection1] o.a.s.c.ShardLeaderElectionContext I am the new leader: http://127.0.0.1:50750/_fj/collection1/ shard4
   [junit4]   2> 124821 INFO  (coreZkRegister-310-thread-1-processing-n:127.0.0.1:50750__fj x:collection1 c:collection1) [n:127.0.0.1:50750__fj c:collection1 s:shard4 r:core_node3 x:collection1] o.a.s.c.ZkController I am the leader, no recovery necessary
   [junit4]   2> 125738 INFO  (TEST-TestCloudSchemaless.test-seed#[F3D7E8490E6FAD5D]) [    ] o.a.s.SolrTestCaseJ4 Writing core.properties file to C:\Users\jenkins\workspace\Lucene-Solr-master-Windows\solr\build\solr-core\test\J0\temp\solr.schema.TestCloudSchemaless_F3D7E8490E6FAD5D-001\shard-4-001\cores\collection1
   [junit4]   2> 125742 INFO  (TEST-TestCloudSchemaless.test-seed#[F3D7E8490E6FAD5D]) [    ] o.a.s.c.AbstractFullDistribZkTestBase create jetty 4 in directory C:\Users\jenkins\workspace\Lucene-Solr-master-Windows\solr\build\solr-core\test\J0\temp\solr.schema.TestCloudSchemaless_F3D7E8490E6FAD5D-001\shard-4-001
   [junit4]   2> 125742 INFO  (TEST-TestCloudSchemaless.test-seed#[F3D7E8490E6FAD5D]) [    ] o.e.j.s.Server jetty-9.3.14.v20161028
   [junit4]   2> 125744 INFO  (TEST-TestCloudSchemaless.test-seed#[F3D7E8490E6FAD5D]) [    ] o.e.j.s.h.ContextHandler Started o.e.j.s.ServletContextHandler@d4acd2{/_fj,null,AVAILABLE}
   [junit4]   2> 125745 INFO  (TEST-TestCloudSchemaless.test-seed#[F3D7E8490E6FAD5D]) [    ] o.e.j.s.AbstractConnector Started ServerConnector@164b1ee{HTTP/1.1,[http/1.1]}{127.0.0.1:50762}
   [junit4]   2> 125746 INFO  (TEST-TestCloudSchemaless.test-seed#[F3D7E8490E6FAD5D]) [    ] o.e.j.s.Server Started @130522ms
   [junit4]   2> 125746 INFO  (TEST-TestCloudSchemaless.test-seed#[F3D7E8490E6FAD5D]) [    ] o.a.s.c.s.e.JettySolrRunner Jetty properties: {solr.data.dir=C:\Users\jenkins\workspace\Lucene-Solr-master-Windows\solr\build\solr-core\test\J0\temp\solr.schema.TestCloudSchemaless_F3D7E8490E6FAD5D-001\tempDir-001/jetty4, solrconfig=solrconfig.xml, hostContext=/_fj, hostPort=50762, coreRootDirectory=C:\Users\jenkins\workspace\Lucene-Solr-master-Windows\solr\build\solr-core\test\J0\temp\solr.schema.TestCloudSchemaless_F3D7E8490E6FAD5D-001\shard-4-001\cores}
   [junit4]   2> 125749 ERROR (TEST-TestCloudSchemaless.test-seed#[F3D7E8490E6FAD5D]) [    ] o.a.s.s.StartupLoggingUtils Missing Java Option solr.log.dir. Logging may be missing or incomplete.
   [junit4]   2> 125749 INFO  (TEST-TestCloudSchemaless.test-seed#[F3D7E8490E6FAD5D]) [    ] o.a.s.s.SolrDispatchFilter  ___      _       Welcome to Apache Solr? version 7.0.0
   [junit4]   2> 125749 INFO  (TEST-TestCloudSchemaless.test-seed#[F3D7E8490E6FAD5D]) [    ] o.a.s.s.SolrDispatchFilter / __| ___| |_ _   Starting in cloud mode on port null
   [junit4]   2> 125749 INFO  (TEST-TestCloudSchemaless.test-seed#[F3D7E8490E6FAD5D]) [    ] o.a.s.s.SolrDispatchFilter \__ \/ _ \ | '_|  Install dir: null
   [junit4]   2> 125749 INFO  (TEST-TestCloudSchemaless.test-seed#[F3D7E8490E6FAD5D]) [    ] o.a.s.s.SolrDispatchFilter |___/\___/_|_|    Start time: 2017-03-20T17:44:21.337Z
   [junit4]   2> 125760 INFO  (TEST-TestCloudSchemaless.test-seed#[F3D7E8490E6FAD5D]) [    ] o.a.s.s.SolrDispatchFilter Loading solr.xml from SolrHome (not found in ZooKeeper)
   [junit4]   2> 125761 INFO  (TEST-TestCloudSchemaless.test-seed#[F3D7E8490E6FAD5D]) [    ] o.a.s.c.SolrXmlConfig Loading container configuration from C:\Users\jenkins\workspace\Lucene-Solr-master-Windows\solr\build\solr-core\test\J0\temp\solr.schema.TestCloudSchemaless_F3D7E8490E6FAD5D-001\shard-4-001\solr.xml
   [junit4]   2> 125797 INFO  (TEST-TestCloudSchemaless.test-seed#[F3D7E8490E6FAD5D]) [    ] o.a.s.c.ZkContainer Zookeeper client=127.0.0.1:50702/solr
   [junit4]   2> 125826 INFO  (TEST-TestCloudSchemaless.test-seed#[F3D7E8490E6FAD5D]) [n:127.0.0.1:50762__fj    ] o.a.s.c.c.ZkStateReader Updated live nodes from ZooKeeper... (0) -> (4)
   [junit4]   2> 125832 INFO  (TEST-TestCloudSchemaless.test-seed#[F3D7E8490E6FAD5D]) [n:127.0.0.1:50762__fj    ] o.a.s.c.Overseer Overseer (id=null) closing
   [junit4]   2> 125836 INFO  (TEST-TestCloudSchemaless.test-seed#[F3D7E8490E6FAD5D]) [n:127.0.0.1:50762__fj    ] o.a.s.c.ZkController Register node as live in ZooKeeper:/live_nodes/127.0.0.1:50762__fj
   [junit4]   2> 125840 INFO  (zkCallback-104-thread-1-processing-n:127.0.0.1:50750__fj) [n:127.0.0.1:50750__fj    ] o.a.s.c.c.ZkStateReader Updated live nodes from ZooKeeper... (4) -> (5)
   [junit4]   2> 125841 INFO  (zkCallback-83-thread-3-processing-n:127.0.0.1:50709__fj) [n:127.0.0.1:50709__fj    ] o.a.s.c.c.ZkStateReader Updated live nodes from ZooKeeper... (4) -> (5)
   [junit4]   2> 125841 INFO  (zkCallback-87-thread-1) [    ] o.a.s.c.c.ZkStateReader Updated live nodes from ZooKeeper... (4) -> (5)
   [junit4]   2> 125841 INFO  (zkCallback-110-thread-1-processing-n:127.0.0.1:50762__fj) [n:127.0.0.1:50762__fj    ] o.a.s.c.c.ZkStateReader Updated live nodes from ZooKeeper... (4) -> (5)
   [junit4]   2> 125842 INFO  (zkCallback-98-thread-1-processing-n:127.0.0.1:50737__fj) [n:127.0.0.1:50737__fj    ] o.a.s.c.c.ZkStateReader Updated live nodes from ZooKeeper... (4) -> (5)
   [junit4]   2> 125842 INFO  (zkCallback-92-thread-1-processing-n:127.0.0.1:50725__fj) [n:127.0.0.1:50725__fj    ] o.a.s.c.c.ZkStateReader Updated live nodes from ZooKeeper... (4) -> (5)
   [junit4]   2> 126332 INFO  (TEST-TestCloudSchemaless.test-seed#[F3D7E8490E6FAD5D]) [n:127.0.0.1:50762__fj    ] o.a.s.c.CorePropertiesLocator Found 1 core definitions underneath C:\Users\jenkins\workspace\Lucene-Solr-master-Windows\solr\build\solr-core\test\J0\temp\solr.schema.TestCloudSchemaless_F3D7E8490E6FAD5D-001\shard-4-001\cores
   [junit4]   2> 126332 INFO  (TEST-TestCloudSchemaless.test-seed#[F3D7E8490E6FAD5D]) [n:127.0.0.1:50762__fj    ] o.a.s.c.CorePropertiesLocator Cores are: [collection1]
   [junit4]   2> 126336 INFO  (OverseerStateUpdate-97650727142162436-127.0.0.1:50709__fj-n_0000000000) [n:127.0.0.1:50709__fj    ] o.a.s.c.o.ReplicaMutator Assigning new node to shard shard=shard1
   [junit4]   2> 127372 WARN  (coreLoadExecutor-326-thread-1-processing-n:127.0.0.1:50762__fj) [n:127.0.0.1:50762__fj c:collection1   x:collection1] o.a.s.c.Config Beginning with Solr 5.5, <mergePolicy> is deprecated, use <mergePolicyFactory> instead.
   [junit4]   2> 127373 INFO  (coreLoadExecutor-326-thread-1-processing-n:127.0.0.1:50762__fj) [n:127.0.0.1:50762__fj c:collection1   x:collection1] o.a.s.c.SolrConfig Using Lucene MatchVersion: 7.0.0
   [junit4]   2> 127403 INFO  (coreLoadExecutor-326-thread-1-processing-n:127.0.0.1:50762__fj) [n:127.0.0.1:50762__fj c:collection1   x:collection1] o.a.s.s.IndexSchema [collection1] Schema name=add-schema-fields-update-processor
   [junit4]   2> 127429 INFO  (coreLoadExecutor-326-thread-1-processing-n:127.0.0.1:50762__fj) [n:127.0.0.1:50762__fj c:collection1   x:collection1] o.a.s.s.IndexSchema Loaded schema add-schema-fields-update-processor/1.6 with uniqueid field id
   [junit4]   2> 127435 INFO  (coreLoadExecutor-326-thread-1-processing-n:127.0.0.1:50762__fj) [n:127.0.0.1:50762__fj c:collection1   x:collection1] o.a.s.c.CoreContainer Creating SolrCore 'collection1' using configuration from collection collection1
   [junit4]   2> 127435 INFO  (coreLoadExecutor-326-thread-1-processing-n:127.0.0.1:50762__fj) [n:127.0.0.1:50762__fj c:collection1   x:collection1] o.a.s.c.SolrCore solr.RecoveryStrategy.Builder
   [junit4]   2> 127435 INFO  (coreLoadExecutor-326-thread-1-processing-n:127.0.0.1:50762__fj) [n:127.0.0.1:50762__fj c:collection1   x:collection1] o.a.s.c.SolrCore [[collection1] ] Opening new SolrCore at [C:\Users\jenkins\workspace\Lucene-Solr-master-Windows\solr\build\solr-core\test\J0\temp\solr.schema.TestCloudSchemaless_F3D7E8490E6FAD5D-001\shard-4-001\cores\collection1], dataDir=[C:\Users\jenkins\workspace\Lucene-Solr-master-Windows\solr\build\solr-core\test\J0\temp\solr.schema.TestCloudSchemaless_F3D7E8490E6FAD5D-001\shard-4-001\cores\collection1\data\]
   [junit4]   2> 127445 INFO  (coreLoadExecutor-326-thread-1-processing-n:127.0.0.1:50762__fj) [n:127.0.0.1:50762__fj c:collection1   x:collection1] o.a.s.u.RandomMergePolicy RandomMergePolicy wrapping class org.apache.lucene.index.TieredMergePolicy: [TieredMergePolicy: maxMergeAtOnce=40, maxMergeAtOnceExplicit=30, maxMergedSegmentMB=66.6318359375, floorSegmentMB=2.13671875, forceMergeDeletesPctAllowed=25.541559388605638, segmentsPerTier=25.0, maxCFSSegmentSizeMB=8.796093022207999E12, noCFSRatio=0.5540389569270155
   [junit4]   2> 127611 INFO  (coreLoadExecutor-326-thread-1-processing-n:127.0.0.1:50762__fj) [n:127.0.0.1:50762__fj c:collection1   x:collection1] o.a.s.u.UpdateHandler Using UpdateLog implementation: org.apache.solr.update.UpdateLog
   [junit4]   2> 127611 INFO  (coreLoadExecutor-326-thread-1-processing-n:127.0.0.1:50762__fj) [n:127.0.0.1:50762__fj c:collection1   x:collection1] o.a.s.u.UpdateLog Initializing UpdateLog: dataDir= defaultSyncLevel=FLUSH numRecordsToKeep=100 maxNumLogsToKeep=10 numVersionBuckets=65536
   [junit4]   2> 127617 INFO  (coreLoadExecutor-326-thread-1-processing-n:127.0.0.1:50762__fj) [n:127.0.0.1:50762__fj c:collection1   x:collection1] o.a.s.u.CommitTracker Hard AutoCommit: disabled
   [junit4]   2> 127617 INFO  (coreLoadExecutor-326-thread-1-processing-n:127.0.0.1:50762__fj) [n:127.0.0.1:50762__fj c:collection1   x:collection1] o.a.s.u.CommitTracker Soft AutoCommit: disabled
   [junit4]   2> 127618 INFO  (coreLoadExecutor-326-thread-1-processing-n:127.0.0.1:50762__fj) [n:127.0.0.1:50762__fj c:collection1   x:collection1] o.a.s.u.RandomMergePolicy RandomMergePolicy wrapping class org.apache.lucene.index.TieredMergePolicy: [TieredMergePolicy: maxMergeAtOnce=15, maxMergeAtOnceExplicit=35, maxMergedSegmentMB=8.3115234375, floorSegmentMB=2.046875, forceMergeDeletesPctAllowed=27.659850238359954, segmentsPerTier=30.0, maxCFSSegmentSizeMB=8.796093022207999E12, noCFSRatio=0.16400509765949814
   [junit4]   2> 127620 INFO  (coreLoadExecutor-326-thread-1-processing-n:127.0.0.1:50762__fj) [n:127.0.0.1:50762__fj c:collection1   x:collection1] o.a.s.s.SolrIndexSearcher Opening [Searcher@44f19e[collection1] main]
   [junit4]   2> 127622 INFO  (coreLoadExecutor-326-thread-1-processing-n:127.0.0.1:50762__fj) [n:127.0.0.1:50762__fj c:collection1   x:collection1] o.a.s.r.ManagedResourceStorage Configured ZooKeeperStorageIO with znodeBase: /configs/conf1
   [junit4]   2> 127623 INFO  (coreLoadExecutor-326-thread-1-processing-n:127.0.0.1:50762__fj) [n:127.0.0.1:50762__fj c:collection1   x:collection1] o.a.s.r.ManagedResourceStorage Loaded null at path _rest_managed.json using ZooKeeperStorageIO:path=/configs/conf1
   [junit4]   2> 127623 INFO  (coreLoadExecutor-326-thread-1-processing-n:127.0.0.1:50762__fj) [n:127.0.0.1:50762__fj c:collection1   x:collection1] o.a.s.s.ZkIndexSchemaReader Creating ZooKeeper watch for the managed schema at /configs/conf1/managed-schema
   [junit4]   2> 127625 INFO  (coreLoadExecutor-326-thread-1-processing-n:127.0.0.1:50762__fj) [n:127.0.0.1:50762__fj c:collection1   x:collection1] o.a.s.s.ZkIndexSchemaReader Current schema version 0 is already the latest
   [junit4]   2> 127625 INFO  (coreLoadExecutor-326-thread-1-processing-n:127.0.0.1:50762__fj) [n:127.0.0.1:50762__fj c:collection1   x:collection1] o.a.s.h.ReplicationHandler Commits will be reserved for  10000
   [junit4]   2> 127625 INFO  (searcherExecutor-327-thread-1-processing-n:127.0.0.1:50762__fj x:collection1 c:collection1) [n:127.0.0.1:50762__fj c:collection1   x:collection1] o.a.s.c.SolrCore [collection1] Registered new searcher Searcher@44f19e[collection1] main{ExitableDirectoryReader(UninvertingDirectoryReader())}
   [junit4]   2> 127625 INFO  (coreLoadExecutor-326-thread-1-processing-n:127.0.0.1:50762__fj) [n:127.0.0.1:50762__fj c:collection1   x:collection1] o.a.s.u.UpdateLog Could not find max version in index or recent updates, using new clock 1562411651000434688
   [junit4]   2> 127639 INFO  (coreZkRegister-321-thread-1-processing-n:127.0.0.1:50762__fj x:collection1 c:collection1) [n:127.0.0.1:50762__fj c:collection1 s:shard1 r:core_node4 x:collection1] o.a.s.c.ShardLeaderElectionContext Enough replicas found to continue.
   [junit4]   2> 127639 INFO  (coreZkRegister-321-thread-1-processing-n:127.0.0.1:50762__fj x:collection1 c:collection1) [n:127.0.0.1:50762__fj c:collection1 s:shard1 r:core_node4 x:collection1] o.a.s.c.ShardLeaderElectionContext I may be the new leader - try and sync
   [junit4]   2> 127639 INFO  (coreZkRegister-321-thread-1-processing-n:127.0.0.1:50762__fj x:collection1 c:collection1) [n:127.0.0.1:50762__fj c:collection1 s:shard1 r:core_node4 x:collection1] o.a.s.c.SyncStrategy Sync replicas to http://127.0.0.1:50762/_fj/collection1/
   [junit4]   2> 127640 INFO  (coreZkRegister-321-thread-1-processing-n:127.0.0.1:50762__fj x:collection1 c:collection1) [n:127.0.0.1:50762__fj c:collection1 s:shard1 r:core_node4 x:collection1] o.a.s.c.SyncStrategy Sync Success - now sync replicas to me
   [junit4]   2> 127640 INFO  (coreZkRegister-321-thread-1-processing-n:127.0.0.1:50762__fj x:collection1 c:collection1) [n:127.0.0.1:50762__fj c:collection1 s:shard1 r:core_node4 x:collection1] o.a.s.c.SyncStrategy http://127.0.0.1:50762/_fj/collection1/ has no replicas
   [junit4]   2> 127640 INFO  (coreZkRegister-321-thread-1-processing-n:127.0.0.1:50762__fj x:collection1 c:collection1) [n:127.0.0.1:50762__fj c:collection1 s:shard1 r:core_node4 x:collection1] o.a.s.c.ShardLeaderElectionContext Found all replicas participating in election, clear LIR
   [junit4]   2> 127647 INFO  (coreZkRegister-321-thread-1-processing-n:127.0.0.1:50762__fj x:collection1 c:collection1) [n:127.0.0.1:50762__fj c:collection1 s:shard1 r:core_node4 x:collection1] o.a.s.c.ShardLeaderElectionContext I am the new leader: http://127.0.0.1:50762/_fj/collection1/ shard1
   [junit4]   2> 127799 INFO  (coreZkRegister-321-thread-1-processing-n:127.0.0.1:50762__fj x:collection1 c:collection1) [n:127.0.0.1:50762__fj c:collection1 s:shard1 r:core_node4 x:collection1] o.a.s.c.ZkController I am the leader, no recovery necessary
   [junit4]   2> 128595 INFO  (TEST-TestCloudSchemaless.test-seed#[F3D7E8490E6FAD5D]) [    ] o.a.s.SolrTestCaseJ4 Writing core.properties file to C:\Users\jenkins\workspace\Lucene-Solr-master-Windows\solr\build\solr-core\test\J0\temp\solr.schema.TestCloudSchemaless_F3D7E8490E6FAD5D-001\shard-5-001\cores\collection1
   [junit4]   2> 128598 INFO  (TEST-TestCloudSchemaless.test-seed#[F3D7E8490E6FAD5D]) [    ] o.a.s.c.AbstractFullDistribZkTestBase create jetty 5 in directory C:\Users\jenkins\workspace\Lucene-Solr-master-Windows\solr\build\solr-core\test\J0\temp\solr.schema.TestCloudSchemaless_F3D7E8490E6FAD5D-001\shard-5-001
   [junit4]   2> 128599 INFO  (TEST-TestCloudSchemaless.test-seed#[F3D7E8490E6FAD5D]) [    ] o.e.j.s.Server jetty-9.3.14.v20161028
   [junit4]   2> 128600 INFO  (TEST-TestCloudSchemaless.test-seed#[F3D7E8490E6FAD5D]) [    ] o.e.j.s.h.ContextHandler Started o.e.j.s.ServletContextHandler@1523716{/_fj,null,AVAILABLE}
   [junit4]   2> 128602 INFO  (TEST-TestCloudSchemaless.test-seed#[F3D7E8490E6FAD5D]) [    ] o.e.j.s.AbstractConnector Started ServerConnector@17e7660{HTTP/1.1,[http/1.1]}{127.0.0.1:50774}
   [junit4]   2> 128602 INFO  (TEST-TestCloudSchemaless.test-seed#[F3D7E8490E6FAD5D]) [    ] o.e.j.s.Server Started @133378ms
   [junit4]   2> 128602 INFO  (TEST-TestCloudSchemaless.test-seed#[F3D7E8490E6FAD5D]) [    ] o.a.s.c.s.e.JettySolrRunner Jetty properties: {solr.data.dir=C:\Users\jenkins\workspace\Lucene-Solr-master-Windows\solr\build\solr-core\test\J0\temp\solr.schema.TestCloudSchemaless_F3D7E8490E6FAD5D-001\tempDir-001/jetty5, solrconfig=solrconfig.xml, hostContext=/_fj, hostPort=50774, coreRootDirectory=C:\Users\jenkins\workspace\Lucene-Solr-master-Windows\solr\build\solr-core\test\J0\..\..\..\..\..\..\..\..\..\Users\jenkins\workspace\Lucene-Solr-master-Windows\solr\build\solr-core\test\J0\temp\solr.schema.TestCloudSchemaless_F3D7E8490E6FAD5D-001\shard-5-001\cores}
   [junit4]   2> 128602 ERROR (TEST-TestCloudSchemaless.test-seed#[F3D7E8490E6FAD5D]) [    ] o.a.s.s.StartupLoggingUtils Missing Java Option solr.log.dir. Logging may be missing or incomplete.
   [junit4]   2> 128604 INFO  (TEST-TestCloudSchemaless.test-seed#[F3D7E8490E6FAD5D]) [    ] o.a.s.s.SolrDispatchFilter  ___      _       Welcome to Apache Solr? version 7.0.0
   [junit4]   2> 128604 INFO  (TEST-TestCloudSchemaless.test-seed#[F3D7E8490E6FAD5D]) [    ] o.a.s.s.SolrDispatchFilter / __| ___| |_ _   Starting in cloud mode on port null
   [junit4]   2> 128604 INFO  (TEST-TestCloudSchemaless.test-seed#[F3D7E8490E6FAD5D]) [    ] o.a.s.s.SolrDispatchFilter \__ \/ _ \ | '_|  Install dir: null
   [junit4]   2> 128604 INFO  (TEST-TestCloudSchemaless.test-seed#[F3D7E8490E6FAD5D]) [    ] o.a.s.s.SolrDispatchFilter |___/\___/_|_|    Start time: 2017-03-20T17:44:24.192Z
   [junit4]   2> 128614 INFO  (TEST-TestCloudSchemaless.test-seed#[F3D7E8490E6FAD5D]) [    ] o.a.s.s.SolrDispatchFilter Loading solr.xml from SolrHome (not found in ZooKeeper)
   [junit4]   2> 128615 INFO  (TEST-TestCloudSchemaless.test-seed#[F3D7E8490E6FAD5D]) [    ] o.a.s.c.SolrXmlConfig Loading container configuration from C:\Users\jenkins\workspace\Lucene-Solr-master-Windows\solr\build\solr-core\test\J0\temp\solr.schema.TestCloudSchemaless_F3D7E8490E6FAD5D-001\shard-5-001\solr.xml
   [junit4]   2> 128647 INFO  (TEST-TestCloudSchemaless.test-seed#[F3D7E8490E6FAD5D]) [    ] o.a.s.c.ZkContainer Zookeeper client=127.0.0.1:50702/solr
   [junit4]   2> 128674 INFO  (TEST-TestCloudSchemaless.test-seed#[F3D7E8490E6FAD5D]) [n:127.0.0.1:50774__fj    ] o.a.s.c.c.ZkStateReader Updated live nodes from ZooKeeper... (0) -> (5)
   [junit4]   2> 128680 INFO  (TEST-TestCloudSchemaless.test-seed#[F3D7E8490E6FAD5D]) [n:127.0.0.1:50774__fj    ] o.a.s.c.Overseer Overseer (id=null) closing
   [junit4]   2> 128684 INFO  (TEST-TestCloudSchemaless.test-seed#[F3D7E8490E6FAD5D]) [n:127.0.0.1:50774__fj    ] o.a.s.c.ZkController Register node as live in ZooKeeper:/live_nodes/127.0.0.1:50774__fj
   [junit4]   2> 128693 INFO  (zkCallback-104-thread-1-processing-n:127.0.0.1:50750__fj) [n:127.0.0.1:50750__fj    ] o.a.s.c.c.ZkStateReader Updated live nodes from ZooKeeper... (5) -> (6)
   [junit4]   2> 128693 INFO  (zkCallback-83-thread-2-processing-n:127.0.0.1:50709__fj) [n:127.0.0.1:50709__fj    ] o.a.s.c.c.ZkStateReader Updated live nodes from ZooKeeper... (5) -> (6)
   [junit4]   2> 128694 INFO  (zkCallback-110-thread-1-processing-n:127.0.0.1:50762__fj) [n:127.0.0.1:50762__fj    ] o.a.s.c.c.ZkStateReader

[...truncated too long message...]

com:8984_solr    ] o.a.s.c.CoreContainer Shutting down CoreContainer instance=3729509
   [junit4]   2> 2809853 INFO  (TEST-TestLeaderElectionZkExpiry.testLeaderElectionWithZkExpiry-seed#[F3D7E8490E6FAD5D]) [n:dummy.host.com:8984_solr    ] o.a.s.m.SolrMetricManager Closing metric reporters for registry=solr.node, tag=null
   [junit4]   2> 2809854 INFO  (TEST-TestLeaderElectionZkExpiry.testLeaderElectionWithZkExpiry-seed#[F3D7E8490E6FAD5D]) [n:dummy.host.com:8984_solr    ] o.a.s.c.ZkTestServer connecting to 127.0.0.1:49852 49852
   [junit4]   2> 2809856 INFO  (Thread-4969) [    ] o.a.s.c.ZkTestServer connecting to 127.0.0.1:49852 49852
   [junit4]   2> 2809858 WARN  (Thread-4969) [    ] o.a.s.c.ZkTestServer Watch limit violations:
   [junit4]   2> Maximum concurrent create/delete watches above limit:
   [junit4]   2>
   [junit4]   2> 3 /solr/aliases.json
   [junit4]   2> 3 /solr/security.json
   [junit4]   2> 3 /solr/clusterprops.json
   [junit4]   2>
   [junit4]   2> Maximum concurrent data watches above limit:
   [junit4]   2>
   [junit4]   2> 3 /solr/clusterstate.json
   [junit4]   2>
   [junit4]   2> Maximum concurrent children watches above limit:
   [junit4]   2>
   [junit4]   2> 3 /solr/collections
   [junit4]   2> 2 /solr/live_nodes
   [junit4]   2>
   [junit4]   2> 2809858 INFO  (TEST-TestLeaderElectionZkExpiry.testLeaderElectionWithZkExpiry-seed#[F3D7E8490E6FAD5D]) [n:dummy.host.com:8984_solr    ] o.a.s.SolrTestCaseJ4 ###Ending testLeaderElectionWithZkExpiry
   [junit4]   2> NOTE: reproduce with: ant test  -Dtestcase=TestLeaderElectionZkExpiry -Dtests.method=testLeaderElectionWithZkExpiry -Dtests.seed=F3D7E8490E6FAD5D -Dtests.slow=true -Dtests.locale=he-IL -Dtests.timezone=Europe/Tirane -Dtests.asserts=true -Dtests.file.encoding=US-ASCII
   [junit4] FAILURE 70.6s J0 | TestLeaderElectionZkExpiry.testLeaderElectionWithZkExpiry <<<
   [junit4]    > Throwable #1: java.lang.AssertionError
   [junit4]    > at __randomizedtesting.SeedInfo.seed([F3D7E8490E6FAD5D:2508C9133872BEC5]:0)
   [junit4]    > at org.apache.solr.cloud.TestLeaderElectionZkExpiry.testLeaderElectionWithZkExpiry(TestLeaderElectionZkExpiry.java:97)
   [junit4]    > at java.lang.Thread.run(Thread.java:745)
   [junit4]   2> 2809860 INFO  (SUITE-TestLeaderElectionZkExpiry-seed#[F3D7E8490E6FAD5D]-worker) [n:dummy.host.com:8984_solr    ] o.a.s.SolrTestCaseJ4 ###deleteCore
   [junit4]   2> 2809860 INFO  (SUITE-TestLeaderElectionZkExpiry-seed#[F3D7E8490E6FAD5D]-worker) [n:dummy.host.com:8984_solr    ] o.a.s.c.CoreContainer Shutting down CoreContainer instance=3729509
   [junit4]   2> 2809860 INFO  (SUITE-TestLeaderElectionZkExpiry-seed#[F3D7E8490E6FAD5D]-worker) [n:dummy.host.com:8984_solr    ] o.a.s.m.SolrMetricManager Closing metric reporters for registry=solr.node, tag=null
   [junit4]   2> NOTE: leaving temporary files on disk at: C:\Users\jenkins\workspace\Lucene-Solr-master-Windows\solr\build\solr-core\test\J0\temp\solr.cloud.TestLeaderElectionZkExpiry_F3D7E8490E6FAD5D-001
   [junit4]   2> Mar 20, 2017 6:29:05 PM com.carrotsearch.randomizedtesting.ThreadLeakControl checkThreadLeaks
   [junit4]   2> WARNING: Will linger awaiting termination of 2 leaked thread(s).
   [junit4]   2> NOTE: test params are: codec=Asserting(Lucene70): {}, docValues:{}, maxPointsInLeafNode=1494, maxMBSortInHeap=5.45859123518522, sim=RandomSimilarity(queryNorm=false): {}, locale=he-IL, timezone=Europe/Tirane
   [junit4]   2> NOTE: Windows 10 10.0 x86/Oracle Corporation 1.8.0_121 (32-bit)/cpus=3,threads=1,free=319916296,total=518979584
   [junit4]   2> NOTE: All tests run in this JVM: [TestLeaderInitiatedRecoveryThread, TestCSVResponseWriter, TestInitParams, MigrateRouteKeyTest, TestCSVLoader, TestRemoteStreaming, BigEndianAscendingWordDeserializerTest, BinaryUpdateRequestHandlerTest, SuggesterFSTTest, SuggestComponentTest, TestCloudSchemaless, TestDocTermOrds, TestLFUCache, TimeZoneUtilsTest, TestFieldSortValues, TestPerFieldSimilarityWithDefaultOverride, JsonValidatorTest, IndexBasedSpellCheckerTest, TestFunctionQuery, TestRTGBase, SolrJmxReporterTest, SolrPluginUtilsTest, DocumentAnalysisRequestHandlerTest, SOLR749Test, RecoveryAfterSoftCommitTest, TestCollectionAPI, TestSurroundQueryParser, TestComplexPhraseQParserPlugin, TestBlobHandler, PrimUtilsTest, DisMaxRequestHandlerTest, TestQuerySenderNoQuery, TestStressLiveNodes, TestCloudManagedSchema, TestPartialUpdateDeduplication, CdcrRequestHandlerTest, MoreLikeThisHandlerTest, TestSlowCompositeReaderWrapper, CursorMarkTest, TestCloudPivotFacet, TestGraphTermsQParserPlugin, SearchHandlerTest, TestExactSharedStatsCache, TestDefaultStatsCache, DistributedQueryElevationComponentTest, TestFieldCacheSortRandom, TestCustomDocTransformer, RulesTest, TestSolrConfigHandler, TestMacros, BasicDistributedZkTest, NumericFieldsTest, TestCoreAdminApis, DocValuesNotIndexedTest, SolrCoreTest, TestSolrJ, DirectoryFactoryTest, TestConfigSetImmutable, ZkControllerTest, StressHdfsTest, CdcrReplicationDistributedZkTest, TestReplicaProperties, TestFieldCollectionResource, HdfsRestartWhileUpdatingTest, MetricUtilsTest, TestCryptoKeys, TestSubQueryTransformerDistrib, SyncSliceTest, AnalyticsMergeStrategyTest, LeaderInitiatedRecoveryOnCommitTest, DistributedSpellCheckComponentTest, TestJsonFacetRefinement, TestHdfsBackupRestoreCore, BlockJoinFacetSimpleTest, SSLMigrationTest, ClassificationUpdateProcessorTest, TestCloudRecovery, QueryEqualityTest, BlockDirectoryTest, TermsComponentTest, DocValuesMultiTest, StatelessScriptUpdateProcessorFactoryTest, TestSweetSpotSimilarityFactory, TestSchemaNameResource, ZkStateReaderTest, TestAuthorizationFramework, TestLRUCache, TestEmbeddedSolrServerConstructors, TestTestInjection, TestUseDocValuesAsStored, ZkNodePropsTest, StandardRequestHandlerTest, TestBulkSchemaAPI, TestSolr4Spatial2, MultiTermTest, MergeStrategyTest, SpatialRPTFieldTypeTest, TestOnReconnectListenerSupport, TestScoreJoinQPNoScore, TestManagedResourceStorage, PeerSyncTest, DocumentBuilderTest, SolrGangliaReporterTest, SortSpecParsingTest, HdfsDirectoryTest, TestDynamicFieldCollectionResource, DistributedFacetPivotWhiteBoxTest, SolrXmlInZkTest, TestDistribDocBasedVersion, SimpleMLTQParserTest, DocValuesTest, ChangedSchemaMergeTest, TestSolrQueryResponse, ActionThrottleTest, TestManagedSchemaThreadSafety, TestSortByMinMaxFunction, UnloadDistributedZkTest, SimplePostToolTest, CoreMergeIndexesAdminHandlerTest, HdfsRecoverLeaseTest, ResponseHeaderTest, AssignTest, TestLRUStatsCache, ManagedSchemaRoundRobinCloudTest, DistributedMLTComponentTest, HdfsDirectoryFactoryTest, TestLockTree, SimpleFacetsTest, TestFaceting, HLLUtilTest, TestCollationField, TestSolrFieldCacheMBean, TestReqParamsAPI, DistributedQueryComponentOptimizationTest, TestRandomRequestDistribution, BitVectorTest, TestMinMaxOnMultiValuedField, TestSolrQueryParserResource, CursorPagingTest, CustomCollectionTest, TestDocumentBuilder, TestPhraseSuggestions, SoftAutoCommitTest, HdfsThreadLeakTest, ClassificationUpdateProcessorFactoryTest, OpenExchangeRatesOrgProviderTest, BlockJoinFacetDistribTest, TestElisionMultitermQuery, TestUninvertingReader, TestXIncludeConfig, ConnectionManagerTest, FacetPivotSmallTest, TestSolrConfigHandlerCloud, DeleteReplicaTest, TestPseudoReturnFields, XsltUpdateRequestHandlerTest, TestJsonRequest, TestRTimerTree, AnalysisErrorHandlingTest, FullHLLTest, ClusterStateUpdateTest, TestBackupRepositoryFactory, TestHighFrequencyDictionaryFactory, BasicAuthStandaloneTest, TestReplicationHandler, TestLazyCores, HdfsBasicDistributedZk2Test, TestOverriddenPrefixQueryForCustomFieldType, TestSolrCloudWithHadoopAuthPlugin, TestBM25SimilarityFactory, TestRandomDVFaceting, AutoCommitTest, TestDistributedGrouping, TestHashPartitioner, TestRealTimeGet, TestStressReorder, TestStressVersions, TestRangeQuery, TestGroupingSearch, SolrCmdDistributorTest, BadIndexSchemaTest, TestSort, TestBadConfig, HighlighterTest, CurrencyFieldXmlFileTest, TestCoreDiscovery, CoreAdminHandlerTest, TestStressLucene, TestTrie, SuggesterWFSTTest, NoCacheHeaderTest, SchemaVersionSpecificBehaviorTest, TestWordDelimiterFilterFactory, TestSolrDeletionPolicy1, DebugComponentTest, CacheHeaderTest, DirectSolrSpellCheckerTest, FileBasedSpellCheckerTest, TestValueSourceCache, TermVectorComponentTest, RequiredFieldsTest, FastVectorHighlighterTest, LoggingHandlerTest, MBeansHandlerTest, UniqFieldsUpdateProcessorFactoryTest, PingRequestHandlerTest, SampleTest, OutputWriterTest, TestSolrCoreProperties, DirectSolrConnectionTest, SpellPossibilityIteratorTest, TestCharFilters, SynonymTokenizerTest, TestPerFieldSimilarity, TestLMDirichletSimilarityFactory, TestIBSimilarityFactory, PluginInfoTest, TestFastLRUCache, ChaosMonkeyNothingIsSafeTest, BaseCdcrDistributedZkTest, CloudExitableDirectoryReaderTest, CollectionTooManyReplicasTest, ConcurrentDeleteAndCreateCollectionTest, ConfigSetsAPITest, CreateCollectionCleanupTest, DeleteLastCustomShardedReplicaTest, DistribCursorPagingTest, DistributedQueueTest, DistributedVersionInfoTest, LeaderElectionContextKeyTest, LeaderFailoverAfterPartitionTest, LeaderInitiatedRecoveryOnShardRestartTest, MultiThreadedOCPTest, OutOfBoxZkACLAndCredentialsProvidersTest, OverriddenZkACLAndCredentialsProvidersTest, OverseerCollectionConfigSetProcessorTest, OverseerRolesTest, OverseerStatusTest, OverseerTaskQueueTest, PeerSyncReplicationTest, RemoteQueryErrorTest, ReplaceNodeTest, SaslZkACLProviderTest, SharedFSAutoReplicaFailoverTest, SharedFSAutoReplicaFailoverUtilsTest, SolrCLIZkUtilsTest, TestCloudDeleteByQuery, TestCloudInspectUtil, TestCloudPseudoReturnFields, TestClusterProperties, TestConfigSetsAPI, TestConfigSetsAPIExclusivity, TestConfigSetsAPIZkFailure, TestDeleteCollectionOnDownNodes, TestDownShardTolerantSearch, TestExclusionRuleCollectionAccess, TestLeaderElectionWithEmptyReplica, TestLeaderElectionZkExpiry]
   [junit4] Completed [533/701 (2!)] on J0 in 71.41s, 1 test, 1 failure <<< FAILURES!

[...truncated 55433 lines...]



---------------------------------------------------------------------
To unsubscribe, e-mail: [hidden email]
For additional commands, e-mail: [hidden email]
Loading...