[JENKINS] Lucene-Solr-master-Windows (64bit/jdk-11.0.2) - Build # 7890 - Unstable!

classic Classic list List threaded Threaded
1 message Options
Reply | Threaded
Open this post in threaded view
|

[JENKINS] Lucene-Solr-master-Windows (64bit/jdk-11.0.2) - Build # 7890 - Unstable!

Policeman Jenkins Server-2
Build: https://jenkins.thetaphi.de/job/Lucene-Solr-master-Windows/7890/
Java: 64bit/jdk-11.0.2 -XX:-UseCompressedOops -XX:+UseSerialGC

2 tests failed.
FAILED:  org.apache.solr.prometheus.exporter.SolrExporterIntegrationTest.jvmMetrics

Error Message:
expected:<36> but was:<48>

Stack Trace:
java.lang.AssertionError: expected:<36> but was:<48>
        at __randomizedtesting.SeedInfo.seed([CE8B0435F26967F3:1D3F39DAE787AB67]:0)
        at org.junit.Assert.fail(Assert.java:88)
        at org.junit.Assert.failNotEquals(Assert.java:834)
        at org.junit.Assert.assertEquals(Assert.java:645)
        at org.junit.Assert.assertEquals(Assert.java:631)
        at org.apache.solr.prometheus.exporter.SolrExporterIntegrationTest.jvmMetrics(SolrExporterIntegrationTest.java:71)
        at java.base/jdk.internal.reflect.NativeMethodAccessorImpl.invoke0(Native Method)
        at java.base/jdk.internal.reflect.NativeMethodAccessorImpl.invoke(NativeMethodAccessorImpl.java:62)
        at java.base/jdk.internal.reflect.DelegatingMethodAccessorImpl.invoke(DelegatingMethodAccessorImpl.java:43)
        at java.base/java.lang.reflect.Method.invoke(Method.java:566)
        at com.carrotsearch.randomizedtesting.RandomizedRunner.invoke(RandomizedRunner.java:1750)
        at com.carrotsearch.randomizedtesting.RandomizedRunner$8.evaluate(RandomizedRunner.java:938)
        at com.carrotsearch.randomizedtesting.RandomizedRunner$9.evaluate(RandomizedRunner.java:974)
        at com.carrotsearch.randomizedtesting.RandomizedRunner$10.evaluate(RandomizedRunner.java:988)
        at com.carrotsearch.randomizedtesting.rules.SystemPropertiesRestoreRule$1.evaluate(SystemPropertiesRestoreRule.java:57)
        at org.apache.lucene.util.TestRuleSetupTeardownChained$1.evaluate(TestRuleSetupTeardownChained.java:49)
        at org.apache.lucene.util.AbstractBeforeAfterRule$1.evaluate(AbstractBeforeAfterRule.java:45)
        at org.apache.lucene.util.TestRuleThreadAndTestName$1.evaluate(TestRuleThreadAndTestName.java:48)
        at org.apache.lucene.util.TestRuleIgnoreAfterMaxFailures$1.evaluate(TestRuleIgnoreAfterMaxFailures.java:64)
        at org.apache.lucene.util.TestRuleMarkFailure$1.evaluate(TestRuleMarkFailure.java:47)
        at com.carrotsearch.randomizedtesting.rules.StatementAdapter.evaluate(StatementAdapter.java:36)
        at com.carrotsearch.randomizedtesting.ThreadLeakControl$StatementRunner.run(ThreadLeakControl.java:368)
        at com.carrotsearch.randomizedtesting.ThreadLeakControl.forkTimeoutingTask(ThreadLeakControl.java:817)
        at com.carrotsearch.randomizedtesting.ThreadLeakControl$3.evaluate(ThreadLeakControl.java:468)
        at com.carrotsearch.randomizedtesting.RandomizedRunner.runSingleTest(RandomizedRunner.java:947)
        at com.carrotsearch.randomizedtesting.RandomizedRunner$5.evaluate(RandomizedRunner.java:832)
        at com.carrotsearch.randomizedtesting.RandomizedRunner$6.evaluate(RandomizedRunner.java:883)
        at com.carrotsearch.randomizedtesting.RandomizedRunner$7.evaluate(RandomizedRunner.java:894)
        at com.carrotsearch.randomizedtesting.rules.StatementAdapter.evaluate(StatementAdapter.java:36)
        at com.carrotsearch.randomizedtesting.rules.SystemPropertiesRestoreRule$1.evaluate(SystemPropertiesRestoreRule.java:57)
        at org.apache.lucene.util.AbstractBeforeAfterRule$1.evaluate(AbstractBeforeAfterRule.java:45)
        at com.carrotsearch.randomizedtesting.rules.StatementAdapter.evaluate(StatementAdapter.java:36)
        at org.apache.lucene.util.TestRuleStoreClassName$1.evaluate(TestRuleStoreClassName.java:41)
        at com.carrotsearch.randomizedtesting.rules.NoShadowingOrOverridesOnMethodsRule$1.evaluate(NoShadowingOrOverridesOnMethodsRule.java:40)
        at com.carrotsearch.randomizedtesting.rules.NoShadowingOrOverridesOnMethodsRule$1.evaluate(NoShadowingOrOverridesOnMethodsRule.java:40)
        at com.carrotsearch.randomizedtesting.rules.StatementAdapter.evaluate(StatementAdapter.java:36)
        at com.carrotsearch.randomizedtesting.rules.StatementAdapter.evaluate(StatementAdapter.java:36)
        at org.apache.lucene.util.TestRuleAssertionsRequired$1.evaluate(TestRuleAssertionsRequired.java:53)
        at org.apache.lucene.util.TestRuleMarkFailure$1.evaluate(TestRuleMarkFailure.java:47)
        at org.apache.lucene.util.TestRuleIgnoreAfterMaxFailures$1.evaluate(TestRuleIgnoreAfterMaxFailures.java:64)
        at org.apache.lucene.util.TestRuleIgnoreTestSuites$1.evaluate(TestRuleIgnoreTestSuites.java:54)
        at com.carrotsearch.randomizedtesting.rules.StatementAdapter.evaluate(StatementAdapter.java:36)
        at com.carrotsearch.randomizedtesting.ThreadLeakControl$StatementRunner.run(ThreadLeakControl.java:368)
        at java.base/java.lang.Thread.run(Thread.java:834)


FAILED:  junit.framework.TestSuite.org.apache.solr.client.solrj.impl.CloudHttp2SolrClientTest

Error Message:
ObjectTracker found 6 object(s) that were not released!!! [InternalHttpClient, MockDirectoryWrapper, MockDirectoryWrapper, MockDirectoryWrapper, SolrCore, MockDirectoryWrapper] org.apache.solr.common.util.ObjectReleaseTracker$ObjectTrackerException: org.apache.http.impl.client.InternalHttpClient  at org.apache.solr.common.util.ObjectReleaseTracker.track(ObjectReleaseTracker.java:42)  at org.apache.solr.client.solrj.impl.HttpClientUtil.createClient(HttpClientUtil.java:322)  at org.apache.solr.client.solrj.impl.HttpClientUtil.createClient(HttpClientUtil.java:331)  at org.apache.solr.handler.IndexFetcher.createHttpClient(IndexFetcher.java:230)  at org.apache.solr.handler.IndexFetcher.<init>(IndexFetcher.java:272)  at org.apache.solr.handler.ReplicationHandler.inform(ReplicationHandler.java:1222)  at org.apache.solr.cloud.ReplicateFromLeader.startReplication(ReplicateFromLeader.java:109)  at org.apache.solr.cloud.ZkController.startReplicationFromLeader(ZkController.java:1307)  at org.apache.solr.cloud.ZkController.register(ZkController.java:1202)  at org.apache.solr.cloud.ZkController.register(ZkController.java:1148)  at org.apache.solr.core.ZkContainer.lambda$registerInZk$0(ZkContainer.java:190)  at org.apache.solr.core.ZkContainer.registerInZk(ZkContainer.java:222)  at org.apache.solr.core.CoreContainer.registerCore(CoreContainer.java:1075)  at org.apache.solr.core.CoreContainer.createFromDescriptor(CoreContainer.java:1237)  at org.apache.solr.core.CoreContainer.create(CoreContainer.java:1137)  at org.apache.solr.handler.admin.CoreAdminOperation.lambda$static$0(CoreAdminOperation.java:92)  at org.apache.solr.handler.admin.CoreAdminOperation.execute(CoreAdminOperation.java:360)  at org.apache.solr.handler.admin.CoreAdminHandler$CallInfo.call(CoreAdminHandler.java:396)  at org.apache.solr.handler.admin.CoreAdminHandler.lambda$handleRequestBody$0(CoreAdminHandler.java:188)  at com.codahale.metrics.InstrumentedExecutorService$InstrumentedRunnable.run(InstrumentedExecutorService.java:176)  at org.apache.solr.common.util.ExecutorUtil$MDCAwareThreadPoolExecutor.lambda$execute$0(ExecutorUtil.java:209)  at java.base/java.util.concurrent.ThreadPoolExecutor.runWorker(ThreadPoolExecutor.java:1128)  at java.base/java.util.concurrent.ThreadPoolExecutor$Worker.run(ThreadPoolExecutor.java:628)  at java.base/java.lang.Thread.run(Thread.java:834)  org.apache.solr.common.util.ObjectReleaseTracker$ObjectTrackerException: org.apache.lucene.store.MockDirectoryWrapper  at org.apache.solr.common.util.ObjectReleaseTracker.track(ObjectReleaseTracker.java:42)  at org.apache.solr.core.CachingDirectoryFactory.get(CachingDirectoryFactory.java:348)  at org.apache.solr.handler.IndexFetcher.fetchLatestIndex(IndexFetcher.java:509)  at org.apache.solr.handler.IndexFetcher.fetchLatestIndex(IndexFetcher.java:351)  at org.apache.solr.handler.ReplicationHandler.doFetch(ReplicationHandler.java:422)  at org.apache.solr.handler.ReplicationHandler.lambda$setupPolling$13(ReplicationHandler.java:1191)  at java.base/java.util.concurrent.Executors$RunnableAdapter.call(Executors.java:515)  at java.base/java.util.concurrent.FutureTask.runAndReset(FutureTask.java:305)  at java.base/java.util.concurrent.ScheduledThreadPoolExecutor$ScheduledFutureTask.run(ScheduledThreadPoolExecutor.java:305)  at java.base/java.util.concurrent.ThreadPoolExecutor.runWorker(ThreadPoolExecutor.java:1128)  at java.base/java.util.concurrent.ThreadPoolExecutor$Worker.run(ThreadPoolExecutor.java:628)  at java.base/java.lang.Thread.run(Thread.java:834)  org.apache.solr.common.util.ObjectReleaseTracker$ObjectTrackerException: org.apache.lucene.store.MockDirectoryWrapper  at org.apache.solr.common.util.ObjectReleaseTracker.track(ObjectReleaseTracker.java:42)  at org.apache.solr.core.CachingDirectoryFactory.get(CachingDirectoryFactory.java:348)  at org.apache.solr.core.SolrCore.initSnapshotMetaDataManager(SolrCore.java:517)  at org.apache.solr.core.SolrCore.<init>(SolrCore.java:968)  at org.apache.solr.core.SolrCore.<init>(SolrCore.java:883)  at org.apache.solr.core.CoreContainer.createFromDescriptor(CoreContainer.java:1227)  at org.apache.solr.core.CoreContainer.create(CoreContainer.java:1137)  at org.apache.solr.handler.admin.CoreAdminOperation.lambda$static$0(CoreAdminOperation.java:92)  at org.apache.solr.handler.admin.CoreAdminOperation.execute(CoreAdminOperation.java:360)  at org.apache.solr.handler.admin.CoreAdminHandler$CallInfo.call(CoreAdminHandler.java:396)  at org.apache.solr.handler.admin.CoreAdminHandler.lambda$handleRequestBody$0(CoreAdminHandler.java:188)  at com.codahale.metrics.InstrumentedExecutorService$InstrumentedRunnable.run(InstrumentedExecutorService.java:176)  at org.apache.solr.common.util.ExecutorUtil$MDCAwareThreadPoolExecutor.lambda$execute$0(ExecutorUtil.java:209)  at java.base/java.util.concurrent.ThreadPoolExecutor.runWorker(ThreadPoolExecutor.java:1128)  at java.base/java.util.concurrent.ThreadPoolExecutor$Worker.run(ThreadPoolExecutor.java:628)  at java.base/java.lang.Thread.run(Thread.java:834)  org.apache.solr.common.util.ObjectReleaseTracker$ObjectTrackerException: org.apache.lucene.store.MockDirectoryWrapper  at org.apache.solr.common.util.ObjectReleaseTracker.track(ObjectReleaseTracker.java:42)  at org.apache.solr.core.CachingDirectoryFactory.get(CachingDirectoryFactory.java:348)  at org.apache.solr.update.SolrIndexWriter.create(SolrIndexWriter.java:99)  at org.apache.solr.core.SolrCore.initIndex(SolrCore.java:779)  at org.apache.solr.core.SolrCore.<init>(SolrCore.java:976)  at org.apache.solr.core.SolrCore.<init>(SolrCore.java:883)  at org.apache.solr.core.CoreContainer.createFromDescriptor(CoreContainer.java:1227)  at org.apache.solr.core.CoreContainer.create(CoreContainer.java:1137)  at org.apache.solr.handler.admin.CoreAdminOperation.lambda$static$0(CoreAdminOperation.java:92)  at org.apache.solr.handler.admin.CoreAdminOperation.execute(CoreAdminOperation.java:360)  at org.apache.solr.handler.admin.CoreAdminHandler$CallInfo.call(CoreAdminHandler.java:396)  at org.apache.solr.handler.admin.CoreAdminHandler.lambda$handleRequestBody$0(CoreAdminHandler.java:188)  at com.codahale.metrics.InstrumentedExecutorService$InstrumentedRunnable.run(InstrumentedExecutorService.java:176)  at org.apache.solr.common.util.ExecutorUtil$MDCAwareThreadPoolExecutor.lambda$execute$0(ExecutorUtil.java:209)  at java.base/java.util.concurrent.ThreadPoolExecutor.runWorker(ThreadPoolExecutor.java:1128)  at java.base/java.util.concurrent.ThreadPoolExecutor$Worker.run(ThreadPoolExecutor.java:628)  at java.base/java.lang.Thread.run(Thread.java:834)  org.apache.solr.common.util.ObjectReleaseTracker$ObjectTrackerException: org.apache.solr.core.SolrCore  at org.apache.solr.common.util.ObjectReleaseTracker.track(ObjectReleaseTracker.java:42)  at org.apache.solr.core.SolrCore.<init>(SolrCore.java:1063)  at org.apache.solr.core.SolrCore.<init>(SolrCore.java:883)  at org.apache.solr.core.CoreContainer.createFromDescriptor(CoreContainer.java:1227)  at org.apache.solr.core.CoreContainer.create(CoreContainer.java:1137)  at org.apache.solr.handler.admin.CoreAdminOperation.lambda$static$0(CoreAdminOperation.java:92)  at org.apache.solr.handler.admin.CoreAdminOperation.execute(CoreAdminOperation.java:360)  at org.apache.solr.handler.admin.CoreAdminHandler$CallInfo.call(CoreAdminHandler.java:396)  at org.apache.solr.handler.admin.CoreAdminHandler.lambda$handleRequestBody$0(CoreAdminHandler.java:188)  at com.codahale.metrics.InstrumentedExecutorService$InstrumentedRunnable.run(InstrumentedExecutorService.java:176)  at org.apache.solr.common.util.ExecutorUtil$MDCAwareThreadPoolExecutor.lambda$execute$0(ExecutorUtil.java:209)  at java.base/java.util.concurrent.ThreadPoolExecutor.runWorker(ThreadPoolExecutor.java:1128)  at java.base/java.util.concurrent.ThreadPoolExecutor$Worker.run(ThreadPoolExecutor.java:628)  at java.base/java.lang.Thread.run(Thread.java:834)  org.apache.solr.common.util.ObjectReleaseTracker$ObjectTrackerException: org.apache.lucene.store.MockDirectoryWrapper  at org.apache.solr.common.util.ObjectReleaseTracker.track(ObjectReleaseTracker.java:42)  at org.apache.solr.core.CachingDirectoryFactory.get(CachingDirectoryFactory.java:348)  at org.apache.solr.core.SolrCore.getNewIndexDir(SolrCore.java:368)  at org.apache.solr.core.SolrCore.initIndex(SolrCore.java:747)  at org.apache.solr.core.SolrCore.<init>(SolrCore.java:976)  at org.apache.solr.core.SolrCore.<init>(SolrCore.java:883)  at org.apache.solr.core.CoreContainer.createFromDescriptor(CoreContainer.java:1227)  at org.apache.solr.core.CoreContainer.create(CoreContainer.java:1137)  at org.apache.solr.handler.admin.CoreAdminOperation.lambda$static$0(CoreAdminOperation.java:92)  at org.apache.solr.handler.admin.CoreAdminOperation.execute(CoreAdminOperation.java:360)  at org.apache.solr.handler.admin.CoreAdminHandler$CallInfo.call(CoreAdminHandler.java:396)  at org.apache.solr.handler.admin.CoreAdminHandler.lambda$handleRequestBody$0(CoreAdminHandler.java:188)  at com.codahale.metrics.InstrumentedExecutorService$InstrumentedRunnable.run(InstrumentedExecutorService.java:176)  at org.apache.solr.common.util.ExecutorUtil$MDCAwareThreadPoolExecutor.lambda$execute$0(ExecutorUtil.java:209)  at java.base/java.util.concurrent.ThreadPoolExecutor.runWorker(ThreadPoolExecutor.java:1128)  at java.base/java.util.concurrent.ThreadPoolExecutor$Worker.run(ThreadPoolExecutor.java:628)  at java.base/java.lang.Thread.run(Thread.java:834)   expected null, but was:<ObjectTracker found 6 object(s) that were not released!!! [InternalHttpClient, MockDirectoryWrapper, MockDirectoryWrapper, MockDirectoryWrapper, SolrCore, MockDirectoryWrapper] org.apache.solr.common.util.ObjectReleaseTracker$ObjectTrackerException: org.apache.http.impl.client.InternalHttpClient  at org.apache.solr.common.util.ObjectReleaseTracker.track(ObjectReleaseTracker.java:42)  at org.apache.solr.client.solrj.impl.HttpClientUtil.createClient(HttpClientUtil.java:322)  at org.apache.solr.client.solrj.impl.HttpClientUtil.createClient(HttpClientUtil.java:331)  at org.apache.solr.handler.IndexFetcher.createHttpClient(IndexFetcher.java:230)  at org.apache.solr.handler.IndexFetcher.<init>(IndexFetcher.java:272)  at org.apache.solr.handler.ReplicationHandler.inform(ReplicationHandler.java:1222)  at org.apache.solr.cloud.ReplicateFromLeader.startReplication(ReplicateFromLeader.java:109)  at org.apache.solr.cloud.ZkController.startReplicationFromLeader(ZkController.java:1307)  at org.apache.solr.cloud.ZkController.register(ZkController.java:1202)  at org.apache.solr.cloud.ZkController.register(ZkController.java:1148)  at org.apache.solr.core.ZkContainer.lambda$registerInZk$0(ZkContainer.java:190)  at org.apache.solr.core.ZkContainer.registerInZk(ZkContainer.java:222)  at org.apache.solr.core.CoreContainer.registerCore(CoreContainer.java:1075)  at org.apache.solr.core.CoreContainer.createFromDescriptor(CoreContainer.java:1237)  at org.apache.solr.core.CoreContainer.create(CoreContainer.java:1137)  at org.apache.solr.handler.admin.CoreAdminOperation.lambda$static$0(CoreAdminOperation.java:92)  at org.apache.solr.handler.admin.CoreAdminOperation.execute(CoreAdminOperation.java:360)  at org.apache.solr.handler.admin.CoreAdminHandler$CallInfo.call(CoreAdminHandler.java:396)  at org.apache.solr.handler.admin.CoreAdminHandler.lambda$handleRequestBody$0(CoreAdminHandler.java:188)  at com.codahale.metrics.InstrumentedExecutorService$InstrumentedRunnable.run(InstrumentedExecutorService.java:176)  at org.apache.solr.common.util.ExecutorUtil$MDCAwareThreadPoolExecutor.lambda$execute$0(ExecutorUtil.java:209)  at java.base/java.util.concurrent.ThreadPoolExecutor.runWorker(ThreadPoolExecutor.java:1128)  at java.base/java.util.concurrent.ThreadPoolExecutor$Worker.run(ThreadPoolExecutor.java:628)  at java.base/java.lang.Thread.run(Thread.java:834)  org.apache.solr.common.util.ObjectReleaseTracker$ObjectTrackerException: org.apache.lucene.store.MockDirectoryWrapper  at org.apache.solr.common.util.ObjectReleaseTracker.track(ObjectReleaseTracker.java:42)  at org.apache.solr.core.CachingDirectoryFactory.get(CachingDirectoryFactory.java:348)  at org.apache.solr.handler.IndexFetcher.fetchLatestIndex(IndexFetcher.java:509)  at org.apache.solr.handler.IndexFetcher.fetchLatestIndex(IndexFetcher.java:351)  at org.apache.solr.handler.ReplicationHandler.doFetch(ReplicationHandler.java:422)  at org.apache.solr.handler.ReplicationHandler.lambda$setupPolling$13(ReplicationHandler.java:1191)  at java.base/java.util.concurrent.Executors$RunnableAdapter.call(Executors.java:515)  at java.base/java.util.concurrent.FutureTask.runAndReset(FutureTask.java:305)  at java.base/java.util.concurrent.ScheduledThreadPoolExecutor$ScheduledFutureTask.run(ScheduledThreadPoolExecutor.java:305)  at java.base/java.util.concurrent.ThreadPoolExecutor.runWorker(ThreadPoolExecutor.java:1128)  at java.base/java.util.concurrent.ThreadPoolExecutor$Worker.run(ThreadPoolExecutor.java:628)  at java.base/java.lang.Thread.run(Thread.java:834)  org.apache.solr.common.util.ObjectReleaseTracker$ObjectTrackerException: org.apache.lucene.store.MockDirectoryWrapper  at org.apache.solr.common.util.ObjectReleaseTracker.track(ObjectReleaseTracker.java:42)  at org.apache.solr.core.CachingDirectoryFactory.get(CachingDirectoryFactory.java:348)  at org.apache.solr.core.SolrCore.initSnapshotMetaDataManager(SolrCore.java:517)  at org.apache.solr.core.SolrCore.<init>(SolrCore.java:968)  at org.apache.solr.core.SolrCore.<init>(SolrCore.java:883)  at org.apache.solr.core.CoreContainer.createFromDescriptor(CoreContainer.java:1227)  at org.apache.solr.core.CoreContainer.create(CoreContainer.java:1137)  at org.apache.solr.handler.admin.CoreAdminOperation.lambda$static$0(CoreAdminOperation.java:92)  at org.apache.solr.handler.admin.CoreAdminOperation.execute(CoreAdminOperation.java:360)  at org.apache.solr.handler.admin.CoreAdminHandler$CallInfo.call(CoreAdminHandler.java:396)  at org.apache.solr.handler.admin.CoreAdminHandler.lambda$handleRequestBody$0(CoreAdminHandler.java:188)  at com.codahale.metrics.InstrumentedExecutorService$InstrumentedRunnable.run(InstrumentedExecutorService.java:176)  at org.apache.solr.common.util.ExecutorUtil$MDCAwareThreadPoolExecutor.lambda$execute$0(ExecutorUtil.java:209)  at java.base/java.util.concurrent.ThreadPoolExecutor.runWorker(ThreadPoolExecutor.java:1128)  at java.base/java.util.concurrent.ThreadPoolExecutor$Worker.run(ThreadPoolExecutor.java:628)  at java.base/java.lang.Thread.run(Thread.java:834)  org.apache.solr.common.util.ObjectReleaseTracker$ObjectTrackerException: org.apache.lucene.store.MockDirectoryWrapper  at org.apache.solr.common.util.ObjectReleaseTracker.track(ObjectReleaseTracker.java:42)  at org.apache.solr.core.CachingDirectoryFactory.get(CachingDirectoryFactory.java:348)  at org.apache.solr.update.SolrIndexWriter.create(SolrIndexWriter.java:99)  at org.apache.solr.core.SolrCore.initIndex(SolrCore.java:779)  at org.apache.solr.core.SolrCore.<init>(SolrCore.java:976)  at org.apache.solr.core.SolrCore.<init>(SolrCore.java:883)  at org.apache.solr.core.CoreContainer.createFromDescriptor(CoreContainer.java:1227)  at org.apache.solr.core.CoreContainer.create(CoreContainer.java:1137)  at org.apache.solr.handler.admin.CoreAdminOperation.lambda$static$0(CoreAdminOperation.java:92)  at org.apache.solr.handler.admin.CoreAdminOperation.execute(CoreAdminOperation.java:360)  at org.apache.solr.handler.admin.CoreAdminHandler$CallInfo.call(CoreAdminHandler.java:396)  at org.apache.solr.handler.admin.CoreAdminHandler.lambda$handleRequestBody$0(CoreAdminHandler.java:188)  at com.codahale.metrics.InstrumentedExecutorService$InstrumentedRunnable.run(InstrumentedExecutorService.java:176)  at org.apache.solr.common.util.ExecutorUtil$MDCAwareThreadPoolExecutor.lambda$execute$0(ExecutorUtil.java:209)  at java.base/java.util.concurrent.ThreadPoolExecutor.runWorker(ThreadPoolExecutor.java:1128)  at java.base/java.util.concurrent.ThreadPoolExecutor$Worker.run(ThreadPoolExecutor.java:628)  at java.base/java.lang.Thread.run(Thread.java:834)  org.apache.solr.common.util.ObjectReleaseTracker$ObjectTrackerException: org.apache.solr.core.SolrCore  at org.apache.solr.common.util.ObjectReleaseTracker.track(ObjectReleaseTracker.java:42)  at org.apache.solr.core.SolrCore.<init>(SolrCore.java:1063)  at org.apache.solr.core.SolrCore.<init>(SolrCore.java:883)  at org.apache.solr.core.CoreContainer.createFromDescriptor(CoreContainer.java:1227)  at org.apache.solr.core.CoreContainer.create(CoreContainer.java:1137)  at org.apache.solr.handler.admin.CoreAdminOperation.lambda$static$0(CoreAdminOperation.java:92)  at org.apache.solr.handler.admin.CoreAdminOperation.execute(CoreAdminOperation.java:360)  at org.apache.solr.handler.admin.CoreAdminHandler$CallInfo.call(CoreAdminHandler.java:396)  at org.apache.solr.handler.admin.CoreAdminHandler.lambda$handleRequestBody$0(CoreAdminHandler.java:188)  at com.codahale.metrics.InstrumentedExecutorService$InstrumentedRunnable.run(InstrumentedExecutorService.java:176)  at org.apache.solr.common.util.ExecutorUtil$MDCAwareThreadPoolExecutor.lambda$execute$0(ExecutorUtil.java:209)  at java.base/java.util.concurrent.ThreadPoolExecutor.runWorker(ThreadPoolExecutor.java:1128)  at java.base/java.util.concurrent.ThreadPoolExecutor$Worker.run(ThreadPoolExecutor.java:628)  at java.base/java.lang.Thread.run(Thread.java:834)  org.apache.solr.common.util.ObjectReleaseTracker$ObjectTrackerException: org.apache.lucene.store.MockDirectoryWrapper  at org.apache.solr.common.util.ObjectReleaseTracker.track(ObjectReleaseTracker.java:42)  at org.apache.solr.core.CachingDirectoryFactory.get(CachingDirectoryFactory.java:348)  at org.apache.solr.core.SolrCore.getNewIndexDir(SolrCore.java:368)  at org.apache.solr.core.SolrCore.initIndex(SolrCore.java:747)  at org.apache.solr.core.SolrCore.<init>(SolrCore.java:976)  at org.apache.solr.core.SolrCore.<init>(SolrCore.java:883)  at org.apache.solr.core.CoreContainer.createFromDescriptor(CoreContainer.java:1227)  at org.apache.solr.core.CoreContainer.create(CoreContainer.java:1137)  at org.apache.solr.handler.admin.CoreAdminOperation.lambda$static$0(CoreAdminOperation.java:92)  at org.apache.solr.handler.admin.CoreAdminOperation.execute(CoreAdminOperation.java:360)  at org.apache.solr.handler.admin.CoreAdminHandler$CallInfo.call(CoreAdminHandler.java:396)  at org.apache.solr.handler.admin.CoreAdminHandler.lambda$handleRequestBody$0(CoreAdminHandler.java:188)  at com.codahale.metrics.InstrumentedExecutorService$InstrumentedRunnable.run(InstrumentedExecutorService.java:176)  at org.apache.solr.common.util.ExecutorUtil$MDCAwareThreadPoolExecutor.lambda$execute$0(ExecutorUtil.java:209)  at java.base/java.util.concurrent.ThreadPoolExecutor.runWorker(ThreadPoolExecutor.java:1128)  at java.base/java.util.concurrent.ThreadPoolExecutor$Worker.run(ThreadPoolExecutor.java:628)  at java.base/java.lang.Thread.run(Thread.java:834)  >

Stack Trace:
java.lang.AssertionError: ObjectTracker found 6 object(s) that were not released!!! [InternalHttpClient, MockDirectoryWrapper, MockDirectoryWrapper, MockDirectoryWrapper, SolrCore, MockDirectoryWrapper]
org.apache.solr.common.util.ObjectReleaseTracker$ObjectTrackerException: org.apache.http.impl.client.InternalHttpClient
        at org.apache.solr.common.util.ObjectReleaseTracker.track(ObjectReleaseTracker.java:42)
        at org.apache.solr.client.solrj.impl.HttpClientUtil.createClient(HttpClientUtil.java:322)
        at org.apache.solr.client.solrj.impl.HttpClientUtil.createClient(HttpClientUtil.java:331)
        at org.apache.solr.handler.IndexFetcher.createHttpClient(IndexFetcher.java:230)
        at org.apache.solr.handler.IndexFetcher.<init>(IndexFetcher.java:272)
        at org.apache.solr.handler.ReplicationHandler.inform(ReplicationHandler.java:1222)
        at org.apache.solr.cloud.ReplicateFromLeader.startReplication(ReplicateFromLeader.java:109)
        at org.apache.solr.cloud.ZkController.startReplicationFromLeader(ZkController.java:1307)
        at org.apache.solr.cloud.ZkController.register(ZkController.java:1202)
        at org.apache.solr.cloud.ZkController.register(ZkController.java:1148)
        at org.apache.solr.core.ZkContainer.lambda$registerInZk$0(ZkContainer.java:190)
        at org.apache.solr.core.ZkContainer.registerInZk(ZkContainer.java:222)
        at org.apache.solr.core.CoreContainer.registerCore(CoreContainer.java:1075)
        at org.apache.solr.core.CoreContainer.createFromDescriptor(CoreContainer.java:1237)
        at org.apache.solr.core.CoreContainer.create(CoreContainer.java:1137)
        at org.apache.solr.handler.admin.CoreAdminOperation.lambda$static$0(CoreAdminOperation.java:92)
        at org.apache.solr.handler.admin.CoreAdminOperation.execute(CoreAdminOperation.java:360)
        at org.apache.solr.handler.admin.CoreAdminHandler$CallInfo.call(CoreAdminHandler.java:396)
        at org.apache.solr.handler.admin.CoreAdminHandler.lambda$handleRequestBody$0(CoreAdminHandler.java:188)
        at com.codahale.metrics.InstrumentedExecutorService$InstrumentedRunnable.run(InstrumentedExecutorService.java:176)
        at org.apache.solr.common.util.ExecutorUtil$MDCAwareThreadPoolExecutor.lambda$execute$0(ExecutorUtil.java:209)
        at java.base/java.util.concurrent.ThreadPoolExecutor.runWorker(ThreadPoolExecutor.java:1128)
        at java.base/java.util.concurrent.ThreadPoolExecutor$Worker.run(ThreadPoolExecutor.java:628)
        at java.base/java.lang.Thread.run(Thread.java:834)

org.apache.solr.common.util.ObjectReleaseTracker$ObjectTrackerException: org.apache.lucene.store.MockDirectoryWrapper
        at org.apache.solr.common.util.ObjectReleaseTracker.track(ObjectReleaseTracker.java:42)
        at org.apache.solr.core.CachingDirectoryFactory.get(CachingDirectoryFactory.java:348)
        at org.apache.solr.handler.IndexFetcher.fetchLatestIndex(IndexFetcher.java:509)
        at org.apache.solr.handler.IndexFetcher.fetchLatestIndex(IndexFetcher.java:351)
        at org.apache.solr.handler.ReplicationHandler.doFetch(ReplicationHandler.java:422)
        at org.apache.solr.handler.ReplicationHandler.lambda$setupPolling$13(ReplicationHandler.java:1191)
        at java.base/java.util.concurrent.Executors$RunnableAdapter.call(Executors.java:515)
        at java.base/java.util.concurrent.FutureTask.runAndReset(FutureTask.java:305)
        at java.base/java.util.concurrent.ScheduledThreadPoolExecutor$ScheduledFutureTask.run(ScheduledThreadPoolExecutor.java:305)
        at java.base/java.util.concurrent.ThreadPoolExecutor.runWorker(ThreadPoolExecutor.java:1128)
        at java.base/java.util.concurrent.ThreadPoolExecutor$Worker.run(ThreadPoolExecutor.java:628)
        at java.base/java.lang.Thread.run(Thread.java:834)

org.apache.solr.common.util.ObjectReleaseTracker$ObjectTrackerException: org.apache.lucene.store.MockDirectoryWrapper
        at org.apache.solr.common.util.ObjectReleaseTracker.track(ObjectReleaseTracker.java:42)
        at org.apache.solr.core.CachingDirectoryFactory.get(CachingDirectoryFactory.java:348)
        at org.apache.solr.core.SolrCore.initSnapshotMetaDataManager(SolrCore.java:517)
        at org.apache.solr.core.SolrCore.<init>(SolrCore.java:968)
        at org.apache.solr.core.SolrCore.<init>(SolrCore.java:883)
        at org.apache.solr.core.CoreContainer.createFromDescriptor(CoreContainer.java:1227)
        at org.apache.solr.core.CoreContainer.create(CoreContainer.java:1137)
        at org.apache.solr.handler.admin.CoreAdminOperation.lambda$static$0(CoreAdminOperation.java:92)
        at org.apache.solr.handler.admin.CoreAdminOperation.execute(CoreAdminOperation.java:360)
        at org.apache.solr.handler.admin.CoreAdminHandler$CallInfo.call(CoreAdminHandler.java:396)
        at org.apache.solr.handler.admin.CoreAdminHandler.lambda$handleRequestBody$0(CoreAdminHandler.java:188)
        at com.codahale.metrics.InstrumentedExecutorService$InstrumentedRunnable.run(InstrumentedExecutorService.java:176)
        at org.apache.solr.common.util.ExecutorUtil$MDCAwareThreadPoolExecutor.lambda$execute$0(ExecutorUtil.java:209)
        at java.base/java.util.concurrent.ThreadPoolExecutor.runWorker(ThreadPoolExecutor.java:1128)
        at java.base/java.util.concurrent.ThreadPoolExecutor$Worker.run(ThreadPoolExecutor.java:628)
        at java.base/java.lang.Thread.run(Thread.java:834)

org.apache.solr.common.util.ObjectReleaseTracker$ObjectTrackerException: org.apache.lucene.store.MockDirectoryWrapper
        at org.apache.solr.common.util.ObjectReleaseTracker.track(ObjectReleaseTracker.java:42)
        at org.apache.solr.core.CachingDirectoryFactory.get(CachingDirectoryFactory.java:348)
        at org.apache.solr.update.SolrIndexWriter.create(SolrIndexWriter.java:99)
        at org.apache.solr.core.SolrCore.initIndex(SolrCore.java:779)
        at org.apache.solr.core.SolrCore.<init>(SolrCore.java:976)
        at org.apache.solr.core.SolrCore.<init>(SolrCore.java:883)
        at org.apache.solr.core.CoreContainer.createFromDescriptor(CoreContainer.java:1227)
        at org.apache.solr.core.CoreContainer.create(CoreContainer.java:1137)
        at org.apache.solr.handler.admin.CoreAdminOperation.lambda$static$0(CoreAdminOperation.java:92)
        at org.apache.solr.handler.admin.CoreAdminOperation.execute(CoreAdminOperation.java:360)
        at org.apache.solr.handler.admin.CoreAdminHandler$CallInfo.call(CoreAdminHandler.java:396)
        at org.apache.solr.handler.admin.CoreAdminHandler.lambda$handleRequestBody$0(CoreAdminHandler.java:188)
        at com.codahale.metrics.InstrumentedExecutorService$InstrumentedRunnable.run(InstrumentedExecutorService.java:176)
        at org.apache.solr.common.util.ExecutorUtil$MDCAwareThreadPoolExecutor.lambda$execute$0(ExecutorUtil.java:209)
        at java.base/java.util.concurrent.ThreadPoolExecutor.runWorker(ThreadPoolExecutor.java:1128)
        at java.base/java.util.concurrent.ThreadPoolExecutor$Worker.run(ThreadPoolExecutor.java:628)
        at java.base/java.lang.Thread.run(Thread.java:834)

org.apache.solr.common.util.ObjectReleaseTracker$ObjectTrackerException: org.apache.solr.core.SolrCore
        at org.apache.solr.common.util.ObjectReleaseTracker.track(ObjectReleaseTracker.java:42)
        at org.apache.solr.core.SolrCore.<init>(SolrCore.java:1063)
        at org.apache.solr.core.SolrCore.<init>(SolrCore.java:883)
        at org.apache.solr.core.CoreContainer.createFromDescriptor(CoreContainer.java:1227)
        at org.apache.solr.core.CoreContainer.create(CoreContainer.java:1137)
        at org.apache.solr.handler.admin.CoreAdminOperation.lambda$static$0(CoreAdminOperation.java:92)
        at org.apache.solr.handler.admin.CoreAdminOperation.execute(CoreAdminOperation.java:360)
        at org.apache.solr.handler.admin.CoreAdminHandler$CallInfo.call(CoreAdminHandler.java:396)
        at org.apache.solr.handler.admin.CoreAdminHandler.lambda$handleRequestBody$0(CoreAdminHandler.java:188)
        at com.codahale.metrics.InstrumentedExecutorService$InstrumentedRunnable.run(InstrumentedExecutorService.java:176)
        at org.apache.solr.common.util.ExecutorUtil$MDCAwareThreadPoolExecutor.lambda$execute$0(ExecutorUtil.java:209)
        at java.base/java.util.concurrent.ThreadPoolExecutor.runWorker(ThreadPoolExecutor.java:1128)
        at java.base/java.util.concurrent.ThreadPoolExecutor$Worker.run(ThreadPoolExecutor.java:628)
        at java.base/java.lang.Thread.run(Thread.java:834)

org.apache.solr.common.util.ObjectReleaseTracker$ObjectTrackerException: org.apache.lucene.store.MockDirectoryWrapper
        at org.apache.solr.common.util.ObjectReleaseTracker.track(ObjectReleaseTracker.java:42)
        at org.apache.solr.core.CachingDirectoryFactory.get(CachingDirectoryFactory.java:348)
        at org.apache.solr.core.SolrCore.getNewIndexDir(SolrCore.java:368)
        at org.apache.solr.core.SolrCore.initIndex(SolrCore.java:747)
        at org.apache.solr.core.SolrCore.<init>(SolrCore.java:976)
        at org.apache.solr.core.SolrCore.<init>(SolrCore.java:883)
        at org.apache.solr.core.CoreContainer.createFromDescriptor(CoreContainer.java:1227)
        at org.apache.solr.core.CoreContainer.create(CoreContainer.java:1137)
        at org.apache.solr.handler.admin.CoreAdminOperation.lambda$static$0(CoreAdminOperation.java:92)
        at org.apache.solr.handler.admin.CoreAdminOperation.execute(CoreAdminOperation.java:360)
        at org.apache.solr.handler.admin.CoreAdminHandler$CallInfo.call(CoreAdminHandler.java:396)
        at org.apache.solr.handler.admin.CoreAdminHandler.lambda$handleRequestBody$0(CoreAdminHandler.java:188)
        at com.codahale.metrics.InstrumentedExecutorService$InstrumentedRunnable.run(InstrumentedExecutorService.java:176)
        at org.apache.solr.common.util.ExecutorUtil$MDCAwareThreadPoolExecutor.lambda$execute$0(ExecutorUtil.java:209)
        at java.base/java.util.concurrent.ThreadPoolExecutor.runWorker(ThreadPoolExecutor.java:1128)
        at java.base/java.util.concurrent.ThreadPoolExecutor$Worker.run(ThreadPoolExecutor.java:628)
        at java.base/java.lang.Thread.run(Thread.java:834)

 expected null, but was:<ObjectTracker found 6 object(s) that were not released!!! [InternalHttpClient, MockDirectoryWrapper, MockDirectoryWrapper, MockDirectoryWrapper, SolrCore, MockDirectoryWrapper]
org.apache.solr.common.util.ObjectReleaseTracker$ObjectTrackerException: org.apache.http.impl.client.InternalHttpClient
        at org.apache.solr.common.util.ObjectReleaseTracker.track(ObjectReleaseTracker.java:42)
        at org.apache.solr.client.solrj.impl.HttpClientUtil.createClient(HttpClientUtil.java:322)
        at org.apache.solr.client.solrj.impl.HttpClientUtil.createClient(HttpClientUtil.java:331)
        at org.apache.solr.handler.IndexFetcher.createHttpClient(IndexFetcher.java:230)
        at org.apache.solr.handler.IndexFetcher.<init>(IndexFetcher.java:272)
        at org.apache.solr.handler.ReplicationHandler.inform(ReplicationHandler.java:1222)
        at org.apache.solr.cloud.ReplicateFromLeader.startReplication(ReplicateFromLeader.java:109)
        at org.apache.solr.cloud.ZkController.startReplicationFromLeader(ZkController.java:1307)
        at org.apache.solr.cloud.ZkController.register(ZkController.java:1202)
        at org.apache.solr.cloud.ZkController.register(ZkController.java:1148)
        at org.apache.solr.core.ZkContainer.lambda$registerInZk$0(ZkContainer.java:190)
        at org.apache.solr.core.ZkContainer.registerInZk(ZkContainer.java:222)
        at org.apache.solr.core.CoreContainer.registerCore(CoreContainer.java:1075)
        at org.apache.solr.core.CoreContainer.createFromDescriptor(CoreContainer.java:1237)
        at org.apache.solr.core.CoreContainer.create(CoreContainer.java:1137)
        at org.apache.solr.handler.admin.CoreAdminOperation.lambda$static$0(CoreAdminOperation.java:92)
        at org.apache.solr.handler.admin.CoreAdminOperation.execute(CoreAdminOperation.java:360)
        at org.apache.solr.handler.admin.CoreAdminHandler$CallInfo.call(CoreAdminHandler.java:396)
        at org.apache.solr.handler.admin.CoreAdminHandler.lambda$handleRequestBody$0(CoreAdminHandler.java:188)
        at com.codahale.metrics.InstrumentedExecutorService$InstrumentedRunnable.run(InstrumentedExecutorService.java:176)
        at org.apache.solr.common.util.ExecutorUtil$MDCAwareThreadPoolExecutor.lambda$execute$0(ExecutorUtil.java:209)
        at java.base/java.util.concurrent.ThreadPoolExecutor.runWorker(ThreadPoolExecutor.java:1128)
        at java.base/java.util.concurrent.ThreadPoolExecutor$Worker.run(ThreadPoolExecutor.java:628)
        at java.base/java.lang.Thread.run(Thread.java:834)

org.apache.solr.common.util.ObjectReleaseTracker$ObjectTrackerException: org.apache.lucene.store.MockDirectoryWrapper
        at org.apache.solr.common.util.ObjectReleaseTracker.track(ObjectReleaseTracker.java:42)
        at org.apache.solr.core.CachingDirectoryFactory.get(CachingDirectoryFactory.java:348)
        at org.apache.solr.handler.IndexFetcher.fetchLatestIndex(IndexFetcher.java:509)
        at org.apache.solr.handler.IndexFetcher.fetchLatestIndex(IndexFetcher.java:351)
        at org.apache.solr.handler.ReplicationHandler.doFetch(ReplicationHandler.java:422)
        at org.apache.solr.handler.ReplicationHandler.lambda$setupPolling$13(ReplicationHandler.java:1191)
        at java.base/java.util.concurrent.Executors$RunnableAdapter.call(Executors.java:515)
        at java.base/java.util.concurrent.FutureTask.runAndReset(FutureTask.java:305)
        at java.base/java.util.concurrent.ScheduledThreadPoolExecutor$ScheduledFutureTask.run(ScheduledThreadPoolExecutor.java:305)
        at java.base/java.util.concurrent.ThreadPoolExecutor.runWorker(ThreadPoolExecutor.java:1128)
        at java.base/java.util.concurrent.ThreadPoolExecutor$Worker.run(ThreadPoolExecutor.java:628)
        at java.base/java.lang.Thread.run(Thread.java:834)

org.apache.solr.common.util.ObjectReleaseTracker$ObjectTrackerException: org.apache.lucene.store.MockDirectoryWrapper
        at org.apache.solr.common.util.ObjectReleaseTracker.track(ObjectReleaseTracker.java:42)
        at org.apache.solr.core.CachingDirectoryFactory.get(CachingDirectoryFactory.java:348)
        at org.apache.solr.core.SolrCore.initSnapshotMetaDataManager(SolrCore.java:517)
        at org.apache.solr.core.SolrCore.<init>(SolrCore.java:968)
        at org.apache.solr.core.SolrCore.<init>(SolrCore.java:883)
        at org.apache.solr.core.CoreContainer.createFromDescriptor(CoreContainer.java:1227)
        at org.apache.solr.core.CoreContainer.create(CoreContainer.java:1137)
        at org.apache.solr.handler.admin.CoreAdminOperation.lambda$static$0(CoreAdminOperation.java:92)
        at org.apache.solr.handler.admin.CoreAdminOperation.execute(CoreAdminOperation.java:360)
        at org.apache.solr.handler.admin.CoreAdminHandler$CallInfo.call(CoreAdminHandler.java:396)
        at org.apache.solr.handler.admin.CoreAdminHandler.lambda$handleRequestBody$0(CoreAdminHandler.java:188)
        at com.codahale.metrics.InstrumentedExecutorService$InstrumentedRunnable.run(InstrumentedExecutorService.java:176)
        at org.apache.solr.common.util.ExecutorUtil$MDCAwareThreadPoolExecutor.lambda$execute$0(ExecutorUtil.java:209)
        at java.base/java.util.concurrent.ThreadPoolExecutor.runWorker(ThreadPoolExecutor.java:1128)
        at java.base/java.util.concurrent.ThreadPoolExecutor$Worker.run(ThreadPoolExecutor.java:628)
        at java.base/java.lang.Thread.run(Thread.java:834)

org.apache.solr.common.util.ObjectReleaseTracker$ObjectTrackerException: org.apache.lucene.store.MockDirectoryWrapper
        at org.apache.solr.common.util.ObjectReleaseTracker.track(ObjectReleaseTracker.java:42)
        at org.apache.solr.core.CachingDirectoryFactory.get(CachingDirectoryFactory.java:348)
        at org.apache.solr.update.SolrIndexWriter.create(SolrIndexWriter.java:99)
        at org.apache.solr.core.SolrCore.initIndex(SolrCore.java:779)
        at org.apache.solr.core.SolrCore.<init>(SolrCore.java:976)
        at org.apache.solr.core.SolrCore.<init>(SolrCore.java:883)
        at org.apache.solr.core.CoreContainer.createFromDescriptor(CoreContainer.java:1227)
        at org.apache.solr.core.CoreContainer.create(CoreContainer.java:1137)
        at org.apache.solr.handler.admin.CoreAdminOperation.lambda$static$0(CoreAdminOperation.java:92)
        at org.apache.solr.handler.admin.CoreAdminOperation.execute(CoreAdminOperation.java:360)
        at org.apache.solr.handler.admin.CoreAdminHandler$CallInfo.call(CoreAdminHandler.java:396)
        at org.apache.solr.handler.admin.CoreAdminHandler.lambda$handleRequestBody$0(CoreAdminHandler.java:188)
        at com.codahale.metrics.InstrumentedExecutorService$InstrumentedRunnable.run(InstrumentedExecutorService.java:176)
        at org.apache.solr.common.util.ExecutorUtil$MDCAwareThreadPoolExecutor.lambda$execute$0(ExecutorUtil.java:209)
        at java.base/java.util.concurrent.ThreadPoolExecutor.runWorker(ThreadPoolExecutor.java:1128)
        at java.base/java.util.concurrent.ThreadPoolExecutor$Worker.run(ThreadPoolExecutor.java:628)
        at java.base/java.lang.Thread.run(Thread.java:834)

org.apache.solr.common.util.ObjectReleaseTracker$ObjectTrackerException: org.apache.solr.core.SolrCore
        at org.apache.solr.common.util.ObjectReleaseTracker.track(ObjectReleaseTracker.java:42)
        at org.apache.solr.core.SolrCore.<init>(SolrCore.java:1063)
        at org.apache.solr.core.SolrCore.<init>(SolrCore.java:883)
        at org.apache.solr.core.CoreContainer.createFromDescriptor(CoreContainer.java:1227)
        at org.apache.solr.core.CoreContainer.create(CoreContainer.java:1137)
        at org.apache.solr.handler.admin.CoreAdminOperation.lambda$static$0(CoreAdminOperation.java:92)
        at org.apache.solr.handler.admin.CoreAdminOperation.execute(CoreAdminOperation.java:360)
        at org.apache.solr.handler.admin.CoreAdminHandler$CallInfo.call(CoreAdminHandler.java:396)
        at org.apache.solr.handler.admin.CoreAdminHandler.lambda$handleRequestBody$0(CoreAdminHandler.java:188)
        at com.codahale.metrics.InstrumentedExecutorService$InstrumentedRunnable.run(InstrumentedExecutorService.java:176)
        at org.apache.solr.common.util.ExecutorUtil$MDCAwareThreadPoolExecutor.lambda$execute$0(ExecutorUtil.java:209)
        at java.base/java.util.concurrent.ThreadPoolExecutor.runWorker(ThreadPoolExecutor.java:1128)
        at java.base/java.util.concurrent.ThreadPoolExecutor$Worker.run(ThreadPoolExecutor.java:628)
        at java.base/java.lang.Thread.run(Thread.java:834)

org.apache.solr.common.util.ObjectReleaseTracker$ObjectTrackerException: org.apache.lucene.store.MockDirectoryWrapper
        at org.apache.solr.common.util.ObjectReleaseTracker.track(ObjectReleaseTracker.java:42)
        at org.apache.solr.core.CachingDirectoryFactory.get(CachingDirectoryFactory.java:348)
        at org.apache.solr.core.SolrCore.getNewIndexDir(SolrCore.java:368)
        at org.apache.solr.core.SolrCore.initIndex(SolrCore.java:747)
        at org.apache.solr.core.SolrCore.<init>(SolrCore.java:976)
        at org.apache.solr.core.SolrCore.<init>(SolrCore.java:883)
        at org.apache.solr.core.CoreContainer.createFromDescriptor(CoreContainer.java:1227)
        at org.apache.solr.core.CoreContainer.create(CoreContainer.java:1137)
        at org.apache.solr.handler.admin.CoreAdminOperation.lambda$static$0(CoreAdminOperation.java:92)
        at org.apache.solr.handler.admin.CoreAdminOperation.execute(CoreAdminOperation.java:360)
        at org.apache.solr.handler.admin.CoreAdminHandler$CallInfo.call(CoreAdminHandler.java:396)
        at org.apache.solr.handler.admin.CoreAdminHandler.lambda$handleRequestBody$0(CoreAdminHandler.java:188)
        at com.codahale.metrics.InstrumentedExecutorService$InstrumentedRunnable.run(InstrumentedExecutorService.java:176)
        at org.apache.solr.common.util.ExecutorUtil$MDCAwareThreadPoolExecutor.lambda$execute$0(ExecutorUtil.java:209)
        at java.base/java.util.concurrent.ThreadPoolExecutor.runWorker(ThreadPoolExecutor.java:1128)
        at java.base/java.util.concurrent.ThreadPoolExecutor$Worker.run(ThreadPoolExecutor.java:628)
        at java.base/java.lang.Thread.run(Thread.java:834)

>
        at __randomizedtesting.SeedInfo.seed([31BE8FD041ACCE]:0)
        at org.junit.Assert.fail(Assert.java:88)
        at org.junit.Assert.failNotNull(Assert.java:755)
        at org.junit.Assert.assertNull(Assert.java:737)
        at org.apache.solr.SolrTestCaseJ4.teardownTestCases(SolrTestCaseJ4.java:326)
        at jdk.internal.reflect.GeneratedMethodAccessor19.invoke(Unknown Source)
        at java.base/jdk.internal.reflect.DelegatingMethodAccessorImpl.invoke(DelegatingMethodAccessorImpl.java:43)
        at java.base/java.lang.reflect.Method.invoke(Method.java:566)
        at com.carrotsearch.randomizedtesting.RandomizedRunner.invoke(RandomizedRunner.java:1750)
        at com.carrotsearch.randomizedtesting.RandomizedRunner$7.evaluate(RandomizedRunner.java:901)
        at com.carrotsearch.randomizedtesting.rules.StatementAdapter.evaluate(StatementAdapter.java:36)
        at com.carrotsearch.randomizedtesting.rules.SystemPropertiesRestoreRule$1.evaluate(SystemPropertiesRestoreRule.java:57)
        at org.apache.lucene.util.AbstractBeforeAfterRule$1.evaluate(AbstractBeforeAfterRule.java:45)
        at com.carrotsearch.randomizedtesting.rules.StatementAdapter.evaluate(StatementAdapter.java:36)
        at org.apache.lucene.util.TestRuleStoreClassName$1.evaluate(TestRuleStoreClassName.java:41)
        at com.carrotsearch.randomizedtesting.rules.NoShadowingOrOverridesOnMethodsRule$1.evaluate(NoShadowingOrOverridesOnMethodsRule.java:40)
        at com.carrotsearch.randomizedtesting.rules.NoShadowingOrOverridesOnMethodsRule$1.evaluate(NoShadowingOrOverridesOnMethodsRule.java:40)
        at com.carrotsearch.randomizedtesting.rules.StatementAdapter.evaluate(StatementAdapter.java:36)
        at com.carrotsearch.randomizedtesting.rules.StatementAdapter.evaluate(StatementAdapter.java:36)
        at org.apache.lucene.util.TestRuleAssertionsRequired$1.evaluate(TestRuleAssertionsRequired.java:53)
        at org.apache.lucene.util.TestRuleMarkFailure$1.evaluate(TestRuleMarkFailure.java:47)
        at org.apache.lucene.util.TestRuleIgnoreAfterMaxFailures$1.evaluate(TestRuleIgnoreAfterMaxFailures.java:64)
        at org.apache.lucene.util.TestRuleIgnoreTestSuites$1.evaluate(TestRuleIgnoreTestSuites.java:54)
        at com.carrotsearch.randomizedtesting.rules.StatementAdapter.evaluate(StatementAdapter.java:36)
        at com.carrotsearch.randomizedtesting.ThreadLeakControl$StatementRunner.run(ThreadLeakControl.java:368)
        at java.base/java.lang.Thread.run(Thread.java:834)




Build Log:
[...truncated 16416 lines...]
   [junit4] Suite: org.apache.solr.client.solrj.impl.CloudHttp2SolrClientTest
   [junit4]   2> 193047 INFO  (SUITE-CloudHttp2SolrClientTest-seed#[31BE8FD041ACCE]-worker) [    ] o.a.s.SolrTestCaseJ4 SecureRandom sanity checks: test.solr.allowed.securerandom=null & java.security.egd=file:/dev/./urandom
   [junit4]   2> Creating dataDir: C:\Users\jenkins\workspace\Lucene-Solr-master-Windows\solr\build\solr-solrj\test\J1\temp\solr.client.solrj.impl.CloudHttp2SolrClientTest_31BE8FD041ACCE-001\init-core-data-001
   [junit4]   2> 193048 INFO  (SUITE-CloudHttp2SolrClientTest-seed#[31BE8FD041ACCE]-worker) [    ] o.a.s.SolrTestCaseJ4 Using PointFields (NUMERIC_POINTS_SYSPROP=true) w/NUMERIC_DOCVALUES_SYSPROP=true
   [junit4]   2> 193050 INFO  (SUITE-CloudHttp2SolrClientTest-seed#[31BE8FD041ACCE]-worker) [    ] o.a.s.SolrTestCaseJ4 Randomized ssl (false) and clientAuth (false) via: @org.apache.solr.util.RandomizeSSL(reason="", value=0.0/0.0, ssl=0.0/0.0, clientAuth=0.0/0.0)
   [junit4]   2> 193052 INFO  (TEST-CloudHttp2SolrClientTest.testParallelUpdateQTime-seed#[31BE8FD041ACCE]) [    ] o.a.s.SolrTestCaseJ4 ###Starting testParallelUpdateQTime
   [junit4]   2> 193052 INFO  (TEST-CloudHttp2SolrClientTest.testParallelUpdateQTime-seed#[31BE8FD041ACCE]) [    ] o.a.s.c.MiniSolrCloudCluster Starting cluster of 3 servers in C:\Users\jenkins\workspace\Lucene-Solr-master-Windows\solr\build\solr-solrj\test\J1\temp\solr.client.solrj.impl.CloudHttp2SolrClientTest_31BE8FD041ACCE-001\tempDir-001
   [junit4]   2> 193053 INFO  (TEST-CloudHttp2SolrClientTest.testParallelUpdateQTime-seed#[31BE8FD041ACCE]) [    ] o.a.s.c.ZkTestServer STARTING ZK TEST SERVER
   [junit4]   2> 193053 INFO  (ZkTestServer Run Thread) [    ] o.a.s.c.ZkTestServer client port:0.0.0.0/0.0.0.0:0
   [junit4]   2> 193053 INFO  (ZkTestServer Run Thread) [    ] o.a.s.c.ZkTestServer Starting server
   [junit4]   2> 193153 INFO  (TEST-CloudHttp2SolrClientTest.testParallelUpdateQTime-seed#[31BE8FD041ACCE]) [    ] o.a.s.c.ZkTestServer start zk server on port:60093
   [junit4]   2> 193153 INFO  (TEST-CloudHttp2SolrClientTest.testParallelUpdateQTime-seed#[31BE8FD041ACCE]) [    ] o.a.s.c.ZkTestServer parse host and port list: 127.0.0.1:60093
   [junit4]   2> 193153 INFO  (TEST-CloudHttp2SolrClientTest.testParallelUpdateQTime-seed#[31BE8FD041ACCE]) [    ] o.a.s.c.ZkTestServer connecting to 127.0.0.1 60093
   [junit4]   2> 193159 INFO  (zkConnectionManagerCallback-1235-thread-1) [    ] o.a.s.c.c.ConnectionManager zkClient has connected
   [junit4]   2> 193163 INFO  (zkConnectionManagerCallback-1237-thread-1) [    ] o.a.s.c.c.ConnectionManager zkClient has connected
   [junit4]   2> 193167 INFO  (zkConnectionManagerCallback-1239-thread-1) [    ] o.a.s.c.c.ConnectionManager zkClient has connected
   [junit4]   2> 193168 WARN  (NIOServerCxn.Factory:0.0.0.0/0.0.0.0:0) [    ] o.a.z.s.NIOServerCnxn Unable to read additional data from client sessionid 0x10011b428c10002, likely client has closed socket
   [junit4]   2> 193169 WARN  (jetty-launcher-1240-thread-1) [    ] o.e.j.s.AbstractConnector Ignoring deprecated socket close linger time
   [junit4]   2> 193169 WARN  (jetty-launcher-1240-thread-2) [    ] o.e.j.s.AbstractConnector Ignoring deprecated socket close linger time
   [junit4]   2> 193170 INFO  (jetty-launcher-1240-thread-1) [    ] o.a.s.c.s.e.JettySolrRunner Start Jetty (original configured port=0)
   [junit4]   2> 193170 INFO  (jetty-launcher-1240-thread-1) [    ] o.a.s.c.s.e.JettySolrRunner Trying to start Jetty on port 0 try number 1 ...
   [junit4]   2> 193170 INFO  (jetty-launcher-1240-thread-2) [    ] o.a.s.c.s.e.JettySolrRunner Start Jetty (original configured port=0)
   [junit4]   2> 193170 INFO  (jetty-launcher-1240-thread-1) [    ] o.e.j.s.Server jetty-9.4.14.v20181114; built: 2018-11-14T21:20:31.478Z; git: c4550056e785fb5665914545889f21dc136ad9e6; jvm 11.0.2+9
   [junit4]   2> 193170 INFO  (jetty-launcher-1240-thread-2) [    ] o.a.s.c.s.e.JettySolrRunner Trying to start Jetty on port 0 try number 1 ...
   [junit4]   2> 193170 INFO  (jetty-launcher-1240-thread-2) [    ] o.e.j.s.Server jetty-9.4.14.v20181114; built: 2018-11-14T21:20:31.478Z; git: c4550056e785fb5665914545889f21dc136ad9e6; jvm 11.0.2+9
   [junit4]   2> 193170 WARN  (jetty-launcher-1240-thread-3) [    ] o.e.j.s.AbstractConnector Ignoring deprecated socket close linger time
   [junit4]   2> 193171 INFO  (jetty-launcher-1240-thread-3) [    ] o.a.s.c.s.e.JettySolrRunner Start Jetty (original configured port=0)
   [junit4]   2> 193171 INFO  (jetty-launcher-1240-thread-3) [    ] o.a.s.c.s.e.JettySolrRunner Trying to start Jetty on port 0 try number 1 ...
   [junit4]   2> 193171 INFO  (jetty-launcher-1240-thread-3) [    ] o.e.j.s.Server jetty-9.4.14.v20181114; built: 2018-11-14T21:20:31.478Z; git: c4550056e785fb5665914545889f21dc136ad9e6; jvm 11.0.2+9
   [junit4]   2> 193171 INFO  (jetty-launcher-1240-thread-1) [    ] o.e.j.s.session DefaultSessionIdManager workerName=node0
   [junit4]   2> 193171 INFO  (jetty-launcher-1240-thread-1) [    ] o.e.j.s.session No SessionScavenger set, using defaults
   [junit4]   2> 193171 INFO  (jetty-launcher-1240-thread-1) [    ] o.e.j.s.session node0 Scavenging every 660000ms
   [junit4]   2> 193171 INFO  (jetty-launcher-1240-thread-2) [    ] o.e.j.s.session DefaultSessionIdManager workerName=node0
   [junit4]   2> 193171 INFO  (jetty-launcher-1240-thread-2) [    ] o.e.j.s.session No SessionScavenger set, using defaults
   [junit4]   2> 193171 INFO  (jetty-launcher-1240-thread-2) [    ] o.e.j.s.session node0 Scavenging every 660000ms
   [junit4]   2> 193171 INFO  (jetty-launcher-1240-thread-1) [    ] o.e.j.s.h.ContextHandler Started o.e.j.s.ServletContextHandler@58ccdae9{/solr,null,AVAILABLE}
   [junit4]   2> 193171 INFO  (jetty-launcher-1240-thread-3) [    ] o.e.j.s.session DefaultSessionIdManager workerName=node0
   [junit4]   2> 193171 INFO  (jetty-launcher-1240-thread-3) [    ] o.e.j.s.session No SessionScavenger set, using defaults
   [junit4]   2> 193171 INFO  (jetty-launcher-1240-thread-3) [    ] o.e.j.s.session node0 Scavenging every 660000ms
   [junit4]   2> 193171 INFO  (jetty-launcher-1240-thread-2) [    ] o.e.j.s.h.ContextHandler Started o.e.j.s.ServletContextHandler@43d5f5f4{/solr,null,AVAILABLE}
   [junit4]   2> 193172 INFO  (jetty-launcher-1240-thread-3) [    ] o.e.j.s.h.ContextHandler Started o.e.j.s.ServletContextHandler@5cb1023c{/solr,null,AVAILABLE}
   [junit4]   2> 193175 INFO  (jetty-launcher-1240-thread-3) [    ] o.e.j.s.AbstractConnector Started ServerConnector@6292316a{HTTP/1.1,[http/1.1, h2c]}{127.0.0.1:60104}
   [junit4]   2> 193175 INFO  (jetty-launcher-1240-thread-1) [    ] o.e.j.s.AbstractConnector Started ServerConnector@3e8f54b4{HTTP/1.1,[http/1.1, h2c]}{127.0.0.1:60110}
   [junit4]   2> 193175 INFO  (jetty-launcher-1240-thread-3) [    ] o.e.j.s.Server Started @193204ms
   [junit4]   2> 193175 INFO  (jetty-launcher-1240-thread-1) [    ] o.e.j.s.Server Started @193204ms
   [junit4]   2> 193175 INFO  (jetty-launcher-1240-thread-1) [    ] o.a.s.c.s.e.JettySolrRunner Jetty properties: {hostContext=/solr, hostPort=60110}
   [junit4]   2> 193175 INFO  (jetty-launcher-1240-thread-3) [    ] o.a.s.c.s.e.JettySolrRunner Jetty properties: {hostContext=/solr, hostPort=60104}
   [junit4]   2> 193176 ERROR (jetty-launcher-1240-thread-1) [    ] o.a.s.u.StartupLoggingUtils Missing Java Option solr.log.dir. Logging may be missing or incomplete.
   [junit4]   2> 193176 INFO  (jetty-launcher-1240-thread-1) [    ] o.a.s.s.SolrDispatchFilter Using logger factory org.apache.logging.slf4j.Log4jLoggerFactory
   [junit4]   2> 193176 INFO  (jetty-launcher-1240-thread-1) [    ] o.a.s.s.SolrDispatchFilter  ___      _       Welcome to Apache Solr? version 9.0.0
   [junit4]   2> 193176 INFO  (jetty-launcher-1240-thread-1) [    ] o.a.s.s.SolrDispatchFilter / __| ___| |_ _   Starting in cloud mode on port null
   [junit4]   2> 193176 INFO  (jetty-launcher-1240-thread-1) [    ] o.a.s.s.SolrDispatchFilter \__ \/ _ \ | '_|  Install dir: null
   [junit4]   2> 193176 INFO  (jetty-launcher-1240-thread-1) [    ] o.a.s.s.SolrDispatchFilter |___/\___/_|_|    Start time: 2019-04-17T04:15:18.265400100Z
   [junit4]   2> 193176 ERROR (jetty-launcher-1240-thread-3) [    ] o.a.s.u.StartupLoggingUtils Missing Java Option solr.log.dir. Logging may be missing or incomplete.
   [junit4]   2> 193176 INFO  (jetty-launcher-1240-thread-3) [    ] o.a.s.s.SolrDispatchFilter Using logger factory org.apache.logging.slf4j.Log4jLoggerFactory
   [junit4]   2> 193176 INFO  (jetty-launcher-1240-thread-3) [    ] o.a.s.s.SolrDispatchFilter  ___      _       Welcome to Apache Solr? version 9.0.0
   [junit4]   2> 193176 INFO  (jetty-launcher-1240-thread-3) [    ] o.a.s.s.SolrDispatchFilter / __| ___| |_ _   Starting in cloud mode on port null
   [junit4]   2> 193176 INFO  (jetty-launcher-1240-thread-2) [    ] o.e.j.s.AbstractConnector Started ServerConnector@f835128{HTTP/1.1,[http/1.1, h2c]}{127.0.0.1:60105}
   [junit4]   2> 193176 INFO  (jetty-launcher-1240-thread-3) [    ] o.a.s.s.SolrDispatchFilter \__ \/ _ \ | '_|  Install dir: null
   [junit4]   2> 193176 INFO  (jetty-launcher-1240-thread-3) [    ] o.a.s.s.SolrDispatchFilter |___/\___/_|_|    Start time: 2019-04-17T04:15:18.265400100Z
   [junit4]   2> 193177 INFO  (jetty-launcher-1240-thread-2) [    ] o.e.j.s.Server Started @193206ms
   [junit4]   2> 193177 INFO  (jetty-launcher-1240-thread-2) [    ] o.a.s.c.s.e.JettySolrRunner Jetty properties: {hostContext=/solr, hostPort=60105}
   [junit4]   2> 193178 ERROR (jetty-launcher-1240-thread-2) [    ] o.a.s.u.StartupLoggingUtils Missing Java Option solr.log.dir. Logging may be missing or incomplete.
   [junit4]   2> 193178 INFO  (jetty-launcher-1240-thread-2) [    ] o.a.s.s.SolrDispatchFilter Using logger factory org.apache.logging.slf4j.Log4jLoggerFactory
   [junit4]   2> 193178 INFO  (jetty-launcher-1240-thread-2) [    ] o.a.s.s.SolrDispatchFilter  ___      _       Welcome to Apache Solr? version 9.0.0
   [junit4]   2> 193178 INFO  (jetty-launcher-1240-thread-2) [    ] o.a.s.s.SolrDispatchFilter / __| ___| |_ _   Starting in cloud mode on port null
   [junit4]   2> 193178 INFO  (jetty-launcher-1240-thread-2) [    ] o.a.s.s.SolrDispatchFilter \__ \/ _ \ | '_|  Install dir: null
   [junit4]   2> 193178 INFO  (jetty-launcher-1240-thread-2) [    ] o.a.s.s.SolrDispatchFilter |___/\___/_|_|    Start time: 2019-04-17T04:15:18.267192600Z
   [junit4]   2> 193184 INFO  (zkConnectionManagerCallback-1244-thread-1) [    ] o.a.s.c.c.ConnectionManager zkClient has connected
   [junit4]   2> 193184 INFO  (jetty-launcher-1240-thread-3) [    ] o.a.s.s.SolrDispatchFilter solr.xml found in ZooKeeper. Loading...
   [junit4]   2> 193184 INFO  (zkConnectionManagerCallback-1246-thread-1) [    ] o.a.s.c.c.ConnectionManager zkClient has connected
   [junit4]   2> 193184 INFO  (jetty-launcher-1240-thread-2) [    ] o.a.s.s.SolrDispatchFilter solr.xml found in ZooKeeper. Loading...
   [junit4]   2> 193194 INFO  (zkConnectionManagerCallback-1243-thread-1) [    ] o.a.s.c.c.ConnectionManager zkClient has connected
   [junit4]   2> 193195 INFO  (jetty-launcher-1240-thread-1) [    ] o.a.s.s.SolrDispatchFilter solr.xml found in ZooKeeper. Loading...
   [junit4]   2> 193204 WARN  (NIOServerCxn.Factory:0.0.0.0/0.0.0.0:0) [    ] o.a.z.s.NIOServerCnxn Unable to read additional data from client sessionid 0x10011b428c10003, likely client has closed socket
   [junit4]   2> 193209 WARN  (NIOServerCxn.Factory:0.0.0.0/0.0.0.0:0) [    ] o.a.z.s.NIOServerCnxn Unable to read additional data from client sessionid 0x10011b428c10005, likely client has closed socket
   [junit4]   2> 193268 INFO  (jetty-launcher-1240-thread-2) [    ] o.a.s.h.c.HttpShardHandlerFactory Host whitelist initialized: WhitelistHostChecker [whitelistHosts=null, whitelistHostCheckingEnabled=true]
   [junit4]   2> 193274 WARN  (jetty-launcher-1240-thread-2) [    ] o.e.j.u.s.S.config No Client EndPointIdentificationAlgorithm configured for SslContextFactory@dca11e3[provider=null,keyStore=null,trustStore=null]
   [junit4]   2> 193280 WARN  (jetty-launcher-1240-thread-2) [    ] o.e.j.u.s.S.config No Client EndPointIdentificationAlgorithm configured for SslContextFactory@688b454d[provider=null,keyStore=null,trustStore=null]
   [junit4]   2> 193280 INFO  (jetty-launcher-1240-thread-2) [    ] o.a.s.c.ZkContainer Zookeeper client=127.0.0.1:60093/solr
   [junit4]   2> 193373 INFO  (jetty-launcher-1240-thread-1) [    ] o.a.s.h.c.HttpShardHandlerFactory Host whitelist initialized: WhitelistHostChecker [whitelistHosts=null, whitelistHostCheckingEnabled=true]
   [junit4]   2> 193374 INFO  (zkConnectionManagerCallback-1255-thread-1) [    ] o.a.s.c.c.ConnectionManager zkClient has connected
   [junit4]   2> 193375 WARN  (jetty-launcher-1240-thread-1) [    ] o.e.j.u.s.S.config No Client EndPointIdentificationAlgorithm configured for SslContextFactory@75e93958[provider=null,keyStore=null,trustStore=null]
   [junit4]   2> 193378 WARN  (jetty-launcher-1240-thread-1) [    ] o.e.j.u.s.S.config No Client EndPointIdentificationAlgorithm configured for SslContextFactory@71d41c1f[provider=null,keyStore=null,trustStore=null]
   [junit4]   2> 193379 INFO  (jetty-launcher-1240-thread-1) [    ] o.a.s.c.ZkContainer Zookeeper client=127.0.0.1:60093/solr
   [junit4]   2> 193381 INFO  (zkConnectionManagerCallback-1260-thread-1) [    ] o.a.s.c.c.ConnectionManager zkClient has connected
   [junit4]   2> 193383 INFO  (zkConnectionManagerCallback-1263-thread-1) [    ] o.a.s.c.c.ConnectionManager zkClient has connected
   [junit4]   2> 193384 WARN  (NIOServerCxn.Factory:0.0.0.0/0.0.0.0:0) [    ] o.a.z.s.NIOServerCnxn Unable to read additional data from client sessionid 0x10011b428c10008, likely client has closed socket
   [junit4]   2> 193393 WARN  (jetty-launcher-1240-thread-2) [n:127.0.0.1:60105_solr    ] o.a.s.c.ZkController The _default configset could not be uploaded. Please provide 'solr.default.confdir' parameter that points to a configset intended to be the default. Current 'solr.default.confdir' value: null
   [junit4]   2> 193394 INFO  (zkConnectionManagerCallback-1265-thread-1) [    ] o.a.s.c.c.ConnectionManager zkClient has connected
   [junit4]   2> 193399 WARN  (jetty-launcher-1240-thread-1) [n:127.0.0.1:60110_solr    ] o.a.s.c.ZkController The _default configset could not be uploaded. Please provide 'solr.default.confdir' parameter that points to a configset intended to be the default. Current 'solr.default.confdir' value: null
   [junit4]   2> 193403 INFO  (jetty-launcher-1240-thread-2) [n:127.0.0.1:60105_solr    ] o.a.s.c.OverseerElectionContext I am going to be the leader 127.0.0.1:60105_solr
   [junit4]   2> 193404 INFO  (jetty-launcher-1240-thread-2) [n:127.0.0.1:60105_solr    ] o.a.s.c.Overseer Overseer (id=72077059513450503-127.0.0.1:60105_solr-n_0000000000) starting
   [junit4]   2> 193404 INFO  (jetty-launcher-1240-thread-1) [n:127.0.0.1:60110_solr    ] o.a.s.c.ZkController Register node as live in ZooKeeper:/live_nodes/127.0.0.1:60110_solr
   [junit4]   2> 193408 INFO  (zkCallback-1259-thread-1) [    ] o.a.s.c.c.ZkStateReader Updated live nodes from ZooKeeper... (0) -> (1)
   [junit4]   2> 193408 INFO  (zkCallback-1264-thread-1) [    ] o.a.s.c.c.ZkStateReader Updated live nodes from ZooKeeper... (0) -> (1)
   [junit4]   2> 193437 INFO  (zkConnectionManagerCallback-1274-thread-1) [    ] o.a.s.c.c.ConnectionManager zkClient has connected
   [junit4]   2> 193438 INFO  (jetty-launcher-1240-thread-2) [n:127.0.0.1:60105_solr    ] o.a.s.c.c.ZkStateReader Updated live nodes from ZooKeeper... (0) -> (1)
   [junit4]   2> 193438 INFO  (jetty-launcher-1240-thread-2) [n:127.0.0.1:60105_solr    ] o.a.s.c.s.i.ZkClientClusterStateProvider Cluster at 127.0.0.1:60093/solr ready
   [junit4]   2> 193438 INFO  (jetty-launcher-1240-thread-2) [n:127.0.0.1:60105_solr    ] o.a.s.c.ZkController Publish node=127.0.0.1:60105_solr as DOWN
   [junit4]   2> 193442 INFO  (zkConnectionManagerCallback-1279-thread-1) [    ] o.a.s.c.c.ConnectionManager zkClient has connected
   [junit4]   2> 193443 INFO  (jetty-launcher-1240-thread-2) [n:127.0.0.1:60105_solr    ] o.a.s.c.TransientSolrCoreCacheDefault Allocating transient cache for 2147483647 transient cores
   [junit4]   2> 193443 INFO  (jetty-launcher-1240-thread-2) [n:127.0.0.1:60105_solr    ] o.a.s.c.ZkController Register node as live in ZooKeeper:/live_nodes/127.0.0.1:60105_solr
   [junit4]   2> 193443 INFO  (jetty-launcher-1240-thread-1) [n:127.0.0.1:60110_solr    ] o.a.s.c.c.ZkStateReader Updated live nodes from ZooKeeper... (0) -> (2)
   [junit4]   2> 193444 INFO  (zkCallback-1259-thread-1) [    ] o.a.s.c.c.ZkStateReader Updated live nodes from ZooKeeper... (1) -> (2)
   [junit4]   2> 193444 INFO  (zkCallback-1264-thread-1) [    ] o.a.s.c.c.ZkStateReader Updated live nodes from ZooKeeper... (1) -> (2)
   [junit4]   2> 193444 INFO  (jetty-launcher-1240-thread-1) [n:127.0.0.1:60110_solr    ] o.a.s.c.s.i.ZkClientClusterStateProvider Cluster at 127.0.0.1:60093/solr ready
   [junit4]   2> 193444 INFO  (jetty-launcher-1240-thread-1) [n:127.0.0.1:60110_solr    ] o.a.s.h.a.MetricsHistoryHandler No .system collection, keeping metrics history in memory.
   [junit4]   2> 193465 INFO  (jetty-launcher-1240-thread-1) [n:127.0.0.1:60110_solr    ] o.a.s.m.r.SolrJmxReporter JMX monitoring for 'solr_60110.solr.node' (registry 'solr.node') enabled at server: com.sun.jmx.mbeanserver.JmxMBeanServer@47798917
   [junit4]   2> 193466 INFO  (jetty-launcher-1240-thread-2) [n:127.0.0.1:60105_solr    ] o.a.s.h.a.MetricsHistoryHandler No .system collection, keeping metrics history in memory.
   [junit4]   2> 193468 INFO  (jetty-launcher-1240-thread-1) [n:127.0.0.1:60110_solr    ] o.a.s.m.r.SolrJmxReporter JMX monitoring for 'solr_60110.solr.jvm' (registry 'solr.jvm') enabled at server: com.sun.jmx.mbeanserver.JmxMBeanServer@47798917
   [junit4]   2> 193468 INFO  (jetty-launcher-1240-thread-1) [n:127.0.0.1:60110_solr    ] o.a.s.m.r.SolrJmxReporter JMX monitoring for 'solr_60110.solr.jetty' (registry 'solr.jetty') enabled at server: com.sun.jmx.mbeanserver.JmxMBeanServer@47798917
   [junit4]   2> 193468 INFO  (jetty-launcher-1240-thread-1) [n:127.0.0.1:60110_solr    ] o.a.s.c.CorePropertiesLocator Found 0 core definitions underneath C:\Users\jenkins\workspace\Lucene-Solr-master-Windows\solr\build\solr-solrj\test\J1\temp\solr.client.solrj.impl.CloudHttp2SolrClientTest_31BE8FD041ACCE-001\tempDir-001\node1\.
   [junit4]   2> 193490 INFO  (jetty-launcher-1240-thread-2) [n:127.0.0.1:60105_solr    ] o.a.s.m.r.SolrJmxReporter JMX monitoring for 'solr_60105.solr.node' (registry 'solr.node') enabled at server: com.sun.jmx.mbeanserver.JmxMBeanServer@47798917
   [junit4]   2> 193494 INFO  (jetty-launcher-1240-thread-2) [n:127.0.0.1:60105_solr    ] o.a.s.m.r.SolrJmxReporter JMX monitoring for 'solr_60105.solr.jvm' (registry 'solr.jvm') enabled at server: com.sun.jmx.mbeanserver.JmxMBeanServer@47798917
   [junit4]   2> 193494 INFO  (jetty-launcher-1240-thread-2) [n:127.0.0.1:60105_solr    ] o.a.s.m.r.SolrJmxReporter JMX monitoring for 'solr_60105.solr.jetty' (registry 'solr.jetty') enabled at server: com.sun.jmx.mbeanserver.JmxMBeanServer@47798917
   [junit4]   2> 193497 INFO  (jetty-launcher-1240-thread-2) [n:127.0.0.1:60105_solr    ] o.a.s.c.CorePropertiesLocator Found 0 core definitions underneath C:\Users\jenkins\workspace\Lucene-Solr-master-Windows\solr\build\solr-solrj\test\J1\temp\solr.client.solrj.impl.CloudHttp2SolrClientTest_31BE8FD041ACCE-001\tempDir-001\node2\.
   [junit4]   2> 193498 INFO  (zkCallback-1273-thread-1) [    ] o.a.s.c.c.ZkStateReader Updated live nodes from ZooKeeper... (1) -> (2)
   [junit4]   2> 193499 INFO  (OverseerStateUpdate-72077059513450503-127.0.0.1:60105_solr-n_0000000000) [n:127.0.0.1:60105_solr    ] o.a.s.c.Overseer Starting to work on the main queue : 127.0.0.1:60105_solr
   [junit4]   2> 193789 INFO  (jetty-launcher-1240-thread-3) [    ] o.a.s.h.c.HttpShardHandlerFactory Host whitelist initialized: WhitelistHostChecker [whitelistHosts=null, whitelistHostCheckingEnabled=true]
   [junit4]   2> 193797 WARN  (jetty-launcher-1240-thread-3) [    ] o.e.j.u.s.S.config No Client EndPointIdentificationAlgorithm configured for SslContextFactory@4da86ca3[provider=null,keyStore=null,trustStore=null]
   [junit4]   2> 193807 WARN  (jetty-launcher-1240-thread-3) [    ] o.e.j.u.s.S.config No Client EndPointIdentificationAlgorithm configured for SslContextFactory@3d7050ae[provider=null,keyStore=null,trustStore=null]
   [junit4]   2> 193807 INFO  (jetty-launcher-1240-thread-3) [    ] o.a.s.c.ZkContainer Zookeeper client=127.0.0.1:60093/solr
   [junit4]   2> 193849 INFO  (zkConnectionManagerCallback-1287-thread-1) [    ] o.a.s.c.c.ConnectionManager zkClient has connected
   [junit4]   2> 193859 INFO  (zkConnectionManagerCallback-1289-thread-1) [    ] o.a.s.c.c.ConnectionManager zkClient has connected
   [junit4]   2> 193865 WARN  (jetty-launcher-1240-thread-3) [n:127.0.0.1:60104_solr    ] o.a.s.c.ZkController The _default configset could not be uploaded. Please provide 'solr.default.confdir' parameter that points to a configset intended to be the default. Current 'solr.default.confdir' value: null
   [junit4]   2> 193867 INFO  (jetty-launcher-1240-thread-3) [n:127.0.0.1:60104_solr    ] o.a.s.c.c.ZkStateReader Updated live nodes from ZooKeeper... (0) -> (2)
   [junit4]   2> 193873 INFO  (jetty-launcher-1240-thread-3) [n:127.0.0.1:60104_solr    ] o.a.s.c.ZkController Publish node=127.0.0.1:60104_solr as DOWN
   [junit4]   2> 193875 INFO  (jetty-launcher-1240-thread-3) [n:127.0.0.1:60104_solr    ] o.a.s.c.TransientSolrCoreCacheDefault Allocating transient cache for 2147483647 transient cores
   [junit4]   2> 193875 INFO  (jetty-launcher-1240-thread-3) [n:127.0.0.1:60104_solr    ] o.a.s.c.ZkController Register node as live in ZooKeeper:/live_nodes/127.0.0.1:60104_solr
   [junit4]   2> 193878 INFO  (zkCallback-1259-thread-1) [    ] o.a.s.c.c.ZkStateReader Updated live nodes from ZooKeeper... (2) -> (3)
   [junit4]   2> 193878 INFO  (zkCallback-1264-thread-1) [    ] o.a.s.c.c.ZkStateReader Updated live nodes from ZooKeeper... (2) -> (3)
   [junit4]   2> 193878 INFO  (zkCallback-1273-thread-1) [    ] o.a.s.c.c.ZkStateReader Updated live nodes from ZooKeeper... (2) -> (3)
   [junit4]   2> 193900 INFO  (zkCallback-1278-thread-1) [    ] o.a.s.c.c.ZkStateReader Updated live nodes from ZooKeeper... (2) -> (3)
   [junit4]   2> 193900 INFO  (zkCallback-1288-thread-1) [    ] o.a.s.c.c.ZkStateReader Updated live nodes from ZooKeeper... (2) -> (3)
   [junit4]   2> 193904 INFO  (zkConnectionManagerCallback-1296-thread-1) [    ] o.a.s.c.c.ConnectionManager zkClient has connected
   [junit4]   2> 193907 INFO  (jetty-launcher-1240-thread-3) [n:127.0.0.1:60104_solr    ] o.a.s.c.c.ZkStateReader Updated live nodes from ZooKeeper... (0) -> (3)
   [junit4]   2> 193909 INFO  (jetty-launcher-1240-thread-3) [n:127.0.0.1:60104_solr    ] o.a.s.c.s.i.ZkClientClusterStateProvider Cluster at 127.0.0.1:60093/solr ready
   [junit4]   2> 193909 INFO  (jetty-launcher-1240-thread-3) [n:127.0.0.1:60104_solr    ] o.a.s.h.a.MetricsHistoryHandler No .system collection, keeping metrics history in memory.
   [junit4]   2> 193927 INFO  (jetty-launcher-1240-thread-3) [n:127.0.0.1:60104_solr    ] o.a.s.m.r.SolrJmxReporter JMX monitoring for 'solr_60104.solr.node' (registry 'solr.node') enabled at server: com.sun.jmx.mbeanserver.JmxMBeanServer@47798917
   [junit4]   2> 193932 INFO  (jetty-launcher-1240-thread-3) [n:127.0.0.1:60104_solr    ] o.a.s.m.r.SolrJmxReporter JMX monitoring for 'solr_60104.solr.jvm' (registry 'solr.jvm') enabled at server: com.sun.jmx.mbeanserver.JmxMBeanServer@47798917
   [junit4]   2> 193933 INFO  (jetty-launcher-1240-thread-3) [n:127.0.0.1:60104_solr    ] o.a.s.m.r.SolrJmxReporter JMX monitoring for 'solr_60104.solr.jetty' (registry 'solr.jetty') enabled at server: com.sun.jmx.mbeanserver.JmxMBeanServer@47798917
   [junit4]   2> 193934 INFO  (jetty-launcher-1240-thread-3) [n:127.0.0.1:60104_solr    ] o.a.s.c.CorePropertiesLocator Found 0 core definitions underneath C:\Users\jenkins\workspace\Lucene-Solr-master-Windows\solr\build\solr-solrj\test\J1\temp\solr.client.solrj.impl.CloudHttp2SolrClientTest_31BE8FD041ACCE-001\tempDir-001\node3\.
   [junit4]   2> 193970 INFO  (zkConnectionManagerCallback-1302-thread-1) [    ] o.a.s.c.c.ConnectionManager zkClient has connected
   [junit4]   2> 193974 INFO  (TEST-CloudHttp2SolrClientTest.testParallelUpdateQTime-seed#[31BE8FD041ACCE]) [    ] o.a.s.c.c.ZkStateReader Updated live nodes from ZooKeeper... (0) -> (3)
   [junit4]   2> 193974 INFO  (TEST-CloudHttp2SolrClientTest.testParallelUpdateQTime-seed#[31BE8FD041ACCE]) [    ] o.a.s.c.s.i.ZkClientClusterStateProvider Cluster at 127.0.0.1:60093/solr ready
   [junit4]   2> 193985 WARN  (TEST-CloudHttp2SolrClientTest.testParallelUpdateQTime-seed#[31BE8FD041ACCE]) [    ] o.e.j.u.s.S.config No Client EndPointIdentificationAlgorithm configured for SslContextFactory@5c1d15f3[provider=null,keyStore=null,trustStore=null]
   [junit4]   2> 194004 INFO  (qtp537851132-3435) [n:127.0.0.1:60110_solr    ] o.a.s.h.a.CollectionsHandler Invoked Collection Action :clusterstatus with params action=CLUSTERSTATUS&wt=javabin&version=2 and sendToOCPQueue=true
   [junit4]   2> 194004 INFO  (qtp537851132-3435) [n:127.0.0.1:60110_solr    ] o.a.s.s.HttpSolrCall [admin] webapp=null path=/admin/collections params={action=CLUSTERSTATUS&wt=javabin&version=2} status=0 QTime=1
   [junit4]   2> 194015 WARN  (TEST-CloudHttp2SolrClientTest.testParallelUpdateQTime-seed#[31BE8FD041ACCE]) [    ] o.e.j.u.s.S.config No Client EndPointIdentificationAlgorithm configured for SslContextFactory@657d992e[provider=null,keyStore=null,trustStore=null]
   [junit4]   2> 194023 WARN  (TEST-CloudHttp2SolrClientTest.testParallelUpdateQTime-seed#[31BE8FD041ACCE]) [    ] o.e.j.u.s.S.config No Client EndPointIdentificationAlgorithm configured for SslContextFactory@190b2680[provider=null,keyStore=null,trustStore=null]
   [junit4]   2> 194024 INFO  (qtp1369461595-3457) [n:127.0.0.1:60104_solr    ] o.a.s.h.a.CollectionsHandler Invoked Collection Action :create with params collection.configName=conf&name=collection1&nrtReplicas=1&action=CREATE&numShards=2&wt=javabin&version=2 and sendToOCPQueue=true
   [junit4]   2> 194034 INFO  (OverseerThreadFactory-984-thread-1-processing-n:127.0.0.1:60105_solr) [n:127.0.0.1:60105_solr    ] o.a.s.c.a.c.CreateCollectionCmd Create collection collection1
   [junit4]   2> 194153 INFO  (OverseerStateUpdate-72077059513450503-127.0.0.1:60105_solr-n_0000000000) [n:127.0.0.1:60105_solr    ] o.a.s.c.o.SliceMutator createReplica() {
   [junit4]   2>   "operation":"ADDREPLICA",
   [junit4]   2>   "collection":"collection1",
   [junit4]   2>   "shard":"shard1",
   [junit4]   2>   "core":"collection1_shard1_replica_n1",
   [junit4]   2>   "state":"down",
   [junit4]   2>   "base_url":"http://127.0.0.1:60105/solr",
   [junit4]   2>   "type":"NRT",
   [junit4]   2>   "waitForFinalState":"false"}
   [junit4]   2> 194154 INFO  (OverseerStateUpdate-72077059513450503-127.0.0.1:60105_solr-n_0000000000) [n:127.0.0.1:60105_solr    ] o.a.s.c.o.SliceMutator createReplica() {
   [junit4]   2>   "operation":"ADDREPLICA",
   [junit4]   2>   "collection":"collection1",
   [junit4]   2>   "shard":"shard2",
   [junit4]   2>   "core":"collection1_shard2_replica_n2",
   [junit4]   2>   "state":"down",
   [junit4]   2>   "base_url":"http://127.0.0.1:60104/solr",
   [junit4]   2>   "type":"NRT",
   [junit4]   2>   "waitForFinalState":"false"}
   [junit4]   2> 194357 INFO  (qtp1369461595-3455) [n:127.0.0.1:60104_solr    x:collection1_shard2_replica_n2] o.a.s.h.a.CoreAdminOperation core create command qt=/admin/cores&coreNodeName=core_node4&collection.configName=conf&newCollection=true&name=collection1_shard2_replica_n2&action=CREATE&numShards=2&collection=collection1&shard=shard2&wt=javabin&version=2&replicaType=NRT
   [junit4]   2> 194357 INFO  (qtp24386857-3441) [n:127.0.0.1:60105_solr    x:collection1_shard1_replica_n1] o.a.s.h.a.CoreAdminOperation core create command qt=/admin/cores&coreNodeName=core_node3&collection.configName=conf&newCollection=true&name=collection1_shard1_replica_n1&action=CREATE&numShards=2&collection=collection1&shard=shard1&wt=javabin&version=2&replicaType=NRT
   [junit4]   2> 195369 INFO  (qtp24386857-3441) [n:127.0.0.1:60105_solr c:collection1 s:shard1 r:core_node3 x:collection1_shard1_replica_n1] o.a.s.c.SolrConfig Using Lucene MatchVersion: 9.0.0
   [junit4]   2> 195369 INFO  (qtp1369461595-3455) [n:127.0.0.1:60104_solr c:collection1 s:shard2 r:core_node4 x:collection1_shard2_replica_n2] o.a.s.c.SolrConfig Using Lucene MatchVersion: 9.0.0
   [junit4]   2> 195385 INFO  (qtp24386857-3441) [n:127.0.0.1:60105_solr c:collection1 s:shard1 r:core_node3 x:collection1_shard1_replica_n1] o.a.s.s.IndexSchema [collection1_shard1_replica_n1] Schema name=test
   [junit4]   2> 195386 INFO  (qtp1369461595-3455) [n:127.0.0.1:60104_solr c:collection1 s:shard2 r:core_node4 x:collection1_shard2_replica_n2] o.a.s.s.IndexSchema [collection1_shard2_replica_n2] Schema name=test
   [junit4]   2> 195450 WARN  (qtp24386857-3441) [n:127.0.0.1:60105_solr c:collection1 s:shard1 r:core_node3 x:collection1_shard1_replica_n1] o.a.s.s.IndexSchema Field lowerfilt1and2 is not multivalued and destination for multiple copyFields (2)
   [junit4]   2> 195450 WARN  (qtp24386857-3441) [n:127.0.0.1:60105_solr c:collection1 s:shard1 r:core_node3 x:collection1_shard1_replica_n1] o.a.s.s.IndexSchema Field text is not multivalued and destination for multiple copyFields (3)
   [junit4]   2> 195450 INFO  (qtp24386857-3441) [n:127.0.0.1:60105_solr c:collection1 s:shard1 r:core_node3 x:collection1_shard1_replica_n1] o.a.s.s.IndexSchema Loaded schema test/1.6 with uniqueid field id
   [junit4]   2> 195450 INFO  (qtp24386857-3441) [n:127.0.0.1:60105_solr c:collection1 s:shard1 r:core_node3 x:collection1_shard1_replica_n1] o.a.s.c.CoreContainer Creating SolrCore 'collection1_shard1_replica_n1' using configuration from collection collection1, trusted=true
   [junit4]   2> 195450 INFO  (qtp24386857-3441) [n:127.0.0.1:60105_solr c:collection1 s:shard1 r:core_node3 x:collection1_shard1_replica_n1] o.a.s.m.r.SolrJmxReporter JMX monitoring for 'solr_60105.solr.core.collection1.shard1.replica_n1' (registry 'solr.core.collection1.shard1.replica_n1') enabled at server: com.sun.jmx.mbeanserver.JmxMBeanServer@47798917
   [junit4]   2> 195450 INFO  (qtp24386857-3441) [n:127.0.0.1:60105_solr c:collection1 s:shard1 r:core_node3 x:collection1_shard1_replica_n1] o.a.s.c.SolrCore [[collection1_shard1_replica_n1] ] Opening new SolrCore at [C:\Users\jenkins\workspace\Lucene-Solr-master-Windows\solr\build\solr-solrj\test\J1\temp\solr.client.solrj.impl.CloudHttp2SolrClientTest_31BE8FD041ACCE-001\tempDir-001\node2\collection1_shard1_replica_n1], dataDir=[C:\Users\jenkins\workspace\Lucene-Solr-master-Windows\solr\build\solr-solrj\test\J1\temp\solr.client.solrj.impl.CloudHttp2SolrClientTest_31BE8FD041ACCE-001\tempDir-001\node2\.\collection1_shard1_replica_n1\data\]
   [junit4]   2> 195450 WARN  (qtp1369461595-3455) [n:127.0.0.1:60104_solr c:collection1 s:shard2 r:core_node4 x:collection1_shard2_replica_n2] o.a.s.s.IndexSchema Field lowerfilt1and2 is not multivalued and destination for multiple copyFields (2)
   [junit4]   2> 195450 WARN  (qtp1369461595-3455) [n:127.0.0.1:60104_solr c:collection1 s:shard2 r:core_node4 x:collection1_shard2_replica_n2] o.a.s.s.IndexSchema Field text is not multivalued and destination for multiple copyFields (3)
   [junit4]   2> 195452 INFO  (qtp1369461595-3455) [n:127.0.0.1:60104_solr c:collection1 s:shard2 r:core_node4 x:collection1_shard2_replica_n2] o.a.s.s.IndexSchema Loaded schema test/1.6 with uniqueid field id
   [junit4]   2> 195452 INFO  (qtp1369461595-3455) [n:127.0.0.1:60104_solr c:collection1 s:shard2 r:core_node4 x:collection1_shard2_replica_n2] o.a.s.c.CoreContainer Creating SolrCore 'collection1_shard2_replica_n2' using configuration from collection collection1, trusted=true
   [junit4]   2> 195453 INFO  (qtp1369461595-3455) [n:127.0.0.1:60104_solr c:collection1 s:shard2 r:core_node4 x:collection1_shard2_replica_n2] o.a.s.m.r.SolrJmxReporter JMX monitoring for 'solr_60104.solr.core.collection1.shard2.replica_n2' (registry 'solr.core.collection1.shard2.replica_n2') enabled at server: com.sun.jmx.mbeanserver.JmxMBeanServer@47798917
   [junit4]   2> 195453 INFO  (qtp1369461595-3455) [n:127.0.0.1:60104_solr c:collection1 s:shard2 r:core_node4 x:collection1_shard2_replica_n2] o.a.s.c.SolrCore [[collection1_shard2_replica_n2] ] Opening new SolrCore at [C:\Users\jenkins\workspace\Lucene-Solr-master-Windows\solr\build\solr-solrj\test\J1\temp\solr.client.solrj.impl.CloudHttp2SolrClientTest_31BE8FD041ACCE-001\tempDir-001\node3\collection1_shard2_replica_n2], dataDir=[C:\Users\jenkins\workspace\Lucene-Solr-master-Windows\solr\build\solr-solrj\test\J1\temp\solr.client.solrj.impl.CloudHttp2SolrClientTest_31BE8FD041ACCE-001\tempDir-001\node3\.\collection1_shard2_replica_n2\data\]
   [junit4]   2> 195522 INFO  (qtp24386857-3441) [n:127.0.0.1:60105_solr c:collection1 s:shard1 r:core_node3 x:collection1_shard1_replica_n1] o.a.s.u.UpdateHandler Using UpdateLog implementation: org.apache.solr.update.UpdateLog
   [junit4]   2> 195522 INFO  (qtp24386857-3441) [n:127.0.0.1:60105_solr c:collection1 s:shard1 r:core_node3 x:collection1_shard1_replica_n1] o.a.s.u.UpdateLog Initializing UpdateLog: dataDir= defaultSyncLevel=FLUSH numRecordsToKeep=100 maxNumLogsToKeep=10 numVersionBuckets=65536
   [junit4]   2> 195526 INFO  (qtp24386857-3441) [n:127.0.0.1:60105_solr c:collection1 s:shard1 r:core_node3 x:collection1_shard1_replica_n1] o.a.s.u.CommitTracker Hard AutoCommit: disabled
   [junit4]   2> 195526 INFO  (qtp24386857-3441) [n:127.0.0.1:60105_solr c:collection1 s:shard1 r:core_node3 x:collection1_shard1_replica_n1] o.a.s.u.CommitTracker Soft AutoCommit: disabled
   [junit4]   2> 195527 INFO  (qtp24386857-3441) [n:127.0.0.1:60105_solr c:collection1 s:shard1 r:core_node3 x:collection1_shard1_replica_n1] o.a.s.s.SolrIndexSearcher Opening [Searcher@51f5391f[collection1_shard1_replica_n1] main]
   [junit4]   2> 195529 INFO  (qtp24386857-3441) [n:127.0.0.1:60105_solr c:collection1 s:shard1 r:core_node3 x:collection1_shard1_replica_n1] o.a.s.r.ManagedResourceStorage Configured ZooKeeperStorageIO with znodeBase: /configs/conf
   [junit4]   2> 195529 INFO  (qtp1369461595-3455) [n:127.0.0.1:60104_solr c:collection1 s:shard2 r:core_node4 x:collection1_shard2_replica_n2] o.a.s.u.UpdateHandler Using UpdateLog implementation: org.apache.solr.update.UpdateLog
   [junit4]   2> 195529 INFO  (qtp24386857-3441) [n:127.0.0.1:60105_solr c:collection1 s:shard1 r:core_node3 x:collection1_shard1_replica_n1] o.a.s.r.ManagedResourceStorage Loaded null at path _rest_managed.json using ZooKeeperStorageIO:path=/configs/conf
   [junit4]   2> 195529 INFO  (qtp1369461595-3455) [n:127.0.0.1:60104_solr c:collection1 s:shard2 r:core_node4 x:collection1_shard2_replica_n2] o.a.s.u.UpdateLog Initializing UpdateLog: dataDir= defaultSyncLevel=FLUSH numRecordsToKeep=100 maxNumLogsToKeep=10 numVersionBuckets=65536
   [junit4]   2> 195530 INFO  (qtp24386857-3441) [n:127.0.0.1:60105_solr c:collection1 s:shard1 r:core_node3 x:collection1_shard1_replica_n1] o.a.s.h.ReplicationHandler Commits will be reserved for 10000ms.
   [junit4]   2> 195530 INFO  (qtp24386857-3441) [n:127.0.0.1:60105_solr c:collection1 s:shard1 r:core_node3 x:collection1_shard1_replica_n1] o.a.s.u.UpdateLog Could not find max version in index or recent updates, using new clock 1631033250932588544
   [junit4]   2> 195550 INFO  (qtp1369461595-3455) [n:127.0.0.1:60104_solr c:collection1 s:shard2 r:core_node4 x:collection1_shard2_replica_n2] o.a.s.u.CommitTracker Hard AutoCommit: disabled
   [junit4]   2> 195550 INFO  (qtp1369461595-3455) [n:127.0.0.1:60104_solr c:collection1 s:shard2 r:core_node4 x:collection1_shard2_replica_n2] o.a.s.u.CommitTracker Soft AutoCommit: disabled
   [junit4]   2> 195550 INFO  (searcherExecutor-992-thread-1-processing-n:127.0.0.1:60105_solr x:collection1_shard1_replica_n1 c:collection1 s:shard1 r:core_node3) [n:127.0.0.1:60105_solr c:collection1 s:shard1 r:core_node3 x:collection1_shard1_replica_n1] o.a.s.c.SolrCore [collection1_shard1_replica_n1] Registered new searcher Searcher@51f5391f[collection1_shard1_replica_n1] main{ExitableDirectoryReader(UninvertingDirectoryReader())}
   [junit4]   2> 195551 INFO  (qtp1369461595-3455) [n:127.0.0.1:60104_solr c:collection1 s:shard2 r:core_node4 x:collection1_shard2_replica_n2] o.a.s.s.SolrIndexSearcher Opening [Searcher@4e15ccbd[collection1_shard2_replica_n2] main]
   [junit4]   2> 195553 INFO  (qtp1369461595-3455) [n:127.0.0.1:60104_solr c:collection1 s:shard2 r:core_node4 x:collection1_shard2_replica_n2] o.a.s.r.ManagedResourceStorage Configured ZooKeeperStorageIO with znodeBase: /configs/conf
   [junit4]   2> 195553 INFO  (qtp1369461595-3455) [n:127.0.0.1:60104_solr c:collection1 s:shard2 r:core_node4 x:collection1_shard2_replica_n2] o.a.s.r.ManagedResourceStorage Loaded null at path _rest_managed.json using ZooKeeperStorageIO:path=/configs/conf
   [junit4]   2> 195553 INFO  (qtp1369461595-3455) [n:127.0.0.1:60104_solr c:collection1 s:shard2 r:core_node4 x:collection1_shard2_replica_n2] o.a.s.h.ReplicationHandler Commits will be reserved for 10000ms.
   [junit4]   2> 195554 INFO  (qtp1369461595-3455) [n:127.0.0.1:60104_solr c:collection1 s:shard2 r:core_node4 x:collection1_shard2_replica_n2] o.a.s.u.UpdateLog Could not find max version in index or recent updates, using new clock 1631033250957754368
   [junit4]   2> 195555 INFO  (qtp24386857-3441) [n:127.0.0.1:60105_solr c:collection1 s:shard1 r:core_node3 x:collection1_shard1_replica_n1] o.a.s.c.ZkShardTerms Successful update of terms at /collections/collection1/terms/shard1 to Terms{values={core_node3=0}, version=0}
   [junit4]   2> 195555 INFO  (qtp24386857-3441) [n:127.0.0.1:60105_solr c:collection1 s:shard1 r:core_node3 x:collection1_shard1_replica_n1] o.a.s.c.ShardLeaderElectionContextBase make sure parent is created /collections/collection1/leaders/shard1
   [junit4]   2> 195556 INFO  (searcherExecutor-993-thread-1-processing-n:127.0.0.1:60104_solr x:collection1_shard2_replica_n2 c:collection1 s:shard2 r:core_node4) [n:127.0.0.1:60104_solr c:collection1 s:shard2 r:core_node4 x:collection1_shard2_replica_n2] o.a.s.c.SolrCore [collection1_shard2_replica_n2] Registered new searcher Searcher@4e15ccbd[collection1_shard2_replica_n2] main{ExitableDirectoryReader(UninvertingDirectoryReader())}
   [junit4]   2> 195560 INFO  (qtp1369461595-3455) [n:127.0.0.1:60104_solr c:collection1 s:shard2 r:core_node4 x:collection1_shard2_replica_n2] o.a.s.c.ZkShardTerms Successful update of terms at /collections/collection1/terms/shard2 to Terms{values={core_node4=0}, version=0}
   [junit4]   2> 195561 INFO  (qtp1369461595-3455) [n:127.0.0.1:60104_solr c:collection1 s:shard2 r:core_node4 x:collection1_shard2_replica_n2] o.a.s.c.ShardLeaderElectionContextBase make sure parent is created /collections/collection1/leaders/shard2
   [junit4]   2> 195561 INFO  (qtp24386857-3441) [n:127.0.0.1:60105_solr c:collection1 s:shard1 r:core_node3 x:collection1_shard1_replica_n1] o.a.s.c.ShardLeaderElectionContext Enough replicas found to continue.
   [junit4]   2> 195561 INFO  (qtp24386857-3441) [n:127.0.0.1:60105_solr c:collection1 s:shard1 r:core_node3 x:collection1_shard1_replica_n1] o.a.s.c.ShardLeaderElectionContext I may be the new leader - try and sync
   [junit4]   2> 195561 INFO  (qtp24386857-3441) [n:127.0.0.1:60105_solr c:collection1 s:shard1 r:core_node3 x:collection1_shard1_replica_n1] o.a.s.c.SyncStrategy Sync replicas to http://127.0.0.1:60105/solr/collection1_shard1_replica_n1/
   [junit4]   2> 195561 INFO  (qtp24386857-3441) [n:127.0.0.1:60105_solr c:collection1 s:shard1 r:core_node3 x:collection1_shard1_replica_n1] o.a.s.c.SyncStrategy Sync Success - now sync replicas to me
   [junit4]   2> 195562 INFO  (qtp24386857-3441) [n:127.0.0.1:60105_solr c:collection1 s:shard1 r:core_node3 x:collection1_shard1_replica_n1] o.a.s.c.SyncStrategy http://127.0.0.1:60105/solr/collection1_shard1_replica_n1/ has no replicas
   [junit4]   2> 195562 INFO  (qtp24386857-3441) [n:127.0.0.1:60105_solr c:collection1 s:shard1 r:core_node3 x:collection1_shard1_replica_n1] o.a.s.c.ShardLeaderElectionContextBase Creating leader registration node /collections/collection1/leaders/shard1/leader after winning as /collections/collection1/leader_elect/shard1/election/72077059513450503-core_node3-n_0000000000
   [junit4]   2> 195565 INFO  (qtp24386857-3441) [n:127.0.0.1:60105_solr c:collection1 s:shard1 r:core_node3 x:collection1_shard1_replica_n1] o.a.s.c.ShardLeaderElectionContext I am the new leader: http://127.0.0.1:60105/solr/collection1_shard1_replica_n1/ shard1
   [junit4]   2> 195566 INFO  (qtp1369461595-3455) [n:127.0.0.1:60104_solr c:collection1 s:shard2 r:core_node4 x:collection1_shard2_replica_n2] o.a.s.c.ShardLeaderElectionContext Enough replicas found to continue.
   [junit4]   2> 195566 INFO  (qtp1369461595-3455) [n:127.0.0.1:60104_solr c:collection1 s:shard2 r:core_node4 x:collection1_shard2_replica_n2] o.a.s.c.ShardLeaderElectionContext I may be the new leader - try and sync
   [junit4]   2> 195566 INFO  (qtp1369461595-3455) [n:127.0.0.1:60104_solr c:collection1 s:shard2 r:core_node4 x:collection1_shard2_replica_n2] o.a.s.c.SyncStrategy Sync replicas to http://127.0.0.1:60104/solr/collection1_shard2_replica_n2/
   [junit4]   2> 195567 INFO  (qtp1369461595-3455) [n:127.0.0.1:60104_solr c:collection1 s:shard2 r:core_node4 x:collection1_shard2_replica_n2] o.a.s.c.SyncStrategy Sync Success - now sync replicas to me
   [junit4]   2> 195568 INFO  (qtp1369461595-3455) [n:127.0.0.1:60104_solr c:collection1 s:shard2 r:core_node4 x:collection1_shard2_replica_n2] o.a.s.c.SyncStrategy http://127.0.0.1:60104/solr/collection1_shard2_replica_n2/ has no replicas
   [junit4]   2> 195568 INFO  (qtp1369461595-3455) [n:127.0.0.1:60104_solr c:collection1 s:shard2 r:core_node4 x:collection1_shard2_replica_n2] o.a.s.c.ShardLeaderElectionContextBase Creating leader registration node /collections/collection1/leaders/shard2/leader after winning as /collections/collection1/leader_elect/shard2/election/72077059513450509-core_node4-n_0000000000
   [junit4]   2> 195572 INFO  (qtp1369461595-3455) [n:127.0.0.1:60104_solr c:collection1 s:shard2 r:core_node4 x:collection1_shard2_replica_n2] o.a.s.c.ShardLeaderElectionContext I am the new leader: http://127.0.0.1:60104/solr/collection1_shard2_replica_n2/ shard2
   [junit4]   2> 195677 INFO  (zkCallback-1259-thread-1) [    ] o.a.s.c.c.ZkStateReader A cluster state change: [WatchedEvent state:SyncConnected type:NodeDataChanged path:/collections/collection1/state.json] for collection [collection1] has occurred - updating... (live nodes size: [3])
   [junit4]   2> 195677 INFO  (zkCallback-1288-thread-1) [    ] o.a.s.c.c.ZkStateReader A cluster state change: [WatchedEvent state:SyncConnected type:NodeDataChanged path:/collections/collection1/state.json] for collection [collection1] has occurred - updating... (live nodes size: [3])
   [junit4]   2> 195678 INFO  (qtp1369461595-3455) [n:127.0.0.1:60104_solr c:collection1 s:shard2 r:core_node4 x:collection1_shard2_replica_n2] o.a.s.c.ZkController I am the leader, no recovery necessary
   [junit4]   2> 195678 INFO  (qtp24386857-3441) [n:127.0.0.1:60105_solr c:collection1 s:shard1 r:core_node3 x:collection1_shard1_replica_n1] o.a.s.c.ZkController I am the leader, no recovery necessary
   [junit4]   2> 195678 INFO  (zkCallback-1288-thread-2) [    ] o.a.s.c.c.ZkStateReader A cluster state change: [WatchedEvent state:SyncConnected type:NodeDataChanged path:/collections/collection1/state.json] for collection [collection1] has occurred - updating... (live nodes size: [3])
   [junit4]   2> 195678 INFO  (qtp1369461595-3455) [n:127.0.0.1:60104_solr c:collection1 s:shard2 r:core_node4 x:collection1_shard2_replica_n2] o.a.s.s.HttpSolrCall [admin] webapp=null path=/admin/cores params={qt=/admin/cores&coreNodeName=core_node4&collection.configName=conf&newCollection=true&name=collection1_shard2_replica_n2&action=CREATE&numShards=2&collection=collection1&shard=shard2&wt=javabin&version=2&replicaType=NRT} status=0 QTime=1324
   [junit4]   2> 195684 INFO  (qtp24386857-3441) [n:127.0.0.1:60105_solr c:collection1 s:shard1 r:core_node3 x:collection1_shard1_replica_n1] o.a.s.s.HttpSolrCall [admin] webapp=null path=/admin/cores params={qt=/admin/cores&coreNodeName=core_node3&collection.configName=conf&newCollection=true&name=collection1_shard1_replica_n1&action=CR

[...truncated too long message...]

tp2SolrClientTest.testNonRetryableRequests
   [junit4] OK      4.12s J1 | CloudHttp2SolrClientTest.testVersionsAreReturned
   [junit4] OK      3.90s J1 | CloudHttp2SolrClientTest.testInitializationWithSolrUrls
   [junit4] OK      6.83s J1 | CloudHttp2SolrClientTest.preferReplicaTypesTest
   [junit4] OK      3.87s J1 | CloudHttp2SolrClientTest.testRouting
   [junit4] OK      1.75s J1 | CloudHttp2SolrClientTest.customHttpClientTest
   [junit4] OK      5.07s J1 | CloudHttp2SolrClientTest.checkCollectionParameters
   [junit4] OK      2.91s J1 | CloudHttp2SolrClientTest.testWrongZkChrootTest
   [junit4] OK      7.91s J1 | CloudHttp2SolrClientTest.testRetryUpdatesWhenClusterStateIsStale
   [junit4] OK      3.95s J1 | CloudHttp2SolrClientTest.testShutdown
   [junit4] OK      4.99s J1 | CloudHttp2SolrClientTest.testOverwriteOption
   [junit4] OK      2.40s J1 | CloudHttp2SolrClientTest.testCollectionDoesntExist
   [junit4] Completed [4/5] on J1 in 78.47s, 16 tests
   [junit4]
   [junit4] Suite: org.apache.solr.client.solrj.impl.CloudHttp2SolrClientTest
   [junit4] OK      4.39s J0 | CloudHttp2SolrClientTest.testParallelUpdateQTime
   [junit4] OK      7.73s J0 | CloudHttp2SolrClientTest.preferLocalShardsTest
   [junit4] OK      3.77s J0 | CloudHttp2SolrClientTest.stateVersionParamTest
   [junit4] OK      6.36s J0 | CloudHttp2SolrClientTest.testAliasHandling
   [junit4] OK      6.09s J0 | CloudHttp2SolrClientTest.testNonRetryableRequests
   [junit4] OK      3.80s J0 | CloudHttp2SolrClientTest.testVersionsAreReturned
   [junit4] OK      3.76s J0 | CloudHttp2SolrClientTest.testInitializationWithSolrUrls
   [junit4] OK      7.46s J0 | CloudHttp2SolrClientTest.preferReplicaTypesTest
   [junit4] OK      4.40s J0 | CloudHttp2SolrClientTest.testRouting
   [junit4] OK      1.86s J0 | CloudHttp2SolrClientTest.customHttpClientTest
   [junit4] OK      4.97s J0 | CloudHttp2SolrClientTest.checkCollectionParameters
   [junit4] OK      1.96s J0 | CloudHttp2SolrClientTest.testWrongZkChrootTest
   [junit4] OK      7.46s J0 | CloudHttp2SolrClientTest.testRetryUpdatesWhenClusterStateIsStale
   [junit4] OK      4.93s J0 | CloudHttp2SolrClientTest.testShutdown
   [junit4] OK      4.78s J0 | CloudHttp2SolrClientTest.testOverwriteOption
   [junit4] OK      2.43s J0 | CloudHttp2SolrClientTest.testCollectionDoesntExist
   [junit4] Completed [5/5] on J0 in 76.39s, 16 tests
   [junit4]
   [junit4] JVM J0:     1.15 ..   281.06 =   279.91s
   [junit4] JVM J1:     1.45 ..   207.19 =   205.74s
   [junit4] Execution time total: 4 minutes 41 seconds
   [junit4] Tests summary: 5 suites, 80 tests
   [junit4] Could not remove temporary path: C:\Users\jenkins\workspace\Lucene-Solr-master-Windows\solr\build\solr-solrj\test\J1 (java.nio.file.DirectoryNotEmptyException: Remaining files: [C:\Users\jenkins\workspace\Lucene-Solr-master-Windows\solr\build\solr-solrj\test\J1\temp])
   [junit4] Could not remove temporary path: C:\Users\jenkins\workspace\Lucene-Solr-master-Windows\solr\build\solr-solrj\test\J0 (java.nio.file.DirectoryNotEmptyException: Remaining files: [C:\Users\jenkins\workspace\Lucene-Solr-master-Windows\solr\build\solr-solrj\test\J0\temp])
     [echo] 5 slowest tests:
[junit4:tophints] 102.85s | org.apache.solr.client.solrj.impl.CloudHttp2SolrClientTest
[junit4:tophints]  73.76s | org.apache.solr.client.solrj.impl.CloudSolrClientTest
[junit4:tophints]  66.00s | org.apache.solr.client.solrj.io.stream.StreamDecoratorTest
[junit4:tophints]  41.46s | org.apache.solr.common.cloud.TestCloudCollectionsListeners
[junit4:tophints]  37.55s | org.apache.solr.common.cloud.TestCollectionStateWatchers

-check-totals:
WARNING: An illegal reflective access operation has occurred
WARNING: Illegal reflective access by org.codehaus.groovy.reflection.CachedClass (file:/C:/Users/jenkins/.ivy2/cache/org.codehaus.groovy/groovy-all/jars/groovy-all-2.4.15.jar) to method java.lang.Object.finalize()
WARNING: Please consider reporting this to the maintainers of org.codehaus.groovy.reflection.CachedClass
WARNING: Use --illegal-access=warn to enable warnings of further illegal reflective access operations
WARNING: All illegal access operations will be denied in a future release

test-nocompile:

BUILD SUCCESSFUL
Total time: 4 minutes 44 seconds
[repro] Failures:
[repro]   0/5 failed: org.apache.solr.client.solrj.impl.CloudHttp2SolrClientTest
[repro]   0/5 failed: org.apache.solr.prometheus.exporter.SolrExporterIntegrationTest
[repro] Exiting with code 0

C:\Users\jenkins\workspace\Lucene-Solr-master-Windows>IF EXIST lucene\build move /y lucene\build lucene\build.repro
        1 dir(s) moved.

C:\Users\jenkins\workspace\Lucene-Solr-master-Windows>IF EXIST solr\build move /y solr\build solr\build.repro
        1 dir(s) moved.

C:\Users\jenkins\workspace\Lucene-Solr-master-Windows>IF EXIST lucene\build.orig move /y lucene\build.orig lucene\build
        1 dir(s) moved.

C:\Users\jenkins\workspace\Lucene-Solr-master-Windows>IF EXIST solr\build.orig move /y solr\build.orig solr\build
        1 dir(s) moved.

C:\Users\jenkins\workspace\Lucene-Solr-master-Windows>exit 0
Archiving artifacts
Setting ANT_1_8_2_HOME=C:\Users\jenkins\tools\hudson.tasks.Ant_AntInstallation\ANT_1.8.2
java.lang.InterruptedException: no matches found within 10000
        at hudson.FilePath$ValidateAntFileMask.hasMatch(FilePath.java:2801)
        at hudson.FilePath$ValidateAntFileMask.invoke(FilePath.java:2680)
        at hudson.FilePath$ValidateAntFileMask.invoke(FilePath.java:2661)
        at hudson.FilePath$FileCallableWrapper.call(FilePath.java:3040)
Also:   hudson.remoting.Channel$CallSiteStackTrace: Remote call to Windows VBOX
                at hudson.remoting.Channel.attachCallSiteStackTrace(Channel.java:1743)
                at hudson.remoting.UserRequest$ExceptionResponse.retrieve(UserRequest.java:357)
                at hudson.remoting.Channel.call(Channel.java:957)
                at hudson.FilePath.act(FilePath.java:1068)
                at hudson.FilePath.act(FilePath.java:1057)
                at hudson.FilePath.validateAntFileMask(FilePath.java:2659)
                at hudson.tasks.ArtifactArchiver.perform(ArtifactArchiver.java:243)
                at hudson.tasks.BuildStepCompatibilityLayer.perform(BuildStepCompatibilityLayer.java:79)
                at hudson.tasks.BuildStepMonitor$1.perform(BuildStepMonitor.java:20)
                at hudson.model.AbstractBuild$AbstractBuildExecution.perform(AbstractBuild.java:741)
                at hudson.model.AbstractBuild$AbstractBuildExecution.performAllBuildSteps(AbstractBuild.java:690)
                at hudson.model.Build$BuildExecution.post2(Build.java:186)
                at hudson.model.AbstractBuild$AbstractBuildExecution.post(AbstractBuild.java:635)
                at hudson.model.Run.execute(Run.java:1843)
                at hudson.model.FreeStyleBuild.run(FreeStyleBuild.java:43)
                at hudson.model.ResourceController.execute(ResourceController.java:97)
                at hudson.model.Executor.run(Executor.java:429)
Caused: hudson.FilePath$TunneledInterruptedException
        at hudson.FilePath$FileCallableWrapper.call(FilePath.java:3042)
        at hudson.remoting.UserRequest.perform(UserRequest.java:212)
        at hudson.remoting.UserRequest.perform(UserRequest.java:54)
        at hudson.remoting.Request$2.run(Request.java:369)
        at hudson.remoting.InterceptingExecutorService$1.call(InterceptingExecutorService.java:72)
        at java.util.concurrent.FutureTask.run(Unknown Source)
        at java.util.concurrent.ThreadPoolExecutor.runWorker(Unknown Source)
        at java.util.concurrent.ThreadPoolExecutor$Worker.run(Unknown Source)
        at java.lang.Thread.run(Unknown Source)
Caused: java.lang.InterruptedException: java.lang.InterruptedException: no matches found within 10000
        at hudson.FilePath.act(FilePath.java:1070)
        at hudson.FilePath.act(FilePath.java:1057)
        at hudson.FilePath.validateAntFileMask(FilePath.java:2659)
        at hudson.tasks.ArtifactArchiver.perform(ArtifactArchiver.java:243)
        at hudson.tasks.BuildStepCompatibilityLayer.perform(BuildStepCompatibilityLayer.java:79)
        at hudson.tasks.BuildStepMonitor$1.perform(BuildStepMonitor.java:20)
        at hudson.model.AbstractBuild$AbstractBuildExecution.perform(AbstractBuild.java:741)
        at hudson.model.AbstractBuild$AbstractBuildExecution.performAllBuildSteps(AbstractBuild.java:690)
        at hudson.model.Build$BuildExecution.post2(Build.java:186)
        at hudson.model.AbstractBuild$AbstractBuildExecution.post(AbstractBuild.java:635)
        at hudson.model.Run.execute(Run.java:1843)
        at hudson.model.FreeStyleBuild.run(FreeStyleBuild.java:43)
        at hudson.model.ResourceController.execute(ResourceController.java:97)
        at hudson.model.Executor.run(Executor.java:429)
No artifacts found that match the file pattern "**/*.events,heapdumps/**,**/*_pid*.log". Configuration error?
[WARNINGS] Parsing warnings in console log with parser Java Compiler (javac)
Setting ANT_1_8_2_HOME=C:\Users\jenkins\tools\hudson.tasks.Ant_AntInstallation\ANT_1.8.2
No credentials specified
Setting ANT_1_8_2_HOME=C:\Users\jenkins\tools\hudson.tasks.Ant_AntInstallation\ANT_1.8.2
<Git Blamer> Using GitBlamer to create author and commit information for all warnings.
<Git Blamer> GIT_COMMIT=faaee86efb01fa6e431fcb129cfb956c7d62d514, workspace=C:\Users\jenkins\workspace\Lucene-Solr-master-Windows
[WARNINGS] Computing warning deltas based on reference build #7889
Recording test results
Setting ANT_1_8_2_HOME=C:\Users\jenkins\tools\hudson.tasks.Ant_AntInstallation\ANT_1.8.2
Build step 'Publish JUnit test result report' changed build result to UNSTABLE
Email was triggered for: Unstable (Test Failures)
Sending email for trigger: Unstable (Test Failures)
Setting ANT_1_8_2_HOME=C:\Users\jenkins\tools\hudson.tasks.Ant_AntInstallation\ANT_1.8.2
Setting ANT_1_8_2_HOME=C:\Users\jenkins\tools\hudson.tasks.Ant_AntInstallation\ANT_1.8.2
Setting ANT_1_8_2_HOME=C:\Users\jenkins\tools\hudson.tasks.Ant_AntInstallation\ANT_1.8.2
Setting ANT_1_8_2_HOME=C:\Users\jenkins\tools\hudson.tasks.Ant_AntInstallation\ANT_1.8.2
Setting ANT_1_8_2_HOME=C:\Users\jenkins\tools\hudson.tasks.Ant_AntInstallation\ANT_1.8.2
Setting ANT_1_8_2_HOME=C:\Users\jenkins\tools\hudson.tasks.Ant_AntInstallation\ANT_1.8.2


---------------------------------------------------------------------
To unsubscribe, e-mail: [hidden email]
For additional commands, e-mail: [hidden email]