[JENKINS] Lucene-Solr-master-Windows (64bit/jdk1.8.0_121) - Build # 6459 - Unstable!

Previous Topic Next Topic
 
classic Classic list List threaded Threaded
4 messages Options
Reply | Threaded
Open this post in threaded view
|  
Report Content as Inappropriate

[JENKINS] Lucene-Solr-master-Windows (64bit/jdk1.8.0_121) - Build # 6459 - Unstable!

Policeman Jenkins Server-2
Build: https://jenkins.thetaphi.de/job/Lucene-Solr-master-Windows/6459/
Java: 64bit/jdk1.8.0_121 -XX:-UseCompressedOops -XX:+UseSerialGC

1 tests failed.
FAILED:  org.apache.solr.morphlines.solr.SolrMorphlineZkAvroTest.test

Error Message:
Cannot download schema.xml from ZooKeeper near: {     # String: 1     "solrUrl" : "",     # String: 1     "collection" : "collection1",     # String: 1     "zkHost" : "127.0.0.1:56768/solr",     # String: 1     "batchSize" : "1000",     # String: 1     "solrHomeDir" : "" }

Stack Trace:
org.kitesdk.morphline.api.MorphlineCompilationException: Cannot download schema.xml from ZooKeeper near: {
    # String: 1
    "solrUrl" : "",
    # String: 1
    "collection" : "collection1",
    # String: 1
    "zkHost" : "127.0.0.1:56768/solr",
    # String: 1
    "batchSize" : "1000",
    # String: 1
    "solrHomeDir" : ""
}
        at __randomizedtesting.SeedInfo.seed([5F83611FEBCF2D3D:D7D75EC5453340C5]:0)
        at org.apache.solr.morphlines.solr.SolrLocator.getIndexSchema(SolrLocator.java:148)
        at org.apache.solr.morphlines.solr.SanitizeUnknownSolrFieldsBuilder$SanitizeUnknownSolrFields.<init>(SanitizeUnknownSolrFieldsBuilder.java:70)
        at org.apache.solr.morphlines.solr.SanitizeUnknownSolrFieldsBuilder.build(SanitizeUnknownSolrFieldsBuilder.java:52)
        at org.kitesdk.morphline.base.AbstractCommand.buildCommand(AbstractCommand.java:302)
        at org.kitesdk.morphline.base.AbstractCommand.buildCommandChain(AbstractCommand.java:249)
        at org.kitesdk.morphline.stdlib.Pipe.<init>(Pipe.java:46)
        at org.kitesdk.morphline.stdlib.PipeBuilder.build(PipeBuilder.java:40)
        at org.apache.solr.morphlines.solr.AbstractSolrMorphlineZkTestBase.createMorphline(AbstractSolrMorphlineZkTestBase.java:112)
        at org.apache.solr.morphlines.solr.AbstractSolrMorphlineZkTestBase.parse(AbstractSolrMorphlineZkTestBase.java:108)
        at org.apache.solr.morphlines.solr.AbstractSolrMorphlineZkTestBase.parse(AbstractSolrMorphlineZkTestBase.java:97)
        at org.apache.solr.morphlines.solr.SolrMorphlineZkAvroTest.test(SolrMorphlineZkAvroTest.java:58)
        at sun.reflect.NativeMethodAccessorImpl.invoke0(Native Method)
        at sun.reflect.NativeMethodAccessorImpl.invoke(NativeMethodAccessorImpl.java:62)
        at sun.reflect.DelegatingMethodAccessorImpl.invoke(DelegatingMethodAccessorImpl.java:43)
        at java.lang.reflect.Method.invoke(Method.java:498)
        at com.carrotsearch.randomizedtesting.RandomizedRunner.invoke(RandomizedRunner.java:1713)
        at com.carrotsearch.randomizedtesting.RandomizedRunner$8.evaluate(RandomizedRunner.java:907)
        at com.carrotsearch.randomizedtesting.RandomizedRunner$9.evaluate(RandomizedRunner.java:943)
        at com.carrotsearch.randomizedtesting.RandomizedRunner$10.evaluate(RandomizedRunner.java:957)
        at com.carrotsearch.randomizedtesting.rules.SystemPropertiesRestoreRule$1.evaluate(SystemPropertiesRestoreRule.java:57)
        at org.apache.lucene.util.TestRuleSetupTeardownChained$1.evaluate(TestRuleSetupTeardownChained.java:49)
        at org.apache.lucene.util.AbstractBeforeAfterRule$1.evaluate(AbstractBeforeAfterRule.java:45)
        at org.apache.lucene.util.TestRuleThreadAndTestName$1.evaluate(TestRuleThreadAndTestName.java:48)
        at org.apache.lucene.util.TestRuleIgnoreAfterMaxFailures$1.evaluate(TestRuleIgnoreAfterMaxFailures.java:64)
        at org.apache.lucene.util.TestRuleMarkFailure$1.evaluate(TestRuleMarkFailure.java:47)
        at com.carrotsearch.randomizedtesting.rules.StatementAdapter.evaluate(StatementAdapter.java:36)
        at com.carrotsearch.randomizedtesting.ThreadLeakControl$StatementRunner.run(ThreadLeakControl.java:368)
        at com.carrotsearch.randomizedtesting.ThreadLeakControl.forkTimeoutingTask(ThreadLeakControl.java:817)
        at com.carrotsearch.randomizedtesting.ThreadLeakControl$3.evaluate(ThreadLeakControl.java:468)
        at com.carrotsearch.randomizedtesting.RandomizedRunner.runSingleTest(RandomizedRunner.java:916)
        at com.carrotsearch.randomizedtesting.RandomizedRunner$5.evaluate(RandomizedRunner.java:802)
        at com.carrotsearch.randomizedtesting.RandomizedRunner$6.evaluate(RandomizedRunner.java:852)
        at com.carrotsearch.randomizedtesting.RandomizedRunner$7.evaluate(RandomizedRunner.java:863)
        at com.carrotsearch.randomizedtesting.rules.StatementAdapter.evaluate(StatementAdapter.java:36)
        at com.carrotsearch.randomizedtesting.rules.SystemPropertiesRestoreRule$1.evaluate(SystemPropertiesRestoreRule.java:57)
        at org.apache.lucene.util.AbstractBeforeAfterRule$1.evaluate(AbstractBeforeAfterRule.java:45)
        at com.carrotsearch.randomizedtesting.rules.StatementAdapter.evaluate(StatementAdapter.java:36)
        at org.apache.lucene.util.TestRuleStoreClassName$1.evaluate(TestRuleStoreClassName.java:41)
        at com.carrotsearch.randomizedtesting.rules.NoShadowingOrOverridesOnMethodsRule$1.evaluate(NoShadowingOrOverridesOnMethodsRule.java:40)
        at com.carrotsearch.randomizedtesting.rules.NoShadowingOrOverridesOnMethodsRule$1.evaluate(NoShadowingOrOverridesOnMethodsRule.java:40)
        at com.carrotsearch.randomizedtesting.rules.StatementAdapter.evaluate(StatementAdapter.java:36)
        at com.carrotsearch.randomizedtesting.rules.StatementAdapter.evaluate(StatementAdapter.java:36)
        at com.carrotsearch.randomizedtesting.rules.StatementAdapter.evaluate(StatementAdapter.java:36)
        at org.apache.lucene.util.TestRuleAssertionsRequired$1.evaluate(TestRuleAssertionsRequired.java:53)
        at org.apache.lucene.util.TestRuleMarkFailure$1.evaluate(TestRuleMarkFailure.java:47)
        at org.apache.lucene.util.TestRuleIgnoreAfterMaxFailures$1.evaluate(TestRuleIgnoreAfterMaxFailures.java:64)
        at org.apache.lucene.util.TestRuleIgnoreTestSuites$1.evaluate(TestRuleIgnoreTestSuites.java:54)
        at com.carrotsearch.randomizedtesting.rules.StatementAdapter.evaluate(StatementAdapter.java:36)
        at com.carrotsearch.randomizedtesting.ThreadLeakControl$StatementRunner.run(ThreadLeakControl.java:368)
        at java.lang.Thread.run(Thread.java:745)
Caused by: java.io.FileNotFoundException: .\temp\1489902057416-0 (Access is denied)
        at java.io.FileInputStream.open0(Native Method)
        at java.io.FileInputStream.open(FileInputStream.java:195)
        at java.io.FileInputStream.<init>(FileInputStream.java:138)
        at com.google.common.io.Files$FileByteSource.openStream(Files.java:124)
        at com.google.common.io.Files$FileByteSource.openStream(Files.java:114)
        at com.google.common.io.ByteSource.copyTo(ByteSource.java:202)
        at com.google.common.io.Files.copy(Files.java:436)
        at com.google.common.io.Files.move(Files.java:651)
        at org.apache.solr.morphlines.solr.ZooKeeperDownloader.downloadConfigDir(ZooKeeperDownloader.java:120)
        at org.apache.solr.morphlines.solr.SolrLocator.getIndexSchema(SolrLocator.java:145)
        ... 49 more




Build Log:
[...truncated 23816 lines...]
   [junit4] Suite: org.apache.solr.morphlines.solr.SolrMorphlineZkAvroTest
   [junit4]   2> Creating dataDir: C:\Users\jenkins\workspace\Lucene-Solr-master-Windows\solr\build\contrib\solr-morphlines-core\test\J0\temp\solr.morphlines.solr.SolrMorphlineZkAvroTest_5F83611FEBCF2D3D-001\init-core-data-001
   [junit4]   2> 18655 WARN  (SUITE-SolrMorphlineZkAvroTest-seed#[5F83611FEBCF2D3D]-worker) [    ] o.a.s.SolrTestCaseJ4 startTrackingSearchers: numOpens=4 numCloses=4
   [junit4]   2> 18656 INFO  (SUITE-SolrMorphlineZkAvroTest-seed#[5F83611FEBCF2D3D]-worker) [    ] o.a.s.SolrTestCaseJ4 Using TrieFields
   [junit4]   2> 18664 INFO  (SUITE-SolrMorphlineZkAvroTest-seed#[5F83611FEBCF2D3D]-worker) [    ] o.a.s.SolrTestCaseJ4 Randomized ssl (true) and clientAuth (false) via: @org.apache.solr.util.RandomizeSSL(reason=, value=NaN, ssl=NaN, clientAuth=NaN)
   [junit4]   2> 18673 INFO  (SUITE-SolrMorphlineZkAvroTest-seed#[5F83611FEBCF2D3D]-worker) [    ] o.a.s.c.MiniSolrCloudCluster Starting cluster of 2 servers in C:\Users\jenkins\workspace\Lucene-Solr-master-Windows\solr\build\contrib\solr-morphlines-core\test\J0\temp\solr.morphlines.solr.SolrMorphlineZkAvroTest_5F83611FEBCF2D3D-001\tempDir-001
   [junit4]   2> 18701 INFO  (SUITE-SolrMorphlineZkAvroTest-seed#[5F83611FEBCF2D3D]-worker) [    ] o.a.s.c.ZkTestServer STARTING ZK TEST SERVER
   [junit4]   2> 18706 INFO  (Thread-2) [    ] o.a.s.c.ZkTestServer client port:0.0.0.0/0.0.0.0:0
   [junit4]   2> 18707 INFO  (Thread-2) [    ] o.a.s.c.ZkTestServer Starting server
   [junit4]   2> 18820 INFO  (Thread-2) [    ] o.a.z.s.ZooKeeperServer Server environment:zookeeper.version=3.4.6-1569965, built on 02/20/2014 09:09 GMT
   [junit4]   2> 18820 INFO  (Thread-2) [    ] o.a.z.s.ZooKeeperServer Server environment:host.name=windows-vm.local
   [junit4]   2> 18820 INFO  (Thread-2) [    ] o.a.z.s.ZooKeeperServer Server environment:java.version=1.8.0_121
   [junit4]   2> 18820 INFO  (Thread-2) [    ] o.a.z.s.ZooKeeperServer Server environment:java.vendor=Oracle Corporation
   [junit4]   2> 18820 INFO  (Thread-2) [    ] o.a.z.s.ZooKeeperServer Server environment:java.home=C:\Users\jenkins\tools\java\64bit\jdk1.8.0_121\jre
   [junit4]   2> 18820 INFO  (Thread-2) [    ] o.a.z.s.ZooKeeperServer Server environment:java.class.path=C:\Users\jenkins\workspace\Lucene-Solr-master-Windows\solr\build\contrib\solr-morphlines-core\classes\test;C:\Users\jenkins\workspace\Lucene-Solr-master-Windows\solr\build\solr-test-framework\classes\java;C:\Users\jenkins\workspace\Lucene-Solr-master-Windows\solr\test-framework\lib\junit4-ant-2.5.0.jar;C:\Users\jenkins\workspace\Lucene-Solr-master-Windows\solr\contrib\morphlines-core\src\test-files;C:\Users\jenkins\workspace\Lucene-Solr-master-Windows\lucene\build\test-framework\classes\java;C:\Users\jenkins\workspace\Lucene-Solr-master-Windows\lucene\build\codecs\classes\java;C:\Users\jenkins\workspace\Lucene-Solr-master-Windows\solr\build\solr-solrj\classes\java;C:\Users\jenkins\workspace\Lucene-Solr-master-Windows\solr\build\solr-core\classes\java;C:\Users\jenkins\workspace\Lucene-Solr-master-Windows\lucene\build\analysis\common\lucene-analyzers-common-7.0.0-SNAPSHOT.jar;C:\Users\jenkins\workspace\Lucene-Solr-master-Windows\lucene\build\analysis\kuromoji\lucene-analyzers-kuromoji-7.0.0-SNAPSHOT.jar;C:\Users\jenkins\workspace\Lucene-Solr-master-Windows\lucene\build\analysis\phonetic\lucene-analyzers-phonetic-7.0.0-SNAPSHOT.jar;C:\Users\jenkins\workspace\Lucene-Solr-master-Windows\lucene\build\codecs\lucene-codecs-7.0.0-SNAPSHOT.jar;C:\Users\jenkins\workspace\Lucene-Solr-master-Windows\lucene\build\backward-codecs\lucene-backward-codecs-7.0.0-SNAPSHOT.jar;C:\Users\jenkins\workspace\Lucene-Solr-master-Windows\lucene\build\highlighter\lucene-highlighter-7.0.0-SNAPSHOT.jar;C:\Users\jenkins\workspace\Lucene-Solr-master-Windows\lucene\build\memory\lucene-memory-7.0.0-SNAPSHOT.jar;C:\Users\jenkins\workspace\Lucene-Solr-master-Windows\lucene\build\misc\lucene-misc-7.0.0-SNAPSHOT.jar;C:\Users\jenkins\workspace\Lucene-Solr-master-Windows\lucene\build\spatial-extras\lucene-spatial-extras-7.0.0-SNAPSHOT.jar;C:\Users\jenkins\workspace\Lucene-Solr-master-Windows\lucene\build\expressions\lucene-expressions-7.0.0-SNAPSHOT.jar;C:\Users\jenkins\workspace\Lucene-Solr-master-Windows\lucene\build\suggest\lucene-suggest-7.0.0-SNAPSHOT.jar;C:\Users\jenkins\workspace\Lucene-Solr-master-Windows\lucene\build\grouping\lucene-grouping-7.0.0-SNAPSHOT.jar;C:\Users\jenkins\workspace\Lucene-Solr-master-Windows\lucene\build\queries\lucene-queries-7.0.0-SNAPSHOT.jar;C:\Users\jenkins\workspace\Lucene-Solr-master-Windows\lucene\build\queryparser\lucene-queryparser-7.0.0-SNAPSHOT.jar;C:\Users\jenkins\workspace\Lucene-Solr-master-Windows\lucene\build\join\lucene-join-7.0.0-SNAPSHOT.jar;C:\Users\jenkins\workspace\Lucene-Solr-master-Windows\lucene\build\sandbox\lucene-sandbox-7.0.0-SNAPSHOT.jar;C:\Users\jenkins\workspace\Lucene-Solr-master-Windows\lucene\build\classification\lucene-classification-7.0.0-SNAPSHOT.jar;C:\Users\jenkins\workspace\Lucene-Solr-master-Windows\solr\core\lib\antlr4-runtime-4.5.1-1.jar;C:\Users\jenkins\workspace\Lucene-Solr-master-Windows\solr\core\lib\asm-5.1.jar;C:\Users\jenkins\workspace\Lucene-Solr-master-Windows\solr\core\lib\asm-commons-5.1.jar;C:\Users\jenkins\workspace\Lucene-Solr-master-Windows\solr\core\lib\avatica-core-1.9.0.jar;C:\Users\jenkins\workspace\Lucene-Solr-master-Windows\solr\core\lib\caffeine-2.4.0.jar;C:\Users\jenkins\workspace\Lucene-Solr-master-Windows\solr\core\lib\calcite-core-1.11.0.jar;C:\Users\jenkins\workspace\Lucene-Solr-master-Windows\solr\core\lib\calcite-linq4j-1.11.0.jar;C:\Users\jenkins\workspace\Lucene-Solr-master-Windows\solr\core\lib\commons-cli-1.2.jar;C:\Users\jenkins\workspace\Lucene-Solr-master-Windows\solr\core\lib\commons-codec-1.10.jar;C:\Users\jenkins\workspace\Lucene-Solr-master-Windows\solr\core\lib\commons-collections-3.2.2.jar;C:\Users\jenkins\workspace\Lucene-Solr-master-Windows\solr\core\lib\commons-compiler-2.7.6.jar;C:\Users\jenkins\workspace\Lucene-Solr-master-Windows\solr\core\lib\commons-configuration-1.6.jar;C:\Users\jenkins\workspace\Lucene-Solr-master-Windows\solr\core\lib\commons-exec-1.3.jar;C:\Users\jenkins\workspace\Lucene-Solr-master-Windows\solr\core\lib\commons-fileupload-1.3.2.jar;C:\Users\jenkins\workspace\Lucene-Solr-master-Windows\solr\core\lib\commons-io-2.5.jar;C:\Users\jenkins\workspace\Lucene-Solr-master-Windows\solr\core\lib\commons-lang-2.6.jar;C:\Users\jenkins\workspace\Lucene-Solr-master-Windows\solr\core\lib\curator-client-2.8.0.jar;C:\Users\jenkins\workspace\Lucene-Solr-master-Windows\solr\core\lib\curator-framework-2.8.0.jar;C:\Users\jenkins\workspace\Lucene-Solr-master-Windows\solr\core\lib\curator-recipes-2.8.0.jar;C:\Users\jenkins\workspace\Lucene-Solr-master-Windows\solr\core\lib\dom4j-1.6.1.jar;C:\Users\jenkins\workspace\Lucene-Solr-master-Windows\solr\core\lib\eigenbase-properties-1.1.5.jar;C:\Users\jenkins\workspace\Lucene-Solr-master-Windows\solr\core\lib\guava-14.0.1.jar;C:\Users\jenkins\workspace\Lucene-Solr-master-Windows\solr\core\lib\hadoop-annotations-2.7.2.jar;C:\Users\jenkins\workspace\Lucene-Solr-master-Windows\solr\core\lib\hadoop-auth-2.7.2.jar;C:\Users\jenkins\workspace\Lucene-Solr-master-Windows\solr\core\lib\hadoop-common-2.7.2.jar;C:\Users\jenkins\workspace\Lucene-Solr-master-Windows\solr\core\lib\hadoop-hdfs-2.7.2.jar;C:\Users\jenkins\workspace\Lucene-Solr-master-Windows\solr\core\lib\hppc-0.7.1.jar;C:\Users\jenkins\workspace\Lucene-Solr-master-Windows\solr\core\lib\htrace-core-3.2.0-incubating.jar;C:\Users\jenkins\workspace\Lucene-Solr-master-Windows\solr\core\lib\jackson-annotations-2.5.4.jar;C:\Users\jenkins\workspace\Lucene-Solr-master-Windows\solr\core\lib\jackson-core-2.5.4.jar;C:\Users\jenkins\workspace\Lucene-Solr-master-Windows\solr\core\lib\jackson-core-asl-1.9.13.jar;C:\Users\jenkins\workspace\Lucene-Solr-master-Windows\solr\core\lib\jackson-databind-2.5.4.jar;C:\Users\jenkins\workspace\Lucene-Solr-master-Windows\solr\core\lib\jackson-dataformat-smile-2.5.4.jar;C:\Users\jenkins\workspace\Lucene-Solr-master-Windows\solr\core\lib\jackson-mapper-asl-1.9.13.jar;C:\Users\jenkins\workspace\Lucene-Solr-master-Windows\solr\core\lib\janino-2.7.6.jar;C:\Users\jenkins\workspace\Lucene-Solr-master-Windows\solr\core\lib\jcl-over-slf4j-1.7.7.jar;C:\Users\jenkins\workspace\Lucene-Solr-master-Windows\solr\core\lib\joda-time-2.2.jar;C:\Users\jenkins\workspace\Lucene-Solr-master-Windows\solr\core\lib\log4j-1.2.17.jar;C:\Users\jenkins\workspace\Lucene-Solr-master-Windows\solr\core\lib\org.restlet-2.3.0.jar;C:\Users\jenkins\workspace\Lucene-Solr-master-Windows\solr\core\lib\org.restlet.ext.servlet-2.3.0.jar;C:\Users\jenkins\workspace\Lucene-Solr-master-Windows\solr\core\lib\protobuf-java-3.1.0.jar;C:\Users\jenkins\workspace\Lucene-Solr-master-Windows\solr\core\lib\slf4j-log4j12-1.7.7.jar;C:\Users\jenkins\workspace\Lucene-Solr-master-Windows\solr\core\lib\spatial4j-0.6.jar;C:\Users\jenkins\workspace\Lucene-Solr-master-Windows\solr\core\lib\t-digest-3.1.jar;C:\Users\jenkins\workspace\Lucene-Solr-master-Windows\solr\solrj\lib\commons-io-2.5.jar;C:\Users\jenkins\workspace\Lucene-Solr-master-Windows\solr\solrj\lib\httpclient-4.4.1.jar;C:\Users\jenkins\workspace\Lucene-Solr-master-Windows\solr\solrj\lib\httpcore-4.4.1.jar;C:\Users\jenkins\workspace\Lucene-Solr-master-Windows\solr\solrj\lib\httpmime-4.4.1.jar;C:\Users\jenkins\workspace\Lucene-Solr-master-Windows\solr\solrj\lib\jcl-over-slf4j-1.7.7.jar;C:\Users\jenkins\workspace\Lucene-Solr-master-Windows\solr\solrj\lib\noggit-0.6.jar;C:\Users\jenkins\workspace\Lucene-Solr-master-Windows\solr\solrj\lib\slf4j-api-1.7.7.jar;C:\Users\jenkins\workspace\Lucene-Solr-master-Windows\solr\solrj\lib\stax2-api-3.1.4.jar;C:\Users\jenkins\workspace\Lucene-Solr-master-Windows\solr\solrj\lib\woodstox-core-asl-4.4.1.jar;C:\Users\jenkins\workspace\Lucene-Solr-master-Windows\solr\solrj\lib\zookeeper-3.4.6.jar;C:\Users\jenkins\workspace\Lucene-Solr-master-Windows\solr\server\lib\gmetric4j-1.0.7.jar;C:\Users\jenkins\workspace\Lucene-Solr-master-Windows\solr\server\lib\javax.servlet-api-3.1.0.jar;C:\Users\jenkins\workspace\Lucene-Solr-master-Windows\solr\server\lib\jetty-continuation-9.3.14.v20161028.jar;C:\Users\jenkins\workspace\Lucene-Solr-master-Windows\solr\server\lib\jetty-deploy-9.3.14.v20161028.jar;C:\Users\jenkins\workspace\Lucene-Solr-master-Windows\solr\server\lib\jetty-http-9.3.14.v20161028.jar;C:\Users\jenkins\workspace\Lucene-Solr-master-Windows\solr\server\lib\jetty-io-9.3.14.v20161028.jar;C:\Users\jenkins\workspace\Lucene-Solr-master-Windows\solr\server\lib\jetty-jmx-9.3.14.v20161028.jar;C:\Users\jenkins\workspace\Lucene-Solr-master-Windows\solr\server\lib\jetty-rewrite-9.3.14.v20161028.jar;C:\Users\jenkins\workspace\Lucene-Solr-master-Windows\solr\server\lib\jetty-security-9.3.14.v20161028.jar;C:\Users\jenkins\workspace\Lucene-Solr-master-Windows\solr\server\lib\jetty-server-9.3.14.v20161028.jar;C:\Users\jenkins\workspace\Lucene-Solr-master-Windows\solr\server\lib\jetty-servlet-9.3.14.v20161028.jar;C:\Users\jenkins\workspace\Lucene-Solr-master-Windows\solr\server\lib\jetty-servlets-9.3.14.v20161028.jar;C:\Users\jenkins\workspace\Lucene-Solr-master-Windows\solr\server\lib\jetty-util-9.3.14.v20161028.jar;C:\Users\jenkins\workspace\Lucene-Solr-master-Windows\solr\server\lib\jetty-webapp-9.3.14.v20161028.jar;C:\Users\jenkins\workspace\Lucene-Solr-master-Windows\solr\server\lib\jetty-xml-9.3.14.v20161028.jar;C:\Users\jenkins\workspace\Lucene-Solr-master-Windows\solr\server\lib\metrics-core-3.1.2.jar;C:\Users\jenkins\workspace\Lucene-Solr-master-Windows\solr\server\lib\metrics-ganglia-3.1.2.jar;C:\Users\jenkins\workspace\Lucene-Solr-master-Windows\solr\server\lib\metrics-graphite-3.1.2.jar;C:\Users\jenkins\workspace\Lucene-Solr-master-Windows\solr\server\lib\metrics-jetty9-3.1.2.jar;C:\Users\jenkins\workspace\Lucene-Solr-master-Windows\solr\server\lib\metrics-jvm-3.1.2.jar;C:\Users\jenkins\workspace\Lucene-Solr-master-Windows\solr\example\example-DIH\solr\db\lib\derby-10.9.1.0.jar;C:\Users\jenkins\workspace\Lucene-Solr-master-Windows\solr\example\example-DIH\solr\db\lib\hsqldb-1.8.0.10.jar;C:\Users\jenkins\workspace\Lucene-Solr-master-Windows\solr\contrib\morphlines-core\lib\config-1.0.2.jar;C:\Users\jenkins\workspace\Lucene-Solr-master-Windows\solr\contrib\morphlines-core\lib\kite-morphlines-avro-1.1.0.jar;C:\Users\jenkins\workspace\Lucene-Solr-master-Windows\solr\contrib\morphlines-core\lib\kite-morphlines-core-1.1.0.jar;C:\Users\jenkins\workspace\Lucene-Solr-master-Windows\solr\contrib\morphlines-core\lib\metrics-core-3.1.2.jar;C:\Users\jenkins\workspace\Lucene-Solr-master-Windows\solr\contrib\morphlines-core\lib\metrics-healthchecks-3.1.2.jar;C:\Users\jenkins\workspace\Lucene-Solr-master-Windows\lucene\build\core\classes\java;C:\Users\jenkins\workspace\Lucene-Solr-master-Windows\solr\build\contrib\solr-cell\classes\java;C:\Users\jenkins\workspace\Lucene-Solr-master-Windows\solr\contrib\extraction\lib\apache-mime4j-core-0.7.2.jar;C:\Users\jenkins\workspace\Lucene-Solr-master-Windows\solr\contrib\extraction\lib\apache-mime4j-dom-0.7.2.jar;C:\Users\jenkins\workspace\Lucene-Solr-master-Windows\solr\contrib\extraction\lib\aspectjrt-1.8.0.jar;C:\Users\jenkins\workspace\Lucene-Solr-master-Windows\solr\contrib\extraction\lib\bcmail-jdk15-1.45.jar;C:\Users\jenkins\workspace\Lucene-Solr-master-Windows\solr\contrib\extraction\lib\bcprov-jdk15-1.45.jar;C:\Users\jenkins\workspace\Lucene-Solr-master-Windows\solr\contrib\extraction\lib\boilerpipe-1.1.0.jar;C:\Users\jenkins\workspace\Lucene-Solr-master-Windows\solr\contrib\extraction\lib\commons-compress-1.11.jar;C:\Users\jenkins\workspace\Lucene-Solr-master-Windows\solr\contrib\extraction\lib\fontbox-2.0.1.jar;C:\Users\jenkins\workspace\Lucene-Solr-master-Windows\solr\contrib\extraction\lib\icu4j-56.1.jar;C:\Users\jenkins\workspace\Lucene-Solr-master-Windows\solr\contrib\extraction\lib\isoparser-1.1.18.jar;C:\Users\jenkins\workspace\Lucene-Solr-master-Windows\solr\contrib\extraction\lib\jackcess-2.1.3.jar;C:\Users\jenkins\workspace\Lucene-Solr-master-Windows\solr\contrib\extraction\lib\java-libpst-0.8.1.jar;C:\Users\jenkins\workspace\Lucene-Solr-master-Windows\solr\contrib\extraction\lib\jdom-1.0.jar;C:\Users\jenkins\workspace\Lucene-Solr-master-Windows\solr\contrib\extraction\lib\jempbox-1.8.12.jar;C:\Users\jenkins\workspace\Lucene-Solr-master-Windows\solr\contrib\extraction\lib\jmatio-1.0.jar;C:\Users\jenkins\workspace\Lucene-Solr-master-Windows\solr\contrib\extraction\lib\juniversalchardet-1.0.3.jar;C:\Users\jenkins\workspace\Lucene-Solr-master-Windows\solr\contrib\extraction\lib\metadata-extractor-2.8.1.jar;C:\Users\jenkins\workspace\Lucene-Solr-master-Windows\solr\contrib\extraction\lib\pdfbox-2.0.1.jar;C:\Users\jenkins\workspace\Lucene-Solr-master-Windows\solr\contrib\extraction\lib\pdfbox-tools-2.0.1.jar;C:\Users\jenkins\workspace\Lucene-Solr-master-Windows\solr\contrib\extraction\lib\poi-3.15-beta1.jar;C:\Users\jenkins\workspace\Lucene-Solr-master-Windows\solr\contrib\extraction\lib\poi-ooxml-3.15-beta1.jar;C:\Users\jenkins\workspace\Lucene-Solr-master-Windows\solr\contrib\extraction\lib\poi-ooxml-schemas-3.15-beta1.jar;C:\Users\jenkins\workspace\Lucene-Solr-master-Windows\solr\contrib\extraction\lib\poi-scratchpad-3.15-beta1.jar;C:\Users\jenkins\workspace\Lucene-Solr-master-Windows\solr\contrib\extraction\lib\rome-1.0.jar;C:\Users\jenkins\workspace\Lucene-Solr-master-Windows\solr\contrib\extraction\lib\tagsoup-1.2.1.jar;C:\Users\jenkins\workspace\Lucene-Solr-master-Windows\solr\contrib\extraction\lib\tika-core-1.13.jar;C:\Users\jenkins\workspace\Lucene-Solr-master-Windows\solr\contrib\extraction\lib\tika-java7-1.13.jar;C:\Users\jenkins\workspace\Lucene-Solr-master-Windows\solr\contrib\extraction\lib\tika-parsers-1.13.jar;C:\Users\jenkins\workspace\Lucene-Solr-master-Windows\solr\contrib\extraction\lib\tika-xmp-1.13.jar;C:\Users\jenkins\workspace\Lucene-Solr-master-Windows\solr\contrib\extraction\lib\vorbis-java-core-0.8.jar;C:\Users\jenkins\workspace\Lucene-Solr-master-Windows\solr\contrib\extraction\lib\vorbis-java-tika-0.8.jar;C:\Users\jenkins\workspace\Lucene-Solr-master-Windows\solr\contrib\extraction\lib\xercesImpl-2.9.1.jar;C:\Users\jenkins\workspace\Lucene-Solr-master-Windows\solr\contrib\extraction\lib\xmlbeans-2.6.0.jar;C:\Users\jenkins\workspace\Lucene-Solr-master-Windows\solr\contrib\extraction\lib\xmpcore-5.1.2.jar;C:\Users\jenkins\workspace\Lucene-Solr-master-Windows\solr\contrib\extraction\lib\xz-1.5.jar;C:\Users\jenkins\workspace\Lucene-Solr-master-Windows\lucene\test-framework\lib\junit-4.10.jar;C:\Users\jenkins\workspace\Lucene-Solr-master-Windows\lucene\test-framework\lib\randomizedtesting-runner-2.5.0.jar;C:\Users\jenkins\workspace\Lucene-Solr-master-Windows\solr\build\contrib\solr-morphlines-core\classes\java;C:\Users\jenkins\workspace\Lucene-Solr-master-Windows\solr\contrib\morphlines-core\test-lib\aopalliance-1.0.jar;C:\Users\jenkins\workspace\Lucene-Solr-master-Windows\solr\contrib\morphlines-core\test-lib\avro-1.7.5.jar;C:\Users\jenkins\workspace\Lucene-Solr-master-Windows\solr\contrib\morphlines-core\test-lib\byte-buddy-1.6.2.jar;C:\Users\jenkins\workspace\Lucene-Solr-master-Windows\solr\contrib\morphlines-core\test-lib\commons-collections-3.2.2.jar;C:\Users\jenkins\workspace\Lucene-Solr-master-Windows\solr\contrib\morphlines-core\test-lib\curator-client-2.8.0.jar;C:\Users\jenkins\workspace\Lucene-Solr-master-Windows\solr\contrib\morphlines-core\test-lib\curator-framework-2.8.0.jar;C:\Users\jenkins\workspace\Lucene-Solr-master-Windows\solr\contrib\morphlines-core\test-lib\guice-3.0.jar;C:\Users\jenkins\workspace\Lucene-Solr-master-Windows\solr\contrib\morphlines-core\test-lib\guice-servlet-3.0.jar;C:\Users\jenkins\workspace\Lucene-Solr-master-Windows\solr\contrib\morphlines-core\test-lib\hadoop-common-2.7.2-tests.jar;C:\Users\jenkins\workspace\Lucene-Solr-master-Windows\solr\contrib\morphlines-core\test-lib\hadoop-common-2.7.2.jar;C:\Users\jenkins\workspace\Lucene-Solr-master-Windows\solr\contrib\morphlines-core\test-lib\hadoop-hdfs-2.7.2-tests.jar;C:\Users\jenkins\workspace\Lucene-Solr-master-Windows\solr\contrib\morphlines-core\test-lib\hadoop-mapreduce-client-app-2.7.2.jar;C:\Users\jenkins\workspace\Lucene-Solr-master-Windows\solr\contrib\morphlines-core\test-lib\hadoop-mapreduce-client-common-2.7.2.jar;C:\Users\jenkins\workspace\Lucene-Solr-master-Windows\solr\contrib\morphlines-core\test-lib\hadoop-mapreduce-client-core-2.7.2.jar;C:\Users\jenkins\workspace\Lucene-Solr-master-Windows\solr
   [junit4]   2> \contrib\morphlines-core\test-lib\hadoop-mapreduce-client-hs-2.7.2.jar;C:\Users\jenkins\workspace\Lucene-Solr-master-Windows\solr\contrib\morphlines-core\test-lib\hadoop-mapreduce-client-jobclient-2.7.2-tests.jar;C:\Users\jenkins\workspace\Lucene-Solr-master-Windows\solr\contrib\morphlines-core\test-lib\hadoop-mapreduce-client-jobclient-2.7.2.jar;C:\Users\jenkins\workspace\Lucene-Solr-master-Windows\solr\contrib\morphlines-core\test-lib\hadoop-mapreduce-client-shuffle-2.7.2.jar;C:\Users\jenkins\workspace\Lucene-Solr-master-Windows\solr\contrib\morphlines-core\test-lib\hadoop-yarn-api-2.7.2.jar;C:\Users\jenkins\workspace\Lucene-Solr-master-Windows\solr\contrib\morphlines-core\test-lib\hadoop-yarn-client-2.7.2.jar;C:\Users\jenkins\workspace\Lucene-Solr-master-Windows\solr\contrib\morphlines-core\test-lib\hadoop-yarn-common-2.7.2.jar;C:\Users\jenkins\workspace\Lucene-Solr-master-Windows\solr\contrib\morphlines-core\test-lib\hadoop-yarn-server-applicationhistoryservice-2.7.2.jar;C:\Users\jenkins\workspace\Lucene-Solr-master-Windows\solr\contrib\morphlines-core\test-lib\hadoop-yarn-server-common-2.7.2.jar;C:\Users\jenkins\workspace\Lucene-Solr-master-Windows\solr\contrib\morphlines-core\test-lib\hadoop-yarn-server-nodemanager-2.7.2.jar;C:\Users\jenkins\workspace\Lucene-Solr-master-Windows\solr\contrib\morphlines-core\test-lib\hadoop-yarn-server-resourcemanager-2.7.2.jar;C:\Users\jenkins\workspace\Lucene-Solr-master-Windows\solr\contrib\morphlines-core\test-lib\hadoop-yarn-server-tests-2.7.2-tests.jar;C:\Users\jenkins\workspace\Lucene-Solr-master-Windows\solr\contrib\morphlines-core\test-lib\hadoop-yarn-server-web-proxy-2.7.2.jar;C:\Users\jenkins\workspace\Lucene-Solr-master-Windows\solr\contrib\morphlines-core\test-lib\htrace-core-3.2.0-incubating.jar;C:\Users\jenkins\workspace\Lucene-Solr-master-Windows\solr\contrib\morphlines-core\test-lib\jackson-annotations-2.5.4.jar;C:\Users\jenkins\workspace\Lucene-Solr-master-Windows\solr\contrib\morphlines-core\test-lib\jackson-core-2.5.4.jar;C:\Users\jenkins\workspace\Lucene-Solr-master-Windows\solr\contrib\morphlines-core\test-lib\jackson-core-asl-1.9.13.jar;C:\Users\jenkins\workspace\Lucene-Solr-master-Windows\solr\contrib\morphlines-core\test-lib\jackson-databind-2.5.4.jar;C:\Users\jenkins\workspace\Lucene-Solr-master-Windows\solr\contrib\morphlines-core\test-lib\jackson-jaxrs-1.9.13.jar;C:\Users\jenkins\workspace\Lucene-Solr-master-Windows\solr\contrib\morphlines-core\test-lib\jackson-mapper-asl-1.9.13.jar;C:\Users\jenkins\workspace\Lucene-Solr-master-Windows\solr\contrib\morphlines-core\test-lib\javax.inject-1.jar;C:\Users\jenkins\workspace\Lucene-Solr-master-Windows\solr\contrib\morphlines-core\test-lib\jaxb-impl-2.2.3-1.jar;C:\Users\jenkins\workspace\Lucene-Solr-master-Windows\solr\contrib\morphlines-core\test-lib\jersey-bundle-1.9.jar;C:\Users\jenkins\workspace\Lucene-Solr-master-Windows\solr\contrib\morphlines-core\test-lib\jersey-core-1.9.jar;C:\Users\jenkins\workspace\Lucene-Solr-master-Windows\solr\contrib\morphlines-core\test-lib\jersey-guice-1.9.jar;C:\Users\jenkins\workspace\Lucene-Solr-master-Windows\solr\contrib\morphlines-core\test-lib\jersey-json-1.9.jar;C:\Users\jenkins\workspace\Lucene-Solr-master-Windows\solr\contrib\morphlines-core\test-lib\jersey-server-1.9.jar;C:\Users\jenkins\workspace\Lucene-Solr-master-Windows\solr\contrib\morphlines-core\test-lib\jetty-6.1.26.jar;C:\Users\jenkins\workspace\Lucene-Solr-master-Windows\solr\contrib\morphlines-core\test-lib\jetty-util-6.1.26.jar;C:\Users\jenkins\workspace\Lucene-Solr-master-Windows\solr\contrib\morphlines-core\test-lib\kite-morphlines-core-1.1.0-tests.jar;C:\Users\jenkins\workspace\Lucene-Solr-master-Windows\solr\contrib\morphlines-core\test-lib\kite-morphlines-core-1.1.0.jar;C:\Users\jenkins\workspace\Lucene-Solr-master-Windows\solr\contrib\morphlines-core\test-lib\leveldb-0.7.jar;C:\Users\jenkins\workspace\Lucene-Solr-master-Windows\solr\contrib\morphlines-core\test-lib\leveldb-api-0.7.jar;C:\Users\jenkins\workspace\Lucene-Solr-master-Windows\solr\contrib\morphlines-core\test-lib\leveldbjni-1.8.jar;C:\Users\jenkins\workspace\Lucene-Solr-master-Windows\solr\contrib\morphlines-core\test-lib\mockito-core-2.6.2.jar;C:\Users\jenkins\workspace\Lucene-Solr-master-Windows\solr\contrib\morphlines-core\test-lib\mrunit-1.0.0-hadoop2.jar;C:\Users\jenkins\workspace\Lucene-Solr-master-Windows\solr\contrib\morphlines-core\test-lib\netty-all-4.0.36.Final.jar;C:\Users\jenkins\workspace\Lucene-Solr-master-Windows\solr\contrib\morphlines-core\test-lib\objenesis-2.5.jar;C:\Users\jenkins\workspace\Lucene-Solr-master-Windows\solr\contrib\morphlines-core\test-lib\paranamer-2.3.jar;C:\Users\jenkins\workspace\Lucene-Solr-master-Windows\solr\contrib\morphlines-core\test-lib\snappy-java-1.0.5.jar;C:\Users\jenkins\tools\hudson.tasks.Ant_AntInstallation\ANT_1.8.2\lib\ant-launcher.jar;C:\Users\jenkins\.ant\lib\ivy-2.3.0.jar;C:\Users\jenkins\tools\hudson.tasks.Ant_AntInstallation\ANT_1.8.2\lib\ant-antlr.jar;C:\Users\jenkins\tools\hudson.tasks.Ant_AntInstallation\ANT_1.8.2\lib\ant-apache-bcel.jar;C:\Users\jenkins\tools\hudson.tasks.Ant_AntInstallation\ANT_1.8.2\lib\ant-apache-bsf.jar;C:\Users\jenkins\tools\hudson.tasks.Ant_AntInstallation\ANT_1.8.2\lib\ant-apache-log4j.jar;C:\Users\jenkins\tools\hudson.tasks.Ant_AntInstallation\ANT_1.8.2\lib\ant-apache-oro.jar;C:\Users\jenkins\tools\hudson.tasks.Ant_AntInstallation\ANT_1.8.2\lib\ant-apache-regexp.jar;C:\Users\jenkins\tools\hudson.tasks.Ant_AntInstallation\ANT_1.8.2\lib\ant-apache-resolver.jar;C:\Users\jenkins\tools\hudson.tasks.Ant_AntInstallation\ANT_1.8.2\lib\ant-apache-xalan2.jar;C:\Users\jenkins\tools\hudson.tasks.Ant_AntInstallation\ANT_1.8.2\lib\ant-commons-logging.jar;C:\Users\jenkins\tools\hudson.tasks.Ant_AntInstallation\ANT_1.8.2\lib\ant-commons-net.jar;C:\Users\jenkins\tools\hudson.tasks.Ant_AntInstallation\ANT_1.8.2\lib\ant-jai.jar;C:\Users\jenkins\tools\hudson.tasks.Ant_AntInstallation\ANT_1.8.2\lib\ant-javamail.jar;C:\Users\jenkins\tools\hudson.tasks.Ant_AntInstallation\ANT_1.8.2\lib\ant-jdepend.jar;C:\Users\jenkins\tools\hudson.tasks.Ant_AntInstallation\ANT_1.8.2\lib\ant-jmf.jar;C:\Users\jenkins\tools\hudson.tasks.Ant_AntInstallation\ANT_1.8.2\lib\ant-jsch.jar;C:\Users\jenkins\tools\hudson.tasks.Ant_AntInstallation\ANT_1.8.2\lib\ant-junit.jar;C:\Users\jenkins\tools\hudson.tasks.Ant_AntInstallation\ANT_1.8.2\lib\ant-junit4.jar;C:\Users\jenkins\tools\hudson.tasks.Ant_AntInstallation\ANT_1.8.2\lib\ant-netrexx.jar;C:\Users\jenkins\tools\hudson.tasks.Ant_AntInstallation\ANT_1.8.2\lib\ant-swing.jar;C:\Users\jenkins\tools\hudson.tasks.Ant_AntInstallation\ANT_1.8.2\lib\ant-testutil.jar;C:\Users\jenkins\tools\hudson.tasks.Ant_AntInstallation\ANT_1.8.2\lib\ant.jar;C:\Users\jenkins\tools\java\64bit\jdk1.8.0_121\lib\tools.jar;C:\Users\jenkins\.ivy2\cache\com.carrotsearch.randomizedtesting\junit4-ant\jars\junit4-ant-2.5.0.jar
   [junit4]   2> 18824 INFO  (Thread-2) [    ] o.a.z.s.ZooKeeperServer Server environment:java.library.path=C:\Users\jenkins\tools\java\64bit\jdk1.8.0_121\jre\bin;C:\WINDOWS\Sun\Java\bin;C:\WINDOWS\system32;C:\WINDOWS;C:\Users\jenkins\tools\java\64bit\jdk1.8.0_121\bin;C:\ProgramData\Oracle\Java\javapath;C:\Python35\Scripts\;C:\Python35\;C:\Perl64\site\bin;C:\Perl64\bin;C:\WINDOWS\system32;C:\WINDOWS;C:\WINDOWS\System32\Wbem;C:\WINDOWS\System32\WindowsPowerShell\v1.0\;C:\Users\jenkins\AppData\Local\Microsoft\WindowsApps;.
   [junit4]   2> 18824 INFO  (Thread-2) [    ] o.a.z.s.ZooKeeperServer Server environment:java.io.tmpdir=./temp
   [junit4]   2> 18824 INFO  (Thread-2) [    ] o.a.z.s.ZooKeeperServer Server environment:java.compiler=<NA>
   [junit4]   2> 18824 INFO  (Thread-2) [    ] o.a.z.s.ZooKeeperServer Server environment:os.name=Windows 10
   [junit4]   2> 18824 INFO  (Thread-2) [    ] o.a.z.s.ZooKeeperServer Server environment:os.arch=amd64
   [junit4]   2> 18824 INFO  (Thread-2) [    ] o.a.z.s.ZooKeeperServer Server environment:os.version=10.0
   [junit4]   2> 18824 INFO  (Thread-2) [    ] o.a.z.s.ZooKeeperServer Server environment:user.name=jenkins
   [junit4]   2> 18824 INFO  (Thread-2) [    ] o.a.z.s.ZooKeeperServer Server environment:user.home=C:\Users\jenkins
   [junit4]   2> 18824 INFO  (Thread-2) [    ] o.a.z.s.ZooKeeperServer Server environment:user.dir=C:\Users\jenkins\workspace\Lucene-Solr-master-Windows\solr\build\contrib\solr-morphlines-core\test\J0
   [junit4]   2> 18875 INFO  (Thread-2) [    ] o.a.z.s.ZooKeeperServer Created server with tickTime 1000 minSessionTimeout 2000 maxSessionTimeout 20000 datadir C:\Users\jenkins\workspace\Lucene-Solr-master-Windows\solr\build\contrib\solr-morphlines-core\test\J0\temp\solr.morphlines.solr.SolrMorphlineZkAvroTest_5F83611FEBCF2D3D-001\tempDir-001\zookeeper\server1\data\version-2 snapdir C:\Users\jenkins\workspace\Lucene-Solr-master-Windows\solr\build\contrib\solr-morphlines-core\test\J0\temp\solr.morphlines.solr.SolrMorphlineZkAvroTest_5F83611FEBCF2D3D-001\tempDir-001\zookeeper\server1\data\version-2
   [junit4]   2> 18881 INFO  (Thread-2) [    ] o.a.z.s.NIOServerCnxnFactory binding to port 0.0.0.0/0.0.0.0:0
   [junit4]   2> 18907 INFO  (SUITE-SolrMorphlineZkAvroTest-seed#[5F83611FEBCF2D3D]-worker) [    ] o.a.s.c.ZkTestServer start zk server on port:56768
   [junit4]   2> 19209 INFO  (SUITE-SolrMorphlineZkAvroTest-seed#[5F83611FEBCF2D3D]-worker) [    ] o.a.z.ZooKeeper Client environment:zookeeper.version=3.4.6-1569965, built on 02/20/2014 09:09 GMT
   [junit4]   2> 19209 INFO  (SUITE-SolrMorphlineZkAvroTest-seed#[5F83611FEBCF2D3D]-worker) [    ] o.a.z.ZooKeeper Client environment:host.name=windows-vm.local
   [junit4]   2> 19209 INFO  (SUITE-SolrMorphlineZkAvroTest-seed#[5F83611FEBCF2D3D]-worker) [    ] o.a.z.ZooKeeper Client environment:java.version=1.8.0_121
   [junit4]   2> 19209 INFO  (SUITE-SolrMorphlineZkAvroTest-seed#[5F83611FEBCF2D3D]-worker) [    ] o.a.z.ZooKeeper Client environment:java.vendor=Oracle Corporation
   [junit4]   2> 19209 INFO  (SUITE-SolrMorphlineZkAvroTest-seed#[5F83611FEBCF2D3D]-worker) [    ] o.a.z.ZooKeeper Client environment:java.home=C:\Users\jenkins\tools\java\64bit\jdk1.8.0_121\jre
   [junit4]   2> 19210 INFO  (SUITE-SolrMorphlineZkAvroTest-seed#[5F83611FEBCF2D3D]-worker) [    ] o.a.z.ZooKeeper Client environment:java.class.path=C:\Users\jenkins\workspace\Lucene-Solr-master-Windows\solr\build\contrib\solr-morphlines-core\classes\test;C:\Users\jenkins\workspace\Lucene-Solr-master-Windows\solr\build\solr-test-framework\classes\java;C:\Users\jenkins\workspace\Lucene-Solr-master-Windows\solr\test-framework\lib\junit4-ant-2.5.0.jar;C:\Users\jenkins\workspace\Lucene-Solr-master-Windows\solr\contrib\morphlines-core\src\test-files;C:\Users\jenkins\workspace\Lucene-Solr-master-Windows\lucene\build\test-framework\classes\java;C:\Users\jenkins\workspace\Lucene-Solr-master-Windows\lucene\build\codecs\classes\java;C:\Users\jenkins\workspace\Lucene-Solr-master-Windows\solr\build\solr-solrj\classes\java;C:\Users\jenkins\workspace\Lucene-Solr-master-Windows\solr\build\solr-core\classes\java;C:\Users\jenkins\workspace\Lucene-Solr-master-Windows\lucene\build\analysis\common\lucene-analyzers-common-7.0.0-SNAPSHOT.jar;C:\Users\jenkins\workspace\Lucene-Solr-master-Windows\lucene\build\analysis\kuromoji\lucene-analyzers-kuromoji-7.0.0-SNAPSHOT.jar;C:\Users\jenkins\workspace\Lucene-Solr-master-Windows\lucene\build\analysis\phonetic\lucene-analyzers-phonetic-7.0.0-SNAPSHOT.jar;C:\Users\jenkins\workspace\Lucene-Solr-master-Windows\lucene\build\codecs\lucene-codecs-7.0.0-SNAPSHOT.jar;C:\Users\jenkins\workspace\Lucene-Solr-master-Windows\lucene\build\backward-codecs\lucene-backward-codecs-7.0.0-SNAPSHOT.jar;C:\Users\jenkins\workspace\Lucene-Solr-master-Windows\lucene\build\highlighter\lucene-highlighter-7.0.0-SNAPSHOT.jar;C:\Users\jenkins\workspace\Lucene-Solr-master-Windows\lucene\build\memory\lucene-memory-7.0.0-SNAPSHOT.jar;C:\Users\jenkins\workspace\Lucene-Solr-master-Windows\lucene\build\misc\lucene-misc-7.0.0-SNAPSHOT.jar;C:\Users\jenkins\workspace\Lucene-Solr-master-Windows\lucene\build\spatial-extras\lucene-spatial-extras-7.0.0-SNAPSHOT.jar;C:\Users\jenkins\workspace\Lucene-Solr-master-Windows\lucene\build\expressions\lucene-expressions-7.0.0-SNAPSHOT.jar;C:\Users\jenkins\workspace\Lucene-Solr-master-Windows\lucene\build\suggest\lucene-suggest-7.0.0-SNAPSHOT.jar;C:\Users\jenkins\workspace\Lucene-Solr-master-Windows\lucene\build\grouping\lucene-grouping-7.0.0-SNAPSHOT.jar;C:\Users\jenkins\workspace\Lucene-Solr-master-Windows\lucene\build\queries\lucene-queries-7.0.0-SNAPSHOT.jar;C:\Users\jenkins\workspace\Lucene-Solr-master-Windows\lucene\build\queryparser\lucene-queryparser-7.0.0-SNAPSHOT.jar;C:\Users\jenkins\workspace\Lucene-Solr-master-Windows\lucene\build\join\lucene-join-7.0.0-SNAPSHOT.jar;C:\Users\jenkins\workspace\Lucene-Solr-master-Windows\lucene\build\sandbox\lucene-sandbox-7.0.0-SNAPSHOT.jar;C:\Users\jenkins\workspace\Lucene-Solr-master-Windows\lucene\build\classification\lucene-classification-7.0.0-SNAPSHOT.jar;C:\Users\jenkins\workspace\Lucene-Solr-master-Windows\solr\core\lib\antlr4-runtime-4.5.1-1.jar;C:\Users\jenkins\workspace\Lucene-Solr-master-Windows\solr\core\lib\asm-5.1.jar;C:\Users\jenkins\workspace\Lucene-Solr-master-Windows\solr\core\lib\asm-commons-5.1.jar;C:\Users\jenkins\workspace\Lucene-Solr-master-Windows\solr\core\lib\avatica-core-1.9.0.jar;C:\Users\jenkins\workspace\Lucene-Solr-master-Windows\solr\core\lib\caffeine-2.4.0.jar;C:\Users\jenkins\workspace\Lucene-Solr-master-Windows\solr\core\lib\calcite-core-1.11.0.jar;C:\Users\jenkins\workspace\Lucene-Solr-master-Windows\solr\core\lib\calcite-linq4j-1.11.0.jar;C:\Users\jenkins\workspace\Lucene-Solr-master-Windows\solr\core\lib\commons-cli-1.2.jar;C:\Users\jenkins\workspace\Lucene-Solr-master-Windows\solr\core\lib\commons-codec-1.10.jar;C:\Users\jenkins\workspace\Lucene-Solr-master-Windows\solr\core\lib\commons-collections-3.2.2.jar;C:\Users\jenkins\workspace\Lucene-Solr-master-Windows\solr\core\lib\commons-compiler-2.7.6.jar;C:\Users\jenkins\workspace\Lucene-Solr-master-Windows\solr\core\lib\commons-configuration-1.6.jar;C:\Users\jenkins\workspace\Lucene-Solr-master-Windows\solr\core\lib\commons-exec-1.3.jar;C:\Users\jenkins\workspace\Lucene-Solr-master-Windows\solr\core\lib\commons-fileupload-1.3.2.jar;C:\Users\jenkins\workspace\Lucene-Solr-master-Windows\solr\core\lib\commons-io-2.5.jar;C:\Users\jenkins\workspace\Lucene-Solr-master-Windows\solr\core\lib\commons-lang-2.6.jar;C:\Users\jenkins\workspace\Lucene-Solr-master-Windows\solr\core\lib\curator-client-2.8.0.jar;C:\Users\jenkins\workspace\Lucene-Solr-master-Windows\solr\core\lib\curator-framework-2.8.0.jar;C:\Users\jenkins\workspace\Lucene-Solr-master-Windows\solr\core\lib\curator-recipes-2.8.0.jar;C:\Users\jenkins\workspace\Lucene-Solr-master-Windows\solr\core\lib\dom4j-1.6.1.jar;C:\Users\jenkins\workspace\Lucene-Solr-master-Windows\solr\core\lib\eigenbase-properties-1.1.5.jar;C:\Users\jenkins\workspace\Lucene-Solr-master-Windows\solr\core\lib\guava-14.0.1.jar;C:\Users\jenkins\workspace\Lucene-Solr-master-Windows\solr\core\lib\hadoop-annotations-2.7.2.jar;C:\Users\jenkins\workspace\Lucene-Solr-master-Windows\solr\core\lib\hadoop-auth-2.7.2.jar;C:\Users\jenkins\workspace\Lucene-Solr-master-Windows\solr\core\lib\hadoop-common-2.7.2.jar;C:\Users\jenkins\workspace\Lucene-Solr-master-Windows\solr\core\lib\hadoop-hdfs-2.7.2.jar;C:\Users\jenkins\workspace\Lucene-Solr-master-Windows\solr\core\lib\hppc-0.7.1.jar;C:\Users\jenkins\workspace\Lucene-Solr-master-Windows\solr\core\lib\htrace-core-3.2.0-incubating.jar;C:\Users\jenkins\workspace\Lucene-Solr-master-Windows\solr\core\lib\jackson-annotations-2.5.4.jar;C:\Users\jenkins\workspace\Lucene-Solr-master-Windows\solr\core\lib\jackson-core-2.5.4.jar;C:\Users\jenkins\workspace\Lucene-Solr-master-Windows\solr\core\lib\jackson-core-asl-1.9.13.jar;C:\Users\jenkins\workspace\Lucene-Solr-master-Windows\solr\core\lib\jackson-databind-2.5.4.jar;C:\Users\jenkins\workspace\Lucene-Solr-master-Windows\solr\core\lib\jackson-dataformat-smile-2.5.4.jar;C:\Users\jenkins\workspace\Lucene-Solr-master-Windows\solr\core\lib\jackson-mapper-asl-1.9.13.jar;C:\Users\jenkins\workspace\Lucene-Solr-master-Windows\solr\core\lib\janino-2.7.6.jar;C:\Users\jenkins\workspace\Lucene-Solr-master-Windows\solr\core\lib\jcl-over-slf4j-1.7.7.jar;C:\Users\jenkins\workspace\Lucene-Solr-master-Windows\solr\core\lib\joda-time-2.2.jar;C:\Users\jenkins\workspace\Lucene-Solr-master-Windows\solr\core\lib\log4j-1.2.17.jar;C:\Users\jenkins\workspace\Lucene-Solr-master-Windows\solr\core\lib\org.restlet-2.3.0.jar;C:\Users\jenkins\workspace\Lucene-Solr-master-Windows\solr\core\lib\org.restlet.ext.servlet-2.3.0.jar;C:\Users\jenkins\workspace\Lucene-Solr-master-Windows\solr\core\lib\protobuf-java-3.1.0.jar;C:\Users\jenkins\workspace\Lucene-Solr-master-Windows\solr\core\lib\slf4j-log4j12-1.7.7.jar;C:\Users\jenkins\workspace\Lucene-Solr-master-Windows\solr\core\lib\spatial4j-0.6.jar;C:\Users\jenkins\workspace\Lucene-Solr-master-Windows\solr\core\lib\t-digest-3.1.jar;C:\Users\jenkins\workspace\Lucene-Solr-master-Windows\solr\solrj\lib\commons-io-2.5.jar;C:\Users\jenkins\workspace\Lucene-Solr-master-Windows\solr\solrj\lib\httpclient-4.4.1.jar;C:\Users\jenkins\workspace\Lucene-Solr-master-Windows\solr\solrj\lib\httpcore-4.4.1.jar;C:\Users\jenkins\workspace\Lucene-Solr-master-Windows\solr\solrj\lib\httpmime-4.4.1.jar;C:\Users\jenkins\workspace\Lucene-Solr-master-Windows\solr\solrj\lib\jcl-over-slf4j-1.7.7.jar;C:\Users\jenkins\workspace\Lucene-Solr-master-Windows\solr\solrj\lib\noggit-0.6.jar;C:\Users\jenkins\workspace\Lucene-Solr-master-Windows\solr\solrj\lib\slf4j-api-1.7.7.jar;C:\Users\jenkins\workspace\Lucene-Solr-master-Windows\solr\solrj\lib\stax2-api-3.1.4.jar;C:\Users\jenkins\workspace\Lucene-Solr-master-Windows\solr\solrj\lib\woodstox-core-asl-4.4.1.jar;C:\Users\jenkins\workspace\Lucene-Solr-master-Windows\solr\solrj\lib\zookeeper-3.4.6.jar;C:\Users\jenkins\workspace\Lucene-Solr-master-Windows\solr\server\lib\gmetric4j-1.0.7.jar;C:\Users\jenkins\workspace\Lucene-Solr-master-Windows\solr\server\lib\javax.servlet-api-3.1.0.jar;C:\Users\jenkins\workspace\Lucene-Solr-master-Windows\solr\server\lib\jetty-continuation-9.3.14.v20161028.jar;C:\Users\jenkins\workspace\Lucene-Solr-master-Windows\solr\server\lib\jetty-deploy-9.3.14.v20161028.jar;C:\Users\jenkins\workspace\Lucene-Solr-master-Windows\solr\server\lib\jetty-http-9.3.14.v20161028.jar;C:\Users\jenkins\workspace\Lucene-Solr-master-Windows\solr\server\lib\jetty-io-9.3.14.v20161028.jar;C:\Users\jenkins\workspace\Lucene-Solr-master-Windows\solr\server\lib\jetty-jmx-9.3.14.v20161028.jar;C:\Users\jenkins\workspace\Lucene-Solr-master-Windows\solr\server\lib\jetty-rewrite-9.3.14.v20161028.jar;C:\Users\jenkins\workspace\Lucene-Solr-master-Windows\solr\server\lib\jetty-security-9.3.14.v20161028.jar;C:\Users\jenkins\workspace\Lucene-Solr-master-Windows\solr\server\lib\jetty-server-9.3.14.v20161028.jar;C:\Users\jenkins\workspace\Lucene-Solr-master-Windows\solr\server\lib\jetty-servlet-9.3.14.v20161028.jar;C:\Users\jenkins\workspace\Lucene-Solr-master-Windows\solr\server\lib\jetty-servlets-9.3.14.v20161028.jar;C:\Users\jenkins\workspace\Lucene-Solr-master-Windows\solr\server\lib\jetty-util-9.3.14.v20161028.jar;C:\Users\jenkins\workspace\Lucene-Solr-master-Windows\solr\server\lib\jetty-webapp-9.3.14.v20161028.jar;C:\Users\jenkins\workspace\Lucene-Solr-master-Windows\solr\server\lib\jetty-xml-9.3.14.v20161028.jar;C:\Users\jenkins\workspace\Lucene-Solr-master-Windows\solr\server\lib\metrics-core-3.1.2.jar;C:\Users\jenkins\workspace\Lucene-Solr-master-Windows\solr\server\lib\metrics-ganglia-3.1.2.jar;C:\Users\jenkins\workspace\Lucene-Solr-master-Windows\solr\server\lib\metrics-graphite-3.1.2.jar;C:\Users\jenkins\workspace\Lucene-Solr-master-Windows\solr\server\lib\metrics-jetty9-3.1.2.jar;C:\Users\jenkins\workspace\Lucene-Solr-master-Windows\solr\server\lib\metrics-jvm-3.1.2.jar;C:\Users\jenkins\workspace\Lucene-Solr-master-Windows\solr\example\example-DIH\solr\db\lib\derby-10.9.1.0.jar;C:\Users\jenkins\workspace\Lucene-Solr-master-Windows\solr\example\example-DIH\solr\db\lib\hsqldb-1.8.0.10.jar;C:\Users\jenkins\workspace\Lucene-Solr-master-Windows\solr\contrib\morphlines-core\lib\config-1.0.2.jar;C:\Users\jenkins\workspace\Lucene-Solr-master-Windows\solr\contrib\morphlines-core\lib\kite-morphlines-avro-1.1.0.jar;C:\Users\jenkins\workspace\Lucene-Solr-master-Windows\solr\contrib\morphlines-core\lib\kite-morphlines-core-1.1.0.jar;C:\Users\jenkins\workspace\Lucene-Solr-master-Windows\solr\contrib\morphlines-core\lib\metrics-core-3.1.2.jar;C:\Users\jenkins\workspace\Lucene-Solr-master-Windows\solr\contrib\morphlines-core\lib\metrics-healthchecks-3.1.2.jar;C:\Users\jenkins\workspace\Lucene-Solr-master-Windows\lucene\build\core\classes\java;C:\Users\jenkins\workspace\Lucene-Solr-master-Windows\solr\build\contrib\solr-cell\classes\java;C:\Users\jenkins\workspace\Lucene-Solr-master-Windows\solr\contrib\extraction\lib\apache-mime4j-core-0.7.2.jar;C:\Users\jenkins\workspace\Lucene-Solr-master-Windows\solr\contrib\extraction\lib\apache-mime4j-dom-0.7.2.jar;C:\Users\jenkins\workspace\Lucene-Solr-master-Windows\solr\contrib\extraction\lib\aspectjrt-1.8.0.jar;C:\Users\jenkins\workspace\Lucene-Solr-master-Windows\solr\contrib\extraction\lib\bcmail-jdk15-1.45.jar;C:\Users\jenkins\workspace\Lucene-Solr-master-Windows\solr\contrib\extraction\lib\bcprov-jdk15-1.45.jar;C:\Users\jenkins\workspace\Lucene-Solr-master-Windows\solr\contrib\extraction\lib\boilerpipe-1.1.0.jar;C:\Users\jenkins\workspace\Lucene-Solr-master-Windows\solr\contrib\extraction\lib\commons-compress-1.11.jar;C:\Users\jenkins\workspace\Lucene-Solr-master-Windows\solr\contrib\extraction\lib\fontbox-2.0.1.jar;C:\Users\jenkins\workspace\Lucene-Solr-master-Windows\solr\contrib\extraction\lib\icu4j-56.1.jar;C:\Users\jenkins\workspace\Lucene-Solr-master-Windows\solr\contrib\extraction\lib\isoparser-1.1.18.jar;C:\Users\jenkins\workspace\Lucene-Solr-master-Windows\solr\contrib\extraction\lib\jackcess-2.1.3.jar;C:\Users\jenkins\workspace\Lucene-Solr-master-Windows\solr\contrib\extraction\lib\java-libpst-0.8.1.jar;C:\Users\jenkins\workspace\Lucene-Solr-master-Windows\solr\contrib\extraction\lib\jdom-1.0.jar;C:\Users\jenkins\workspace\Lucene-Solr-master-Windows\solr\contrib\extraction\lib\jempbox-1.8.12.jar;C:\Users\jenkins\workspace\Lucene-Solr-master-Windows\solr\contrib\extraction\lib\jmatio-1.0.jar;C:\Users\jenkins\workspace\Lucene-Solr-master-Windows\solr\contrib\extraction\lib\juniversalchardet-1.0.3.jar;C:\Users\jenkins\workspace\Lucene-Solr-master-Windows\solr\contrib\extraction\lib\metadata-extractor-2.8.1.jar;C:\Users\jenkins\workspace\Lucene-Solr-master-Windows\solr\contrib\extraction\lib\pdfbox-2.0.1.jar;C:\Users\jenkins\workspace\Lucene-Solr-master-Windows\solr\contrib\extraction\lib\pdfbox-tools-2.0.1.jar;C:\Users\jenkins\workspace\Lucene-Solr-master-Windows\solr\contrib\extraction\lib\poi-3.15-beta1.jar;C:\Users\jenkins\workspace\Lucene-Solr-master-Windows\solr\contrib\extraction\lib\poi-ooxml-3.15-beta1.jar;C:\Users\jenkins\workspace\Lucene-Solr-master-Windows\solr\contrib\extraction\lib\poi-ooxml-schemas-3.15-beta1.jar;C:\Users\jenkins\workspace\Lucene-Solr-master-Windows\solr\contrib\extraction\lib\poi-scratchpad-3.15-beta1.jar;C:\Users\jenkins\workspace\Lucene-Solr-master-Windows\solr\contrib\extraction\lib\rome-1.0.jar;C:\Users\jenkins\workspace\Lucene-Solr-master-Windows\solr\contrib\extraction\lib\tagsoup-1.2.1.jar;C:\Users\jenkins\workspace\Lucene-Solr-master-Windows\solr\contrib\extraction\lib\tika-core-1.13.jar;C:\Users\jenkins\workspace\Lucene-Solr-master-Windows\solr\contrib\extraction\lib\tika-java7-1.13.jar;C:\Users\jenkins\workspace\Lucene-Solr-master-Windows\solr\contrib\extraction\lib\tika-parsers-1.13.jar;C:\Users\jenkins\workspace\Lucene-Solr-master-Windows\solr\contrib\extraction\lib\tika-xmp-1.13.jar;C:\Users\jenkins\workspace\Lucene-Solr-master-Windows\solr\contrib\extraction\lib\vorbis-java-core-0.8.jar;C:\Users\jenkins\workspace\Lucene-Solr-master-Windows\solr\contrib\extraction\lib\vorbis-java-tika-0.8.jar;C:\Users\jenkins\workspace\Lucene-Solr-master-Windows\solr\contrib\extraction\lib\xercesImpl-2.9.1.jar;C:\Users\jenkins\workspace\Lucene-Solr-master-Windows\solr\contrib\extraction\lib\xmlbeans-2.6.0.jar;C:\Users\jenkins\workspace\Lucene-Solr-master-Windows\solr\contrib\extraction\lib\xmpcore-5.1.2.jar;C:\Users\jenkins\workspace\Lucene-Solr-master-Windows\solr\contrib\extraction\lib\xz-1.5.jar;C:\Users\jenkins\workspace\Lucene-Solr-master-Windows\lucene\test-framework\lib\junit-4.10.jar;C:\Users\jenkins\workspace\Lucene-Solr-master-Windows\lucene\test-framework\lib\randomizedtesting-runner-2.5.0.jar;C:\Users\jenkins\workspace\Lucene-Solr-master-Windows\solr\build\contrib\solr-morphlines-core\classes\java;C:\Users\jenkins\workspace\Lucene-Solr-master-Windows\solr\contrib\morphlines-core\test-lib\aopalliance-1.0.jar;C:\Users\jenkins\workspace\Lucene-Solr-master-Windows\solr\contrib\morphlines-core\test-lib\avro-1.7.5.jar;C:\Users\jenkins\workspace\Lucene-Solr-master-Windows\solr\contrib\morphlines-core\test-lib\byte-buddy-1.6.2.jar;C:\Users\jenkins\workspace\Lucene-Solr-master-Windows\solr\contrib\morphlines-core\test-lib\commons-collections-3.2.2.jar;C:\Users\jenkins\workspace\Lucene-Solr-master-Windows\solr\contrib\morphlines-core\test-lib\curator-client-2.8.0.jar;C:\Users\jenkins\workspace\Lucene-Solr-master-Windows\solr\contrib\morphlines-core\test-lib\curator-framework-2.8.0.jar;C:\Users\jenkins\workspace\Lucene-Solr-master-Windows\solr\contrib\morphlines-core\test-lib\guice-3.0.jar;C:\Users\jenkins\workspace\Lucene-Solr-master-Windows\solr\contrib\morphlines-core\test-lib\guice-servlet-3.0.jar;C:\Users\jenkins\workspace\Lucene-Solr-master-Windows\solr\contrib\morphlines-core\test-lib\hadoop-common-2.7.2-tests.jar;C:\Users\jenkins\workspace\Lucene-Solr-master-Windows\solr\contrib\morphlines-core\test-lib\hadoop-common-2.7.2.jar;C:\Users\jenkins\workspace\Lucene-Solr-master-Windows\solr\contrib\morphlines-core\test-lib\hadoop-hdfs-2.7.2-tests.jar;C:\Users\jenkins\workspace\Lucene-Solr-master-Windows\solr\contrib\morphlines-core\test-lib\hadoop-mapreduce-client-app-2.7.2.jar;C:\Users\jenkins\workspace\Lucene-Solr-master-Windows\solr\contrib\morphlines-core\test-lib\hadoop-mapreduce-client-common-2.7.2.jar;C:\Users\jenkins\workspace\Lucene-Solr-master-Windows\solr\contrib\morphlines-core\test-lib\hadoop-mapreduce-client-core-2.7.2.jar;C:\Users\jenki
   [junit4]   2> ns\workspace\Lucene-Solr-master-Windows\solr\contrib\morphlines-core\test-lib\hadoop-mapreduce-client-hs-2.7.2.jar;C:\Users\jenkins\workspace\Lucene-Solr-master-Windows\solr\contrib\morphlines-core\test-lib\hadoop-mapreduce-client-jobclient-2.7.2-tests.jar;C:\Users\jenkins\workspace\Lucene-Solr-master-Windows\solr\contrib\morphlines-core\test-lib\hadoop-mapreduce-client-jobclient-2.7.2.jar;C:\Users\jenkins\workspace\Lucene-Solr-master-Windows\solr\contrib\morphlines-core\test-lib\hadoop-mapreduce-client-shuffle-2.7.2.jar;C:\Users\jenkins\workspace\Lucene-Solr-master-Windows\solr\contrib\morphlines-core\test-lib\hadoop-yarn-api-2.7.2.jar;C:\Users\jenkins\workspace\Lucene-Solr-master-Windows\solr\contrib\morphlines-core\test-lib\hadoop-yarn-client-2.7.2.jar;C:\Users\jenkins\workspace\Lucene-Solr-master-Windows\solr\contrib\morphlines-core\test-lib\hadoop-yarn-common-2.7.2.jar;C:\Users\jenkins\workspace\Lucene-Solr-master-Windows\solr\contrib\morphlines-core\test-lib\hadoop-yarn-server-applicationhistoryservice-2.7.2.jar;C:\Users\jenkins\workspace\Lucene-Solr-master-Windows\solr\contrib\morphlines-core\test-lib\hadoop-yarn-server-common-2.7.2.jar;C:\Users\jenkins\workspace\Lucene-Solr-master-Windows\solr\contrib\morphlines-core\test-lib\hadoop-yarn-server-nodemanager-2.7.2.jar;C:\Users\jenkins\workspace\Lucene-Solr-master-Windows\solr\contrib\morphlines-core\test-lib\hadoop-yarn-server-resourcemanager-2.7.2.jar;C:\Users\jenkins\workspace\Lucene-Solr-master-Windows\solr\contrib\morphlines-core\test-lib\hadoop-yarn-server-tests-2.7.2-tests.jar;C:\Users\jenkins\workspace\Lucene-Solr-master-Windows\solr\contrib\morphlines-core\test-lib\hadoop-yarn-server-web-proxy-2.7.2.jar;C:\Users\jenkins\workspace\Lucene-Solr-master-Windows\solr\contrib\morphlines-core\test-lib\htrace-core-3.2.0-incubating.jar;C:\Users\jenkins\workspace\Lucene-Solr-master-Windows\solr\contrib\morphlines-core\test-lib\jackson-annotations-2.5.4.jar;C:\Users\jenkins\workspace\Lucene-Solr-master-Windows\solr\contrib\morphlines-core\test-lib\jackson-core-2.5.4.jar;C:\Users\jenkins\workspace\Lucene-Solr-master-Windows\solr\contrib\morphlines-core\test-lib\jackson-core-asl-1.9.13.jar;C:\Users\jenkins\workspace\Lucene-Solr-master-Windows\solr\contrib\morphlines-core\test-lib\jackson-databind-2.5.4.jar;C:\Users\jenkins\workspace\Lucene-Solr-master-Windows\solr\contrib\morphlines-core\test-lib\jackson-jaxrs-1.9.13.jar;C:\Users\jenkins\workspace\Lucene-Solr-master-Windows\solr\contrib\morphlines-core\test-lib\jackson-mapper-asl-1.9.13.jar;C:\Users\jenkins\workspace\Lucene-Solr-master-Windows\solr\contrib\morphlines-core\test-lib\javax.inject-1.jar;C:\Users\jenkins\workspace\Lucene-Solr-master-Windows\solr\contrib\morphlines-core\test-lib\jaxb-impl-2.2.3-1.jar;C:\Users\jenkins\workspace\Lucene-Solr-master-Windows\solr\contrib\morphlines-core\test-lib\jersey-bundle-1.9.jar;C:\Users\jenkins\workspace\Lucene-Solr-master-Windows\solr\contrib\morphlines-core\test-lib\jersey-core-1.9.jar;C:\Users\jenkins\workspace\Lucene-Solr-master-Windows\solr\contrib\morphlines-core\test-lib\jersey-guice-1.9.jar;C:\Users\jenkins\workspace\Lucene-Solr-master-Windows\solr\contrib\morphlines-core\test-lib\jersey-json-1.9.jar;C:\Users\jenkins\workspace\Lucene-Solr-master-Windows\solr\contrib\morphlines-core\test-lib\jersey-server-1.9.jar;C:\Users\jenkins\workspace\Lucene-Solr-master-Windows\solr\contrib\morphlines-core\test-lib\jetty-6.1.26.jar;C:\Users\jenkins\workspace\Lucene-Solr-master-Windows\solr\contrib\morphlines-core\test-lib\jetty-util-6.1.26.jar;C:\Users\jenkins\workspace\Lucene-Solr-master-Windows\solr\contrib\morphlines-core\test-lib\kite-morphlines-core-1.1.0-tests.jar;C:\Users\jenkins\workspace\Lucene-Solr-master-Windows\solr\contrib\morphlines-core\test-lib\kite-morphlines-core-1.1.0.jar;C:\Users\jenkins\workspace\Lucene-Solr-master-Windows\solr\contrib\morphlines-core\test-lib\leveldb-0.7.jar;C:\Users\jenkins\workspace\Lucene-Solr-master-Windows\solr\contrib\morphlines-core\test-lib\leveldb-api-0.7.jar;C:\Users\jenkins\workspace\Lucene-Solr-master-Windows\solr\contrib\morphlines-core\test-lib\leveldbjni-1.8.jar;C:\Users\jenkins\workspace\Lucene-Solr-master-Windows\solr\contrib\morphlines-core\test-lib\mockito-core-2.6.2.jar;C:\Users\jenkins\workspace\Lucene-Solr-master-Windows\solr\contrib\morphlines-core\test-lib\mrunit-1.0.0-hadoop2.jar;C:\Users\jenkins\workspace\Lucene-Solr-master-Windows\solr\contrib\morphlines-core\test-lib\netty-all-4.0.36.Final.jar;C:\Users\jenkins\workspace\Lucene-Solr-master-Windows\solr\contrib\morphlines-core\test-lib\objenesis-2.5.jar;C:\Users\jenkins\workspace\Lucene-Solr-master-Windows\solr\contrib\morphlines-core\test-lib\paranamer-2.3.jar;C:\Users\jenkins\workspace\Lucene-Solr-master-Windows\solr\contrib\morphlines-core\test-lib\snappy-java-1.0.5.jar;C:\Users\jenkins\tools\hudson.tasks.Ant_AntInstallation\ANT_1.8.2\lib\ant-launcher.jar;C:\Users\jenkins\.ant\lib\ivy-2.3.0.jar;C:\Users\jenkins\tools\hudson.tasks.Ant_AntInstallation\ANT_1.8.2\lib\ant-antlr.jar;C:\Users\jenkins\tools\hudson.tasks.Ant_AntInstallation\ANT_1.8.2\lib\ant-apache-bcel.jar;C:\Users\jenkins\tools\hudson.tasks.Ant_AntInstallation\ANT_1.8.2\lib\ant-apache-bsf.jar;C:\Users\jenkins\tools\hudson.tasks.Ant_AntInstallation\ANT_1.8.2\lib\ant-apache-log4j.jar;C:\Users\jenkins\tools\hudson.tasks.Ant_AntInstallation\ANT_1.8.2\lib\ant-apache-oro.jar;C:\Users\jenkins\tools\hudson.tasks.Ant_AntInstallation\ANT_1.8.2\lib\ant-apache-regexp.jar;C:\Users\jenkins\tools\hudson.tasks.Ant_AntInstallation\ANT_1.8.2\lib\ant-apache-resolver.jar;C:\Users\jenkins\tools\hudson.tasks.Ant_AntInstallation\ANT_1.8.2\lib\ant-apache-xalan2.jar;C:\Users\jenkins\tools\hudson.tasks.Ant_AntInstallation\ANT_1.8.2\lib\ant-commons-logging.jar;C:\Users\jenkins\tools\hudson.tasks.Ant_AntInstallation\ANT_1.8.2\lib\ant-commons-net.jar;C:\Users\jenkins\tools\hudson.tasks.Ant_AntInstallation\ANT_1.8.2\lib\ant-jai.jar;C:\Users\jenkins\tools\hudson.tasks.Ant_AntInstallation\ANT_1.8.2\lib\ant-javamail.jar;C:\Users\jenkins\tools\hudson.tasks.Ant_AntInstallation\ANT_1.8.2\lib\ant-jdepend.jar;C:\Users\jenkins\tools\hudson.tasks.Ant_AntInstallation\ANT_1.8.2\lib\ant-jmf.jar;C:\Users\jenkins\tools\hudson.tasks.Ant_AntInstallation\ANT_1.8.2\lib\ant-jsch.jar;C:\Users\jenkins\tools\hudson.tasks.Ant_AntInstallation\ANT_1.8.2\lib\ant-junit.jar;C:\Users\jenkins\tools\hudson.tasks.Ant_AntInstallation\ANT_1.8.2\lib\ant-junit4.jar;C:\Users\jenkins\tools\hudson.tasks.Ant_AntInstallation\ANT_1.8.2\lib\ant-netrexx.jar;C:\Users\jenkins\tools\hudson.tasks.Ant_AntInstallation\ANT_1.8.2\lib\ant-swing.jar;C:\Users\jenkins\tools\hudson.tasks.Ant_AntInstallation\ANT_1.8.2\lib\ant-testutil.jar;C:\Users\jenkins\tools\hudson.tasks.Ant_AntInstallation\ANT_1.8.2\lib\ant.jar;C:\Users\jenkins\tools\java\64bit\jdk1.8.0_121\lib\tools.jar;C:\Users\jenkins\.ivy2\cache\com.carrotsearch.randomizedtesting\junit4-ant\jars\junit4-ant-2.5.0.jar
   [junit4]   2> 19214 INFO  (SUITE-SolrMorphlineZkAvroTest-seed#[5F83611FEBCF2D3D]-worker) [    ] o.a.z.ZooKeeper Client environment:java.library.path=C:\Users\jenkins\tools\java\64bit\jdk1.8.0_121\jre\bin;C:\WINDOWS\Sun\Java\bin;C:\WINDOWS\system32;C:\WINDOWS;C:\Users\jenkins\tools\java\64bit\jdk1.8.0_121\bin;C:\ProgramData\Oracle\Java\javapath;C:\Python35\Scripts\;C:\Python35\;C:\Perl64\site\bin;C:\Perl64\bin;C:\WINDOWS\system32;C:\WINDOWS;C:\WINDOWS\System32\Wbem;C:\WINDOWS\System32\WindowsPowerShell\v1.0\;C:\Users\jenkins\AppData\Local\Microsoft\WindowsApps;.
   [junit4]   2> 19214 INFO  (SUITE-SolrMorphlineZkAvroTest-seed#[5F83611FEBCF2D3D]-worker) [    ] o.a.z.ZooKeeper Client environment:java.io.tmpdir=./temp
   [junit4]   2> 19214 INFO  (SUITE-SolrMorphlineZkAvroTest-seed#[5F83611FEBCF2D3D]-worker) [    ] o.a.z.ZooKeeper Client environment:java.compiler=<NA>
   [junit4]   2> 19214 INFO  (SUITE-SolrMorphlineZkAvroTest-seed#[5F83611FEBCF2D3D]-worker) [    ] o.a.z.ZooKeeper Client environment:os.name=Windows 10
   [junit4]   2> 19214 INFO  (SUITE-SolrMorphlineZkAvroTest-seed#[5F83611FEBCF2D3D]-worker) [    ] o.a.z.ZooKeeper Client environment:os.arch=amd64
   [junit4]   2> 19214 INFO  (SUITE-SolrMorphlineZkAvroTest-seed#[5F83611FEBCF2D3D]-worker) [    ] o.a.z.ZooKeeper Client environment:os.version=10.0
   [junit4]   2> 19214 INFO  (SUITE-SolrMorphlineZkAvroTest-seed#[5F83611FEBCF2D3D]-worker) [    ] o.a.z.ZooKeeper Client environment:user.name=jenkins
   [junit4]   2> 19214 INFO  (SUITE-SolrMorphlineZkAvroTest-seed#[5F83611FEBCF2D3D]-worker) [    ] o.a.z.ZooKeeper Client environment:user.home=C:\Users\jenkins
   [junit4]   2> 19214 INFO  (SUITE-SolrMorphlineZkAvroTest-seed#[5F83611FEBCF2D3D]-worker) [    ] o.a.z.ZooKeeper Client environment:user.dir=C:\Users\jenkins\workspace\Lucene-Solr-master-Windows\solr\build\contrib\solr-morphlines-core\test\J0
   [junit4]   2> 19219 INFO  (SUITE-SolrMorphlineZkAvroTest-seed#[5F83611FEBCF2D3D]-worker) [    ] o.a.z.ZooKeeper Initiating client connection, connectString=127.0.0.1:56768 sessionTimeout=45000 watcher=org.apache.solr.common.cloud.SolrZkClient$3@6c603595
   [junit4]   2> 19386 INFO  (SUITE-SolrMorphlineZkAvroTest-seed#[5F83611FEBCF2D3D]-worker-SendThread(127.0.0.1:56768)) [    ] o.a.z.ClientCnxn Opening socket connection to server 127.0.0.1/127.0.0.1:56768. Will not attempt to authenticate using SASL (unknown error)
   [junit4]   2> 19389 INFO  (NIOServerCxn.Factory:0.0.0.0/0.0.0.0:0) [    ] o.a.z.s.NIOServerCnxnFactory Accepted socket connection from /127.0.0.1:56771
   [junit4]   2> 19390 INFO  (SUITE-SolrMorphlineZkAvroTest-seed#[5F83611FEBCF2D3D]-worker-SendThread(127.0.0.1:56768)) [    ] o.a.z.ClientCnxn Socket connection established to 127.0.0.1/127.0.0.1:56768, initiating session
   [junit4]   2> 19417 WARN  (NIOServerCxn.Factory:0.0.0.0/0.0.0.0:0) [    ] o.a.z.s.NIOServerCnxn Exception causing close of session 0x0 due to java.io.IOException: ZooKeeperServer not running
   [junit4]   2> 19417 INFO  (NIOServerCxn.Factory:0.0.0.0/0.0.0.0:0) [    ] o.a.z.s.NIOServerCnxn Closed socket connection for client /127.0.0.1:56771 (no session established for client)
   [junit4]   2> 19417 INFO  (SUITE-SolrMorphlineZkAvroTest-seed#[5F83611FEBCF2D3D]-worker-SendThread(127.0.0.1:56768)) [    ] o.a.z.ClientCnxn Unable to read additional data from server sessionid 0x0, likely server has closed socket, closing socket connection and attempting reconnect
   [junit4]   2> 21108 INFO  (SUITE-SolrMorphlineZkAvroTest-seed#[5F83611FEBCF2D3D]-worker-SendThread(127.0.0.1:56768)) [    ] o.a.z.ClientCnxn Opening socket connection to server 127.0.0.1/127.0.0.1:56768. Will not attempt to authenticate using SASL (unknown error)
   [junit4]   2> 21109 INFO  (NIOServerCxn.Factory:0.0.0.0/0.0.0.0:0) [    ] o.a.z.s.NIOServerCnxnFactory Accepted socket connection from /127.0.0.1:56775
   [junit4]   2> 21109 INFO  (SUITE-SolrMorphlineZkAvroTest-seed#[5F83611FEBCF2D3D]-worker-SendThread(127.0.0.1:56768)) [    ] o.a.z.ClientCnxn Socket connection established to 127.0.0.1/127.0.0.1:56768, initiating session
   [junit4]   2> 21117 INFO  (NIOServerCxn.Factory:0.0.0.0/0.0.0.0:0) [    ] o.a.z.s.ZooKeeperServer Client attempting to establish new session at /127.0.0.1:56775
   [junit4]   2> 21133 INFO  (SyncThread:0) [    ] o.a.z.s.p.FileTxnLog Creating new log file: log.1
   [junit4]   2> 21172 INFO  (SyncThread:0) [    ] o.a.z.s.ZooKeeperServer Established session 0x15ae5150b370000 with negotiated timeout 20000 for client /127.0.0.1:56775
   [junit4]   2> 21173 INFO  (SUITE-SolrMorphlineZkAvroTest-seed#[5F83611FEBCF2D3D]-worker-SendThread(127.0.0.1:56768)) [    ] o.a.z.ClientCnxn Session establishment complete on server 127.0.0.1/127.0.0.1:56768, sessionid = 0x15ae5150b370000, negotiated timeout = 20000
   [junit4]   2> 21304 INFO  (ProcessThread(sid:0 cport:-1):) [    ] o.a.z.s.PrepRequestProcessor Processed session termination for sessionid: 0x15ae5150b370000
   [junit4]   2> 21305 INFO  (SUITE-SolrMorphlineZkAvroTest-seed#[5F83611FEBCF2D3D]-worker) [    ] o.a.z.ZooKeeper Session: 0x15ae5150b370000 closed
   [junit4]   2> 21305 INFO  (SUITE-SolrMorphlineZkAvroTest-seed#[5F83611FEBCF2D3D]-worker-EventThread) [    ] o.a.z.ClientCnxn EventThread shut down
   [junit4]   2> 21306 INFO  (NIOServerCxn.Factory:0.0.0.0/0.0.0.0:0) [    ] o.a.z.s.NIOServerCnxn Closed socket connection for client /127.0.0.1:56775 which had sessionid 0x15ae5150b370000
   [junit4]   2> 22096 INFO  (jetty-launcher-3-thread-2) [    ] o.e.j.s.Server jetty-9.3.14.v20161028
   [junit4]   2> 22096 INFO  (jetty-launcher-3-thread-1) [    ] o.e.j.s.Server jetty-9.3.14.v20161028
   [junit4]   2> 22199 INFO  (jetty-launcher-3-thread-1) [    ] o.e.j.s.h.ContextHandler Started o.e.j.s.ServletContextHandler@ccc229e{/solr,null,AVAILABLE}
   [junit4]   2> 22217 INFO  (jetty-launcher-3-thread-2) [    ] o.e.j.s.h.ContextHandler Started o.e.j.s.ServletContextHandler@741c63c3{/solr,null,AVAILABLE}
   [junit4]   2> 22294 INFO  (jetty-launcher-3-thread-1) [    ] o.e.j.s.AbstractConnector Started ServerConnector@6c8fc9be{SSL,[ssl, http/1.1]}{127.0.0.1:56779}
   [junit4]   2> 22295 INFO  (jetty-launcher-3-thread-1) [    ] o.e.j.s.Server Started @27728ms
   [junit4]   2> 22295 INFO  (jetty-launcher-3-thread-1) [    ] o.a.s.c.s.e.JettySolrRunner Jetty properties: {hostContext=/solr, hostPort=56779}
   [junit4]   2> 22298 INFO  (jetty-launcher-3-thread-2) [    ] o.e.j.s.AbstractConnector Started ServerConnector@3bff8185{SSL,[ssl, http/1.1]}{127.0.0.1:56780}
   [junit4]   2> 22298 INFO  (jetty-launcher-3-thread-2) [    ] o.e.j.s.Server Started @27732ms
   [junit4]   2> 22298 INFO  (jetty-launcher-3-thread-2) [    ] o.a.s.c.s.e.JettySolrRunner Jetty properties: {hostContext=/solr, hostPort=56780}
   [junit4]   2> 22367 ERROR (jetty-launcher-3-thread-1) [    ] o.a.s.s.StartupLoggingUtils Missing Java Option solr.log.dir. Logging may be missing or incomplete.
   [junit4]   2> 22367 ERROR (jetty-launcher-3-thread-2) [    ] o.a.s.s.StartupLoggingUtils Missing Java Option solr.log.dir. Logging may be missing or incomplete.
   [junit4]   2> 22368 INFO  (jetty-launcher-3-thread-1) [    ] o.a.s.s.SolrDispatchFilter  ___      _       Welcome to Apache Solr™ version 7.0.0
   [junit4]   2> 22368 INFO  (jetty-launcher-3-thread-2) [    ] o.a.s.s.SolrDispatchFilter  ___      _       Welcome to Apache Solr™ version 7.0.0
   [junit4]   2> 22369 INFO  (jetty-launcher-3-thread-1) [    ] o.a.s.s.SolrDispatchFilter / __| ___| |_ _   Starting in cloud mode on port null
   [junit4]   2> 22369 INFO  (jetty-launcher-3-thread-2) [    ] o.a.s.s.SolrDispatchFilter / __| ___| |_ _   Starting in cloud mode on port null
   [junit4]   2> 22369 INFO  (jetty-launcher-3-thread-1) [    ] o.a.s.s.SolrDispatchFilter \__ \/ _ \ | '_|  Install dir: null
   [junit4]   2> 22369 INFO  (jetty-launcher-3-thread-2) [    ] o.a.s.s.SolrDispatchFilter \__ \/ _ \ | '_|  Install dir: null
   [junit4]   2> 22390 INFO  (jetty-launcher-3-thread-1) [    ] o.a.s.s.SolrDispatchFilter |___/\___/_|_|    Start time: 2017-03-19T05:40:49.442Z
   [junit4]   2> 22390 INFO  (jetty-launcher-3-thread-2) [    ] o.a.s.s.SolrDispatchFilter |___/\___/_|_|    Start time: 2017-03-19T05:40:49.442Z
   [junit4]   2> 22395 INFO  (jetty-launcher-3-thread-1) [    ] o.a.s.c.SolrResourceLoader solr home defaulted to 'solr/' (could not find system property or JNDI)
   [junit4]   2> 22396 INFO  (jetty-launcher-3-thread-1) [    ] o.a.z.ZooKeeper Initiating client connection, connectString=127.0.0.1:56768/solr sessionTimeout=30000 watcher=org.apache.solr.common.cloud.SolrZkClient$3@1ed31bb5
   [junit4]   2> 22396 INFO  (jetty-launcher-3-thread-2) [    ] o.a.z.ZooKeeper Initiating client connection, connectString=127.0.0.1:56768/solr sessionTimeout=30000 watcher=org.apache.solr.common.cloud.SolrZkClient$3@4794b635
   [junit4]   2> 22399 INFO  (jetty-launcher-3-thread-2-SendThread(127.0.0.1:56768)) [    ] o.a.z.ClientCnxn Opening socket connection to server 127.0.0.1/127.0.0.1:56768. Will not attempt to authenticate using SASL (unknown error)
   [junit4]   2> 22400 INFO  (NIOServerCxn.Factory:0.0.0.0/0.0.0.0:0) [    ] o.a.z.s.NIOServerCnxnFactory Accepted socket connection from /127.0.0.1:56792
   [junit4]   2> 22400 INFO  (jetty-launcher-3-thread-2-SendThread(127.0.0.1:56768)) [    ] o.a.z.ClientCnxn Socket connection established to 127.0.0.1/127.0.0.1:56768, initiating session
   [junit4]   2> 22401 INFO  (jetty-launcher-3-thread-1-SendThread(127.0.0.1:56768)) [    ] o.a.z.ClientCnxn Opening socket connection to server 127.0.0.1/127.0.0.1:56768. Will not attempt to authenticate using SASL (unknown error)
   [junit4]   2> 22401 INFO  (NIOServerCxn.Factory:0.0.0.0/0.0.0.0:0) [    ] o.a.z.s.ZooKeeperServer Client attempting to establish new session at /127.0.0.1:56792
   [junit4]   2> 22401 INFO  (NIOServerCxn.Factory:0.0.0.0/0.0.0.0:0) [    ] o.a.z.s.NIOServerCnxnFactory Accepted socket connection from /127.0.0.1:56793
   [junit4]   2> 22401 INFO  (jetty-launcher-3-thread-1-SendThread(127.0.0.1:56768)) [    ] o.a.z.ClientCnxn Socket connection established to 127.0.0.1/127.0.0.1:56768, initiating session
   [junit4]   2> 22402 INFO  (NIOServerCxn.Factory:0.0.0.0/0.0.0.0:0) [    ] o.a.z.s.ZooKeeperServer Client attempting to establish new session at /127.0.0.1:56793
   [junit4]   2> 22403 INFO  (jetty-launcher-3-thread-2-SendThread(127.0.0.1:56768)) [    ] o.a.z.ClientCnxn Session establishment complete on server 127.0.0.1/127.0.0.1:56768, sessionid = 0x15ae5150b370001, negotiated timeout = 20000
   [junit4]   2> 22403 INFO  (SyncThread:0) [    ] o.a.z.s.ZooKeeperServer Established session 0x15ae5150b370001 with negotiated timeout 20000 for client /127.0.0.1:56792
   [junit4]   2> 22404 INFO  (jetty-launcher-3-thread-1-SendThread(127.0.0.1:56768)) [    ] o.a.z.ClientCnxn Session establishment complete on server 127.0.0.1/127.0.0.1:56768, sessionid = 0x15ae5150b370002, negotiated timeout = 20000
   [junit4]   2> 22404 INFO  (SyncThread:0) [    ] o.a.z.s.ZooKeeperServer Established session 0x15ae5150b370002 with negotiated timeout 20000 for client /127.0.0.1:56793
   [junit4]   2> 22406 INFO  (jetty-launcher-3-thread-1) [    ] o.a.s.s.SolrDispatchFilter solr.xml found in ZooKeeper. Loading...
   [junit4]   2> 22409 INFO  (jetty-launcher-3-thread-2) [    ] o.a.s.s.SolrDispatchFilter solr.xml found in ZooKeeper. Loading...
   [junit4]   2> 22457 INFO  (ProcessThread(sid:0 cport:-1):) [    ] o.a.z.s.PrepRequestProcessor Processed session termination for sessionid: 0x15ae5150b370002
   [junit4]   2> 22458 INFO  (jetty-launcher-3-thread-1) [    ] o.a.z.ZooKeeper Session: 0x15ae5150b370002 closed
   [junit4]   2> 22461 INFO  (jetty-launcher-3-thread-1-EventThread) [    ] o.a.z.ClientCnxn EventThread shut down
   [junit4]   2> 22463 WARN  (NIOServerCxn.Factory:0.0.0.0/0.0.0.0:0) [    ] o.a.z.s.NIOServerCnxn caught end of stream exception
   [junit4]   2> EndOfStreamException: Unable to read additional data from client sessionid 0x15ae5150b370002, likely client has closed socket
   [junit4]   2> at org.apache.zookeeper.server.NIOServerCnxn.doIO(NIOServerCnxn.java:228)
   [junit4]   2> at org.apache.zookeeper.server.NIOServerCnxnFactory.run(NIOServerCnxnFactory.java:208)
   [junit4]   2> at java.lang.Thread.run(Thread.java:745)
   [junit4]   2> 22469 INFO  (NIOServerCxn.Factory:0.0.0.0/0.0.0.0:0) [    ] o.a.z.s.NIOServerCnxn Closed socket connection for client /127.0.0.1:56793 which had sessionid 0x15ae5150b370002
   [junit4]   2> 22472 INFO  (ProcessThread(sid:0 cport:-1):) [    ] o.a.z.s.PrepRequestProcessor Processed session termination for sessionid: 0x15ae5150b370001
   [junit4]   2> 22475 INFO  (NIOServerCxn.Factory:0.0.0.0/0.0.0.0:0) [    ] o.a.z.s.NIOServerCnxn Closed socket connection for client /127.0.0.1:56792 which had sessionid 0x15ae5150b370001
   [junit4]   2> 22475 INFO  (jetty-launcher-3-thread-2) [    ] o.a.z.ZooKeeper Session: 0x15ae5150b370001 closed
   [junit4]   2> 22475 INFO  (jetty-launcher-3-thread-2-EventThread) [    ] o.a.z.ClientCnxn EventThread shut down
   [junit4]   2> 22534 INFO  (jetty-launcher-3-thread-1) [    ] o.a.s.c.ZkContainer Zookeeper client=127.0.0.1:56768/solr
   [junit4]   2> 22567 INFO  (jetty-launcher-3-thread-1) [    ] o.a.z.ZooKeeper Initiating client connection, connectString=127.0.0.1:56768 sessionTimeout=60000 watcher=org.apache.solr.common.cloud.SolrZkClient$3@524e4d25
   [junit4]   2> 22582 INFO  (jetty-launcher-3-thread-2) [    ] o.a.s.c.ZkContainer Zookeeper client=127.0.0.1:56768/solr
   [junit4]   2> 22582 INFO  (jetty-launcher-3-thread-2) [    ] o.a.z.ZooKeeper Initiating client connection, connectString=127.0.0.1:56768 sessionTimeout=60000 watcher=org.apache.solr.common.cloud.SolrZkClient$3@3a5707e5
   [junit4]   2> 22585 INFO  (jetty-launcher-3-thread-1-SendThread(127.0.0.1:56768)) [    ] o.a.z.ClientCnxn Opening socket connection to server 127.0.0.1/127.0.0.1:56768. Will not attempt to authenticate using SASL (unknown error)
   [junit4]   2> 22587 INFO  (NIOServerCxn.Factory:0.0.0.0/0.0.0.0:0) [    ] o.a.z.s.NIOServerCnxnFactory Accepted socket connection from /127.0.0.1:56800
   [junit4]   2> 22587 INFO  (jetty-launcher-3-thread-1-SendThread(127.0.0.1:56768)) [    ] o.a.z.ClientCnxn Socket connection established to 127.0.0.1/127.0.0.1:56768, initiating session
   [junit4]   2> 22588 INFO  (NIOServerCxn.Factory:0.0.0.0/0.0.0.0:0) [    ] o.a.z.s.ZooKeeperServer Client attempting to establish new session at /127.0.0.1:56800
   [junit4]   2> 22589 INFO  (jetty-launcher-3-thread-1-SendThread(127.0.0.1:56768)) [    ] o.a.z.ClientCnxn Session establishment complete on server 127.0.0.1/127.0.0.1:56768, sessionid = 0x15ae5150b370003, negotiated timeout = 20000
   [junit4]   2> 22589 INFO  (SyncThread:0) [    ] o.a.z.s.ZooKeeperServer Established session 0x15ae5150b370003 with negotiated timeout 20000 for client /127.0.0.1:56800
   [junit4]   2> 22593 INFO  (jetty-launcher-3-thread-2-SendThread(127.0.0.1:56768)) [    ] o.a.z.ClientCnxn Opening socket connection to server 127.0.0.1/127.0.0.1:56768. Will not attempt to authenticate using SASL (unknown error)
   [junit4]   2> 22594 INFO  (NIOServerCxn.Factory:0.0.0.0/0.0.0.0:0) [    ] o.a.z.s.NIOServerCnxnFactory Accepted socket connection from /127.0.0.1:56801
   [junit4]   2> 22594 INFO  (jetty-launcher-3-thread-2-SendThread(127.0.0.1:56768)) [    ] o.a.z.ClientCnxn Socket connection established to 127.0.0.1/127.0.0.1:56768, initiating session
   [junit4]   2> 22594 INFO  (NIOServerCxn.Factory:0.0.0.0/0.0.0.0:0) [    ] o.a.z.s.ZooKeeperServer Client attempting to establish new session at /127.0.0.1:56801
   [junit4]   2> 22597 INFO  (jetty-launcher-3-thread-2-SendThread(127.0.0.1:56768)) [    ] o.a.z.ClientCnxn Session establishment complete on server 127.0.0.1/127.0.0.1:56768, sessionid = 0x15ae5150b370004, negotiated timeout = 20000
   [junit4]   2> 22597 INFO  (SyncThread:0) [    ] o.a.z.s.ZooKeeperServer Established session 0x15ae5150b370004 with negotiated timeout 20000 for client /127.0.0.1:56801
   [junit4]   2> 22602 INFO  (ProcessThread(sid:0 cport:-1):) [    ] o.a.z.s.PrepRequestProcessor Processed session termination for sessionid: 0x15ae5150b370003
   [junit4]   2> 22606 INFO  (NIOServerCxn.Factory:0.0.0.0/0.0.0.0:0) [    ] o.a.z.s.NIOServerCnxn Closed socket connection for client /127.0.0.1:56800 which had sessionid 0x15ae5150b370003
   [junit4]   2> 22607 INFO  (ProcessThread(sid:0 cport:-1):) [    ] o.a.z.s.PrepRequestProcessor Processed session termination for sessionid: 0x15ae5150b370004
   [junit4]   2> 22611 INFO  (jetty-launcher-3-thread-1) [    ] o.a.z.ZooKeeper Session: 0x15ae5150b370003 closed
   [junit4]   2> 22613 INFO  (NIOServerCxn.Factory:0.0.0.0/0.0.0.0:0) [    ] o.a.z.s.NIOServerCnxn Closed socket connection for client /127.0.0.1:56801 which had sessionid 0x15ae5150b370004
   [junit4]   2> 22614 INFO  (jetty-launcher-3-thread-1-EventThread) [    ] o.a.z.ClientCnxn EventThread shut down
   [junit4]   2> 22614 INFO  (jetty-launcher-3-thread-2) [    ] o.a.z.ZooKeeper Session: 0x15ae5150b370004 closed
   [junit4]   2> 22615 INFO  (jetty-launcher-3-thread-2-EventThread) [    ] o.a.z.ClientCnxn EventThread shut down
   [junit4]   2> 22632 INFO  (jetty-launcher-3-thread-2) [n:127.0.0.1:56780_solr    ] o.a.z.ZooKeeper Initiating client connection, connectString=127.0.0.1:56768/solr sessionTimeout=30000 watcher=org.apache.solr.common.cloud.SolrZkClient$3@21a66dea
   [junit4]   2> 22634 INFO  (jetty-launcher-3-thread-1) [n:127.0.0.1:56779_solr    ] o.a.z.ZooKeeper Initiating client connection, connectString=127.0.0.1:56768/solr sessionTimeout=30000 watcher=org.apache.solr.common.cloud.SolrZkClient$3@71fdb3d8
   [junit4]   2> 22636 INFO  (jetty-launcher-3-thread-2-SendThread(127.0.0.1:56768)) [n:127.0.0.1:56780_solr    ] o.a.z.ClientCnxn Opening socket connection to server 127.0.0.1/127.0.0.1:56768. Will not attempt to authenticate using SASL (unknown error)
   [junit4]   2> 22641 INFO  (NIOServerCxn.Factory:0.0.0.0/0.0.0.0:0) [    ] o.a.z.s.NIOServerCnxnFactory Accepted socket connection from /127.0.0.1:56806
   [junit4]   2> 22642 INFO  (jetty-launcher-3-thread-2-SendThread(127.0.0.1:56768)) [n:127.0.0.1:56780_solr    ] o.a.z.ClientCnxn Socket connection established to 127.0.0.1/127.0.0.1:56768, initiating session
   [junit4]   2> 22642 INFO  (NIOServerCxn.Factory:0.0.0.0/0.0.0.0:0) [    ] o.a.z.s.ZooKeeperServer Client attempting to establish new session at /127.0.0.1:56806
   [junit4]   2> 22643 INFO  (jetty-launcher-3-thread-1-SendThread(127.0.0.1:56768)) [n:127.0.0.1:56779_solr    ] o.a.z.ClientCnxn Opening socket connection to server 127.0.0.1/127.0.0.1:56768. Will not attempt to authenticate using SASL (unknown error)
   [junit4]   2> 22644 INFO  (NIOServerCxn.Factory:0.0.0.0/0.0.0.0:0) [    ] o.a.z.s.NIOServerCnxnFactory Accepted socket connection from /127.0.0.1:56807
   [junit4]   2> 22644 INFO  (jetty-launcher-3-thread-1-SendThread(127.0.0.1:56768)) [n:127.0.0.1:56779_solr    ] o.a.z.ClientCnxn Socket connection established to 127.0.0.1/127.0.0.1:56768, initiating session
   [junit4]   2> 22644 INFO  (NIOServerCxn.Factory:0.0.0.0/0.0.0.0:0) [    ] o.a.z.s.ZooKeeperServer Client attempting to establish new session at /127.0.0.1:56807
   [junit4]   2> 22645 INFO  (jetty-launcher-3-thread-2-SendThread(127.0.0.1:56768)) [n:127.0.0.1:56780_solr    ] o.a.z.ClientCnxn Session establishment complete on server 127.0.0.1/127.0.0.1:56768, sessionid = 0x15ae5150b370005, negotiated timeout = 20000
   [junit4]   2> 22645 INFO  (SyncThread:0) [    ] o.a.z.s.ZooKeeperServer Established session 0x15ae5150b370005 with negotiated timeout 20000 for client /127.0.0.1:56806
   [junit4]   2> 22646 INFO  (jetty-launcher-3-thread-1-SendThread(127.0.0.1:56768)) [n:127.0.0.1:56779_solr    ] o.a.z.ClientCnxn Session establishment complete on server 127.0.0.1/127.0.0.1:56768, sessionid = 0x15ae5150b370006, negotiated timeout = 20000
   [junit4]   2> 22647 INFO  (SyncThread:0) [    ] o.a.z.s.ZooKeeperServer Established session 0x15ae5150b370006 with negotiated timeout 20000 for client /127.0.0.1:56807
   [junit4]   2> 22676 INFO  (ProcessThread(sid:0 cport:-1):) [    ] o.a.z.s.PrepRequestProcessor Got user-level KeeperException when processing sessionid:0x15ae5150b370006 type:create cxid:0x1 zxid:0x11 txntype:-1 reqpath:n/a Error Path:/solr/overseer Error:KeeperErrorCode = NodeExists for /solr/overseer
   [junit4]   2> 22686 INFO  (ProcessThread(sid:0 cport:-1):) [    ] o.a.z.s.PrepRequestProcessor Got user-level KeeperException when processing sessionid:0x15ae5150b370006 type:create cxid:0x5 zxid:0x13 txntype:-1 reqpath:n/a Error Path:/solr/overseer/queue Error:KeeperErrorCode = NodeExists for /solr/overseer/queue
   [junit4]   2> 22688 INFO  (ProcessThread(sid:0 cport:-1):) [    ] o.a.z.s.PrepRequestProcessor Got user-level KeeperException when processing sessionid:0x15ae5150b370006 type:create cxid:0x6 zxid:0x14 txntype:-1 reqpath:n/a Error Path:/solr/overseer Error:KeeperErrorCode = NodeExists for /solr/overseer
   [junit4]   2> 22689 INFO  (ProcessThread(sid:0 cport:-1):) [    ] o.a.z.s.PrepRequestProcessor Got user-level KeeperException when processing sessionid:0x15ae5150b370005 type:create cxid:0x7 zxid:0x15 txntype:-1 reqpath:n/a Error Path:/solr/overseer Error:KeeperErrorCode = NodeExists for /solr/overseer
   [junit4]   2> 22702 INFO  (ProcessThread(sid:0 cport:-1):) [    ] o.a.z.s.PrepRequestProcessor Got user-level KeeperException when processing sessionid:0x15ae5150b370005 type:create cxid:0xb zxid:0x17 txntype:-1 reqpath:n/a Error Path:/solr/overseer/collection-queue-work Error:KeeperErrorCode = NodeExists for /solr/overseer/collection-queue-work
   [junit4]   2> 22704 INFO  (ProcessThread(sid:0 cport:-1):) [    ] o.a.z.s.PrepRequestProcessor Got user-level KeeperException when processing sessionid:0x15ae5150b370005 type:create cxid:0xc zxid:0x18 txntype:-1 reqpath:n/a Error Path:/solr/overseer Error:KeeperErrorCode = NodeExists for /solr/overseer
   [junit4]   2> 22706 INFO  (ProcessThread(sid:0 cport:-1):) [    ] o.a.z.s.PrepRequestProcessor Got user-level KeeperException when processing sessionid:0x15ae5150b370006 type:create cxid:0xc zxid:0x19 txntype:-1 reqpath:n/a Error Path:/solr/overseer Error:KeeperErrorCode = NodeExists for /solr/overseer
   [junit4]   2> 22706 INFO  (ProcessThread(sid:0 cport:-1):) [    ] o.a.z.s.PrepRequestProcessor Got user-level KeeperException when processing sessionid:0x15ae5150b370005 type:create cxid:0xd zxid:0x1a txntype:-1 reqpath:n/a Error Path:/solr/overseer Error:KeeperErrorCode = NodeExists for /solr/overseer
   [junit4]   2> 22709 INFO  (ProcessThread(sid:0 cport:-1):) [    ] o.a.z.s.PrepRequestProcessor Got user-level KeeperException when processing sessionid:0x15ae5150b370006 type:create cxid:0xd zxid:0x1b txntype:-1 reqpath:n/a Error Path:/solr/overseer Error:KeeperErrorCode = NodeExists for /solr/overseer
   [junit4]   2> 22713 INFO  (ProcessThread(sid:0 cport:-1):) [    ] o.a.z.s.PrepRequestProcessor Got user-level KeeperException when processing sessionid:0x15ae5150b370005 type:create cxid:0xf zxid:0x1c txntype:-1 reqpath:n/a Error Path:/solr/overseer Error:KeeperErrorCode = NodeExists for /solr/overseer
   [junit4]   2> 22717 INFO  (ProcessThread(sid:0 cport:-1):) [    ] o.a.z.s.PrepRequestProcessor Got user-level KeeperException when processing sessionid:0x15ae5150b370006 type:create cxid:0xf zxid:0x1d txntype:-1 reqpath:n/a Error Path:/solr/overseer Error:KeeperErrorCode = NodeExists for /solr/overseer
   [junit4]   2> 22726 INFO  (ProcessThread(sid:0 cport:-1):) [    ] o.a.z.s.PrepRequestProcessor Got user-level KeeperException when processing sessionid:0x15ae5150b370006 type:create cxid:0x13 zxid:0x1f txntype:-1 reqpath:n/a Error Path:/solr/overseer/collection-map-running Error:KeeperErrorCode = NodeExists for /solr/overseer/collection-map-running
   [junit4]   2> 22728 INFO  (ProcessThread(sid:0 cport:-1):) [    ] o.a.z.s.PrepRequestProcessor Got user-level KeeperException when processing sessionid:0x15ae5150b370006 type:create cxid:0x14 zxid:0x20 txntype:-1 reqpath:n/a Error Path:/solr/overseer Error:KeeperErrorCode = NodeExists for /solr/overseer
   [junit4]   2> 22729 INFO  (ProcessThread(sid:0 cport:-1):) [    ] o.a.z.s.PrepRequestProcessor Got user-level KeeperException when processing sessionid:0x15ae5150b370005 type:create cxid:0x15 zxid:0x21 txntype:-1 reqpath:n/a Error Path:/solr/overseer Error:KeeperErrorCode = NodeExists for /solr/overseer
   [junit4]   2> 22741 INFO  (ProcessThread(sid:0 cport:-1):) [    ] o.a.z.s.PrepRequestProcessor Got user-level KeeperException when processing sessionid:0x15ae5150b370005 type:create cxid:0x19 zxid:0x23 txntype:-1 reqpath:n/a Error Path:/solr/overseer/collection-map-completed Error:KeeperErrorCode = NodeExists for /solr/overseer/collection-map-completed
   [junit4]   2> 22750 INFO  (ProcessThread(sid:0 cport:-1):) [    ] o.a.z.s.PrepRequestProcessor Got user-level KeeperException when processing sessionid:0x15ae5150b370005 type:create cxid:0x1a zxid:0x24 txntype:-1 reqpath:n/a Error Path:/solr/overseer Error:KeeperErrorCode = NodeExists for /solr/overseer
   [junit4]   2> 22751 INFO  (ProcessThread(sid:0 cport:-1):) [    ] o.a.z.s.PrepRequestProcessor Got user-level KeeperException when processing sessionid:0x15ae5150b370006 type:create cxid:0x1a zxid:0x25 txntype:-1 reqpath:n/a Error Path:/solr/overseer Error:KeeperErrorCode = NodeExists for /solr/overseer
   [junit4]   2> 22761 INFO  (ProcessThread(sid:0 cport:-1):) [    ] o.a.z.s.PrepRequestProcessor Got user-level KeeperException when processing sessionid:0x15ae5150b370006 type:create cxid:0x1e zxid:0x27 txntype:-1 reqpath:n/a Error Path:/solr/overseer/collection-map-failure Error:KeeperErrorCode = NodeExists for /solr/overseer/collection-map-failure
   [junit4]   2> 22781 INFO  (ProcessThread(sid:0 cport:-1):) [    ] o.a.z.s.PrepRequestProcessor Got user-level KeeperException when processing sessionid:0x15ae5150b370005 type:create cxid:0x22 zxid:0x29 txntype:-1 reqpath:n/a Error Path:/solr/live_nodes Error:KeeperErrorCode = NodeExists for /solr/live_nodes
   [junit4]   2> 22787 INFO  (ProcessThread(sid:0 cport:-1):) [    ] o.a.z.s.PrepRequestProcessor Got user-level KeeperException when processing sessionid:0x15ae5150b370006 type:create cxid:0x25 zxid:0x2b txntype:-1 reqpath:n/a Error Path:/solr/collections Error:KeeperErrorCode = NodeExists for /solr/collections
   [junit4]   2> 22793 INFO  (ProcessThread(sid:0 cport:-1):) [    ] o.a.z.s.PrepRequestProcessor Got user-level KeeperException when processing sessionid:0x15ae5150b370006 type:create cxid:0x28 zxid:0x2d txntype:-1 reqpath:n/a Error Path:/solr/aliases.json Error:KeeperErrorCode = NodeExists for /solr/aliases.json
   [junit4]   2> 22796 INFO  (ProcessThread(sid:0 cport:-1):) [    ] o.a.z.s.PrepRequestProcessor Got user-level KeeperException when processing sessionid:0x15ae5150b370006 type:create cxid:0x2b zxid:0x2f txntype:-1 reqpath:n/a Error Path:/solr/clusterstate.json Error:KeeperErrorCode = NodeExists for /solr/clusterstate.json
   [junit4]   2> 22802 INFO  (ProcessThread(sid:0 cport:-1):) [    ] o.a.z.s.PrepRequestProcessor Got user-level KeeperException when processing sessionid:0x15ae5150b370005 type:create cxid:0x31 zxid:0x31 txntype:-1 reqpath:n/a Error Path:/solr/security.json Error:KeeperErrorCode = NodeExists for /solr/security.json
   [junit4]   2> 22871 INFO  (ProcessThread(sid:0 cport:-1):) [    ] o.a.z.s.PrepRequestProcessor Got user-level KeeperException when processing sessionid:0x15ae5150b370005 type:create cxid:0x3f zxid:0x33 txntype:-1 reqpath:n/a Error Path:/solr/overseer_elect Error:KeeperErrorCode = NodeExists for /solr/overseer_elect
   [junit4]   2> 22878 INFO  (ProcessThread(sid:0 cport:-1):) [    ] o.a.z.s.PrepRequestProcessor Got user-level KeeperException when processing sessionid:0x15ae5150b370006 type:create cxid:0x42 zxid:0x35 txntype:-1 reqpath:n/a Error Path:/solr/overseer_elect/election Error:KeeperErrorCode = NodeExists for /solr/overseer_elect/election
   [junit4]   2> 22879 INFO  (jetty-launcher-3-thread-1) [n:127.0.0.1:56779_solr    ] o.a.s.c.Overseer Overseer (id=null) closing
   [junit4]   2> 22880 INFO  (jetty-launcher-3-thread-2) [n:127.0.0.1:56780_solr    ] o.a.s.c.Overseer Overseer (id=null) closing
   [junit4]   2> 22884 INFO  (jetty-launcher-3-thread-1) [n:127.0.0.1:56779_solr    ] o.a.s.c.OverseerElectionContext I am going to be the leader 127.0.0.1:56779_solr
   [junit4]   2> 22891 INFO  (jetty-launcher-3-thread-2) [n:127.0.0.1:56780_solr    ] o.a.s.c.ZkController Register node as live in ZooKeeper:/live_nodes/127.0.0.1:56780_solr
   [junit4]   2> 22892 INFO  (jetty-launcher-3-thread-1) [n:127.0.0.1:56779_solr    ] o.a.s.c.Overseer Overseer (id=97642220487114758-127.0.0.1:56779_solr-n_0000000000) starting
   [junit4]   2> 22894 INFO  (ProcessThread(sid:0 cport:-1):) [    ] o.a.z.s.PrepRequestProcessor Got user-level KeeperException when processing sessionid:0x15ae5150b370006 type:create cxid:0x49 zxid:0x39 txntype:-1 reqpath:n/a Error Path:/solr/overseer Error:KeeperErrorCode = NodeExists for /solr/overseer
   [junit4]   2> 22905 INFO  (zkCallback-14-thread-1-processing-n:127.0.0.1:56780_solr) [n:127.0.0.1:56780_solr    ] o.a.s.c.c.ZkStateReader Updated live nodes from ZooKeeper... (0) -> (1)
   [junit4]   2> 22906 INFO  (zkCallback-15-thread-1-processing-n:127.0.0.1:56779_solr) [n:127.0.0.1:56779_solr    ] o.a.s.c.c.ZkStateReader Updated live nodes from ZooKeeper... (0) -> (1)
   [junit4]   2> 22910 INFO  (ProcessThread(sid:0 cport:-1):) [    ] o.a.z.s.PrepRequestProcessor Got user-level KeeperException when processing sessionid:0x15ae5150b370006 type:create cxid:0x4b zxid:0x3b txntype:-1 reqpath:n/a Error Path:/solr/overseer Error:KeeperErrorCode = NodeExists for /solr/overseer
   [junit4]   2> 22913 INFO  (ProcessThread(sid:0 cport:-1):) [    ] o.a.z.s.PrepRequestProcessor Got user-level KeeperException when processing sessionid:0x15ae5150b370006 type:create cxid:0x4d zxid:0x3c txntype:-1 reqpath:n/a Error Path:/solr/overseer Error:KeeperErrorCode = NodeExists for /solr/overseer
   [junit4]   2> 22919 INFO  (ProcessThread(sid:0 cport:-1):) [    ] o.a.z.s.PrepRequestProcessor Got user-level KeeperException when processing sessionid:0x15ae5150b370006 type:create cxid:0x53 zxid:0x3e txntype:-1 reqpath:n/a Error Path:/solr/overseer Error:KeeperErrorCode = NodeExists for /solr/overseer
   [junit4]   2> 22921 INFO  (ProcessThread(sid:0 cport:-1):) [    ] o.a.z.s.PrepRequestProcessor Got user-level KeeperException when processing sessionid:0x15ae5150b370006 type:create cxid:0x55 zxid:0x3f txntype:-1 reqpath:n/a Error Path:/solr/overseer Error:KeeperErrorCode = NodeExists for /solr/overseer
   [junit4]   2> 22922 INFO  (ProcessThread(sid:0 cport:-1):) [    ] o.a.z.s.PrepRequestProcessor Got user-level KeeperException when processing sessionid:0x15ae5150b370006 type:create cxid:0x57 zxid:0x40 txntype:-1 reqpath:n/a Error Path:/solr/overseer Error:KeeperError

[...truncated too long message...]

n when processing sessionid:0x15ae5150b370005 type:create cxid:0xf6 zxid:0xc4 txntype:-1 reqpath:n/a Error Path:/solr/overseer Error:KeeperErrorCode = NodeExists for /solr/overseer
   [junit4]   2> 30701 INFO  (jetty-closer-4-thread-2) [    ] o.a.s.m.SolrMetricManager Closing metric reporters for registry=solr.cluster, tag=null
   [junit4]   2> 30702 INFO  (jetty-closer-4-thread-1) [    ] o.a.s.m.SolrMetricManager Closing metric reporters for registry=solr.cluster, tag=null
   [junit4]   2> 30720 INFO  (coreCloseExecutor-39-thread-1) [n:127.0.0.1:56780_solr c:collection1 s:shard2 r:core_node2 x:collection1_shard2_replica1] o.a.s.c.SolrCore [collection1_shard2_replica1]  CLOSING SolrCore org.apache.solr.core.SolrCore@76ce75d3
   [junit4]   2> 30721 INFO  (coreCloseExecutor-38-thread-1) [n:127.0.0.1:56779_solr c:collection1 s:shard1 r:core_node1 x:collection1_shard1_replica1] o.a.s.c.SolrCore [collection1_shard1_replica1]  CLOSING SolrCore org.apache.solr.core.SolrCore@daceae3
   [junit4]   2> 30873 INFO  (zkCallback-15-thread-2-processing-n:127.0.0.1:56779_solr) [n:127.0.0.1:56779_solr    ] o.a.s.c.c.ZkStateReader A cluster state change: [WatchedEvent state:SyncConnected type:NodeDataChanged path:/collections/collection1/state.json] for collection [collection1] has occurred - updating... (live nodes size: [2])
   [junit4]   2> 30873 INFO  (zkCallback-14-thread-1-processing-n:127.0.0.1:56780_solr) [n:127.0.0.1:56780_solr    ] o.a.s.c.c.ZkStateReader A cluster state change: [WatchedEvent state:SyncConnected type:NodeDataChanged path:/collections/collection1/state.json] for collection [collection1] has occurred - updating... (live nodes size: [2])
   [junit4]   2> 31211 INFO  (coreCloseExecutor-39-thread-1) [n:127.0.0.1:56780_solr c:collection1 s:shard2 r:core_node2 x:collection1_shard2_replica1] o.a.s.m.SolrMetricManager Closing metric reporters for registry=solr.core.collection1.shard2.replica1, tag=1993242067
   [junit4]   2> 31220 INFO  (ProcessThread(sid:0 cport:-1):) [    ] o.a.z.s.PrepRequestProcessor Processed session termination for sessionid: 0x15ae5150b370005
   [junit4]   2> 31221 INFO  (NIOServerCxn.Factory:0.0.0.0/0.0.0.0:0) [    ] o.a.z.s.NIOServerCnxn Closed socket connection for client /127.0.0.1:56806 which had sessionid 0x15ae5150b370005
   [junit4]   2> 31222 INFO  (jetty-closer-4-thread-1) [    ] o.a.z.ZooKeeper Session: 0x15ae5150b370005 closed
   [junit4]   2> 31222 INFO  (jetty-launcher-3-thread-2-EventThread) [n:127.0.0.1:56780_solr    ] o.a.z.ClientCnxn EventThread shut down
   [junit4]   2> 31223 INFO  (zkCallback-15-thread-2-processing-n:127.0.0.1:56779_solr) [n:127.0.0.1:56779_solr    ] o.a.s.c.c.ZkStateReader Updated live nodes from ZooKeeper... (2) -> (1)
   [junit4]   2> 31226 WARN  (zkCallback-14-thread-1-processing-n:127.0.0.1:56780_solr) [n:127.0.0.1:56780_solr    ] o.a.s.c.c.ZkStateReader ZooKeeper watch triggered, but Solr cannot talk to ZK: [KeeperErrorCode = Session expired for /live_nodes]
   [junit4]   2> 31231 INFO  (jetty-closer-4-thread-1) [    ] o.e.j.s.h.ContextHandler Stopped o.e.j.s.ServletContextHandler@741c63c3{/solr,null,UNAVAILABLE}
   [junit4]   2> 31235 INFO  (coreCloseExecutor-38-thread-1) [n:127.0.0.1:56779_solr c:collection1 s:shard1 r:core_node1 x:collection1_shard1_replica1] o.a.s.m.SolrMetricManager Closing metric reporters for registry=solr.core.collection1.shard1.replica1, tag=229436131
   [junit4]   2> 31241 INFO  (jetty-closer-4-thread-2) [    ] o.a.s.c.Overseer Overseer (id=97642220487114758-127.0.0.1:56779_solr-n_0000000000) closing
   [junit4]   2> 31242 INFO  (OverseerStateUpdate-97642220487114758-127.0.0.1:56779_solr-n_0000000000) [n:127.0.0.1:56779_solr    ] o.a.s.c.Overseer Overseer Loop exiting : 127.0.0.1:56779_solr
   [junit4]   2> 31246 INFO  (ProcessThread(sid:0 cport:-1):) [    ] o.a.z.s.PrepRequestProcessor Processed session termination for sessionid: 0x15ae5150b370006
   [junit4]   2> 31251 INFO  (NIOServerCxn.Factory:0.0.0.0/0.0.0.0:0) [    ] o.a.z.s.NIOServerCnxn Closed socket connection for client /127.0.0.1:56807 which had sessionid 0x15ae5150b370006
   [junit4]   2> 31252 INFO  (jetty-closer-4-thread-2) [    ] o.a.z.ZooKeeper Session: 0x15ae5150b370006 closed
   [junit4]   2> 31253 WARN  (zkCallback-15-thread-2-processing-n:127.0.0.1:56779_solr) [n:127.0.0.1:56779_solr    ] o.a.s.c.c.ZkStateReader ZooKeeper watch triggered, but Solr cannot talk to ZK: [KeeperErrorCode = Session expired for /live_nodes]
   [junit4]   2> 31257 INFO  (jetty-launcher-3-thread-1-EventThread) [n:127.0.0.1:56779_solr    ] o.a.z.ClientCnxn EventThread shut down
   [junit4]   2> 31257 INFO  (jetty-closer-4-thread-2) [    ] o.e.j.s.h.ContextHandler Stopped o.e.j.s.ServletContextHandler@ccc229e{/solr,null,UNAVAILABLE}
   [junit4]   2> 31267 INFO  (SUITE-SolrMorphlineZkAvroTest-seed#[5F83611FEBCF2D3D]-worker) [    ] o.a.z.s.ZooKeeperServer shutting down
   [junit4]   2> 31267 INFO  (SUITE-SolrMorphlineZkAvroTest-seed#[5F83611FEBCF2D3D]-worker) [    ] o.a.z.s.SessionTrackerImpl Shutting down
   [junit4]   2> 31267 INFO  (SUITE-SolrMorphlineZkAvroTest-seed#[5F83611FEBCF2D3D]-worker) [    ] o.a.z.s.PrepRequestProcessor Shutting down
   [junit4]   2> 31267 INFO  (SUITE-SolrMorphlineZkAvroTest-seed#[5F83611FEBCF2D3D]-worker) [    ] o.a.z.s.SyncRequestProcessor Shutting down
   [junit4]   2> 31267 INFO  (SyncThread:0) [    ] o.a.z.s.SyncRequestProcessor SyncRequestProcessor exited!
   [junit4]   2> 31268 INFO  (ProcessThread(sid:0 cport:-1):) [    ] o.a.z.s.PrepRequestProcessor PrepRequestProcessor exited loop!
   [junit4]   2> 31268 INFO  (SUITE-SolrMorphlineZkAvroTest-seed#[5F83611FEBCF2D3D]-worker) [    ] o.a.z.s.FinalRequestProcessor shutdown of request processor complete
   [junit4]   2> 31270 INFO  (SUITE-SolrMorphlineZkAvroTest-seed#[5F83611FEBCF2D3D]-worker) [    ] o.a.s.c.ZkTestServer connecting to 127.0.0.1:56768 56768
   [junit4]   2> 31272 INFO  (NIOServerCxn.Factory:0.0.0.0/0.0.0.0:0) [    ] o.a.z.s.NIOServerCnxnFactory NIOServerCnxn factory exited run method
   [junit4]   2> 31273 INFO  (SUITE-SolrMorphlineZkAvroTest-seed#[5F83611FEBCF2D3D]-worker) [    ] o.a.z.s.ZooKeeperServer shutting down
   [junit4]   2> 31273 INFO  (SUITE-SolrMorphlineZkAvroTest-seed#[5F83611FEBCF2D3D]-worker) [    ] o.a.z.s.SessionTrackerImpl Shutting down
   [junit4]   2> 31273 INFO  (SUITE-SolrMorphlineZkAvroTest-seed#[5F83611FEBCF2D3D]-worker) [    ] o.a.z.s.PrepRequestProcessor Shutting down
   [junit4]   2> 31273 INFO  (SUITE-SolrMorphlineZkAvroTest-seed#[5F83611FEBCF2D3D]-worker) [    ] o.a.z.s.SyncRequestProcessor Shutting down
   [junit4]   2> 31273 INFO  (SUITE-SolrMorphlineZkAvroTest-seed#[5F83611FEBCF2D3D]-worker) [    ] o.a.z.s.FinalRequestProcessor shutdown of request processor complete
   [junit4]   2> 31273 INFO  (Thread-2) [    ] o.a.z.s.ZooKeeperServer shutting down
   [junit4]   2> 31273 INFO  (Thread-2) [    ] o.a.z.s.SessionTrackerImpl Shutting down
   [junit4]   2> 31273 INFO  (Thread-2) [    ] o.a.z.s.PrepRequestProcessor Shutting down
   [junit4]   2> 31273 INFO  (Thread-2) [    ] o.a.z.s.SyncRequestProcessor Shutting down
   [junit4]   2> 31273 INFO  (Thread-2) [    ] o.a.z.s.FinalRequestProcessor shutdown of request processor complete
   [junit4]   2> 31273 INFO  (Thread-2) [    ] o.a.s.c.ZkTestServer connecting to 127.0.0.1:56768 56768
   [junit4]   2> 31275 INFO  (Thread-2) [    ] o.a.z.s.ZooKeeperServer shutting down
   [junit4]   2> 31275 INFO  (Thread-2) [    ] o.a.z.s.SessionTrackerImpl Shutting down
   [junit4]   2> 31275 INFO  (Thread-2) [    ] o.a.z.s.PrepRequestProcessor Shutting down
   [junit4]   2> 31275 INFO  (Thread-2) [    ] o.a.z.s.SyncRequestProcessor Shutting down
   [junit4]   2> 31275 INFO  (Thread-2) [    ] o.a.z.s.FinalRequestProcessor shutdown of request processor complete
   [junit4]   2> 31278 WARN  (Thread-2) [    ] o.a.s.c.ZkTestServer Watch limit violations:
   [junit4]   2> Maximum concurrent create/delete watches above limit:
   [junit4]   2>
   [junit4]   2> 3 /solr/aliases.json
   [junit4]   2> 2 /solr/security.json
   [junit4]   2> 2 /solr/configs/conf
   [junit4]   2>
   [junit4]   2> Maximum concurrent data watches above limit:
   [junit4]   2>
   [junit4]   2> 3 /solr/clusterstate.json
   [junit4]   2> 3 /solr/clusterprops.json
   [junit4]   2> 2 /solr/collections/collection1/state.json
   [junit4]   2>
   [junit4]   2> Maximum concurrent children watches above limit:
   [junit4]   2>
   [junit4]   2> 15 /solr/overseer/queue
   [junit4]   2> 5 /solr/overseer/collection-queue-work
   [junit4]   2> 3 /solr/live_nodes
   [junit4]   2> 3 /solr/collections
   [junit4]   2> 3 /solr/overseer/queue-work
   [junit4]   2>
   [junit4]   2> 31279 INFO  (SUITE-SolrMorphlineZkAvroTest-seed#[5F83611FEBCF2D3D]-worker) [    ] o.a.s.SolrTestCaseJ4 ###deleteCore
   [junit4]   2> NOTE: leaving temporary files on disk at: C:\Users\jenkins\workspace\Lucene-Solr-master-Windows\solr\build\contrib\solr-morphlines-core\test\J0\temp\solr.morphlines.solr.SolrMorphlineZkAvroTest_5F83611FEBCF2D3D-001
   [junit4]   2> Mar 19, 2017 5:40:58 AM com.carrotsearch.randomizedtesting.ThreadLeakControl checkThreadLeaks
   [junit4]   2> WARNING: Will linger awaiting termination of 3 leaked thread(s).
   [junit4]   2> 31929 INFO  (SessionTracker) [    ] o.a.z.s.SessionTrackerImpl SessionTrackerImpl exited loop!
   [junit4]   2> NOTE: test params are: codec=Asserting(Lucene70): {}, docValues:{}, maxPointsInLeafNode=21, maxMBSortInHeap=5.540545670491527, sim=RandomSimilarity(queryNorm=true): {}, locale=id-ID, timezone=America/Guatemala
   [junit4]   2> NOTE: Windows 10 10.0 amd64/Oracle Corporation 1.8.0_121 (64-bit)/cpus=3,threads=1,free=11129264,total=64946176
   [junit4]   2> NOTE: All tests run in this JVM: [SolrMorphlineTest, SolrMorphlineZkAvroTest]
   [junit4] Completed [3/4 (1!)] on J0 in 13.44s, 1 test, 1 error <<< FAILURES!

[...truncated 52028 lines...]



---------------------------------------------------------------------
To unsubscribe, e-mail: [hidden email]
For additional commands, e-mail: [hidden email]
Reply | Threaded
Open this post in threaded view
|  
Report Content as Inappropriate

[JENKINS] Lucene-Solr-master-Windows (64bit/jdk1.8.0_121) - Build # 6460 - Still Unstable!

Policeman Jenkins Server-2
Build: https://jenkins.thetaphi.de/job/Lucene-Solr-master-Windows/6460/
Java: 64bit/jdk1.8.0_121 -XX:-UseCompressedOops -XX:+UseParallelGC

3 tests failed.
FAILED:  org.apache.lucene.store.TestFileSwitchDirectory.testListAllIsSorted

Error Message:
access denied ("java.io.FilePermission" "C:\Users\jenkins\workspace\Lucene-Solr-master-Windows\lucene\build\core\test\J1\temp\lucene.store.TestFileSwitchDirectory_121F5D1A61C5BA5C-001\bar-017\con" "write")

Stack Trace:
java.security.AccessControlException: access denied ("java.io.FilePermission" "C:\Users\jenkins\workspace\Lucene-Solr-master-Windows\lucene\build\core\test\J1\temp\lucene.store.TestFileSwitchDirectory_121F5D1A61C5BA5C-001\bar-017\con" "write")
        at __randomizedtesting.SeedInfo.seed([121F5D1A61C5BA5C:8833FA68A1FA35D5]:0)
        at java.security.AccessControlContext.checkPermission(AccessControlContext.java:472)
        at java.security.AccessController.checkPermission(AccessController.java:884)
        at java.lang.SecurityManager.checkPermission(SecurityManager.java:549)
        at java.lang.SecurityManager.checkWrite(SecurityManager.java:979)
        at sun.nio.fs.WindowsChannelFactory.open(WindowsChannelFactory.java:295)
        at sun.nio.fs.WindowsChannelFactory.newFileChannel(WindowsChannelFactory.java:162)
        at sun.nio.fs.WindowsFileSystemProvider.newByteChannel(WindowsFileSystemProvider.java:225)
        at java.nio.file.spi.FileSystemProvider.newOutputStream(FileSystemProvider.java:434)
        at org.apache.lucene.mockfile.FilterFileSystemProvider.newOutputStream(FilterFileSystemProvider.java:197)
        at org.apache.lucene.mockfile.FilterFileSystemProvider.newOutputStream(FilterFileSystemProvider.java:197)
        at org.apache.lucene.mockfile.HandleTrackingFS.newOutputStream(HandleTrackingFS.java:129)
        at org.apache.lucene.mockfile.HandleTrackingFS.newOutputStream(HandleTrackingFS.java:129)
        at org.apache.lucene.mockfile.FilterFileSystemProvider.newOutputStream(FilterFileSystemProvider.java:197)
        at java.nio.file.Files.newOutputStream(Files.java:216)
        at org.apache.lucene.store.FSDirectory$FSIndexOutput.<init>(FSDirectory.java:413)
        at org.apache.lucene.store.FSDirectory$FSIndexOutput.<init>(FSDirectory.java:409)
        at org.apache.lucene.store.FSDirectory.createOutput(FSDirectory.java:253)
        at org.apache.lucene.store.FileSwitchDirectory.createOutput(FileSwitchDirectory.java:161)
        at org.apache.lucene.store.BaseDirectoryTestCase.testListAllIsSorted(BaseDirectoryTestCase.java:1198)
        at sun.reflect.NativeMethodAccessorImpl.invoke0(Native Method)
        at sun.reflect.NativeMethodAccessorImpl.invoke(NativeMethodAccessorImpl.java:62)
        at sun.reflect.DelegatingMethodAccessorImpl.invoke(DelegatingMethodAccessorImpl.java:43)
        at java.lang.reflect.Method.invoke(Method.java:498)
        at com.carrotsearch.randomizedtesting.RandomizedRunner.invoke(RandomizedRunner.java:1713)
        at com.carrotsearch.randomizedtesting.RandomizedRunner$8.evaluate(RandomizedRunner.java:907)
        at com.carrotsearch.randomizedtesting.RandomizedRunner$9.evaluate(RandomizedRunner.java:943)
        at com.carrotsearch.randomizedtesting.RandomizedRunner$10.evaluate(RandomizedRunner.java:957)
        at org.apache.lucene.util.TestRuleSetupTeardownChained$1.evaluate(TestRuleSetupTeardownChained.java:49)
        at org.apache.lucene.util.AbstractBeforeAfterRule$1.evaluate(AbstractBeforeAfterRule.java:45)
        at org.apache.lucene.util.TestRuleThreadAndTestName$1.evaluate(TestRuleThreadAndTestName.java:48)
        at org.apache.lucene.util.TestRuleIgnoreAfterMaxFailures$1.evaluate(TestRuleIgnoreAfterMaxFailures.java:64)
        at org.apache.lucene.util.TestRuleMarkFailure$1.evaluate(TestRuleMarkFailure.java:47)
        at com.carrotsearch.randomizedtesting.rules.StatementAdapter.evaluate(StatementAdapter.java:36)
        at com.carrotsearch.randomizedtesting.ThreadLeakControl$StatementRunner.run(ThreadLeakControl.java:368)
        at com.carrotsearch.randomizedtesting.ThreadLeakControl.forkTimeoutingTask(ThreadLeakControl.java:817)
        at com.carrotsearch.randomizedtesting.ThreadLeakControl$3.evaluate(ThreadLeakControl.java:468)
        at com.carrotsearch.randomizedtesting.RandomizedRunner.runSingleTest(RandomizedRunner.java:916)
        at com.carrotsearch.randomizedtesting.RandomizedRunner$5.evaluate(RandomizedRunner.java:802)
        at com.carrotsearch.randomizedtesting.RandomizedRunner$6.evaluate(RandomizedRunner.java:852)
        at com.carrotsearch.randomizedtesting.RandomizedRunner$7.evaluate(RandomizedRunner.java:863)
        at org.apache.lucene.util.AbstractBeforeAfterRule$1.evaluate(AbstractBeforeAfterRule.java:45)
        at com.carrotsearch.randomizedtesting.rules.StatementAdapter.evaluate(StatementAdapter.java:36)
        at org.apache.lucene.util.TestRuleStoreClassName$1.evaluate(TestRuleStoreClassName.java:41)
        at com.carrotsearch.randomizedtesting.rules.NoShadowingOrOverridesOnMethodsRule$1.evaluate(NoShadowingOrOverridesOnMethodsRule.java:40)
        at com.carrotsearch.randomizedtesting.rules.NoShadowingOrOverridesOnMethodsRule$1.evaluate(NoShadowingOrOverridesOnMethodsRule.java:40)
        at com.carrotsearch.randomizedtesting.rules.StatementAdapter.evaluate(StatementAdapter.java:36)
        at com.carrotsearch.randomizedtesting.rules.StatementAdapter.evaluate(StatementAdapter.java:36)
        at com.carrotsearch.randomizedtesting.rules.StatementAdapter.evaluate(StatementAdapter.java:36)
        at org.apache.lucene.util.TestRuleAssertionsRequired$1.evaluate(TestRuleAssertionsRequired.java:53)
        at org.apache.lucene.util.TestRuleMarkFailure$1.evaluate(TestRuleMarkFailure.java:47)
        at org.apache.lucene.util.TestRuleIgnoreAfterMaxFailures$1.evaluate(TestRuleIgnoreAfterMaxFailures.java:64)
        at org.apache.lucene.util.TestRuleIgnoreTestSuites$1.evaluate(TestRuleIgnoreTestSuites.java:54)
        at com.carrotsearch.randomizedtesting.rules.StatementAdapter.evaluate(StatementAdapter.java:36)
        at com.carrotsearch.randomizedtesting.ThreadLeakControl$StatementRunner.run(ThreadLeakControl.java:368)
        at java.lang.Thread.run(Thread.java:745)


FAILED:  org.apache.lucene.store.TestNIOFSDirectory.testListAllIsSorted

Error Message:
access denied ("java.io.FilePermission" "C:\Users\jenkins\workspace\Lucene-Solr-master-Windows\lucene\build\core\test\J1\temp\lucene.store.TestNIOFSDirectory_121F5D1A61C5BA5C-001\tempDir-006\con" "write")

Stack Trace:
java.security.AccessControlException: access denied ("java.io.FilePermission" "C:\Users\jenkins\workspace\Lucene-Solr-master-Windows\lucene\build\core\test\J1\temp\lucene.store.TestNIOFSDirectory_121F5D1A61C5BA5C-001\tempDir-006\con" "write")
        at __randomizedtesting.SeedInfo.seed([121F5D1A61C5BA5C:8833FA68A1FA35D5]:0)
        at java.security.AccessControlContext.checkPermission(AccessControlContext.java:472)
        at java.security.AccessController.checkPermission(AccessController.java:884)
        at java.lang.SecurityManager.checkPermission(SecurityManager.java:549)
        at java.lang.SecurityManager.checkWrite(SecurityManager.java:979)
        at sun.nio.fs.WindowsChannelFactory.open(WindowsChannelFactory.java:295)
        at sun.nio.fs.WindowsChannelFactory.newFileChannel(WindowsChannelFactory.java:162)
        at sun.nio.fs.WindowsFileSystemProvider.newByteChannel(WindowsFileSystemProvider.java:225)
        at java.nio.file.spi.FileSystemProvider.newOutputStream(FileSystemProvider.java:434)
        at org.apache.lucene.mockfile.FilterFileSystemProvider.newOutputStream(FilterFileSystemProvider.java:197)
        at org.apache.lucene.mockfile.FilterFileSystemProvider.newOutputStream(FilterFileSystemProvider.java:197)
        at org.apache.lucene.mockfile.HandleTrackingFS.newOutputStream(HandleTrackingFS.java:129)
        at org.apache.lucene.mockfile.HandleTrackingFS.newOutputStream(HandleTrackingFS.java:129)
        at org.apache.lucene.mockfile.FilterFileSystemProvider.newOutputStream(FilterFileSystemProvider.java:197)
        at java.nio.file.Files.newOutputStream(Files.java:216)
        at org.apache.lucene.store.FSDirectory$FSIndexOutput.<init>(FSDirectory.java:413)
        at org.apache.lucene.store.FSDirectory$FSIndexOutput.<init>(FSDirectory.java:409)
        at org.apache.lucene.store.FSDirectory.createOutput(FSDirectory.java:253)
        at org.apache.lucene.store.BaseDirectoryTestCase.testListAllIsSorted(BaseDirectoryTestCase.java:1198)
        at sun.reflect.NativeMethodAccessorImpl.invoke0(Native Method)
        at sun.reflect.NativeMethodAccessorImpl.invoke(NativeMethodAccessorImpl.java:62)
        at sun.reflect.DelegatingMethodAccessorImpl.invoke(DelegatingMethodAccessorImpl.java:43)
        at java.lang.reflect.Method.invoke(Method.java:498)
        at com.carrotsearch.randomizedtesting.RandomizedRunner.invoke(RandomizedRunner.java:1713)
        at com.carrotsearch.randomizedtesting.RandomizedRunner$8.evaluate(RandomizedRunner.java:907)
        at com.carrotsearch.randomizedtesting.RandomizedRunner$9.evaluate(RandomizedRunner.java:943)
        at com.carrotsearch.randomizedtesting.RandomizedRunner$10.evaluate(RandomizedRunner.java:957)
        at org.apache.lucene.util.TestRuleSetupTeardownChained$1.evaluate(TestRuleSetupTeardownChained.java:49)
        at org.apache.lucene.util.AbstractBeforeAfterRule$1.evaluate(AbstractBeforeAfterRule.java:45)
        at org.apache.lucene.util.TestRuleThreadAndTestName$1.evaluate(TestRuleThreadAndTestName.java:48)
        at org.apache.lucene.util.TestRuleIgnoreAfterMaxFailures$1.evaluate(TestRuleIgnoreAfterMaxFailures.java:64)
        at org.apache.lucene.util.TestRuleMarkFailure$1.evaluate(TestRuleMarkFailure.java:47)
        at com.carrotsearch.randomizedtesting.rules.StatementAdapter.evaluate(StatementAdapter.java:36)
        at com.carrotsearch.randomizedtesting.ThreadLeakControl$StatementRunner.run(ThreadLeakControl.java:368)
        at com.carrotsearch.randomizedtesting.ThreadLeakControl.forkTimeoutingTask(ThreadLeakControl.java:817)
        at com.carrotsearch.randomizedtesting.ThreadLeakControl$3.evaluate(ThreadLeakControl.java:468)
        at com.carrotsearch.randomizedtesting.RandomizedRunner.runSingleTest(RandomizedRunner.java:916)
        at com.carrotsearch.randomizedtesting.RandomizedRunner$5.evaluate(RandomizedRunner.java:802)
        at com.carrotsearch.randomizedtesting.RandomizedRunner$6.evaluate(RandomizedRunner.java:852)
        at com.carrotsearch.randomizedtesting.RandomizedRunner$7.evaluate(RandomizedRunner.java:863)
        at org.apache.lucene.util.AbstractBeforeAfterRule$1.evaluate(AbstractBeforeAfterRule.java:45)
        at com.carrotsearch.randomizedtesting.rules.StatementAdapter.evaluate(StatementAdapter.java:36)
        at org.apache.lucene.util.TestRuleStoreClassName$1.evaluate(TestRuleStoreClassName.java:41)
        at com.carrotsearch.randomizedtesting.rules.NoShadowingOrOverridesOnMethodsRule$1.evaluate(NoShadowingOrOverridesOnMethodsRule.java:40)
        at com.carrotsearch.randomizedtesting.rules.NoShadowingOrOverridesOnMethodsRule$1.evaluate(NoShadowingOrOverridesOnMethodsRule.java:40)
        at com.carrotsearch.randomizedtesting.rules.StatementAdapter.evaluate(StatementAdapter.java:36)
        at com.carrotsearch.randomizedtesting.rules.StatementAdapter.evaluate(StatementAdapter.java:36)
        at com.carrotsearch.randomizedtesting.rules.StatementAdapter.evaluate(StatementAdapter.java:36)
        at org.apache.lucene.util.TestRuleAssertionsRequired$1.evaluate(TestRuleAssertionsRequired.java:53)
        at org.apache.lucene.util.TestRuleMarkFailure$1.evaluate(TestRuleMarkFailure.java:47)
        at org.apache.lucene.util.TestRuleIgnoreAfterMaxFailures$1.evaluate(TestRuleIgnoreAfterMaxFailures.java:64)
        at org.apache.lucene.util.TestRuleIgnoreTestSuites$1.evaluate(TestRuleIgnoreTestSuites.java:54)
        at com.carrotsearch.randomizedtesting.rules.StatementAdapter.evaluate(StatementAdapter.java:36)
        at com.carrotsearch.randomizedtesting.ThreadLeakControl$StatementRunner.run(ThreadLeakControl.java:368)
        at java.lang.Thread.run(Thread.java:745)


FAILED:  org.apache.lucene.store.TestSimpleFSDirectory.testListAllIsSorted

Error Message:
access denied ("java.io.FilePermission" "C:\Users\jenkins\workspace\Lucene-Solr-master-Windows\lucene\build\core\test\J1\temp\lucene.store.TestSimpleFSDirectory_121F5D1A61C5BA5C-001\tempDir-006\con" "write")

Stack Trace:
java.security.AccessControlException: access denied ("java.io.FilePermission" "C:\Users\jenkins\workspace\Lucene-Solr-master-Windows\lucene\build\core\test\J1\temp\lucene.store.TestSimpleFSDirectory_121F5D1A61C5BA5C-001\tempDir-006\con" "write")
        at __randomizedtesting.SeedInfo.seed([121F5D1A61C5BA5C:8833FA68A1FA35D5]:0)
        at java.security.AccessControlContext.checkPermission(AccessControlContext.java:472)
        at java.security.AccessController.checkPermission(AccessController.java:884)
        at java.lang.SecurityManager.checkPermission(SecurityManager.java:549)
        at java.lang.SecurityManager.checkWrite(SecurityManager.java:979)
        at sun.nio.fs.WindowsChannelFactory.open(WindowsChannelFactory.java:295)
        at sun.nio.fs.WindowsChannelFactory.newFileChannel(WindowsChannelFactory.java:162)
        at sun.nio.fs.WindowsFileSystemProvider.newByteChannel(WindowsFileSystemProvider.java:225)
        at java.nio.file.spi.FileSystemProvider.newOutputStream(FileSystemProvider.java:434)
        at org.apache.lucene.mockfile.FilterFileSystemProvider.newOutputStream(FilterFileSystemProvider.java:197)
        at org.apache.lucene.mockfile.FilterFileSystemProvider.newOutputStream(FilterFileSystemProvider.java:197)
        at org.apache.lucene.mockfile.HandleTrackingFS.newOutputStream(HandleTrackingFS.java:129)
        at org.apache.lucene.mockfile.HandleTrackingFS.newOutputStream(HandleTrackingFS.java:129)
        at org.apache.lucene.mockfile.FilterFileSystemProvider.newOutputStream(FilterFileSystemProvider.java:197)
        at java.nio.file.Files.newOutputStream(Files.java:216)
        at org.apache.lucene.store.FSDirectory$FSIndexOutput.<init>(FSDirectory.java:413)
        at org.apache.lucene.store.FSDirectory$FSIndexOutput.<init>(FSDirectory.java:409)
        at org.apache.lucene.store.FSDirectory.createOutput(FSDirectory.java:253)
        at org.apache.lucene.store.BaseDirectoryTestCase.testListAllIsSorted(BaseDirectoryTestCase.java:1198)
        at sun.reflect.NativeMethodAccessorImpl.invoke0(Native Method)
        at sun.reflect.NativeMethodAccessorImpl.invoke(NativeMethodAccessorImpl.java:62)
        at sun.reflect.DelegatingMethodAccessorImpl.invoke(DelegatingMethodAccessorImpl.java:43)
        at java.lang.reflect.Method.invoke(Method.java:498)
        at com.carrotsearch.randomizedtesting.RandomizedRunner.invoke(RandomizedRunner.java:1713)
        at com.carrotsearch.randomizedtesting.RandomizedRunner$8.evaluate(RandomizedRunner.java:907)
        at com.carrotsearch.randomizedtesting.RandomizedRunner$9.evaluate(RandomizedRunner.java:943)
        at com.carrotsearch.randomizedtesting.RandomizedRunner$10.evaluate(RandomizedRunner.java:957)
        at org.apache.lucene.util.TestRuleSetupTeardownChained$1.evaluate(TestRuleSetupTeardownChained.java:49)
        at org.apache.lucene.util.AbstractBeforeAfterRule$1.evaluate(AbstractBeforeAfterRule.java:45)
        at org.apache.lucene.util.TestRuleThreadAndTestName$1.evaluate(TestRuleThreadAndTestName.java:48)
        at org.apache.lucene.util.TestRuleIgnoreAfterMaxFailures$1.evaluate(TestRuleIgnoreAfterMaxFailures.java:64)
        at org.apache.lucene.util.TestRuleMarkFailure$1.evaluate(TestRuleMarkFailure.java:47)
        at com.carrotsearch.randomizedtesting.rules.StatementAdapter.evaluate(StatementAdapter.java:36)
        at com.carrotsearch.randomizedtesting.ThreadLeakControl$StatementRunner.run(ThreadLeakControl.java:368)
        at com.carrotsearch.randomizedtesting.ThreadLeakControl.forkTimeoutingTask(ThreadLeakControl.java:817)
        at com.carrotsearch.randomizedtesting.ThreadLeakControl$3.evaluate(ThreadLeakControl.java:468)
        at com.carrotsearch.randomizedtesting.RandomizedRunner.runSingleTest(RandomizedRunner.java:916)
        at com.carrotsearch.randomizedtesting.RandomizedRunner$5.evaluate(RandomizedRunner.java:802)
        at com.carrotsearch.randomizedtesting.RandomizedRunner$6.evaluate(RandomizedRunner.java:852)
        at com.carrotsearch.randomizedtesting.RandomizedRunner$7.evaluate(RandomizedRunner.java:863)
        at org.apache.lucene.util.AbstractBeforeAfterRule$1.evaluate(AbstractBeforeAfterRule.java:45)
        at com.carrotsearch.randomizedtesting.rules.StatementAdapter.evaluate(StatementAdapter.java:36)
        at org.apache.lucene.util.TestRuleStoreClassName$1.evaluate(TestRuleStoreClassName.java:41)
        at com.carrotsearch.randomizedtesting.rules.NoShadowingOrOverridesOnMethodsRule$1.evaluate(NoShadowingOrOverridesOnMethodsRule.java:40)
        at com.carrotsearch.randomizedtesting.rules.NoShadowingOrOverridesOnMethodsRule$1.evaluate(NoShadowingOrOverridesOnMethodsRule.java:40)
        at com.carrotsearch.randomizedtesting.rules.StatementAdapter.evaluate(StatementAdapter.java:36)
        at com.carrotsearch.randomizedtesting.rules.StatementAdapter.evaluate(StatementAdapter.java:36)
        at com.carrotsearch.randomizedtesting.rules.StatementAdapter.evaluate(StatementAdapter.java:36)
        at org.apache.lucene.util.TestRuleAssertionsRequired$1.evaluate(TestRuleAssertionsRequired.java:53)
        at org.apache.lucene.util.TestRuleMarkFailure$1.evaluate(TestRuleMarkFailure.java:47)
        at org.apache.lucene.util.TestRuleIgnoreAfterMaxFailures$1.evaluate(TestRuleIgnoreAfterMaxFailures.java:64)
        at org.apache.lucene.util.TestRuleIgnoreTestSuites$1.evaluate(TestRuleIgnoreTestSuites.java:54)
        at com.carrotsearch.randomizedtesting.rules.StatementAdapter.evaluate(StatementAdapter.java:36)
        at com.carrotsearch.randomizedtesting.ThreadLeakControl$StatementRunner.run(ThreadLeakControl.java:368)
        at java.lang.Thread.run(Thread.java:745)




Build Log:
[...truncated 688 lines...]
   [junit4] Suite: org.apache.lucene.store.TestFileSwitchDirectory
   [junit4] IGNOR/A 0.02s J1 | TestFileSwitchDirectory.testPendingDeletions
   [junit4]    > Assumption #1: we can only install VirusCheckingFS on an FSDirectory
   [junit4]   2> NOTE: reproduce with: ant test  -Dtestcase=TestFileSwitchDirectory -Dtests.method=testListAllIsSorted -Dtests.seed=121F5D1A61C5BA5C -Dtests.slow=true -Dtests.locale=ar-BH -Dtests.timezone=America/Jamaica -Dtests.asserts=true -Dtests.file.encoding=ISO-8859-1
   [junit4] ERROR   0.03s J1 | TestFileSwitchDirectory.testListAllIsSorted <<<
   [junit4]    > Throwable #1: java.security.AccessControlException: access denied ("java.io.FilePermission" "C:\Users\jenkins\workspace\Lucene-Solr-master-Windows\lucene\build\core\test\J1\temp\lucene.store.TestFileSwitchDirectory_121F5D1A61C5BA5C-001\bar-017\con" "write")
   [junit4]    > at __randomizedtesting.SeedInfo.seed([121F5D1A61C5BA5C:8833FA68A1FA35D5]:0)
   [junit4]    > at java.security.AccessControlContext.checkPermission(AccessControlContext.java:472)
   [junit4]    > at java.security.AccessController.checkPermission(AccessController.java:884)
   [junit4]    > at java.lang.SecurityManager.checkPermission(SecurityManager.java:549)
   [junit4]    > at java.lang.SecurityManager.checkWrite(SecurityManager.java:979)
   [junit4]    > at sun.nio.fs.WindowsChannelFactory.open(WindowsChannelFactory.java:295)
   [junit4]    > at sun.nio.fs.WindowsChannelFactory.newFileChannel(WindowsChannelFactory.java:162)
   [junit4]    > at sun.nio.fs.WindowsFileSystemProvider.newByteChannel(WindowsFileSystemProvider.java:225)
   [junit4]    > at java.nio.file.spi.FileSystemProvider.newOutputStream(FileSystemProvider.java:434)
   [junit4]    > at org.apache.lucene.mockfile.FilterFileSystemProvider.newOutputStream(FilterFileSystemProvider.java:197)
   [junit4]    > at org.apache.lucene.mockfile.FilterFileSystemProvider.newOutputStream(FilterFileSystemProvider.java:197)
   [junit4]    > at org.apache.lucene.mockfile.HandleTrackingFS.newOutputStream(HandleTrackingFS.java:129)
   [junit4]    > at org.apache.lucene.mockfile.HandleTrackingFS.newOutputStream(HandleTrackingFS.java:129)
   [junit4]    > at org.apache.lucene.mockfile.FilterFileSystemProvider.newOutputStream(FilterFileSystemProvider.java:197)
   [junit4]    > at java.nio.file.Files.newOutputStream(Files.java:216)
   [junit4]    > at org.apache.lucene.store.FSDirectory$FSIndexOutput.<init>(FSDirectory.java:413)
   [junit4]    > at org.apache.lucene.store.FSDirectory$FSIndexOutput.<init>(FSDirectory.java:409)
   [junit4]    > at org.apache.lucene.store.FSDirectory.createOutput(FSDirectory.java:253)
   [junit4]    > at org.apache.lucene.store.FileSwitchDirectory.createOutput(FileSwitchDirectory.java:161)
   [junit4]    > at org.apache.lucene.store.BaseDirectoryTestCase.testListAllIsSorted(BaseDirectoryTestCase.java:1198)
   [junit4]    > at java.lang.Thread.run(Thread.java:745)
   [junit4] IGNOR/A 0.01s J1 | TestFileSwitchDirectory.testFsyncDoesntCreateNewFiles
   [junit4]    > Assumption #1: test only works for FSDirectory subclasses
   [junit4]   2> NOTE: leaving temporary files on disk at: C:\Users\jenkins\workspace\Lucene-Solr-master-Windows\lucene\build\core\test\J1\temp\lucene.store.TestFileSwitchDirectory_121F5D1A61C5BA5C-001
   [junit4]   2> NOTE: test params are: codec=CheapBastard, sim=RandomSimilarity(queryNorm=false): {}, locale=ar-BH, timezone=America/Jamaica
   [junit4]   2> NOTE: Windows 10 10.0 amd64/Oracle Corporation 1.8.0_121 (64-bit)/cpus=3,threads=1,free=26564936,total=201326592
   [junit4]   2> NOTE: All tests run in this JVM: [TestPerFieldPostingsFormat2, TestCharArraySet, TestBytesRefHash, TestOmitNorms, TestFilterSpans, TestEarlyTerminatingSortingCollector, TestIndexWriterNRTIsCurrent, TestRollback, TestReadOnlyIndex, TestExceedMaxTermLength, Test2BNumericDocValues, TestTrackingDirectoryWrapper, TestParallelTermEnum, TestTransactionRollback, TestIndexWriterConfig, TestConcurrentMergeScheduler, TestDeterminism, TestUniqueTermCount, TestIndexSearcher, TestDoubleRangeFieldQueries, TestIndexWriterOutOfFileDescriptors, TestTermVectorsReader, TestBlockPostingsFormat, TestNearSpansOrdered, TestLucene70DocValuesFormat, TestTermRangeQuery, TestLucene62SegmentInfoFormat, TestAxiomaticSimilarity, TestDirectPacked, TestSpanOrQuery, TestIndexWriterForceMerge, TestFileSwitchDirectory]
   [junit4] Completed [144/451 (1!)] on J1 in 3.13s, 43 tests, 1 error, 2 skipped <<< FAILURES!

[...truncated 222 lines...]
   [junit4] Suite: org.apache.lucene.store.TestSimpleFSDirectory
   [junit4]   2> NOTE: reproduce with: ant test  -Dtestcase=TestSimpleFSDirectory -Dtests.method=testListAllIsSorted -Dtests.seed=121F5D1A61C5BA5C -Dtests.slow=true -Dtests.locale=en-ZA -Dtests.timezone=America/Knox_IN -Dtests.asserts=true -Dtests.file.encoding=ISO-8859-1
   [junit4] ERROR   0.01s J1 | TestSimpleFSDirectory.testListAllIsSorted <<<
   [junit4]    > Throwable #1: java.security.AccessControlException: access denied ("java.io.FilePermission" "C:\Users\jenkins\workspace\Lucene-Solr-master-Windows\lucene\build\core\test\J1\temp\lucene.store.TestSimpleFSDirectory_121F5D1A61C5BA5C-001\tempDir-006\con" "write")
   [junit4]    > at __randomizedtesting.SeedInfo.seed([121F5D1A61C5BA5C:8833FA68A1FA35D5]:0)
   [junit4]    > at java.security.AccessControlContext.checkPermission(AccessControlContext.java:472)
   [junit4]    > at java.security.AccessController.checkPermission(AccessController.java:884)
   [junit4]    > at java.lang.SecurityManager.checkPermission(SecurityManager.java:549)
   [junit4]    > at java.lang.SecurityManager.checkWrite(SecurityManager.java:979)
   [junit4]    > at sun.nio.fs.WindowsChannelFactory.open(WindowsChannelFactory.java:295)
   [junit4]    > at sun.nio.fs.WindowsChannelFactory.newFileChannel(WindowsChannelFactory.java:162)
   [junit4]    > at sun.nio.fs.WindowsFileSystemProvider.newByteChannel(WindowsFileSystemProvider.java:225)
   [junit4]    > at java.nio.file.spi.FileSystemProvider.newOutputStream(FileSystemProvider.java:434)
   [junit4]    > at org.apache.lucene.mockfile.FilterFileSystemProvider.newOutputStream(FilterFileSystemProvider.java:197)
   [junit4]    > at org.apache.lucene.mockfile.FilterFileSystemProvider.newOutputStream(FilterFileSystemProvider.java:197)
   [junit4]    > at org.apache.lucene.mockfile.HandleTrackingFS.newOutputStream(HandleTrackingFS.java:129)
   [junit4]    > at org.apache.lucene.mockfile.HandleTrackingFS.newOutputStream(HandleTrackingFS.java:129)
   [junit4]    > at org.apache.lucene.mockfile.FilterFileSystemProvider.newOutputStream(FilterFileSystemProvider.java:197)
   [junit4]    > at java.nio.file.Files.newOutputStream(Files.java:216)
   [junit4]    > at org.apache.lucene.store.FSDirectory$FSIndexOutput.<init>(FSDirectory.java:413)
   [junit4]    > at org.apache.lucene.store.FSDirectory$FSIndexOutput.<init>(FSDirectory.java:409)
   [junit4]    > at org.apache.lucene.store.FSDirectory.createOutput(FSDirectory.java:253)
   [junit4]    > at org.apache.lucene.store.BaseDirectoryTestCase.testListAllIsSorted(BaseDirectoryTestCase.java:1198)
   [junit4]    > at java.lang.Thread.run(Thread.java:745)
   [junit4]   2> NOTE: leaving temporary files on disk at: C:\Users\jenkins\workspace\Lucene-Solr-master-Windows\lucene\build\core\test\J1\temp\lucene.store.TestSimpleFSDirectory_121F5D1A61C5BA5C-001
   [junit4]   2> NOTE: test params are: codec=Asserting(Lucene70): {}, docValues:{}, maxPointsInLeafNode=1369, maxMBSortInHeap=6.070639152294969, sim=RandomSimilarity(queryNorm=false): {}, locale=en-ZA, timezone=America/Knox_IN
   [junit4]   2> NOTE: Windows 10 10.0 amd64/Oracle Corporation 1.8.0_121 (64-bit)/cpus=3,threads=1,free=114851360,total=213385216
   [junit4]   2> NOTE: All tests run in this JVM: [TestPerFieldPostingsFormat2, TestCharArraySet, TestBytesRefHash, TestOmitNorms, TestFilterSpans, TestEarlyTerminatingSortingCollector, TestIndexWriterNRTIsCurrent, TestRollback, TestReadOnlyIndex, TestExceedMaxTermLength, Test2BNumericDocValues, TestTrackingDirectoryWrapper, TestParallelTermEnum, TestTransactionRollback, TestIndexWriterConfig, TestConcurrentMergeScheduler, TestDeterminism, TestUniqueTermCount, TestIndexSearcher, TestDoubleRangeFieldQueries, TestIndexWriterOutOfFileDescriptors, TestTermVectorsReader, TestBlockPostingsFormat, TestNearSpansOrdered, TestLucene70DocValuesFormat, TestTermRangeQuery, TestLucene62SegmentInfoFormat, TestAxiomaticSimilarity, TestDirectPacked, TestSpanOrQuery, TestIndexWriterForceMerge, TestFileSwitchDirectory, TestLucene50StoredFieldsFormatHighCompression, TestSimpleExplanationsWithFillerDocs, TestAllFilesCheckIndexHeader, TestCharTermAttributeImpl, Test2BPostingsBytes, TestFixedBitSet, TestCompiledAutomaton, TestSpanFirstQuery, TestMinShouldMatch2, TestMultiFields, TestSearchAfter, Test2BDocs, TestDelegatingAnalyzerWrapper, TestSingleInstanceLockFactory, TestDocumentsWriterStallControl, TestForTooMuchCloning, TestRollingBuffer, TestMultiDocValues, TestRollingUpdates, TestIndexWriterOnDiskFull, TestSegmentTermDocs, TestDocValuesScoring, TestBlockPostingsFormat3, TestRegExp, TestIndexingSequenceNumbers, TestTermVectorsWriter, TermInSetQueryTest, TestMergeSchedulerExternal, TestDirectoryReaderReopen, TestTotalHitCountCollector, TestSearcherManager, TestNRTCachingDirectory, TestNGramPhraseQuery, TestUpgradeIndexMergePolicy, TestDemoParallelLeafReader, TestSortRandom, TestDemo, TestIndexSorting, TestSparseFixedBitDocIdSet, TestStopFilter, TestDeletionPolicy, TestCharsRefBuilder, TestCachingCollector, TestMultiPhraseEnum, TestSimpleFSDirectory]
   [junit4] Completed [212/451 (2!)] on J1 in 2.49s, 42 tests, 1 error <<< FAILURES!

[...truncated 690 lines...]
   [junit4] Suite: org.apache.lucene.store.TestNIOFSDirectory
   [junit4]   2> NOTE: reproduce with: ant test  -Dtestcase=TestNIOFSDirectory -Dtests.method=testListAllIsSorted -Dtests.seed=121F5D1A61C5BA5C -Dtests.slow=true -Dtests.locale=sr-ME -Dtests.timezone=Africa/Bissau -Dtests.asserts=true -Dtests.file.encoding=ISO-8859-1
   [junit4] ERROR   0.01s J1 | TestNIOFSDirectory.testListAllIsSorted <<<
   [junit4]    > Throwable #1: java.security.AccessControlException: access denied ("java.io.FilePermission" "C:\Users\jenkins\workspace\Lucene-Solr-master-Windows\lucene\build\core\test\J1\temp\lucene.store.TestNIOFSDirectory_121F5D1A61C5BA5C-001\tempDir-006\con" "write")
   [junit4]    > at __randomizedtesting.SeedInfo.seed([121F5D1A61C5BA5C:8833FA68A1FA35D5]:0)
   [junit4]    > at java.security.AccessControlContext.checkPermission(AccessControlContext.java:472)
   [junit4]    > at java.security.AccessController.checkPermission(AccessController.java:884)
   [junit4]    > at java.lang.SecurityManager.checkPermission(SecurityManager.java:549)
   [junit4]    > at java.lang.SecurityManager.checkWrite(SecurityManager.java:979)
   [junit4]    > at sun.nio.fs.WindowsChannelFactory.open(WindowsChannelFactory.java:295)
   [junit4]    > at sun.nio.fs.WindowsChannelFactory.newFileChannel(WindowsChannelFactory.java:162)
   [junit4]    > at sun.nio.fs.WindowsFileSystemProvider.newByteChannel(WindowsFileSystemProvider.java:225)
   [junit4]    > at java.nio.file.spi.FileSystemProvider.newOutputStream(FileSystemProvider.java:434)
   [junit4]    > at org.apache.lucene.mockfile.FilterFileSystemProvider.newOutputStream(FilterFileSystemProvider.java:197)
   [junit4]    > at org.apache.lucene.mockfile.FilterFileSystemProvider.newOutputStream(FilterFileSystemProvider.java:197)
   [junit4]    > at org.apache.lucene.mockfile.HandleTrackingFS.newOutputStream(HandleTrackingFS.java:129)
   [junit4]    > at org.apache.lucene.mockfile.HandleTrackingFS.newOutputStream(HandleTrackingFS.java:129)
   [junit4]    > at org.apache.lucene.mockfile.FilterFileSystemProvider.newOutputStream(FilterFileSystemProvider.java:197)
   [junit4]    > at java.nio.file.Files.newOutputStream(Files.java:216)
   [junit4]    > at org.apache.lucene.store.FSDirectory$FSIndexOutput.<init>(FSDirectory.java:413)
   [junit4]    > at org.apache.lucene.store.FSDirectory$FSIndexOutput.<init>(FSDirectory.java:409)
   [junit4]    > at org.apache.lucene.store.FSDirectory.createOutput(FSDirectory.java:253)
   [junit4]    > at org.apache.lucene.store.BaseDirectoryTestCase.testListAllIsSorted(BaseDirectoryTestCase.java:1198)
   [junit4]    > at java.lang.Thread.run(Thread.java:745)
   [junit4]   2> NOTE: leaving temporary files on disk at: C:\Users\jenkins\workspace\Lucene-Solr-master-Windows\lucene\build\core\test\J1\temp\lucene.store.TestNIOFSDirectory_121F5D1A61C5BA5C-001
   [junit4]   2> NOTE: test params are: codec=Asserting(Lucene70): {}, docValues:{}, maxPointsInLeafNode=1652, maxMBSortInHeap=7.556654604900439, sim=RandomSimilarity(queryNorm=false): {}, locale=sr-ME, timezone=Africa/Bissau
   [junit4]   2> NOTE: Windows 10 10.0 amd64/Oracle Corporation 1.8.0_121 (64-bit)/cpus=3,threads=1,free=160648488,total=299892736
   [junit4]   2> NOTE: All tests run in this JVM: [TestPerFieldPostingsFormat2, TestCharArraySet, TestBytesRefHash, TestOmitNorms, TestFilterSpans, TestEarlyTerminatingSortingCollector, TestIndexWriterNRTIsCurrent, TestRollback, TestReadOnlyIndex, TestExceedMaxTermLength, Test2BNumericDocValues, TestTrackingDirectoryWrapper, TestParallelTermEnum, TestTransactionRollback, TestIndexWriterConfig, TestConcurrentMergeScheduler, TestDeterminism, TestUniqueTermCount, TestIndexSearcher, TestDoubleRangeFieldQueries, TestIndexWriterOutOfFileDescriptors, TestTermVectorsReader, TestBlockPostingsFormat, TestNearSpansOrdered, TestLucene70DocValuesFormat, TestTermRangeQuery, TestLucene62SegmentInfoFormat, TestAxiomaticSimilarity, TestDirectPacked, TestSpanOrQuery, TestIndexWriterForceMerge, TestFileSwitchDirectory, TestLucene50StoredFieldsFormatHighCompression, TestSimpleExplanationsWithFillerDocs, TestAllFilesCheckIndexHeader, TestCharTermAttributeImpl, Test2BPostingsBytes, TestFixedBitSet, TestCompiledAutomaton, TestSpanFirstQuery, TestMinShouldMatch2, TestMultiFields, TestSearchAfter, Test2BDocs, TestDelegatingAnalyzerWrapper, TestSingleInstanceLockFactory, TestDocumentsWriterStallControl, TestForTooMuchCloning, TestRollingBuffer, TestMultiDocValues, TestRollingUpdates, TestIndexWriterOnDiskFull, TestSegmentTermDocs, TestDocValuesScoring, TestBlockPostingsFormat3, TestRegExp, TestIndexingSequenceNumbers, TestTermVectorsWriter, TermInSetQueryTest, TestMergeSchedulerExternal, TestDirectoryReaderReopen, TestTotalHitCountCollector, TestSearcherManager, TestNRTCachingDirectory, TestNGramPhraseQuery, TestUpgradeIndexMergePolicy, TestDemoParallelLeafReader, TestSortRandom, TestDemo, TestIndexSorting, TestSparseFixedBitDocIdSet, TestStopFilter, TestDeletionPolicy, TestCharsRefBuilder, TestCachingCollector, TestMultiPhraseEnum, TestSimpleFSDirectory, TestSizeBoundedForceMerge, TestCachingTokenFilter, TestPositiveScoresOnlyCollector, TestIndexWriterReader, TestSpanMultiTermQueryWrapper, TestByteBlockPool, TestComplexExplanationsOfNonMatches, TestIndexWriterCommit, TestRadixSelector, TestShardSearching, TestNot, TestMathUtil, TestPersistentSnapshotDeletionPolicy, TestVersion, TestIntsRef, TestFlex, TestDocInverterPerFieldErrorInfo, TestFrequencyTrackingRingBuffer, TestMutableValues, TestDisjunctionMaxQuery, TestStressAdvance, TestIndexWriterMaxDocs, TestSimpleSearchEquivalence, TestIsCurrent, TestLongPostings, Test2BBinaryDocValues, TestCheckIndex, TestMultiTermConstantScore, TestSpansEnum, TestFixedBitDocIdSet, TestIndexWriterExceptions2, TestCustomSearcherSort, TestMmapDirectory, TestDocumentWriter, TestTragicIndexWriterDeadlock, TestStressDeletes, TestByteSlices, TestDocValuesIndexing, TestHugeRamFile, TestCustomNorms, TestUTF32ToUTF8, TestMultiPhraseQuery, TestStressNRT, TestSloppyPhraseQuery2, TestSameScoresWithThreads, TestCrashCausesCorruptIndex, TestFuzzyQuery, TestFieldMaskingSpanQuery, TestSimpleExplanationsOfNonMatches, TestPrefixInBooleanQuery, TestAutomatonQuery, TestIndexableField, TestPrefixRandom, TestMultiLevelSkipList, TestSearchForDuplicates, TestMatchAllDocsQuery, TestElevationComparator, TestSubScorerFreqs, TestRecyclingIntBlockAllocator, TestMultiTermQueryRewrites, TestSimilarity, TestVirtualMethod, TestSimilarityProvider, TestDateTools, Test2BPostings, TestDocCount, TestAutomatonQueryUnicode, TestRamUsageEstimator, TestNoMergeScheduler, TestIndexWriterLockRelease, TestPhrasePrefixQuery, TestAssertions, TestCloseableThreadLocal, Test4GBStoredFields, TestReaderClosed, TestSimpleAttributeImpl, Test2BPositions, Test2BTerms, Test2BPagedBytes, TestCharArrayMap, TestPackedTokenAttributeImpl, TestCodecUtil, TestBlockPostingsFormat2, TestLucene50StoredFieldsFormat, TestLucene60FieldInfoFormat, TestFieldType, TestGeoUtils, TestPolygon, TestPolygon2D, TestDocsWithFieldSet, TestExitableDirectoryReader, TestFilterDirectoryReader, TestInfoStream, TestMaxPosition, TestMergeRateLimiter, TestNRTReaderCleanup, TestNumericDocValuesUpdates, TestReaderWrapperDVTypeCheck, TestSegmentInfos, TestSortedSetDocValues, TestTermVectors, FuzzyTermOnShortTermsTest, TestApproximationSearchEquivalence, TestBlendedTermQuery, TestBooleanRewrites, TestBoostQuery, TestConjunctionDISI, TestControlledRealTimeReopenThread, TestDocValuesQueries, TestEarlyTermination, TestFieldValueQuery, TestFloatRangeFieldQueries, TestIntRangeFieldQueries, TestLRUQueryCache, TestMultiset, TestQueryRescorer, TestSortedSetSelector, TestSynonymQuery, TestBM25Similarity, TestSpanCollection, TestSpanTermQuery, TestFilterDirectory, TestNIOFSDirectory]
   [junit4] Completed [425/451 (3!)] on J1 in 2.00s, 42 tests, 1 error <<< FAILURES!

[...truncated 74223 lines...]



---------------------------------------------------------------------
To unsubscribe, e-mail: [hidden email]
For additional commands, e-mail: [hidden email]
Reply | Threaded
Open this post in threaded view
|  
Report Content as Inappropriate

Re: [JENKINS] Lucene-Solr-master-Windows (64bit/jdk1.8.0_121) - Build # 6460 - Still Unstable!

sarowe
Files named “con[0-9]?” (and “prn[0-9]?”, etc.?) anger Windows.

I thought this got fixed a while back?  I can’t find any JIRAs for it though.

--
Steve
www.lucidworks.com

> On Mar 19, 2017, at 1:06 PM, Policeman Jenkins Server <[hidden email]> wrote:
>
> Build: https://jenkins.thetaphi.de/job/Lucene-Solr-master-Windows/6460/
> Java: 64bit/jdk1.8.0_121 -XX:-UseCompressedOops -XX:+UseParallelGC
>
> 3 tests failed.
> FAILED:  org.apache.lucene.store.TestFileSwitchDirectory.testListAllIsSorted
>
> Error Message:
> access denied ("java.io.FilePermission" "C:\Users\jenkins\workspace\Lucene-Solr-master-Windows\lucene\build\core\test\J1\temp\lucene.store.TestFileSwitchDirectory_121F5D1A61C5BA5C-001\bar-017\con" "write")
>
> Stack Trace:
> java.security.AccessControlException: access denied ("java.io.FilePermission" "C:\Users\jenkins\workspace\Lucene-Solr-master-Windows\lucene\build\core\test\J1\temp\lucene.store.TestFileSwitchDirectory_121F5D1A61C5BA5C-001\bar-017\con" "write")
> at __randomizedtesting.SeedInfo.seed([121F5D1A61C5BA5C:8833FA68A1FA35D5]:0)
> at java.security.AccessControlContext.checkPermission(AccessControlContext.java:472)
> at java.security.AccessController.checkPermission(AccessController.java:884)
> at java.lang.SecurityManager.checkPermission(SecurityManager.java:549)
> at java.lang.SecurityManager.checkWrite(SecurityManager.java:979)
> at sun.nio.fs.WindowsChannelFactory.open(WindowsChannelFactory.java:295)
> at sun.nio.fs.WindowsChannelFactory.newFileChannel(WindowsChannelFactory.java:162)
> at sun.nio.fs.WindowsFileSystemProvider.newByteChannel(WindowsFileSystemProvider.java:225)
> at java.nio.file.spi.FileSystemProvider.newOutputStream(FileSystemProvider.java:434)
> at org.apache.lucene.mockfile.FilterFileSystemProvider.newOutputStream(FilterFileSystemProvider.java:197)
> at org.apache.lucene.mockfile.FilterFileSystemProvider.newOutputStream(FilterFileSystemProvider.java:197)
> at org.apache.lucene.mockfile.HandleTrackingFS.newOutputStream(HandleTrackingFS.java:129)
> at org.apache.lucene.mockfile.HandleTrackingFS.newOutputStream(HandleTrackingFS.java:129)
> at org.apache.lucene.mockfile.FilterFileSystemProvider.newOutputStream(FilterFileSystemProvider.java:197)
> at java.nio.file.Files.newOutputStream(Files.java:216)
> at org.apache.lucene.store.FSDirectory$FSIndexOutput.<init>(FSDirectory.java:413)
> at org.apache.lucene.store.FSDirectory$FSIndexOutput.<init>(FSDirectory.java:409)
> at org.apache.lucene.store.FSDirectory.createOutput(FSDirectory.java:253)
> at org.apache.lucene.store.FileSwitchDirectory.createOutput(FileSwitchDirectory.java:161)
> at org.apache.lucene.store.BaseDirectoryTestCase.testListAllIsSorted(BaseDirectoryTestCase.java:1198)
> at sun.reflect.NativeMethodAccessorImpl.invoke0(Native Method)
> at sun.reflect.NativeMethodAccessorImpl.invoke(NativeMethodAccessorImpl.java:62)
> at sun.reflect.DelegatingMethodAccessorImpl.invoke(DelegatingMethodAccessorImpl.java:43)
> at java.lang.reflect.Method.invoke(Method.java:498)
> at com.carrotsearch.randomizedtesting.RandomizedRunner.invoke(RandomizedRunner.java:1713)
> at com.carrotsearch.randomizedtesting.RandomizedRunner$8.evaluate(RandomizedRunner.java:907)
> at com.carrotsearch.randomizedtesting.RandomizedRunner$9.evaluate(RandomizedRunner.java:943)
> at com.carrotsearch.randomizedtesting.RandomizedRunner$10.evaluate(RandomizedRunner.java:957)
> at org.apache.lucene.util.TestRuleSetupTeardownChained$1.evaluate(TestRuleSetupTeardownChained.java:49)
> at org.apache.lucene.util.AbstractBeforeAfterRule$1.evaluate(AbstractBeforeAfterRule.java:45)
> at org.apache.lucene.util.TestRuleThreadAndTestName$1.evaluate(TestRuleThreadAndTestName.java:48)
> at org.apache.lucene.util.TestRuleIgnoreAfterMaxFailures$1.evaluate(TestRuleIgnoreAfterMaxFailures.java:64)
> at org.apache.lucene.util.TestRuleMarkFailure$1.evaluate(TestRuleMarkFailure.java:47)
> at com.carrotsearch.randomizedtesting.rules.StatementAdapter.evaluate(StatementAdapter.java:36)
> at com.carrotsearch.randomizedtesting.ThreadLeakControl$StatementRunner.run(ThreadLeakControl.java:368)
> at com.carrotsearch.randomizedtesting.ThreadLeakControl.forkTimeoutingTask(ThreadLeakControl.java:817)
> at com.carrotsearch.randomizedtesting.ThreadLeakControl$3.evaluate(ThreadLeakControl.java:468)
> at com.carrotsearch.randomizedtesting.RandomizedRunner.runSingleTest(RandomizedRunner.java:916)
> at com.carrotsearch.randomizedtesting.RandomizedRunner$5.evaluate(RandomizedRunner.java:802)
> at com.carrotsearch.randomizedtesting.RandomizedRunner$6.evaluate(RandomizedRunner.java:852)
> at com.carrotsearch.randomizedtesting.RandomizedRunner$7.evaluate(RandomizedRunner.java:863)
> at org.apache.lucene.util.AbstractBeforeAfterRule$1.evaluate(AbstractBeforeAfterRule.java:45)
> at com.carrotsearch.randomizedtesting.rules.StatementAdapter.evaluate(StatementAdapter.java:36)
> at org.apache.lucene.util.TestRuleStoreClassName$1.evaluate(TestRuleStoreClassName.java:41)
> at com.carrotsearch.randomizedtesting.rules.NoShadowingOrOverridesOnMethodsRule$1.evaluate(NoShadowingOrOverridesOnMethodsRule.java:40)
> at com.carrotsearch.randomizedtesting.rules.NoShadowingOrOverridesOnMethodsRule$1.evaluate(NoShadowingOrOverridesOnMethodsRule.java:40)
> at com.carrotsearch.randomizedtesting.rules.StatementAdapter.evaluate(StatementAdapter.java:36)
> at com.carrotsearch.randomizedtesting.rules.StatementAdapter.evaluate(StatementAdapter.java:36)
> at com.carrotsearch.randomizedtesting.rules.StatementAdapter.evaluate(StatementAdapter.java:36)
> at org.apache.lucene.util.TestRuleAssertionsRequired$1.evaluate(TestRuleAssertionsRequired.java:53)
> at org.apache.lucene.util.TestRuleMarkFailure$1.evaluate(TestRuleMarkFailure.java:47)
> at org.apache.lucene.util.TestRuleIgnoreAfterMaxFailures$1.evaluate(TestRuleIgnoreAfterMaxFailures.java:64)
> at org.apache.lucene.util.TestRuleIgnoreTestSuites$1.evaluate(TestRuleIgnoreTestSuites.java:54)
> at com.carrotsearch.randomizedtesting.rules.StatementAdapter.evaluate(StatementAdapter.java:36)
> at com.carrotsearch.randomizedtesting.ThreadLeakControl$StatementRunner.run(ThreadLeakControl.java:368)
> at java.lang.Thread.run(Thread.java:745)
>
>
> FAILED:  org.apache.lucene.store.TestNIOFSDirectory.testListAllIsSorted
>
> Error Message:
> access denied ("java.io.FilePermission" "C:\Users\jenkins\workspace\Lucene-Solr-master-Windows\lucene\build\core\test\J1\temp\lucene.store.TestNIOFSDirectory_121F5D1A61C5BA5C-001\tempDir-006\con" "write")
>
> Stack Trace:
> java.security.AccessControlException: access denied ("java.io.FilePermission" "C:\Users\jenkins\workspace\Lucene-Solr-master-Windows\lucene\build\core\test\J1\temp\lucene.store.TestNIOFSDirectory_121F5D1A61C5BA5C-001\tempDir-006\con" "write")
> at __randomizedtesting.SeedInfo.seed([121F5D1A61C5BA5C:8833FA68A1FA35D5]:0)
> at java.security.AccessControlContext.checkPermission(AccessControlContext.java:472)
> at java.security.AccessController.checkPermission(AccessController.java:884)
> at java.lang.SecurityManager.checkPermission(SecurityManager.java:549)
> at java.lang.SecurityManager.checkWrite(SecurityManager.java:979)
> at sun.nio.fs.WindowsChannelFactory.open(WindowsChannelFactory.java:295)
> at sun.nio.fs.WindowsChannelFactory.newFileChannel(WindowsChannelFactory.java:162)
> at sun.nio.fs.WindowsFileSystemProvider.newByteChannel(WindowsFileSystemProvider.java:225)
> at java.nio.file.spi.FileSystemProvider.newOutputStream(FileSystemProvider.java:434)
> at org.apache.lucene.mockfile.FilterFileSystemProvider.newOutputStream(FilterFileSystemProvider.java:197)
> at org.apache.lucene.mockfile.FilterFileSystemProvider.newOutputStream(FilterFileSystemProvider.java:197)
> at org.apache.lucene.mockfile.HandleTrackingFS.newOutputStream(HandleTrackingFS.java:129)
> at org.apache.lucene.mockfile.HandleTrackingFS.newOutputStream(HandleTrackingFS.java:129)
> at org.apache.lucene.mockfile.FilterFileSystemProvider.newOutputStream(FilterFileSystemProvider.java:197)
> at java.nio.file.Files.newOutputStream(Files.java:216)
> at org.apache.lucene.store.FSDirectory$FSIndexOutput.<init>(FSDirectory.java:413)
> at org.apache.lucene.store.FSDirectory$FSIndexOutput.<init>(FSDirectory.java:409)
> at org.apache.lucene.store.FSDirectory.createOutput(FSDirectory.java:253)
> at org.apache.lucene.store.BaseDirectoryTestCase.testListAllIsSorted(BaseDirectoryTestCase.java:1198)
> at sun.reflect.NativeMethodAccessorImpl.invoke0(Native Method)
> at sun.reflect.NativeMethodAccessorImpl.invoke(NativeMethodAccessorImpl.java:62)
> at sun.reflect.DelegatingMethodAccessorImpl.invoke(DelegatingMethodAccessorImpl.java:43)
> at java.lang.reflect.Method.invoke(Method.java:498)
> at com.carrotsearch.randomizedtesting.RandomizedRunner.invoke(RandomizedRunner.java:1713)
> at com.carrotsearch.randomizedtesting.RandomizedRunner$8.evaluate(RandomizedRunner.java:907)
> at com.carrotsearch.randomizedtesting.RandomizedRunner$9.evaluate(RandomizedRunner.java:943)
> at com.carrotsearch.randomizedtesting.RandomizedRunner$10.evaluate(RandomizedRunner.java:957)
> at org.apache.lucene.util.TestRuleSetupTeardownChained$1.evaluate(TestRuleSetupTeardownChained.java:49)
> at org.apache.lucene.util.AbstractBeforeAfterRule$1.evaluate(AbstractBeforeAfterRule.java:45)
> at org.apache.lucene.util.TestRuleThreadAndTestName$1.evaluate(TestRuleThreadAndTestName.java:48)
> at org.apache.lucene.util.TestRuleIgnoreAfterMaxFailures$1.evaluate(TestRuleIgnoreAfterMaxFailures.java:64)
> at org.apache.lucene.util.TestRuleMarkFailure$1.evaluate(TestRuleMarkFailure.java:47)
> at com.carrotsearch.randomizedtesting.rules.StatementAdapter.evaluate(StatementAdapter.java:36)
> at com.carrotsearch.randomizedtesting.ThreadLeakControl$StatementRunner.run(ThreadLeakControl.java:368)
> at com.carrotsearch.randomizedtesting.ThreadLeakControl.forkTimeoutingTask(ThreadLeakControl.java:817)
> at com.carrotsearch.randomizedtesting.ThreadLeakControl$3.evaluate(ThreadLeakControl.java:468)
> at com.carrotsearch.randomizedtesting.RandomizedRunner.runSingleTest(RandomizedRunner.java:916)
> at com.carrotsearch.randomizedtesting.RandomizedRunner$5.evaluate(RandomizedRunner.java:802)
> at com.carrotsearch.randomizedtesting.RandomizedRunner$6.evaluate(RandomizedRunner.java:852)
> at com.carrotsearch.randomizedtesting.RandomizedRunner$7.evaluate(RandomizedRunner.java:863)
> at org.apache.lucene.util.AbstractBeforeAfterRule$1.evaluate(AbstractBeforeAfterRule.java:45)
> at com.carrotsearch.randomizedtesting.rules.StatementAdapter.evaluate(StatementAdapter.java:36)
> at org.apache.lucene.util.TestRuleStoreClassName$1.evaluate(TestRuleStoreClassName.java:41)
> at com.carrotsearch.randomizedtesting.rules.NoShadowingOrOverridesOnMethodsRule$1.evaluate(NoShadowingOrOverridesOnMethodsRule.java:40)
> at com.carrotsearch.randomizedtesting.rules.NoShadowingOrOverridesOnMethodsRule$1.evaluate(NoShadowingOrOverridesOnMethodsRule.java:40)
> at com.carrotsearch.randomizedtesting.rules.StatementAdapter.evaluate(StatementAdapter.java:36)
> at com.carrotsearch.randomizedtesting.rules.StatementAdapter.evaluate(StatementAdapter.java:36)
> at com.carrotsearch.randomizedtesting.rules.StatementAdapter.evaluate(StatementAdapter.java:36)
> at org.apache.lucene.util.TestRuleAssertionsRequired$1.evaluate(TestRuleAssertionsRequired.java:53)
> at org.apache.lucene.util.TestRuleMarkFailure$1.evaluate(TestRuleMarkFailure.java:47)
> at org.apache.lucene.util.TestRuleIgnoreAfterMaxFailures$1.evaluate(TestRuleIgnoreAfterMaxFailures.java:64)
> at org.apache.lucene.util.TestRuleIgnoreTestSuites$1.evaluate(TestRuleIgnoreTestSuites.java:54)
> at com.carrotsearch.randomizedtesting.rules.StatementAdapter.evaluate(StatementAdapter.java:36)
> at com.carrotsearch.randomizedtesting.ThreadLeakControl$StatementRunner.run(ThreadLeakControl.java:368)
> at java.lang.Thread.run(Thread.java:745)
>
>
> FAILED:  org.apache.lucene.store.TestSimpleFSDirectory.testListAllIsSorted
>
> Error Message:
> access denied ("java.io.FilePermission" "C:\Users\jenkins\workspace\Lucene-Solr-master-Windows\lucene\build\core\test\J1\temp\lucene.store.TestSimpleFSDirectory_121F5D1A61C5BA5C-001\tempDir-006\con" "write")
>
> Stack Trace:
> java.security.AccessControlException: access denied ("java.io.FilePermission" "C:\Users\jenkins\workspace\Lucene-Solr-master-Windows\lucene\build\core\test\J1\temp\lucene.store.TestSimpleFSDirectory_121F5D1A61C5BA5C-001\tempDir-006\con" "write")
> at __randomizedtesting.SeedInfo.seed([121F5D1A61C5BA5C:8833FA68A1FA35D5]:0)
> at java.security.AccessControlContext.checkPermission(AccessControlContext.java:472)
> at java.security.AccessController.checkPermission(AccessController.java:884)
> at java.lang.SecurityManager.checkPermission(SecurityManager.java:549)
> at java.lang.SecurityManager.checkWrite(SecurityManager.java:979)
> at sun.nio.fs.WindowsChannelFactory.open(WindowsChannelFactory.java:295)
> at sun.nio.fs.WindowsChannelFactory.newFileChannel(WindowsChannelFactory.java:162)
> at sun.nio.fs.WindowsFileSystemProvider.newByteChannel(WindowsFileSystemProvider.java:225)
> at java.nio.file.spi.FileSystemProvider.newOutputStream(FileSystemProvider.java:434)
> at org.apache.lucene.mockfile.FilterFileSystemProvider.newOutputStream(FilterFileSystemProvider.java:197)
> at org.apache.lucene.mockfile.FilterFileSystemProvider.newOutputStream(FilterFileSystemProvider.java:197)
> at org.apache.lucene.mockfile.HandleTrackingFS.newOutputStream(HandleTrackingFS.java:129)
> at org.apache.lucene.mockfile.HandleTrackingFS.newOutputStream(HandleTrackingFS.java:129)
> at org.apache.lucene.mockfile.FilterFileSystemProvider.newOutputStream(FilterFileSystemProvider.java:197)
> at java.nio.file.Files.newOutputStream(Files.java:216)
> at org.apache.lucene.store.FSDirectory$FSIndexOutput.<init>(FSDirectory.java:413)
> at org.apache.lucene.store.FSDirectory$FSIndexOutput.<init>(FSDirectory.java:409)
> at org.apache.lucene.store.FSDirectory.createOutput(FSDirectory.java:253)
> at org.apache.lucene.store.BaseDirectoryTestCase.testListAllIsSorted(BaseDirectoryTestCase.java:1198)
> at sun.reflect.NativeMethodAccessorImpl.invoke0(Native Method)
> at sun.reflect.NativeMethodAccessorImpl.invoke(NativeMethodAccessorImpl.java:62)
> at sun.reflect.DelegatingMethodAccessorImpl.invoke(DelegatingMethodAccessorImpl.java:43)
> at java.lang.reflect.Method.invoke(Method.java:498)
> at com.carrotsearch.randomizedtesting.RandomizedRunner.invoke(RandomizedRunner.java:1713)
> at com.carrotsearch.randomizedtesting.RandomizedRunner$8.evaluate(RandomizedRunner.java:907)
> at com.carrotsearch.randomizedtesting.RandomizedRunner$9.evaluate(RandomizedRunner.java:943)
> at com.carrotsearch.randomizedtesting.RandomizedRunner$10.evaluate(RandomizedRunner.java:957)
> at org.apache.lucene.util.TestRuleSetupTeardownChained$1.evaluate(TestRuleSetupTeardownChained.java:49)
> at org.apache.lucene.util.AbstractBeforeAfterRule$1.evaluate(AbstractBeforeAfterRule.java:45)
> at org.apache.lucene.util.TestRuleThreadAndTestName$1.evaluate(TestRuleThreadAndTestName.java:48)
> at org.apache.lucene.util.TestRuleIgnoreAfterMaxFailures$1.evaluate(TestRuleIgnoreAfterMaxFailures.java:64)
> at org.apache.lucene.util.TestRuleMarkFailure$1.evaluate(TestRuleMarkFailure.java:47)
> at com.carrotsearch.randomizedtesting.rules.StatementAdapter.evaluate(StatementAdapter.java:36)
> at com.carrotsearch.randomizedtesting.ThreadLeakControl$StatementRunner.run(ThreadLeakControl.java:368)
> at com.carrotsearch.randomizedtesting.ThreadLeakControl.forkTimeoutingTask(ThreadLeakControl.java:817)
> at com.carrotsearch.randomizedtesting.ThreadLeakControl$3.evaluate(ThreadLeakControl.java:468)
> at com.carrotsearch.randomizedtesting.RandomizedRunner.runSingleTest(RandomizedRunner.java:916)
> at com.carrotsearch.randomizedtesting.RandomizedRunner$5.evaluate(RandomizedRunner.java:802)
> at com.carrotsearch.randomizedtesting.RandomizedRunner$6.evaluate(RandomizedRunner.java:852)
> at com.carrotsearch.randomizedtesting.RandomizedRunner$7.evaluate(RandomizedRunner.java:863)
> at org.apache.lucene.util.AbstractBeforeAfterRule$1.evaluate(AbstractBeforeAfterRule.java:45)
> at com.carrotsearch.randomizedtesting.rules.StatementAdapter.evaluate(StatementAdapter.java:36)
> at org.apache.lucene.util.TestRuleStoreClassName$1.evaluate(TestRuleStoreClassName.java:41)
> at com.carrotsearch.randomizedtesting.rules.NoShadowingOrOverridesOnMethodsRule$1.evaluate(NoShadowingOrOverridesOnMethodsRule.java:40)
> at com.carrotsearch.randomizedtesting.rules.NoShadowingOrOverridesOnMethodsRule$1.evaluate(NoShadowingOrOverridesOnMethodsRule.java:40)
> at com.carrotsearch.randomizedtesting.rules.StatementAdapter.evaluate(StatementAdapter.java:36)
> at com.carrotsearch.randomizedtesting.rules.StatementAdapter.evaluate(StatementAdapter.java:36)
> at com.carrotsearch.randomizedtesting.rules.StatementAdapter.evaluate(StatementAdapter.java:36)
> at org.apache.lucene.util.TestRuleAssertionsRequired$1.evaluate(TestRuleAssertionsRequired.java:53)
> at org.apache.lucene.util.TestRuleMarkFailure$1.evaluate(TestRuleMarkFailure.java:47)
> at org.apache.lucene.util.TestRuleIgnoreAfterMaxFailures$1.evaluate(TestRuleIgnoreAfterMaxFailures.java:64)
> at org.apache.lucene.util.TestRuleIgnoreTestSuites$1.evaluate(TestRuleIgnoreTestSuites.java:54)
> at com.carrotsearch.randomizedtesting.rules.StatementAdapter.evaluate(StatementAdapter.java:36)
> at com.carrotsearch.randomizedtesting.ThreadLeakControl$StatementRunner.run(ThreadLeakControl.java:368)
> at java.lang.Thread.run(Thread.java:745)
>
>
>
>
> Build Log:
> [...truncated 688 lines...]
>   [junit4] Suite: org.apache.lucene.store.TestFileSwitchDirectory
>   [junit4] IGNOR/A 0.02s J1 | TestFileSwitchDirectory.testPendingDeletions
>   [junit4]    > Assumption #1: we can only install VirusCheckingFS on an FSDirectory
>   [junit4]   2> NOTE: reproduce with: ant test  -Dtestcase=TestFileSwitchDirectory -Dtests.method=testListAllIsSorted -Dtests.seed=121F5D1A61C5BA5C -Dtests.slow=true -Dtests.locale=ar-BH -Dtests.timezone=America/Jamaica -Dtests.asserts=true -Dtests.file.encoding=ISO-8859-1
>   [junit4] ERROR   0.03s J1 | TestFileSwitchDirectory.testListAllIsSorted <<<
>   [junit4]    > Throwable #1: java.security.AccessControlException: access denied ("java.io.FilePermission" "C:\Users\jenkins\workspace\Lucene-Solr-master-Windows\lucene\build\core\test\J1\temp\lucene.store.TestFileSwitchDirectory_121F5D1A61C5BA5C-001\bar-017\con" "write")
>   [junit4]    > at __randomizedtesting.SeedInfo.seed([121F5D1A61C5BA5C:8833FA68A1FA35D5]:0)
>   [junit4]    > at java.security.AccessControlContext.checkPermission(AccessControlContext.java:472)
>   [junit4]    > at java.security.AccessController.checkPermission(AccessController.java:884)
>   [junit4]    > at java.lang.SecurityManager.checkPermission(SecurityManager.java:549)
>   [junit4]    > at java.lang.SecurityManager.checkWrite(SecurityManager.java:979)
>   [junit4]    > at sun.nio.fs.WindowsChannelFactory.open(WindowsChannelFactory.java:295)
>   [junit4]    > at sun.nio.fs.WindowsChannelFactory.newFileChannel(WindowsChannelFactory.java:162)
>   [junit4]    > at sun.nio.fs.WindowsFileSystemProvider.newByteChannel(WindowsFileSystemProvider.java:225)
>   [junit4]    > at java.nio.file.spi.FileSystemProvider.newOutputStream(FileSystemProvider.java:434)
>   [junit4]    > at org.apache.lucene.mockfile.FilterFileSystemProvider.newOutputStream(FilterFileSystemProvider.java:197)
>   [junit4]    > at org.apache.lucene.mockfile.FilterFileSystemProvider.newOutputStream(FilterFileSystemProvider.java:197)
>   [junit4]    > at org.apache.lucene.mockfile.HandleTrackingFS.newOutputStream(HandleTrackingFS.java:129)
>   [junit4]    > at org.apache.lucene.mockfile.HandleTrackingFS.newOutputStream(HandleTrackingFS.java:129)
>   [junit4]    > at org.apache.lucene.mockfile.FilterFileSystemProvider.newOutputStream(FilterFileSystemProvider.java:197)
>   [junit4]    > at java.nio.file.Files.newOutputStream(Files.java:216)
>   [junit4]    > at org.apache.lucene.store.FSDirectory$FSIndexOutput.<init>(FSDirectory.java:413)
>   [junit4]    > at org.apache.lucene.store.FSDirectory$FSIndexOutput.<init>(FSDirectory.java:409)
>   [junit4]    > at org.apache.lucene.store.FSDirectory.createOutput(FSDirectory.java:253)
>   [junit4]    > at org.apache.lucene.store.FileSwitchDirectory.createOutput(FileSwitchDirectory.java:161)
>   [junit4]    > at org.apache.lucene.store.BaseDirectoryTestCase.testListAllIsSorted(BaseDirectoryTestCase.java:1198)
>   [junit4]    > at java.lang.Thread.run(Thread.java:745)
>   [junit4] IGNOR/A 0.01s J1 | TestFileSwitchDirectory.testFsyncDoesntCreateNewFiles
>   [junit4]    > Assumption #1: test only works for FSDirectory subclasses
>   [junit4]   2> NOTE: leaving temporary files on disk at: C:\Users\jenkins\workspace\Lucene-Solr-master-Windows\lucene\build\core\test\J1\temp\lucene.store.TestFileSwitchDirectory_121F5D1A61C5BA5C-001
>   [junit4]   2> NOTE: test params are: codec=CheapBastard, sim=RandomSimilarity(queryNorm=false): {}, locale=ar-BH, timezone=America/Jamaica
>   [junit4]   2> NOTE: Windows 10 10.0 amd64/Oracle Corporation 1.8.0_121 (64-bit)/cpus=3,threads=1,free=26564936,total=201326592
>   [junit4]   2> NOTE: All tests run in this JVM: [TestPerFieldPostingsFormat2, TestCharArraySet, TestBytesRefHash, TestOmitNorms, TestFilterSpans, TestEarlyTerminatingSortingCollector, TestIndexWriterNRTIsCurrent, TestRollback, TestReadOnlyIndex, TestExceedMaxTermLength, Test2BNumericDocValues, TestTrackingDirectoryWrapper, TestParallelTermEnum, TestTransactionRollback, TestIndexWriterConfig, TestConcurrentMergeScheduler, TestDeterminism, TestUniqueTermCount, TestIndexSearcher, TestDoubleRangeFieldQueries, TestIndexWriterOutOfFileDescriptors, TestTermVectorsReader, TestBlockPostingsFormat, TestNearSpansOrdered, TestLucene70DocValuesFormat, TestTermRangeQuery, TestLucene62SegmentInfoFormat, TestAxiomaticSimilarity, TestDirectPacked, TestSpanOrQuery, TestIndexWriterForceMerge, TestFileSwitchDirectory]
>   [junit4] Completed [144/451 (1!)] on J1 in 3.13s, 43 tests, 1 error, 2 skipped <<< FAILURES!
>
> [...truncated 222 lines...]
>   [junit4] Suite: org.apache.lucene.store.TestSimpleFSDirectory
>   [junit4]   2> NOTE: reproduce with: ant test  -Dtestcase=TestSimpleFSDirectory -Dtests.method=testListAllIsSorted -Dtests.seed=121F5D1A61C5BA5C -Dtests.slow=true -Dtests.locale=en-ZA -Dtests.timezone=America/Knox_IN -Dtests.asserts=true -Dtests.file.encoding=ISO-8859-1
>   [junit4] ERROR   0.01s J1 | TestSimpleFSDirectory.testListAllIsSorted <<<
>   [junit4]    > Throwable #1: java.security.AccessControlException: access denied ("java.io.FilePermission" "C:\Users\jenkins\workspace\Lucene-Solr-master-Windows\lucene\build\core\test\J1\temp\lucene.store.TestSimpleFSDirectory_121F5D1A61C5BA5C-001\tempDir-006\con" "write")
>   [junit4]    > at __randomizedtesting.SeedInfo.seed([121F5D1A61C5BA5C:8833FA68A1FA35D5]:0)
>   [junit4]    > at java.security.AccessControlContext.checkPermission(AccessControlContext.java:472)
>   [junit4]    > at java.security.AccessController.checkPermission(AccessController.java:884)
>   [junit4]    > at java.lang.SecurityManager.checkPermission(SecurityManager.java:549)
>   [junit4]    > at java.lang.SecurityManager.checkWrite(SecurityManager.java:979)
>   [junit4]    > at sun.nio.fs.WindowsChannelFactory.open(WindowsChannelFactory.java:295)
>   [junit4]    > at sun.nio.fs.WindowsChannelFactory.newFileChannel(WindowsChannelFactory.java:162)
>   [junit4]    > at sun.nio.fs.WindowsFileSystemProvider.newByteChannel(WindowsFileSystemProvider.java:225)
>   [junit4]    > at java.nio.file.spi.FileSystemProvider.newOutputStream(FileSystemProvider.java:434)
>   [junit4]    > at org.apache.lucene.mockfile.FilterFileSystemProvider.newOutputStream(FilterFileSystemProvider.java:197)
>   [junit4]    > at org.apache.lucene.mockfile.FilterFileSystemProvider.newOutputStream(FilterFileSystemProvider.java:197)
>   [junit4]    > at org.apache.lucene.mockfile.HandleTrackingFS.newOutputStream(HandleTrackingFS.java:129)
>   [junit4]    > at org.apache.lucene.mockfile.HandleTrackingFS.newOutputStream(HandleTrackingFS.java:129)
>   [junit4]    > at org.apache.lucene.mockfile.FilterFileSystemProvider.newOutputStream(FilterFileSystemProvider.java:197)
>   [junit4]    > at java.nio.file.Files.newOutputStream(Files.java:216)
>   [junit4]    > at org.apache.lucene.store.FSDirectory$FSIndexOutput.<init>(FSDirectory.java:413)
>   [junit4]    > at org.apache.lucene.store.FSDirectory$FSIndexOutput.<init>(FSDirectory.java:409)
>   [junit4]    > at org.apache.lucene.store.FSDirectory.createOutput(FSDirectory.java:253)
>   [junit4]    > at org.apache.lucene.store.BaseDirectoryTestCase.testListAllIsSorted(BaseDirectoryTestCase.java:1198)
>   [junit4]    > at java.lang.Thread.run(Thread.java:745)
>   [junit4]   2> NOTE: leaving temporary files on disk at: C:\Users\jenkins\workspace\Lucene-Solr-master-Windows\lucene\build\core\test\J1\temp\lucene.store.TestSimpleFSDirectory_121F5D1A61C5BA5C-001
>   [junit4]   2> NOTE: test params are: codec=Asserting(Lucene70): {}, docValues:{}, maxPointsInLeafNode=1369, maxMBSortInHeap=6.070639152294969, sim=RandomSimilarity(queryNorm=false): {}, locale=en-ZA, timezone=America/Knox_IN
>   [junit4]   2> NOTE: Windows 10 10.0 amd64/Oracle Corporation 1.8.0_121 (64-bit)/cpus=3,threads=1,free=114851360,total=213385216
>   [junit4]   2> NOTE: All tests run in this JVM: [TestPerFieldPostingsFormat2, TestCharArraySet, TestBytesRefHash, TestOmitNorms, TestFilterSpans, TestEarlyTerminatingSortingCollector, TestIndexWriterNRTIsCurrent, TestRollback, TestReadOnlyIndex, TestExceedMaxTermLength, Test2BNumericDocValues, TestTrackingDirectoryWrapper, TestParallelTermEnum, TestTransactionRollback, TestIndexWriterConfig, TestConcurrentMergeScheduler, TestDeterminism, TestUniqueTermCount, TestIndexSearcher, TestDoubleRangeFieldQueries, TestIndexWriterOutOfFileDescriptors, TestTermVectorsReader, TestBlockPostingsFormat, TestNearSpansOrdered, TestLucene70DocValuesFormat, TestTermRangeQuery, TestLucene62SegmentInfoFormat, TestAxiomaticSimilarity, TestDirectPacked, TestSpanOrQuery, TestIndexWriterForceMerge, TestFileSwitchDirectory, TestLucene50StoredFieldsFormatHighCompression, TestSimpleExplanationsWithFillerDocs, TestAllFilesCheckIndexHeader, TestCharTermAttributeImpl, Test2BPostingsBytes, TestFixedBitSet, TestCompiledAutomaton, TestSpanFirstQuery, TestMinShouldMatch2, TestMultiFields, TestSearchAfter, Test2BDocs, TestDelegatingAnalyzerWrapper, TestSingleInstanceLockFactory, TestDocumentsWriterStallControl, TestForTooMuchCloning, TestRollingBuffer, TestMultiDocValues, TestRollingUpdates, TestIndexWriterOnDiskFull, TestSegmentTermDocs, TestDocValuesScoring, TestBlockPostingsFormat3, TestRegExp, TestIndexingSequenceNumbers, TestTermVectorsWriter, TermInSetQueryTest, TestMergeSchedulerExternal, TestDirectoryReaderReopen, TestTotalHitCountCollector, TestSearcherManager, TestNRTCachingDirectory, TestNGramPhraseQuery, TestUpgradeIndexMergePolicy, TestDemoParallelLeafReader, TestSortRandom, TestDemo, TestIndexSorting, TestSparseFixedBitDocIdSet, TestStopFilter, TestDeletionPolicy, TestCharsRefBuilder, TestCachingCollector, TestMultiPhraseEnum, TestSimpleFSDirectory]
>   [junit4] Completed [212/451 (2!)] on J1 in 2.49s, 42 tests, 1 error <<< FAILURES!
>
> [...truncated 690 lines...]
>   [junit4] Suite: org.apache.lucene.store.TestNIOFSDirectory
>   [junit4]   2> NOTE: reproduce with: ant test  -Dtestcase=TestNIOFSDirectory -Dtests.method=testListAllIsSorted -Dtests.seed=121F5D1A61C5BA5C -Dtests.slow=true -Dtests.locale=sr-ME -Dtests.timezone=Africa/Bissau -Dtests.asserts=true -Dtests.file.encoding=ISO-8859-1
>   [junit4] ERROR   0.01s J1 | TestNIOFSDirectory.testListAllIsSorted <<<
>   [junit4]    > Throwable #1: java.security.AccessControlException: access denied ("java.io.FilePermission" "C:\Users\jenkins\workspace\Lucene-Solr-master-Windows\lucene\build\core\test\J1\temp\lucene.store.TestNIOFSDirectory_121F5D1A61C5BA5C-001\tempDir-006\con" "write")
>   [junit4]    > at __randomizedtesting.SeedInfo.seed([121F5D1A61C5BA5C:8833FA68A1FA35D5]:0)
>   [junit4]    > at java.security.AccessControlContext.checkPermission(AccessControlContext.java:472)
>   [junit4]    > at java.security.AccessController.checkPermission(AccessController.java:884)
>   [junit4]    > at java.lang.SecurityManager.checkPermission(SecurityManager.java:549)
>   [junit4]    > at java.lang.SecurityManager.checkWrite(SecurityManager.java:979)
>   [junit4]    > at sun.nio.fs.WindowsChannelFactory.open(WindowsChannelFactory.java:295)
>   [junit4]    > at sun.nio.fs.WindowsChannelFactory.newFileChannel(WindowsChannelFactory.java:162)
>   [junit4]    > at sun.nio.fs.WindowsFileSystemProvider.newByteChannel(WindowsFileSystemProvider.java:225)
>   [junit4]    > at java.nio.file.spi.FileSystemProvider.newOutputStream(FileSystemProvider.java:434)
>   [junit4]    > at org.apache.lucene.mockfile.FilterFileSystemProvider.newOutputStream(FilterFileSystemProvider.java:197)
>   [junit4]    > at org.apache.lucene.mockfile.FilterFileSystemProvider.newOutputStream(FilterFileSystemProvider.java:197)
>   [junit4]    > at org.apache.lucene.mockfile.HandleTrackingFS.newOutputStream(HandleTrackingFS.java:129)
>   [junit4]    > at org.apache.lucene.mockfile.HandleTrackingFS.newOutputStream(HandleTrackingFS.java:129)
>   [junit4]    > at org.apache.lucene.mockfile.FilterFileSystemProvider.newOutputStream(FilterFileSystemProvider.java:197)
>   [junit4]    > at java.nio.file.Files.newOutputStream(Files.java:216)
>   [junit4]    > at org.apache.lucene.store.FSDirectory$FSIndexOutput.<init>(FSDirectory.java:413)
>   [junit4]    > at org.apache.lucene.store.FSDirectory$FSIndexOutput.<init>(FSDirectory.java:409)
>   [junit4]    > at org.apache.lucene.store.FSDirectory.createOutput(FSDirectory.java:253)
>   [junit4]    > at org.apache.lucene.store.BaseDirectoryTestCase.testListAllIsSorted(BaseDirectoryTestCase.java:1198)
>   [junit4]    > at java.lang.Thread.run(Thread.java:745)
>   [junit4]   2> NOTE: leaving temporary files on disk at: C:\Users\jenkins\workspace\Lucene-Solr-master-Windows\lucene\build\core\test\J1\temp\lucene.store.TestNIOFSDirectory_121F5D1A61C5BA5C-001
>   [junit4]   2> NOTE: test params are: codec=Asserting(Lucene70): {}, docValues:{}, maxPointsInLeafNode=1652, maxMBSortInHeap=7.556654604900439, sim=RandomSimilarity(queryNorm=false): {}, locale=sr-ME, timezone=Africa/Bissau
>   [junit4]   2> NOTE: Windows 10 10.0 amd64/Oracle Corporation 1.8.0_121 (64-bit)/cpus=3,threads=1,free=160648488,total=299892736
>   [junit4]   2> NOTE: All tests run in this JVM: [TestPerFieldPostingsFormat2, TestCharArraySet, TestBytesRefHash, TestOmitNorms, TestFilterSpans, TestEarlyTerminatingSortingCollector, TestIndexWriterNRTIsCurrent, TestRollback, TestReadOnlyIndex, TestExceedMaxTermLength, Test2BNumericDocValues, TestTrackingDirectoryWrapper, TestParallelTermEnum, TestTransactionRollback, TestIndexWriterConfig, TestConcurrentMergeScheduler, TestDeterminism, TestUniqueTermCount, TestIndexSearcher, TestDoubleRangeFieldQueries, TestIndexWriterOutOfFileDescriptors, TestTermVectorsReader, TestBlockPostingsFormat, TestNearSpansOrdered, TestLucene70DocValuesFormat, TestTermRangeQuery, TestLucene62SegmentInfoFormat, TestAxiomaticSimilarity, TestDirectPacked, TestSpanOrQuery, TestIndexWriterForceMerge, TestFileSwitchDirectory, TestLucene50StoredFieldsFormatHighCompression, TestSimpleExplanationsWithFillerDocs, TestAllFilesCheckIndexHeader, TestCharTermAttributeImpl, Test2BPostingsBytes, TestFixedBitSet, TestCompiledAutomaton, TestSpanFirstQuery, TestMinShouldMatch2, TestMultiFields, TestSearchAfter, Test2BDocs, TestDelegatingAnalyzerWrapper, TestSingleInstanceLockFactory, TestDocumentsWriterStallControl, TestForTooMuchCloning, TestRollingBuffer, TestMultiDocValues, TestRollingUpdates, TestIndexWriterOnDiskFull, TestSegmentTermDocs, TestDocValuesScoring, TestBlockPostingsFormat3, TestRegExp, TestIndexingSequenceNumbers, TestTermVectorsWriter, TermInSetQueryTest, TestMergeSchedulerExternal, TestDirectoryReaderReopen, TestTotalHitCountCollector, TestSearcherManager, TestNRTCachingDirectory, TestNGramPhraseQuery, TestUpgradeIndexMergePolicy, TestDemoParallelLeafReader, TestSortRandom, TestDemo, TestIndexSorting, TestSparseFixedBitDocIdSet, TestStopFilter, TestDeletionPolicy, TestCharsRefBuilder, TestCachingCollector, TestMultiPhraseEnum, TestSimpleFSDirectory, TestSizeBoundedForceMerge, TestCachingTokenFilter, TestPositiveScoresOnlyCollector, TestIndexWriterReader, TestSpanMultiTermQueryWrapper, TestByteBlockPool, TestComplexExplanationsOfNonMatches, TestIndexWriterCommit, TestRadixSelector, TestShardSearching, TestNot, TestMathUtil, TestPersistentSnapshotDeletionPolicy, TestVersion, TestIntsRef, TestFlex, TestDocInverterPerFieldErrorInfo, TestFrequencyTrackingRingBuffer, TestMutableValues, TestDisjunctionMaxQuery, TestStressAdvance, TestIndexWriterMaxDocs, TestSimpleSearchEquivalence, TestIsCurrent, TestLongPostings, Test2BBinaryDocValues, TestCheckIndex, TestMultiTermConstantScore, TestSpansEnum, TestFixedBitDocIdSet, TestIndexWriterExceptions2, TestCustomSearcherSort, TestMmapDirectory, TestDocumentWriter, TestTragicIndexWriterDeadlock, TestStressDeletes, TestByteSlices, TestDocValuesIndexing, TestHugeRamFile, TestCustomNorms, TestUTF32ToUTF8, TestMultiPhraseQuery, TestStressNRT, TestSloppyPhraseQuery2, TestSameScoresWithThreads, TestCrashCausesCorruptIndex, TestFuzzyQuery, TestFieldMaskingSpanQuery, TestSimpleExplanationsOfNonMatches, TestPrefixInBooleanQuery, TestAutomatonQuery, TestIndexableField, TestPrefixRandom, TestMultiLevelSkipList, TestSearchForDuplicates, TestMatchAllDocsQuery, TestElevationComparator, TestSubScorerFreqs, TestRecyclingIntBlockAllocator, TestMultiTermQueryRewrites, TestSimilarity, TestVirtualMethod, TestSimilarityProvider, TestDateTools, Test2BPostings, TestDocCount, TestAutomatonQueryUnicode, TestRamUsageEstimator, TestNoMergeScheduler, TestIndexWriterLockRelease, TestPhrasePrefixQuery, TestAssertions, TestCloseableThreadLocal, Test4GBStoredFields, TestReaderClosed, TestSimpleAttributeImpl, Test2BPositions, Test2BTerms, Test2BPagedBytes, TestCharArrayMap, TestPackedTokenAttributeImpl, TestCodecUtil, TestBlockPostingsFormat2, TestLucene50StoredFieldsFormat, TestLucene60FieldInfoFormat, TestFieldType, TestGeoUtils, TestPolygon, TestPolygon2D, TestDocsWithFieldSet, TestExitableDirectoryReader, TestFilterDirectoryReader, TestInfoStream, TestMaxPosition, TestMergeRateLimiter, TestNRTReaderCleanup, TestNumericDocValuesUpdates, TestReaderWrapperDVTypeCheck, TestSegmentInfos, TestSortedSetDocValues, TestTermVectors, FuzzyTermOnShortTermsTest, TestApproximationSearchEquivalence, TestBlendedTermQuery, TestBooleanRewrites, TestBoostQuery, TestConjunctionDISI, TestControlledRealTimeReopenThread, TestDocValuesQueries, TestEarlyTermination, TestFieldValueQuery, TestFloatRangeFieldQueries, TestIntRangeFieldQueries, TestLRUQueryCache, TestMultiset, TestQueryRescorer, TestSortedSetSelector, TestSynonymQuery, TestBM25Similarity, TestSpanCollection, TestSpanTermQuery, TestFilterDirectory, TestNIOFSDirectory]
>   [junit4] Completed [425/451 (3!)] on J1 in 2.00s, 42 tests, 1 error <<< FAILURES!
>
> [...truncated 74223 lines...]
>
>
> ---------------------------------------------------------------------
> To unsubscribe, e-mail: [hidden email]
> For additional commands, e-mail: [hidden email]



---------------------------------------------------------------------
To unsubscribe, e-mail: [hidden email]
For additional commands, e-mail: [hidden email]

Reply | Threaded
Open this post in threaded view
|  
Report Content as Inappropriate

Re: [JENKINS] Lucene-Solr-master-Windows (64bit/jdk1.8.0_121) - Build # 6460 - Still Unstable!

sarowe
A more accurate/complete list of reserved Windows filenames, from the NTFS row in the table at <https://en.wikipedia.org/wiki/Filename#Comparison_of_filename_limitations>:

> Reserved words: Only in root directory: $AttrDef $BadClus $Bitmap $Boot $LogFile $MFT $MFTMirr pagefile.sys $Secure $UpCase $Volume $Extend $Extend\$ObjId $Extend\$Quota $Extend\$Reparse ($Extend is a directory) […] Windows forbids the use of the MS-DOS device names AUX, CLOCK$, COM1, …, COM9, CON, LPT1, …, LPT9, NUL and PRN, as well as these names with any extension (for example, AUX.txt)


--
Steve
www.lucidworks.com

> On Mar 19, 2017, at 4:15 PM, Steve Rowe <[hidden email]> wrote:
>
> Files named “con[0-9]?” (and “prn[0-9]?”, etc.?) anger Windows.
>
> I thought this got fixed a while back?  I can’t find any JIRAs for it though.
>
> --
> Steve
> www.lucidworks.com
>
>> On Mar 19, 2017, at 1:06 PM, Policeman Jenkins Server <[hidden email]> wrote:
>>
>> Build: https://jenkins.thetaphi.de/job/Lucene-Solr-master-Windows/6460/
>> Java: 64bit/jdk1.8.0_121 -XX:-UseCompressedOops -XX:+UseParallelGC
>>
>> 3 tests failed.
>> FAILED:  org.apache.lucene.store.TestFileSwitchDirectory.testListAllIsSorted
>>
>> Error Message:
>> access denied ("java.io.FilePermission" "C:\Users\jenkins\workspace\Lucene-Solr-master-Windows\lucene\build\core\test\J1\temp\lucene.store.TestFileSwitchDirectory_121F5D1A61C5BA5C-001\bar-017\con" "write")
>>
>> Stack Trace:
>> java.security.AccessControlException: access denied ("java.io.FilePermission" "C:\Users\jenkins\workspace\Lucene-Solr-master-Windows\lucene\build\core\test\J1\temp\lucene.store.TestFileSwitchDirectory_121F5D1A61C5BA5C-001\bar-017\con" "write")
>> at __randomizedtesting.SeedInfo.seed([121F5D1A61C5BA5C:8833FA68A1FA35D5]:0)
>> at java.security.AccessControlContext.checkPermission(AccessControlContext.java:472)
>> at java.security.AccessController.checkPermission(AccessController.java:884)
>> at java.lang.SecurityManager.checkPermission(SecurityManager.java:549)
>> at java.lang.SecurityManager.checkWrite(SecurityManager.java:979)
>> at sun.nio.fs.WindowsChannelFactory.open(WindowsChannelFactory.java:295)
>> at sun.nio.fs.WindowsChannelFactory.newFileChannel(WindowsChannelFactory.java:162)
>> at sun.nio.fs.WindowsFileSystemProvider.newByteChannel(WindowsFileSystemProvider.java:225)
>> at java.nio.file.spi.FileSystemProvider.newOutputStream(FileSystemProvider.java:434)
>> at org.apache.lucene.mockfile.FilterFileSystemProvider.newOutputStream(FilterFileSystemProvider.java:197)
>> at org.apache.lucene.mockfile.FilterFileSystemProvider.newOutputStream(FilterFileSystemProvider.java:197)
>> at org.apache.lucene.mockfile.HandleTrackingFS.newOutputStream(HandleTrackingFS.java:129)
>> at org.apache.lucene.mockfile.HandleTrackingFS.newOutputStream(HandleTrackingFS.java:129)
>> at org.apache.lucene.mockfile.FilterFileSystemProvider.newOutputStream(FilterFileSystemProvider.java:197)
>> at java.nio.file.Files.newOutputStream(Files.java:216)
>> at org.apache.lucene.store.FSDirectory$FSIndexOutput.<init>(FSDirectory.java:413)
>> at org.apache.lucene.store.FSDirectory$FSIndexOutput.<init>(FSDirectory.java:409)
>> at org.apache.lucene.store.FSDirectory.createOutput(FSDirectory.java:253)
>> at org.apache.lucene.store.FileSwitchDirectory.createOutput(FileSwitchDirectory.java:161)
>> at org.apache.lucene.store.BaseDirectoryTestCase.testListAllIsSorted(BaseDirectoryTestCase.java:1198)
>> at sun.reflect.NativeMethodAccessorImpl.invoke0(Native Method)
>> at sun.reflect.NativeMethodAccessorImpl.invoke(NativeMethodAccessorImpl.java:62)
>> at sun.reflect.DelegatingMethodAccessorImpl.invoke(DelegatingMethodAccessorImpl.java:43)
>> at java.lang.reflect.Method.invoke(Method.java:498)
>> at com.carrotsearch.randomizedtesting.RandomizedRunner.invoke(RandomizedRunner.java:1713)
>> at com.carrotsearch.randomizedtesting.RandomizedRunner$8.evaluate(RandomizedRunner.java:907)
>> at com.carrotsearch.randomizedtesting.RandomizedRunner$9.evaluate(RandomizedRunner.java:943)
>> at com.carrotsearch.randomizedtesting.RandomizedRunner$10.evaluate(RandomizedRunner.java:957)
>> at org.apache.lucene.util.TestRuleSetupTeardownChained$1.evaluate(TestRuleSetupTeardownChained.java:49)
>> at org.apache.lucene.util.AbstractBeforeAfterRule$1.evaluate(AbstractBeforeAfterRule.java:45)
>> at org.apache.lucene.util.TestRuleThreadAndTestName$1.evaluate(TestRuleThreadAndTestName.java:48)
>> at org.apache.lucene.util.TestRuleIgnoreAfterMaxFailures$1.evaluate(TestRuleIgnoreAfterMaxFailures.java:64)
>> at org.apache.lucene.util.TestRuleMarkFailure$1.evaluate(TestRuleMarkFailure.java:47)
>> at com.carrotsearch.randomizedtesting.rules.StatementAdapter.evaluate(StatementAdapter.java:36)
>> at com.carrotsearch.randomizedtesting.ThreadLeakControl$StatementRunner.run(ThreadLeakControl.java:368)
>> at com.carrotsearch.randomizedtesting.ThreadLeakControl.forkTimeoutingTask(ThreadLeakControl.java:817)
>> at com.carrotsearch.randomizedtesting.ThreadLeakControl$3.evaluate(ThreadLeakControl.java:468)
>> at com.carrotsearch.randomizedtesting.RandomizedRunner.runSingleTest(RandomizedRunner.java:916)
>> at com.carrotsearch.randomizedtesting.RandomizedRunner$5.evaluate(RandomizedRunner.java:802)
>> at com.carrotsearch.randomizedtesting.RandomizedRunner$6.evaluate(RandomizedRunner.java:852)
>> at com.carrotsearch.randomizedtesting.RandomizedRunner$7.evaluate(RandomizedRunner.java:863)
>> at org.apache.lucene.util.AbstractBeforeAfterRule$1.evaluate(AbstractBeforeAfterRule.java:45)
>> at com.carrotsearch.randomizedtesting.rules.StatementAdapter.evaluate(StatementAdapter.java:36)
>> at org.apache.lucene.util.TestRuleStoreClassName$1.evaluate(TestRuleStoreClassName.java:41)
>> at com.carrotsearch.randomizedtesting.rules.NoShadowingOrOverridesOnMethodsRule$1.evaluate(NoShadowingOrOverridesOnMethodsRule.java:40)
>> at com.carrotsearch.randomizedtesting.rules.NoShadowingOrOverridesOnMethodsRule$1.evaluate(NoShadowingOrOverridesOnMethodsRule.java:40)
>> at com.carrotsearch.randomizedtesting.rules.StatementAdapter.evaluate(StatementAdapter.java:36)
>> at com.carrotsearch.randomizedtesting.rules.StatementAdapter.evaluate(StatementAdapter.java:36)
>> at com.carrotsearch.randomizedtesting.rules.StatementAdapter.evaluate(StatementAdapter.java:36)
>> at org.apache.lucene.util.TestRuleAssertionsRequired$1.evaluate(TestRuleAssertionsRequired.java:53)
>> at org.apache.lucene.util.TestRuleMarkFailure$1.evaluate(TestRuleMarkFailure.java:47)
>> at org.apache.lucene.util.TestRuleIgnoreAfterMaxFailures$1.evaluate(TestRuleIgnoreAfterMaxFailures.java:64)
>> at org.apache.lucene.util.TestRuleIgnoreTestSuites$1.evaluate(TestRuleIgnoreTestSuites.java:54)
>> at com.carrotsearch.randomizedtesting.rules.StatementAdapter.evaluate(StatementAdapter.java:36)
>> at com.carrotsearch.randomizedtesting.ThreadLeakControl$StatementRunner.run(ThreadLeakControl.java:368)
>> at java.lang.Thread.run(Thread.java:745)
>>
>>
>> FAILED:  org.apache.lucene.store.TestNIOFSDirectory.testListAllIsSorted
>>
>> Error Message:
>> access denied ("java.io.FilePermission" "C:\Users\jenkins\workspace\Lucene-Solr-master-Windows\lucene\build\core\test\J1\temp\lucene.store.TestNIOFSDirectory_121F5D1A61C5BA5C-001\tempDir-006\con" "write")
>>
>> Stack Trace:
>> java.security.AccessControlException: access denied ("java.io.FilePermission" "C:\Users\jenkins\workspace\Lucene-Solr-master-Windows\lucene\build\core\test\J1\temp\lucene.store.TestNIOFSDirectory_121F5D1A61C5BA5C-001\tempDir-006\con" "write")
>> at __randomizedtesting.SeedInfo.seed([121F5D1A61C5BA5C:8833FA68A1FA35D5]:0)
>> at java.security.AccessControlContext.checkPermission(AccessControlContext.java:472)
>> at java.security.AccessController.checkPermission(AccessController.java:884)
>> at java.lang.SecurityManager.checkPermission(SecurityManager.java:549)
>> at java.lang.SecurityManager.checkWrite(SecurityManager.java:979)
>> at sun.nio.fs.WindowsChannelFactory.open(WindowsChannelFactory.java:295)
>> at sun.nio.fs.WindowsChannelFactory.newFileChannel(WindowsChannelFactory.java:162)
>> at sun.nio.fs.WindowsFileSystemProvider.newByteChannel(WindowsFileSystemProvider.java:225)
>> at java.nio.file.spi.FileSystemProvider.newOutputStream(FileSystemProvider.java:434)
>> at org.apache.lucene.mockfile.FilterFileSystemProvider.newOutputStream(FilterFileSystemProvider.java:197)
>> at org.apache.lucene.mockfile.FilterFileSystemProvider.newOutputStream(FilterFileSystemProvider.java:197)
>> at org.apache.lucene.mockfile.HandleTrackingFS.newOutputStream(HandleTrackingFS.java:129)
>> at org.apache.lucene.mockfile.HandleTrackingFS.newOutputStream(HandleTrackingFS.java:129)
>> at org.apache.lucene.mockfile.FilterFileSystemProvider.newOutputStream(FilterFileSystemProvider.java:197)
>> at java.nio.file.Files.newOutputStream(Files.java:216)
>> at org.apache.lucene.store.FSDirectory$FSIndexOutput.<init>(FSDirectory.java:413)
>> at org.apache.lucene.store.FSDirectory$FSIndexOutput.<init>(FSDirectory.java:409)
>> at org.apache.lucene.store.FSDirectory.createOutput(FSDirectory.java:253)
>> at org.apache.lucene.store.BaseDirectoryTestCase.testListAllIsSorted(BaseDirectoryTestCase.java:1198)
>> at sun.reflect.NativeMethodAccessorImpl.invoke0(Native Method)
>> at sun.reflect.NativeMethodAccessorImpl.invoke(NativeMethodAccessorImpl.java:62)
>> at sun.reflect.DelegatingMethodAccessorImpl.invoke(DelegatingMethodAccessorImpl.java:43)
>> at java.lang.reflect.Method.invoke(Method.java:498)
>> at com.carrotsearch.randomizedtesting.RandomizedRunner.invoke(RandomizedRunner.java:1713)
>> at com.carrotsearch.randomizedtesting.RandomizedRunner$8.evaluate(RandomizedRunner.java:907)
>> at com.carrotsearch.randomizedtesting.RandomizedRunner$9.evaluate(RandomizedRunner.java:943)
>> at com.carrotsearch.randomizedtesting.RandomizedRunner$10.evaluate(RandomizedRunner.java:957)
>> at org.apache.lucene.util.TestRuleSetupTeardownChained$1.evaluate(TestRuleSetupTeardownChained.java:49)
>> at org.apache.lucene.util.AbstractBeforeAfterRule$1.evaluate(AbstractBeforeAfterRule.java:45)
>> at org.apache.lucene.util.TestRuleThreadAndTestName$1.evaluate(TestRuleThreadAndTestName.java:48)
>> at org.apache.lucene.util.TestRuleIgnoreAfterMaxFailures$1.evaluate(TestRuleIgnoreAfterMaxFailures.java:64)
>> at org.apache.lucene.util.TestRuleMarkFailure$1.evaluate(TestRuleMarkFailure.java:47)
>> at com.carrotsearch.randomizedtesting.rules.StatementAdapter.evaluate(StatementAdapter.java:36)
>> at com.carrotsearch.randomizedtesting.ThreadLeakControl$StatementRunner.run(ThreadLeakControl.java:368)
>> at com.carrotsearch.randomizedtesting.ThreadLeakControl.forkTimeoutingTask(ThreadLeakControl.java:817)
>> at com.carrotsearch.randomizedtesting.ThreadLeakControl$3.evaluate(ThreadLeakControl.java:468)
>> at com.carrotsearch.randomizedtesting.RandomizedRunner.runSingleTest(RandomizedRunner.java:916)
>> at com.carrotsearch.randomizedtesting.RandomizedRunner$5.evaluate(RandomizedRunner.java:802)
>> at com.carrotsearch.randomizedtesting.RandomizedRunner$6.evaluate(RandomizedRunner.java:852)
>> at com.carrotsearch.randomizedtesting.RandomizedRunner$7.evaluate(RandomizedRunner.java:863)
>> at org.apache.lucene.util.AbstractBeforeAfterRule$1.evaluate(AbstractBeforeAfterRule.java:45)
>> at com.carrotsearch.randomizedtesting.rules.StatementAdapter.evaluate(StatementAdapter.java:36)
>> at org.apache.lucene.util.TestRuleStoreClassName$1.evaluate(TestRuleStoreClassName.java:41)
>> at com.carrotsearch.randomizedtesting.rules.NoShadowingOrOverridesOnMethodsRule$1.evaluate(NoShadowingOrOverridesOnMethodsRule.java:40)
>> at com.carrotsearch.randomizedtesting.rules.NoShadowingOrOverridesOnMethodsRule$1.evaluate(NoShadowingOrOverridesOnMethodsRule.java:40)
>> at com.carrotsearch.randomizedtesting.rules.StatementAdapter.evaluate(StatementAdapter.java:36)
>> at com.carrotsearch.randomizedtesting.rules.StatementAdapter.evaluate(StatementAdapter.java:36)
>> at com.carrotsearch.randomizedtesting.rules.StatementAdapter.evaluate(StatementAdapter.java:36)
>> at org.apache.lucene.util.TestRuleAssertionsRequired$1.evaluate(TestRuleAssertionsRequired.java:53)
>> at org.apache.lucene.util.TestRuleMarkFailure$1.evaluate(TestRuleMarkFailure.java:47)
>> at org.apache.lucene.util.TestRuleIgnoreAfterMaxFailures$1.evaluate(TestRuleIgnoreAfterMaxFailures.java:64)
>> at org.apache.lucene.util.TestRuleIgnoreTestSuites$1.evaluate(TestRuleIgnoreTestSuites.java:54)
>> at com.carrotsearch.randomizedtesting.rules.StatementAdapter.evaluate(StatementAdapter.java:36)
>> at com.carrotsearch.randomizedtesting.ThreadLeakControl$StatementRunner.run(ThreadLeakControl.java:368)
>> at java.lang.Thread.run(Thread.java:745)
>>
>>
>> FAILED:  org.apache.lucene.store.TestSimpleFSDirectory.testListAllIsSorted
>>
>> Error Message:
>> access denied ("java.io.FilePermission" "C:\Users\jenkins\workspace\Lucene-Solr-master-Windows\lucene\build\core\test\J1\temp\lucene.store.TestSimpleFSDirectory_121F5D1A61C5BA5C-001\tempDir-006\con" "write")
>>
>> Stack Trace:
>> java.security.AccessControlException: access denied ("java.io.FilePermission" "C:\Users\jenkins\workspace\Lucene-Solr-master-Windows\lucene\build\core\test\J1\temp\lucene.store.TestSimpleFSDirectory_121F5D1A61C5BA5C-001\tempDir-006\con" "write")
>> at __randomizedtesting.SeedInfo.seed([121F5D1A61C5BA5C:8833FA68A1FA35D5]:0)
>> at java.security.AccessControlContext.checkPermission(AccessControlContext.java:472)
>> at java.security.AccessController.checkPermission(AccessController.java:884)
>> at java.lang.SecurityManager.checkPermission(SecurityManager.java:549)
>> at java.lang.SecurityManager.checkWrite(SecurityManager.java:979)
>> at sun.nio.fs.WindowsChannelFactory.open(WindowsChannelFactory.java:295)
>> at sun.nio.fs.WindowsChannelFactory.newFileChannel(WindowsChannelFactory.java:162)
>> at sun.nio.fs.WindowsFileSystemProvider.newByteChannel(WindowsFileSystemProvider.java:225)
>> at java.nio.file.spi.FileSystemProvider.newOutputStream(FileSystemProvider.java:434)
>> at org.apache.lucene.mockfile.FilterFileSystemProvider.newOutputStream(FilterFileSystemProvider.java:197)
>> at org.apache.lucene.mockfile.FilterFileSystemProvider.newOutputStream(FilterFileSystemProvider.java:197)
>> at org.apache.lucene.mockfile.HandleTrackingFS.newOutputStream(HandleTrackingFS.java:129)
>> at org.apache.lucene.mockfile.HandleTrackingFS.newOutputStream(HandleTrackingFS.java:129)
>> at org.apache.lucene.mockfile.FilterFileSystemProvider.newOutputStream(FilterFileSystemProvider.java:197)
>> at java.nio.file.Files.newOutputStream(Files.java:216)
>> at org.apache.lucene.store.FSDirectory$FSIndexOutput.<init>(FSDirectory.java:413)
>> at org.apache.lucene.store.FSDirectory$FSIndexOutput.<init>(FSDirectory.java:409)
>> at org.apache.lucene.store.FSDirectory.createOutput(FSDirectory.java:253)
>> at org.apache.lucene.store.BaseDirectoryTestCase.testListAllIsSorted(BaseDirectoryTestCase.java:1198)
>> at sun.reflect.NativeMethodAccessorImpl.invoke0(Native Method)
>> at sun.reflect.NativeMethodAccessorImpl.invoke(NativeMethodAccessorImpl.java:62)
>> at sun.reflect.DelegatingMethodAccessorImpl.invoke(DelegatingMethodAccessorImpl.java:43)
>> at java.lang.reflect.Method.invoke(Method.java:498)
>> at com.carrotsearch.randomizedtesting.RandomizedRunner.invoke(RandomizedRunner.java:1713)
>> at com.carrotsearch.randomizedtesting.RandomizedRunner$8.evaluate(RandomizedRunner.java:907)
>> at com.carrotsearch.randomizedtesting.RandomizedRunner$9.evaluate(RandomizedRunner.java:943)
>> at com.carrotsearch.randomizedtesting.RandomizedRunner$10.evaluate(RandomizedRunner.java:957)
>> at org.apache.lucene.util.TestRuleSetupTeardownChained$1.evaluate(TestRuleSetupTeardownChained.java:49)
>> at org.apache.lucene.util.AbstractBeforeAfterRule$1.evaluate(AbstractBeforeAfterRule.java:45)
>> at org.apache.lucene.util.TestRuleThreadAndTestName$1.evaluate(TestRuleThreadAndTestName.java:48)
>> at org.apache.lucene.util.TestRuleIgnoreAfterMaxFailures$1.evaluate(TestRuleIgnoreAfterMaxFailures.java:64)
>> at org.apache.lucene.util.TestRuleMarkFailure$1.evaluate(TestRuleMarkFailure.java:47)
>> at com.carrotsearch.randomizedtesting.rules.StatementAdapter.evaluate(StatementAdapter.java:36)
>> at com.carrotsearch.randomizedtesting.ThreadLeakControl$StatementRunner.run(ThreadLeakControl.java:368)
>> at com.carrotsearch.randomizedtesting.ThreadLeakControl.forkTimeoutingTask(ThreadLeakControl.java:817)
>> at com.carrotsearch.randomizedtesting.ThreadLeakControl$3.evaluate(ThreadLeakControl.java:468)
>> at com.carrotsearch.randomizedtesting.RandomizedRunner.runSingleTest(RandomizedRunner.java:916)
>> at com.carrotsearch.randomizedtesting.RandomizedRunner$5.evaluate(RandomizedRunner.java:802)
>> at com.carrotsearch.randomizedtesting.RandomizedRunner$6.evaluate(RandomizedRunner.java:852)
>> at com.carrotsearch.randomizedtesting.RandomizedRunner$7.evaluate(RandomizedRunner.java:863)
>> at org.apache.lucene.util.AbstractBeforeAfterRule$1.evaluate(AbstractBeforeAfterRule.java:45)
>> at com.carrotsearch.randomizedtesting.rules.StatementAdapter.evaluate(StatementAdapter.java:36)
>> at org.apache.lucene.util.TestRuleStoreClassName$1.evaluate(TestRuleStoreClassName.java:41)
>> at com.carrotsearch.randomizedtesting.rules.NoShadowingOrOverridesOnMethodsRule$1.evaluate(NoShadowingOrOverridesOnMethodsRule.java:40)
>> at com.carrotsearch.randomizedtesting.rules.NoShadowingOrOverridesOnMethodsRule$1.evaluate(NoShadowingOrOverridesOnMethodsRule.java:40)
>> at com.carrotsearch.randomizedtesting.rules.StatementAdapter.evaluate(StatementAdapter.java:36)
>> at com.carrotsearch.randomizedtesting.rules.StatementAdapter.evaluate(StatementAdapter.java:36)
>> at com.carrotsearch.randomizedtesting.rules.StatementAdapter.evaluate(StatementAdapter.java:36)
>> at org.apache.lucene.util.TestRuleAssertionsRequired$1.evaluate(TestRuleAssertionsRequired.java:53)
>> at org.apache.lucene.util.TestRuleMarkFailure$1.evaluate(TestRuleMarkFailure.java:47)
>> at org.apache.lucene.util.TestRuleIgnoreAfterMaxFailures$1.evaluate(TestRuleIgnoreAfterMaxFailures.java:64)
>> at org.apache.lucene.util.TestRuleIgnoreTestSuites$1.evaluate(TestRuleIgnoreTestSuites.java:54)
>> at com.carrotsearch.randomizedtesting.rules.StatementAdapter.evaluate(StatementAdapter.java:36)
>> at com.carrotsearch.randomizedtesting.ThreadLeakControl$StatementRunner.run(ThreadLeakControl.java:368)
>> at java.lang.Thread.run(Thread.java:745)
>>
>>
>>
>>
>> Build Log:
>> [...truncated 688 lines...]
>>  [junit4] Suite: org.apache.lucene.store.TestFileSwitchDirectory
>>  [junit4] IGNOR/A 0.02s J1 | TestFileSwitchDirectory.testPendingDeletions
>>  [junit4]    > Assumption #1: we can only install VirusCheckingFS on an FSDirectory
>>  [junit4]   2> NOTE: reproduce with: ant test  -Dtestcase=TestFileSwitchDirectory -Dtests.method=testListAllIsSorted -Dtests.seed=121F5D1A61C5BA5C -Dtests.slow=true -Dtests.locale=ar-BH -Dtests.timezone=America/Jamaica -Dtests.asserts=true -Dtests.file.encoding=ISO-8859-1
>>  [junit4] ERROR   0.03s J1 | TestFileSwitchDirectory.testListAllIsSorted <<<
>>  [junit4]    > Throwable #1: java.security.AccessControlException: access denied ("java.io.FilePermission" "C:\Users\jenkins\workspace\Lucene-Solr-master-Windows\lucene\build\core\test\J1\temp\lucene.store.TestFileSwitchDirectory_121F5D1A61C5BA5C-001\bar-017\con" "write")
>>  [junit4]    > at __randomizedtesting.SeedInfo.seed([121F5D1A61C5BA5C:8833FA68A1FA35D5]:0)
>>  [junit4]    > at java.security.AccessControlContext.checkPermission(AccessControlContext.java:472)
>>  [junit4]    > at java.security.AccessController.checkPermission(AccessController.java:884)
>>  [junit4]    > at java.lang.SecurityManager.checkPermission(SecurityManager.java:549)
>>  [junit4]    > at java.lang.SecurityManager.checkWrite(SecurityManager.java:979)
>>  [junit4]    > at sun.nio.fs.WindowsChannelFactory.open(WindowsChannelFactory.java:295)
>>  [junit4]    > at sun.nio.fs.WindowsChannelFactory.newFileChannel(WindowsChannelFactory.java:162)
>>  [junit4]    > at sun.nio.fs.WindowsFileSystemProvider.newByteChannel(WindowsFileSystemProvider.java:225)
>>  [junit4]    > at java.nio.file.spi.FileSystemProvider.newOutputStream(FileSystemProvider.java:434)
>>  [junit4]    > at org.apache.lucene.mockfile.FilterFileSystemProvider.newOutputStream(FilterFileSystemProvider.java:197)
>>  [junit4]    > at org.apache.lucene.mockfile.FilterFileSystemProvider.newOutputStream(FilterFileSystemProvider.java:197)
>>  [junit4]    > at org.apache.lucene.mockfile.HandleTrackingFS.newOutputStream(HandleTrackingFS.java:129)
>>  [junit4]    > at org.apache.lucene.mockfile.HandleTrackingFS.newOutputStream(HandleTrackingFS.java:129)
>>  [junit4]    > at org.apache.lucene.mockfile.FilterFileSystemProvider.newOutputStream(FilterFileSystemProvider.java:197)
>>  [junit4]    > at java.nio.file.Files.newOutputStream(Files.java:216)
>>  [junit4]    > at org.apache.lucene.store.FSDirectory$FSIndexOutput.<init>(FSDirectory.java:413)
>>  [junit4]    > at org.apache.lucene.store.FSDirectory$FSIndexOutput.<init>(FSDirectory.java:409)
>>  [junit4]    > at org.apache.lucene.store.FSDirectory.createOutput(FSDirectory.java:253)
>>  [junit4]    > at org.apache.lucene.store.FileSwitchDirectory.createOutput(FileSwitchDirectory.java:161)
>>  [junit4]    > at org.apache.lucene.store.BaseDirectoryTestCase.testListAllIsSorted(BaseDirectoryTestCase.java:1198)
>>  [junit4]    > at java.lang.Thread.run(Thread.java:745)
>>  [junit4] IGNOR/A 0.01s J1 | TestFileSwitchDirectory.testFsyncDoesntCreateNewFiles
>>  [junit4]    > Assumption #1: test only works for FSDirectory subclasses
>>  [junit4]   2> NOTE: leaving temporary files on disk at: C:\Users\jenkins\workspace\Lucene-Solr-master-Windows\lucene\build\core\test\J1\temp\lucene.store.TestFileSwitchDirectory_121F5D1A61C5BA5C-001
>>  [junit4]   2> NOTE: test params are: codec=CheapBastard, sim=RandomSimilarity(queryNorm=false): {}, locale=ar-BH, timezone=America/Jamaica
>>  [junit4]   2> NOTE: Windows 10 10.0 amd64/Oracle Corporation 1.8.0_121 (64-bit)/cpus=3,threads=1,free=26564936,total=201326592
>>  [junit4]   2> NOTE: All tests run in this JVM: [TestPerFieldPostingsFormat2, TestCharArraySet, TestBytesRefHash, TestOmitNorms, TestFilterSpans, TestEarlyTerminatingSortingCollector, TestIndexWriterNRTIsCurrent, TestRollback, TestReadOnlyIndex, TestExceedMaxTermLength, Test2BNumericDocValues, TestTrackingDirectoryWrapper, TestParallelTermEnum, TestTransactionRollback, TestIndexWriterConfig, TestConcurrentMergeScheduler, TestDeterminism, TestUniqueTermCount, TestIndexSearcher, TestDoubleRangeFieldQueries, TestIndexWriterOutOfFileDescriptors, TestTermVectorsReader, TestBlockPostingsFormat, TestNearSpansOrdered, TestLucene70DocValuesFormat, TestTermRangeQuery, TestLucene62SegmentInfoFormat, TestAxiomaticSimilarity, TestDirectPacked, TestSpanOrQuery, TestIndexWriterForceMerge, TestFileSwitchDirectory]
>>  [junit4] Completed [144/451 (1!)] on J1 in 3.13s, 43 tests, 1 error, 2 skipped <<< FAILURES!
>>
>> [...truncated 222 lines...]
>>  [junit4] Suite: org.apache.lucene.store.TestSimpleFSDirectory
>>  [junit4]   2> NOTE: reproduce with: ant test  -Dtestcase=TestSimpleFSDirectory -Dtests.method=testListAllIsSorted -Dtests.seed=121F5D1A61C5BA5C -Dtests.slow=true -Dtests.locale=en-ZA -Dtests.timezone=America/Knox_IN -Dtests.asserts=true -Dtests.file.encoding=ISO-8859-1
>>  [junit4] ERROR   0.01s J1 | TestSimpleFSDirectory.testListAllIsSorted <<<
>>  [junit4]    > Throwable #1: java.security.AccessControlException: access denied ("java.io.FilePermission" "C:\Users\jenkins\workspace\Lucene-Solr-master-Windows\lucene\build\core\test\J1\temp\lucene.store.TestSimpleFSDirectory_121F5D1A61C5BA5C-001\tempDir-006\con" "write")
>>  [junit4]    > at __randomizedtesting.SeedInfo.seed([121F5D1A61C5BA5C:8833FA68A1FA35D5]:0)
>>  [junit4]    > at java.security.AccessControlContext.checkPermission(AccessControlContext.java:472)
>>  [junit4]    > at java.security.AccessController.checkPermission(AccessController.java:884)
>>  [junit4]    > at java.lang.SecurityManager.checkPermission(SecurityManager.java:549)
>>  [junit4]    > at java.lang.SecurityManager.checkWrite(SecurityManager.java:979)
>>  [junit4]    > at sun.nio.fs.WindowsChannelFactory.open(WindowsChannelFactory.java:295)
>>  [junit4]    > at sun.nio.fs.WindowsChannelFactory.newFileChannel(WindowsChannelFactory.java:162)
>>  [junit4]    > at sun.nio.fs.WindowsFileSystemProvider.newByteChannel(WindowsFileSystemProvider.java:225)
>>  [junit4]    > at java.nio.file.spi.FileSystemProvider.newOutputStream(FileSystemProvider.java:434)
>>  [junit4]    > at org.apache.lucene.mockfile.FilterFileSystemProvider.newOutputStream(FilterFileSystemProvider.java:197)
>>  [junit4]    > at org.apache.lucene.mockfile.FilterFileSystemProvider.newOutputStream(FilterFileSystemProvider.java:197)
>>  [junit4]    > at org.apache.lucene.mockfile.HandleTrackingFS.newOutputStream(HandleTrackingFS.java:129)
>>  [junit4]    > at org.apache.lucene.mockfile.HandleTrackingFS.newOutputStream(HandleTrackingFS.java:129)
>>  [junit4]    > at org.apache.lucene.mockfile.FilterFileSystemProvider.newOutputStream(FilterFileSystemProvider.java:197)
>>  [junit4]    > at java.nio.file.Files.newOutputStream(Files.java:216)
>>  [junit4]    > at org.apache.lucene.store.FSDirectory$FSIndexOutput.<init>(FSDirectory.java:413)
>>  [junit4]    > at org.apache.lucene.store.FSDirectory$FSIndexOutput.<init>(FSDirectory.java:409)
>>  [junit4]    > at org.apache.lucene.store.FSDirectory.createOutput(FSDirectory.java:253)
>>  [junit4]    > at org.apache.lucene.store.BaseDirectoryTestCase.testListAllIsSorted(BaseDirectoryTestCase.java:1198)
>>  [junit4]    > at java.lang.Thread.run(Thread.java:745)
>>  [junit4]   2> NOTE: leaving temporary files on disk at: C:\Users\jenkins\workspace\Lucene-Solr-master-Windows\lucene\build\core\test\J1\temp\lucene.store.TestSimpleFSDirectory_121F5D1A61C5BA5C-001
>>  [junit4]   2> NOTE: test params are: codec=Asserting(Lucene70): {}, docValues:{}, maxPointsInLeafNode=1369, maxMBSortInHeap=6.070639152294969, sim=RandomSimilarity(queryNorm=false): {}, locale=en-ZA, timezone=America/Knox_IN
>>  [junit4]   2> NOTE: Windows 10 10.0 amd64/Oracle Corporation 1.8.0_121 (64-bit)/cpus=3,threads=1,free=114851360,total=213385216
>>  [junit4]   2> NOTE: All tests run in this JVM: [TestPerFieldPostingsFormat2, TestCharArraySet, TestBytesRefHash, TestOmitNorms, TestFilterSpans, TestEarlyTerminatingSortingCollector, TestIndexWriterNRTIsCurrent, TestRollback, TestReadOnlyIndex, TestExceedMaxTermLength, Test2BNumericDocValues, TestTrackingDirectoryWrapper, TestParallelTermEnum, TestTransactionRollback, TestIndexWriterConfig, TestConcurrentMergeScheduler, TestDeterminism, TestUniqueTermCount, TestIndexSearcher, TestDoubleRangeFieldQueries, TestIndexWriterOutOfFileDescriptors, TestTermVectorsReader, TestBlockPostingsFormat, TestNearSpansOrdered, TestLucene70DocValuesFormat, TestTermRangeQuery, TestLucene62SegmentInfoFormat, TestAxiomaticSimilarity, TestDirectPacked, TestSpanOrQuery, TestIndexWriterForceMerge, TestFileSwitchDirectory, TestLucene50StoredFieldsFormatHighCompression, TestSimpleExplanationsWithFillerDocs, TestAllFilesCheckIndexHeader, TestCharTermAttributeImpl, Test2BPostingsBytes, TestFixedBitSet, TestCompiledAutomaton, TestSpanFirstQuery, TestMinShouldMatch2, TestMultiFields, TestSearchAfter, Test2BDocs, TestDelegatingAnalyzerWrapper, TestSingleInstanceLockFactory, TestDocumentsWriterStallControl, TestForTooMuchCloning, TestRollingBuffer, TestMultiDocValues, TestRollingUpdates, TestIndexWriterOnDiskFull, TestSegmentTermDocs, TestDocValuesScoring, TestBlockPostingsFormat3, TestRegExp, TestIndexingSequenceNumbers, TestTermVectorsWriter, TermInSetQueryTest, TestMergeSchedulerExternal, TestDirectoryReaderReopen, TestTotalHitCountCollector, TestSearcherManager, TestNRTCachingDirectory, TestNGramPhraseQuery, TestUpgradeIndexMergePolicy, TestDemoParallelLeafReader, TestSortRandom, TestDemo, TestIndexSorting, TestSparseFixedBitDocIdSet, TestStopFilter, TestDeletionPolicy, TestCharsRefBuilder, TestCachingCollector, TestMultiPhraseEnum, TestSimpleFSDirectory]
>>  [junit4] Completed [212/451 (2!)] on J1 in 2.49s, 42 tests, 1 error <<< FAILURES!
>>
>> [...truncated 690 lines...]
>>  [junit4] Suite: org.apache.lucene.store.TestNIOFSDirectory
>>  [junit4]   2> NOTE: reproduce with: ant test  -Dtestcase=TestNIOFSDirectory -Dtests.method=testListAllIsSorted -Dtests.seed=121F5D1A61C5BA5C -Dtests.slow=true -Dtests.locale=sr-ME -Dtests.timezone=Africa/Bissau -Dtests.asserts=true -Dtests.file.encoding=ISO-8859-1
>>  [junit4] ERROR   0.01s J1 | TestNIOFSDirectory.testListAllIsSorted <<<
>>  [junit4]    > Throwable #1: java.security.AccessControlException: access denied ("java.io.FilePermission" "C:\Users\jenkins\workspace\Lucene-Solr-master-Windows\lucene\build\core\test\J1\temp\lucene.store.TestNIOFSDirectory_121F5D1A61C5BA5C-001\tempDir-006\con" "write")
>>  [junit4]    > at __randomizedtesting.SeedInfo.seed([121F5D1A61C5BA5C:8833FA68A1FA35D5]:0)
>>  [junit4]    > at java.security.AccessControlContext.checkPermission(AccessControlContext.java:472)
>>  [junit4]    > at java.security.AccessController.checkPermission(AccessController.java:884)
>>  [junit4]    > at java.lang.SecurityManager.checkPermission(SecurityManager.java:549)
>>  [junit4]    > at java.lang.SecurityManager.checkWrite(SecurityManager.java:979)
>>  [junit4]    > at sun.nio.fs.WindowsChannelFactory.open(WindowsChannelFactory.java:295)
>>  [junit4]    > at sun.nio.fs.WindowsChannelFactory.newFileChannel(WindowsChannelFactory.java:162)
>>  [junit4]    > at sun.nio.fs.WindowsFileSystemProvider.newByteChannel(WindowsFileSystemProvider.java:225)
>>  [junit4]    > at java.nio.file.spi.FileSystemProvider.newOutputStream(FileSystemProvider.java:434)
>>  [junit4]    > at org.apache.lucene.mockfile.FilterFileSystemProvider.newOutputStream(FilterFileSystemProvider.java:197)
>>  [junit4]    > at org.apache.lucene.mockfile.FilterFileSystemProvider.newOutputStream(FilterFileSystemProvider.java:197)
>>  [junit4]    > at org.apache.lucene.mockfile.HandleTrackingFS.newOutputStream(HandleTrackingFS.java:129)
>>  [junit4]    > at org.apache.lucene.mockfile.HandleTrackingFS.newOutputStream(HandleTrackingFS.java:129)
>>  [junit4]    > at org.apache.lucene.mockfile.FilterFileSystemProvider.newOutputStream(FilterFileSystemProvider.java:197)
>>  [junit4]    > at java.nio.file.Files.newOutputStream(Files.java:216)
>>  [junit4]    > at org.apache.lucene.store.FSDirectory$FSIndexOutput.<init>(FSDirectory.java:413)
>>  [junit4]    > at org.apache.lucene.store.FSDirectory$FSIndexOutput.<init>(FSDirectory.java:409)
>>  [junit4]    > at org.apache.lucene.store.FSDirectory.createOutput(FSDirectory.java:253)
>>  [junit4]    > at org.apache.lucene.store.BaseDirectoryTestCase.testListAllIsSorted(BaseDirectoryTestCase.java:1198)
>>  [junit4]    > at java.lang.Thread.run(Thread.java:745)
>>  [junit4]   2> NOTE: leaving temporary files on disk at: C:\Users\jenkins\workspace\Lucene-Solr-master-Windows\lucene\build\core\test\J1\temp\lucene.store.TestNIOFSDirectory_121F5D1A61C5BA5C-001
>>  [junit4]   2> NOTE: test params are: codec=Asserting(Lucene70): {}, docValues:{}, maxPointsInLeafNode=1652, maxMBSortInHeap=7.556654604900439, sim=RandomSimilarity(queryNorm=false): {}, locale=sr-ME, timezone=Africa/Bissau
>>  [junit4]   2> NOTE: Windows 10 10.0 amd64/Oracle Corporation 1.8.0_121 (64-bit)/cpus=3,threads=1,free=160648488,total=299892736
>>  [junit4]   2> NOTE: All tests run in this JVM: [TestPerFieldPostingsFormat2, TestCharArraySet, TestBytesRefHash, TestOmitNorms, TestFilterSpans, TestEarlyTerminatingSortingCollector, TestIndexWriterNRTIsCurrent, TestRollback, TestReadOnlyIndex, TestExceedMaxTermLength, Test2BNumericDocValues, TestTrackingDirectoryWrapper, TestParallelTermEnum, TestTransactionRollback, TestIndexWriterConfig, TestConcurrentMergeScheduler, TestDeterminism, TestUniqueTermCount, TestIndexSearcher, TestDoubleRangeFieldQueries, TestIndexWriterOutOfFileDescriptors, TestTermVectorsReader, TestBlockPostingsFormat, TestNearSpansOrdered, TestLucene70DocValuesFormat, TestTermRangeQuery, TestLucene62SegmentInfoFormat, TestAxiomaticSimilarity, TestDirectPacked, TestSpanOrQuery, TestIndexWriterForceMerge, TestFileSwitchDirectory, TestLucene50StoredFieldsFormatHighCompression, TestSimpleExplanationsWithFillerDocs, TestAllFilesCheckIndexHeader, TestCharTermAttributeImpl, Test2BPostingsBytes, TestFixedBitSet, TestCompiledAutomaton, TestSpanFirstQuery, TestMinShouldMatch2, TestMultiFields, TestSearchAfter, Test2BDocs, TestDelegatingAnalyzerWrapper, TestSingleInstanceLockFactory, TestDocumentsWriterStallControl, TestForTooMuchCloning, TestRollingBuffer, TestMultiDocValues, TestRollingUpdates, TestIndexWriterOnDiskFull, TestSegmentTermDocs, TestDocValuesScoring, TestBlockPostingsFormat3, TestRegExp, TestIndexingSequenceNumbers, TestTermVectorsWriter, TermInSetQueryTest, TestMergeSchedulerExternal, TestDirectoryReaderReopen, TestTotalHitCountCollector, TestSearcherManager, TestNRTCachingDirectory, TestNGramPhraseQuery, TestUpgradeIndexMergePolicy, TestDemoParallelLeafReader, TestSortRandom, TestDemo, TestIndexSorting, TestSparseFixedBitDocIdSet, TestStopFilter, TestDeletionPolicy, TestCharsRefBuilder, TestCachingCollector, TestMultiPhraseEnum, TestSimpleFSDirectory, TestSizeBoundedForceMerge, TestCachingTokenFilter, TestPositiveScoresOnlyCollector, TestIndexWriterReader, TestSpanMultiTermQueryWrapper, TestByteBlockPool, TestComplexExplanationsOfNonMatches, TestIndexWriterCommit, TestRadixSelector, TestShardSearching, TestNot, TestMathUtil, TestPersistentSnapshotDeletionPolicy, TestVersion, TestIntsRef, TestFlex, TestDocInverterPerFieldErrorInfo, TestFrequencyTrackingRingBuffer, TestMutableValues, TestDisjunctionMaxQuery, TestStressAdvance, TestIndexWriterMaxDocs, TestSimpleSearchEquivalence, TestIsCurrent, TestLongPostings, Test2BBinaryDocValues, TestCheckIndex, TestMultiTermConstantScore, TestSpansEnum, TestFixedBitDocIdSet, TestIndexWriterExceptions2, TestCustomSearcherSort, TestMmapDirectory, TestDocumentWriter, TestTragicIndexWriterDeadlock, TestStressDeletes, TestByteSlices, TestDocValuesIndexing, TestHugeRamFile, TestCustomNorms, TestUTF32ToUTF8, TestMultiPhraseQuery, TestStressNRT, TestSloppyPhraseQuery2, TestSameScoresWithThreads, TestCrashCausesCorruptIndex, TestFuzzyQuery, TestFieldMaskingSpanQuery, TestSimpleExplanationsOfNonMatches, TestPrefixInBooleanQuery, TestAutomatonQuery, TestIndexableField, TestPrefixRandom, TestMultiLevelSkipList, TestSearchForDuplicates, TestMatchAllDocsQuery, TestElevationComparator, TestSubScorerFreqs, TestRecyclingIntBlockAllocator, TestMultiTermQueryRewrites, TestSimilarity, TestVirtualMethod, TestSimilarityProvider, TestDateTools, Test2BPostings, TestDocCount, TestAutomatonQueryUnicode, TestRamUsageEstimator, TestNoMergeScheduler, TestIndexWriterLockRelease, TestPhrasePrefixQuery, TestAssertions, TestCloseableThreadLocal, Test4GBStoredFields, TestReaderClosed, TestSimpleAttributeImpl, Test2BPositions, Test2BTerms, Test2BPagedBytes, TestCharArrayMap, TestPackedTokenAttributeImpl, TestCodecUtil, TestBlockPostingsFormat2, TestLucene50StoredFieldsFormat, TestLucene60FieldInfoFormat, TestFieldType, TestGeoUtils, TestPolygon, TestPolygon2D, TestDocsWithFieldSet, TestExitableDirectoryReader, TestFilterDirectoryReader, TestInfoStream, TestMaxPosition, TestMergeRateLimiter, TestNRTReaderCleanup, TestNumericDocValuesUpdates, TestReaderWrapperDVTypeCheck, TestSegmentInfos, TestSortedSetDocValues, TestTermVectors, FuzzyTermOnShortTermsTest, TestApproximationSearchEquivalence, TestBlendedTermQuery, TestBooleanRewrites, TestBoostQuery, TestConjunctionDISI, TestControlledRealTimeReopenThread, TestDocValuesQueries, TestEarlyTermination, TestFieldValueQuery, TestFloatRangeFieldQueries, TestIntRangeFieldQueries, TestLRUQueryCache, TestMultiset, TestQueryRescorer, TestSortedSetSelector, TestSynonymQuery, TestBM25Similarity, TestSpanCollection, TestSpanTermQuery, TestFilterDirectory, TestNIOFSDirectory]
>>  [junit4] Completed [425/451 (3!)] on J1 in 2.00s, 42 tests, 1 error <<< FAILURES!
>>
>> [...truncated 74223 lines...]
>>
>>
>> ---------------------------------------------------------------------
>> To unsubscribe, e-mail: [hidden email]
>> For additional commands, e-mail: [hidden email]
>



---------------------------------------------------------------------
To unsubscribe, e-mail: [hidden email]
For additional commands, e-mail: [hidden email]

Loading...