[JENKINS] Lucene-Solr-master-Windows (64bit/jdk1.8.0_144) - Build # 6954 - Unstable!

Previous Topic Next Topic
 
classic Classic list List threaded Threaded
3 messages Options
Reply | Threaded
Open this post in threaded view
|

[JENKINS] Lucene-Solr-master-Windows (64bit/jdk1.8.0_144) - Build # 6954 - Unstable!

Policeman Jenkins Server-2
Build: https://jenkins.thetaphi.de/job/Lucene-Solr-master-Windows/6954/
Java: 64bit/jdk1.8.0_144 -XX:+UseCompressedOops -XX:+UseG1GC

5 tests failed.
FAILED:  junit.framework.TestSuite.org.apache.lucene.store.TestNIOFSDirectory

Error Message:
Could not remove the following files (in the order of attempts):    C:\Users\jenkins\workspace\Lucene-Solr-master-Windows\lucene\build\core\test\J1\temp\lucene.store.TestNIOFSDirectory_BBEC1310C2AF9B08-001\testThreadSafety-001: java.nio.file.AccessDeniedException: C:\Users\jenkins\workspace\Lucene-Solr-master-Windows\lucene\build\core\test\J1\temp\lucene.store.TestNIOFSDirectory_BBEC1310C2AF9B08-001\testThreadSafety-001    C:\Users\jenkins\workspace\Lucene-Solr-master-Windows\lucene\build\core\test\J1\temp\lucene.store.TestNIOFSDirectory_BBEC1310C2AF9B08-001: java.nio.file.DirectoryNotEmptyException: C:\Users\jenkins\workspace\Lucene-Solr-master-Windows\lucene\build\core\test\J1\temp\lucene.store.TestNIOFSDirectory_BBEC1310C2AF9B08-001

Stack Trace:
java.io.IOException: Could not remove the following files (in the order of attempts):
   C:\Users\jenkins\workspace\Lucene-Solr-master-Windows\lucene\build\core\test\J1\temp\lucene.store.TestNIOFSDirectory_BBEC1310C2AF9B08-001\testThreadSafety-001: java.nio.file.AccessDeniedException: C:\Users\jenkins\workspace\Lucene-Solr-master-Windows\lucene\build\core\test\J1\temp\lucene.store.TestNIOFSDirectory_BBEC1310C2AF9B08-001\testThreadSafety-001
   C:\Users\jenkins\workspace\Lucene-Solr-master-Windows\lucene\build\core\test\J1\temp\lucene.store.TestNIOFSDirectory_BBEC1310C2AF9B08-001: java.nio.file.DirectoryNotEmptyException: C:\Users\jenkins\workspace\Lucene-Solr-master-Windows\lucene\build\core\test\J1\temp\lucene.store.TestNIOFSDirectory_BBEC1310C2AF9B08-001

        at __randomizedtesting.SeedInfo.seed([BBEC1310C2AF9B08]:0)
        at org.apache.lucene.util.IOUtils.rm(IOUtils.java:329)
        at org.apache.lucene.util.TestRuleTemporaryFilesCleanup.afterAlways(TestRuleTemporaryFilesCleanup.java:216)
        at com.carrotsearch.randomizedtesting.rules.TestRuleAdapter$1.afterAlways(TestRuleAdapter.java:31)
        at com.carrotsearch.randomizedtesting.rules.StatementAdapter.evaluate(StatementAdapter.java:43)
        at com.carrotsearch.randomizedtesting.rules.StatementAdapter.evaluate(StatementAdapter.java:36)
        at org.apache.lucene.util.TestRuleAssertionsRequired$1.evaluate(TestRuleAssertionsRequired.java:53)
        at org.apache.lucene.util.TestRuleMarkFailure$1.evaluate(TestRuleMarkFailure.java:47)
        at org.apache.lucene.util.TestRuleIgnoreAfterMaxFailures$1.evaluate(TestRuleIgnoreAfterMaxFailures.java:64)
        at org.apache.lucene.util.TestRuleIgnoreTestSuites$1.evaluate(TestRuleIgnoreTestSuites.java:54)
        at com.carrotsearch.randomizedtesting.rules.StatementAdapter.evaluate(StatementAdapter.java:36)
        at com.carrotsearch.randomizedtesting.ThreadLeakControl$StatementRunner.run(ThreadLeakControl.java:368)
        at java.lang.Thread.run(Thread.java:748)


FAILED:  org.apache.solr.cloud.CollectionsAPIDistributedZkTest.testCollectionsAPI

Error Message:
Error from server at http://127.0.0.1:57637/solr/awhollynewcollection_0_shard1_replica_n1: ClusterState says we are the leader (http://127.0.0.1:57637/solr/awhollynewcollection_0_shard1_replica_n1), but locally we don't think so. Request came from null

Stack Trace:
org.apache.solr.client.solrj.impl.CloudSolrClient$RouteException: Error from server at http://127.0.0.1:57637/solr/awhollynewcollection_0_shard1_replica_n1: ClusterState says we are the leader (http://127.0.0.1:57637/solr/awhollynewcollection_0_shard1_replica_n1), but locally we don't think so. Request came from null
        at __randomizedtesting.SeedInfo.seed([5273222CF93A20D5:1A065698FF090F40]:0)
        at org.apache.solr.client.solrj.impl.CloudSolrClient.directUpdate(CloudSolrClient.java:539)
        at org.apache.solr.client.solrj.impl.CloudSolrClient.sendRequest(CloudSolrClient.java:993)
        at org.apache.solr.client.solrj.impl.CloudSolrClient.requestWithRetryOnStaleState(CloudSolrClient.java:862)
        at org.apache.solr.client.solrj.impl.CloudSolrClient.request(CloudSolrClient.java:793)
        at org.apache.solr.client.solrj.SolrRequest.process(SolrRequest.java:178)
        at org.apache.solr.client.solrj.request.UpdateRequest.commit(UpdateRequest.java:233)
        at org.apache.solr.cloud.CollectionsAPIDistributedZkTest.testCollectionsAPI(CollectionsAPIDistributedZkTest.java:459)
        at sun.reflect.NativeMethodAccessorImpl.invoke0(Native Method)
        at sun.reflect.NativeMethodAccessorImpl.invoke(NativeMethodAccessorImpl.java:62)
        at sun.reflect.DelegatingMethodAccessorImpl.invoke(DelegatingMethodAccessorImpl.java:43)
        at java.lang.reflect.Method.invoke(Method.java:498)
        at com.carrotsearch.randomizedtesting.RandomizedRunner.invoke(RandomizedRunner.java:1737)
        at com.carrotsearch.randomizedtesting.RandomizedRunner$8.evaluate(RandomizedRunner.java:934)
        at com.carrotsearch.randomizedtesting.RandomizedRunner$9.evaluate(RandomizedRunner.java:970)
        at com.carrotsearch.randomizedtesting.RandomizedRunner$10.evaluate(RandomizedRunner.java:984)
        at com.carrotsearch.randomizedtesting.rules.SystemPropertiesRestoreRule$1.evaluate(SystemPropertiesRestoreRule.java:57)
        at org.apache.lucene.util.TestRuleSetupTeardownChained$1.evaluate(TestRuleSetupTeardownChained.java:49)
        at org.apache.lucene.util.AbstractBeforeAfterRule$1.evaluate(AbstractBeforeAfterRule.java:45)
        at org.apache.lucene.util.TestRuleThreadAndTestName$1.evaluate(TestRuleThreadAndTestName.java:48)
        at org.apache.lucene.util.TestRuleIgnoreAfterMaxFailures$1.evaluate(TestRuleIgnoreAfterMaxFailures.java:64)
        at org.apache.lucene.util.TestRuleMarkFailure$1.evaluate(TestRuleMarkFailure.java:47)
        at com.carrotsearch.randomizedtesting.rules.StatementAdapter.evaluate(StatementAdapter.java:36)
        at com.carrotsearch.randomizedtesting.ThreadLeakControl$StatementRunner.run(ThreadLeakControl.java:368)
        at com.carrotsearch.randomizedtesting.ThreadLeakControl.forkTimeoutingTask(ThreadLeakControl.java:817)
        at com.carrotsearch.randomizedtesting.ThreadLeakControl$3.evaluate(ThreadLeakControl.java:468)
        at com.carrotsearch.randomizedtesting.RandomizedRunner.runSingleTest(RandomizedRunner.java:943)
        at com.carrotsearch.randomizedtesting.RandomizedRunner$5.evaluate(RandomizedRunner.java:829)
        at com.carrotsearch.randomizedtesting.RandomizedRunner$6.evaluate(RandomizedRunner.java:879)
        at com.carrotsearch.randomizedtesting.RandomizedRunner$7.evaluate(RandomizedRunner.java:890)
        at com.carrotsearch.randomizedtesting.rules.StatementAdapter.evaluate(StatementAdapter.java:36)
        at com.carrotsearch.randomizedtesting.rules.SystemPropertiesRestoreRule$1.evaluate(SystemPropertiesRestoreRule.java:57)
        at org.apache.lucene.util.AbstractBeforeAfterRule$1.evaluate(AbstractBeforeAfterRule.java:45)
        at com.carrotsearch.randomizedtesting.rules.StatementAdapter.evaluate(StatementAdapter.java:36)
        at org.apache.lucene.util.TestRuleStoreClassName$1.evaluate(TestRuleStoreClassName.java:41)
        at com.carrotsearch.randomizedtesting.rules.NoShadowingOrOverridesOnMethodsRule$1.evaluate(NoShadowingOrOverridesOnMethodsRule.java:40)
        at com.carrotsearch.randomizedtesting.rules.NoShadowingOrOverridesOnMethodsRule$1.evaluate(NoShadowingOrOverridesOnMethodsRule.java:40)
        at com.carrotsearch.randomizedtesting.rules.StatementAdapter.evaluate(StatementAdapter.java:36)
        at com.carrotsearch.randomizedtesting.rules.StatementAdapter.evaluate(StatementAdapter.java:36)
        at com.carrotsearch.randomizedtesting.rules.StatementAdapter.evaluate(StatementAdapter.java:36)
        at org.apache.lucene.util.TestRuleAssertionsRequired$1.evaluate(TestRuleAssertionsRequired.java:53)
        at org.apache.lucene.util.TestRuleMarkFailure$1.evaluate(TestRuleMarkFailure.java:47)
        at org.apache.lucene.util.TestRuleIgnoreAfterMaxFailures$1.evaluate(TestRuleIgnoreAfterMaxFailures.java:64)
        at org.apache.lucene.util.TestRuleIgnoreTestSuites$1.evaluate(TestRuleIgnoreTestSuites.java:54)
        at com.carrotsearch.randomizedtesting.rules.StatementAdapter.evaluate(StatementAdapter.java:36)
        at com.carrotsearch.randomizedtesting.ThreadLeakControl$StatementRunner.run(ThreadLeakControl.java:368)
        at java.lang.Thread.run(Thread.java:748)
Caused by: org.apache.solr.client.solrj.impl.HttpSolrClient$RemoteSolrException: Error from server at http://127.0.0.1:57637/solr/awhollynewcollection_0_shard1_replica_n1: ClusterState says we are the leader (http://127.0.0.1:57637/solr/awhollynewcollection_0_shard1_replica_n1), but locally we don't think so. Request came from null
        at org.apache.solr.client.solrj.impl.HttpSolrClient.executeMethod(HttpSolrClient.java:626)
        at org.apache.solr.client.solrj.impl.HttpSolrClient.request(HttpSolrClient.java:253)
        at org.apache.solr.client.solrj.impl.HttpSolrClient.request(HttpSolrClient.java:242)
        at org.apache.solr.client.solrj.impl.LBHttpSolrClient.doRequest(LBHttpSolrClient.java:483)
        at org.apache.solr.client.solrj.impl.LBHttpSolrClient.request(LBHttpSolrClient.java:413)
        at org.apache.solr.client.solrj.impl.CloudSolrClient.lambda$directUpdate$0(CloudSolrClient.java:516)
        at java.util.concurrent.FutureTask.run(FutureTask.java:266)
        at org.apache.solr.common.util.ExecutorUtil$MDCAwareThreadPoolExecutor.lambda$execute$0(ExecutorUtil.java:188)
        at java.util.concurrent.ThreadPoolExecutor.runWorker(ThreadPoolExecutor.java:1149)
        at java.util.concurrent.ThreadPoolExecutor$Worker.run(ThreadPoolExecutor.java:624)
        ... 1 more


FAILED:  junit.framework.TestSuite.org.apache.solr.handler.component.InfixSuggestersTest

Error Message:
Could not remove the following files (in the order of attempts):    C:\Users\jenkins\workspace\Lucene-Solr-master-Windows\solr\build\solr-core\test\J0\temp\solr.handler.component.InfixSuggestersTest_5273222CF93A20D5-001\init-core-data-001: java.nio.file.AccessDeniedException: C:\Users\jenkins\workspace\Lucene-Solr-master-Windows\solr\build\solr-core\test\J0\temp\solr.handler.component.InfixSuggestersTest_5273222CF93A20D5-001\init-core-data-001    C:\Users\jenkins\workspace\Lucene-Solr-master-Windows\solr\build\solr-core\test\J0\temp\solr.handler.component.InfixSuggestersTest_5273222CF93A20D5-001: java.nio.file.DirectoryNotEmptyException: C:\Users\jenkins\workspace\Lucene-Solr-master-Windows\solr\build\solr-core\test\J0\temp\solr.handler.component.InfixSuggestersTest_5273222CF93A20D5-001

Stack Trace:
java.io.IOException: Could not remove the following files (in the order of attempts):
   C:\Users\jenkins\workspace\Lucene-Solr-master-Windows\solr\build\solr-core\test\J0\temp\solr.handler.component.InfixSuggestersTest_5273222CF93A20D5-001\init-core-data-001: java.nio.file.AccessDeniedException: C:\Users\jenkins\workspace\Lucene-Solr-master-Windows\solr\build\solr-core\test\J0\temp\solr.handler.component.InfixSuggestersTest_5273222CF93A20D5-001\init-core-data-001
   C:\Users\jenkins\workspace\Lucene-Solr-master-Windows\solr\build\solr-core\test\J0\temp\solr.handler.component.InfixSuggestersTest_5273222CF93A20D5-001: java.nio.file.DirectoryNotEmptyException: C:\Users\jenkins\workspace\Lucene-Solr-master-Windows\solr\build\solr-core\test\J0\temp\solr.handler.component.InfixSuggestersTest_5273222CF93A20D5-001

        at __randomizedtesting.SeedInfo.seed([5273222CF93A20D5]:0)
        at org.apache.lucene.util.IOUtils.rm(IOUtils.java:329)
        at org.apache.lucene.util.TestRuleTemporaryFilesCleanup.afterAlways(TestRuleTemporaryFilesCleanup.java:216)
        at com.carrotsearch.randomizedtesting.rules.TestRuleAdapter$1.afterAlways(TestRuleAdapter.java:31)
        at com.carrotsearch.randomizedtesting.rules.StatementAdapter.evaluate(StatementAdapter.java:43)
        at com.carrotsearch.randomizedtesting.rules.StatementAdapter.evaluate(StatementAdapter.java:36)
        at org.apache.lucene.util.TestRuleAssertionsRequired$1.evaluate(TestRuleAssertionsRequired.java:53)
        at org.apache.lucene.util.TestRuleMarkFailure$1.evaluate(TestRuleMarkFailure.java:47)
        at org.apache.lucene.util.TestRuleIgnoreAfterMaxFailures$1.evaluate(TestRuleIgnoreAfterMaxFailures.java:64)
        at org.apache.lucene.util.TestRuleIgnoreTestSuites$1.evaluate(TestRuleIgnoreTestSuites.java:54)
        at com.carrotsearch.randomizedtesting.rules.StatementAdapter.evaluate(StatementAdapter.java:36)
        at com.carrotsearch.randomizedtesting.ThreadLeakControl$StatementRunner.run(ThreadLeakControl.java:368)
        at java.lang.Thread.run(Thread.java:748)


FAILED:  org.apache.solr.client.solrj.io.stream.StreamExpressionTest.testParallelDaemonUpdateStream

Error Message:
Test abandoned because suite timeout was reached.

Stack Trace:
java.lang.Exception: Test abandoned because suite timeout was reached.
        at __randomizedtesting.SeedInfo.seed([2AEA13FFF5648378]:0)


FAILED:  junit.framework.TestSuite.org.apache.solr.client.solrj.io.stream.StreamExpressionTest

Error Message:
Suite timeout exceeded (>= 7200000 msec).

Stack Trace:
java.lang.Exception: Suite timeout exceeded (>= 7200000 msec).
        at __randomizedtesting.SeedInfo.seed([2AEA13FFF5648378]:0)




Build Log:
[...truncated 1640 lines...]
   [junit4] Suite: org.apache.lucene.store.TestNIOFSDirectory
   [junit4]   2> NOTE: test params are: codec=Asserting(Lucene70), sim=RandomSimilarity(queryNorm=true): {}, locale=es-DO, timezone=Africa/Douala
   [junit4]   2> NOTE: Windows 10 10.0 amd64/Oracle Corporation 1.8.0_144 (64-bit)/cpus=3,threads=1,free=316631216,total=536870912
   [junit4]   2> NOTE: All tests run in this JVM: [TestIndexWriterThreadsToSegments, TestMultiCollector, TestAxiomaticSimilarity, TestMergePolicyWrapper, TestNRTReaderWithThreads, TestSimpleExplanationsWithFillerDocs, TestIntroSorter, Test2BPostingsBytes, TestPayloads, TestIndexWriterOnJRECrash, Test2BSortedDocValuesFixedSorted, TestBooleanSimilarity, TestMultiFields, TestTermQuery, TestSpanNearQuery, TestNoMergeScheduler, TestFilterWeight, TestAutomatonQueryUnicode, TestBoolean2, TestPostingsOffsets, TestOfflineSorter, TestComplexExplanationsOfNonMatches, TestTotalHitCountCollector, TestMutableValues, TestStressIndexing2, TestFieldMaskingSpanQuery, TestIndexWriterFromReader, TestNRTReaderCleanup, TestSearcherManager, TestTopFieldCollector, TestConstantScoreQuery, Test2BDocs, TestIndexWriterForceMerge, TestLucene50StoredFieldsFormatHighCompression, TestAllFilesCheckIndexHeader, TestMultiset, TestStressIndexing, TestDocValuesScoring, TestIndexedDISI, TestSpanFirstQuery, TestFastCompressionMode, TestBasics, TestDemo, TestFilterDirectoryReader, TestFilterDirectory, TestNot, TestIndexCommit, Test2BNumericDocValues, TestCustomTermFreq, TestField, TestPerFieldPostingsFormat, TestConcurrentMergeScheduler, TestSegmentTermDocs, TestFlex, TestDuelingCodecsAtNight, TestCharsRefBuilder, TestSpanCollection, TestNGramPhraseQuery, TestDeletionPolicy, TestCompiledAutomaton, TestGeoUtils, TestSizeBoundedForceMerge, TestBoolean2ScorerSupplier, Test2BBinaryDocValues, TestFastDecompressionMode, TestFuzzyQuery, TestTermRangeQuery, TestIndexWriterReader, TestCharTermAttributeImpl, TestRegExp, TestDoubleValuesSource, TestFileSwitchDirectory, TestDirectoryReaderReopen, TestIntRangeFieldQueries, TestDisjunctionMaxQuery, TestPackedInts, TestBytesRefHash, TestIndexWriterOnVMError, TestMultiTermConstantScore, TestIndexWriterNRTIsCurrent, TestSmallFloat, TestForTooMuchCloning, TestIndexWriterOnDiskFull, TestLongRangeFieldQueries, TestSpansEnum, TestNativeFSLockFactory, TestFilterSpans, TestTermsEnum, TestSearchAfter, TestFixedBitSet, TestLucene70NormsFormat, TestTransactionRollback, TestVersion, TestMixedDocValuesUpdates, TestStopFilter, TestTimSorter, TestDelegatingAnalyzerWrapper, TestTermsEnum2, TestMultiPhraseQuery, TestSegmentMerger, TestOneMergeWrappingMergePolicy, TestDocumentsWriterStallControl, TestSimpleFSDirectory, TestAutomaton, TestBKD, TestTransactions, TestCachingCollector, TestShardSearching, TestCustomSearcherSort, TestPointValues, TestSentinelIntSet, TestDocumentWriter, TestIndexReaderClose, TestIndexWriter, TestPerFieldDocValuesFormat, TestFlushByRamOrCountsPolicy, TestIndexWriterMergePolicy, TestNRTThreads, TestDuelingCodecs, TestIndexWriterCommit, TestTopDocsMerge, TestLongPostings, TestRollingUpdates, TestIndexWriterUnicode, TestByteSlices, TestSimpleExplanations, TestLockFactory, TestPhraseQuery, TestRegexpRandom2, TestNRTCachingDirectory, TestCrash, TestPerFieldPostingsFormat2, TestMultiDocValues, TestToken, TestFieldsReader, TestSimpleSearchEquivalence, TestDocValuesIndexing, TestSimilarityBase, TestBooleanMinShouldMatch, TestSpans, TestMixedCodecs, TestRAMDirectory, TestLazyProxSkipping, TestDeterminism, TestMergeSchedulerExternal, TestTermVectorsWriter, TestCodecs, TestStressNRT, TestForceMergeForever, TestDocumentsWriterDeleteQueue, TestScorerPerf, TestSpanSearchEquivalence, TestWildcard, TestExternalCodecs, TestSimpleExplanationsOfNonMatches, TestPerSegmentDeletes, TestPrefixInBooleanQuery, TestSortRandom, TestAutomatonQuery, TestSumDocFreq, TestDirectory, TestPayloadsOnVectors, TestSpanMultiTermQueryWrapper, TestIndexFileDeleter, TestElevationComparator, TestSubScorerFreqs, TestConjunctions, TestPositionIncrement, TestVirtualMethod, TestSimilarityProvider, TestFilterLeafReader, TestDateTools, TestPriorityQueue, TestBooleanScorer, TestByteBlockPool, TestCodecHoldsOpenFiles, MultiCollectorTest, TestSimpleAttributeImpl, Test2BPositions, TestPositiveScoresOnlyCollector, TestByteArrayDataInput, TestCharArraySet, TestReusableStringReader, TestPackedTokenAttributeImpl, TestBlockPostingsFormat, TestLucene60FieldInfoFormat, TestLucene70SegmentInfoFormat, TestFieldType, TestPolygon2D, TestDocIDMerger, TestDocValues, TestExitableDirectoryReader, TestFieldReuse, TestIndexManyDocuments, TestIndexSorting, TestIndexingSequenceNumbers, TestControlledRealTimeReopenThread, TestDocValuesRewriteMethod, TestEarlyTerminatingSortingCollector, TestNormsFieldExistsQuery, TestQueryRescorer, TestReqExclBulkScorer, TestSortedNumericSortField, TestSortedSetSelector, TestSortedSetSortField, TestSynonymQuery, TestUsageTrackingFilterCachingPolicy, TestBM25Similarity, TestClassicSimilarity, TestSpanBoostQuery, TestSpanNotQuery, TestSpanOrQuery, TestGrowableByteArrayDataOutput, TestNIOFSDirectory]
   [junit4]   2> NOTE: reproduce with: ant test  -Dtestcase=TestNIOFSDirectory -Dtests.seed=BBEC1310C2AF9B08 -Dtests.slow=true -Dtests.locale=es-DO -Dtests.timezone=Africa/Douala -Dtests.asserts=true -Dtests.file.encoding=ISO-8859-1
   [junit4] ERROR   0.00s J1 | TestNIOFSDirectory (suite) <<<
   [junit4]    > Throwable #1: java.io.IOException: Could not remove the following files (in the order of attempts):
   [junit4]    >    C:\Users\jenkins\workspace\Lucene-Solr-master-Windows\lucene\build\core\test\J1\temp\lucene.store.TestNIOFSDirectory_BBEC1310C2AF9B08-001\testThreadSafety-001: java.nio.file.AccessDeniedException: C:\Users\jenkins\workspace\Lucene-Solr-master-Windows\lucene\build\core\test\J1\temp\lucene.store.TestNIOFSDirectory_BBEC1310C2AF9B08-001\testThreadSafety-001
   [junit4]    >    C:\Users\jenkins\workspace\Lucene-Solr-master-Windows\lucene\build\core\test\J1\temp\lucene.store.TestNIOFSDirectory_BBEC1310C2AF9B08-001: java.nio.file.DirectoryNotEmptyException: C:\Users\jenkins\workspace\Lucene-Solr-master-Windows\lucene\build\core\test\J1\temp\lucene.store.TestNIOFSDirectory_BBEC1310C2AF9B08-001
   [junit4]    > at __randomizedtesting.SeedInfo.seed([BBEC1310C2AF9B08]:0)
   [junit4]    > at org.apache.lucene.util.IOUtils.rm(IOUtils.java:329)
   [junit4]    > at java.lang.Thread.run(Thread.java:748)
   [junit4] Completed [428/455 (1!)] on J1 in 2.43s, 42 tests, 1 error <<< FAILURES!

[...truncated 10065 lines...]
   [junit4] Suite: org.apache.solr.handler.component.InfixSuggestersTest
   [junit4]   2> 200369 INFO  (SUITE-InfixSuggestersTest-seed#[5273222CF93A20D5]-worker) [    ] o.a.s.SolrTestCaseJ4 SecureRandom sanity checks: test.solr.allowed.securerandom=null & java.security.egd=file:/dev/./urandom
   [junit4]   2> Creating dataDir: C:\Users\jenkins\workspace\Lucene-Solr-master-Windows\solr\build\solr-core\test\J0\temp\solr.handler.component.InfixSuggestersTest_5273222CF93A20D5-001\init-core-data-001
   [junit4]   2> 200370 INFO  (SUITE-InfixSuggestersTest-seed#[5273222CF93A20D5]-worker) [    ] o.a.s.SolrTestCaseJ4 Using PointFields (NUMERIC_POINTS_SYSPROP=true) w/NUMERIC_DOCVALUES_SYSPROP=true
   [junit4]   2> 200372 INFO  (SUITE-InfixSuggestersTest-seed#[5273222CF93A20D5]-worker) [    ] o.a.s.SolrTestCaseJ4 Randomized ssl (false) and clientAuth (false) via: @org.apache.solr.util.RandomizeSSL(reason=, value=NaN, ssl=NaN, clientAuth=NaN)
   [junit4]   2> 200372 INFO  (SUITE-InfixSuggestersTest-seed#[5273222CF93A20D5]-worker) [    ] o.a.s.SolrTestCaseJ4 ####initCore
   [junit4]   2> 200373 INFO  (SUITE-InfixSuggestersTest-seed#[5273222CF93A20D5]-worker) [    ] o.a.s.c.SolrResourceLoader [null] Added 2 libs to classloader, from paths: [/C:/Users/jenkins/workspace/Lucene-Solr-master-Windows/solr/core/src/test-files/solr/collection1/lib, /C:/Users/jenkins/workspace/Lucene-Solr-master-Windows/solr/core/src/test-files/solr/collection1/lib/classes]
   [junit4]   2> 200411 INFO  (SUITE-InfixSuggestersTest-seed#[5273222CF93A20D5]-worker) [    ] o.a.s.c.SolrConfig Using Lucene MatchVersion: 8.0.0
   [junit4]   2> 200418 INFO  (SUITE-InfixSuggestersTest-seed#[5273222CF93A20D5]-worker) [    ] o.a.s.s.IndexSchema [null] Schema name=test
   [junit4]   2> 200483 INFO  (SUITE-InfixSuggestersTest-seed#[5273222CF93A20D5]-worker) [    ] o.a.s.s.IndexSchema Loaded schema test/1.0 with uniqueid field id
   [junit4]   2> 200550 INFO  (SUITE-InfixSuggestersTest-seed#[5273222CF93A20D5]-worker) [    ] o.a.s.m.r.SolrJmxReporter JMX monitoring for 'solr.node' (registry 'solr.node') enabled at server: com.sun.jmx.mbeanserver.JmxMBeanServer@40e935f0
   [junit4]   2> 200555 INFO  (SUITE-InfixSuggestersTest-seed#[5273222CF93A20D5]-worker) [    ] o.a.s.m.r.SolrJmxReporter JMX monitoring for 'solr.jvm' (registry 'solr.jvm') enabled at server: com.sun.jmx.mbeanserver.JmxMBeanServer@40e935f0
   [junit4]   2> 200555 INFO  (SUITE-InfixSuggestersTest-seed#[5273222CF93A20D5]-worker) [    ] o.a.s.m.r.SolrJmxReporter JMX monitoring for 'solr.jetty' (registry 'solr.jetty') enabled at server: com.sun.jmx.mbeanserver.JmxMBeanServer@40e935f0
   [junit4]   2> 200556 INFO  (coreLoadExecutor-580-thread-1) [    ] o.a.s.c.TransientSolrCoreCacheDefault Allocating transient cache for 2147483647 transient cores
   [junit4]   2> 200557 INFO  (coreLoadExecutor-580-thread-1) [    x:collection1] o.a.s.c.SolrResourceLoader [null] Added 2 libs to classloader, from paths: [/C:/Users/jenkins/workspace/Lucene-Solr-master-Windows/solr/core/src/test-files/solr/collection1/lib, /C:/Users/jenkins/workspace/Lucene-Solr-master-Windows/solr/core/src/test-files/solr/collection1/lib/classes]
   [junit4]   2> 200596 INFO  (coreLoadExecutor-580-thread-1) [    x:collection1] o.a.s.c.SolrConfig Using Lucene MatchVersion: 8.0.0
   [junit4]   2> 200602 INFO  (coreLoadExecutor-580-thread-1) [    x:collection1] o.a.s.s.IndexSchema [collection1] Schema name=test
   [junit4]   2> 200654 INFO  (coreLoadExecutor-580-thread-1) [    x:collection1] o.a.s.s.IndexSchema Loaded schema test/1.0 with uniqueid field id
   [junit4]   2> 200663 INFO  (coreLoadExecutor-580-thread-1) [    x:collection1] o.a.s.c.CoreContainer Creating SolrCore 'collection1' using configuration from instancedir C:\Users\jenkins\workspace\Lucene-Solr-master-Windows\solr\core\src\test-files\solr\collection1, trusted=true
   [junit4]   2> 200663 INFO  (coreLoadExecutor-580-thread-1) [    x:collection1] o.a.s.m.r.SolrJmxReporter JMX monitoring for 'solr.core.collection1' (registry 'solr.core.collection1') enabled at server: com.sun.jmx.mbeanserver.JmxMBeanServer@40e935f0
   [junit4]   2> 200681 INFO  (coreLoadExecutor-580-thread-1) [    x:collection1] o.a.s.c.SolrCore solr.RecoveryStrategy.Builder
   [junit4]   2> 200682 INFO  (coreLoadExecutor-580-thread-1) [    x:collection1] o.a.s.c.SolrCore [[collection1] ] Opening new SolrCore at [C:\Users\jenkins\workspace\Lucene-Solr-master-Windows\solr\core\src\test-files\solr\collection1], dataDir=[C:\Users\jenkins\workspace\Lucene-Solr-master-Windows\solr\build\solr-core\test\J0\temp\solr.handler.component.InfixSuggestersTest_5273222CF93A20D5-001\init-core-data-001\]
   [junit4]   2> 200685 INFO  (coreLoadExecutor-580-thread-1) [    x:collection1] o.a.s.u.RandomMergePolicy RandomMergePolicy wrapping class org.apache.lucene.index.TieredMergePolicy: [TieredMergePolicy: maxMergeAtOnce=24, maxMergeAtOnceExplicit=20, maxMergedSegmentMB=39.2724609375, floorSegmentMB=2.0068359375, forceMergeDeletesPctAllowed=11.312336032641578, segmentsPerTier=19.0, maxCFSSegmentSizeMB=8.796093022207999E12, noCFSRatio=0.24377662392982993
   [junit4]   2> 200785 INFO  (coreLoadExecutor-580-thread-1) [    x:collection1] o.a.s.u.CommitTracker Hard AutoCommit: disabled
   [junit4]   2> 200785 INFO  (coreLoadExecutor-580-thread-1) [    x:collection1] o.a.s.u.CommitTracker Soft AutoCommit: disabled
   [junit4]   2> 200787 INFO  (coreLoadExecutor-580-thread-1) [    x:collection1] o.a.s.u.RandomMergePolicy RandomMergePolicy wrapping class org.apache.lucene.index.LogDocMergePolicy: [LogDocMergePolicy: minMergeSize=1000, mergeFactor=32, maxMergeSize=9223372036854775807, maxMergeSizeForForcedMerge=9223372036854775807, calibrateSizeByDeletes=false, maxMergeDocs=2147483647, maxCFSSegmentSizeMB=8.796093022207999E12, noCFSRatio=0.3732053269958546]
   [junit4]   2> 200788 INFO  (coreLoadExecutor-580-thread-1) [    x:collection1] o.a.s.s.SolrIndexSearcher Opening [Searcher@283eca58[collection1] main]
   [junit4]   2> 200788 WARN  (coreLoadExecutor-580-thread-1) [    x:collection1] o.a.s.r.ManagedResourceStorage Cannot write to config directory C:\Users\jenkins\workspace\Lucene-Solr-master-Windows\solr\core\src\test-files\solr\collection1\conf; switching to use InMemory storage instead.
   [junit4]   2> 200788 INFO  (coreLoadExecutor-580-thread-1) [    x:collection1] o.a.s.h.c.SuggestComponent Initializing SuggestComponent
   [junit4]   2> 200797 INFO  (coreLoadExecutor-580-thread-1) [    x:collection1] o.a.s.s.s.SolrSuggester init: {name=shortRandomAnalyzingInfixSuggester,lookupImpl=AnalyzingInfixLookupFactory,dictionaryImpl=RandomTestDictionaryFactory,randDictMaxItems=100,indexPath=short_random_analyzing_infix_suggester,suggestAnalyzerFieldType=text,buildOnCommit=false,buildOnStartup=false}
   [junit4]   2> 200903 INFO  (coreLoadExecutor-580-thread-1) [    x:collection1] o.a.s.s.s.SolrSuggester Dictionary loaded with params: {name=shortRandomAnalyzingInfixSuggester,lookupImpl=AnalyzingInfixLookupFactory,dictionaryImpl=RandomTestDictionaryFactory,randDictMaxItems=100,indexPath=short_random_analyzing_infix_suggester,suggestAnalyzerFieldType=text,buildOnCommit=false,buildOnStartup=false}
   [junit4]   2> 200903 INFO  (coreLoadExecutor-580-thread-1) [    x:collection1] o.a.s.h.c.SuggestComponent Initializing SuggestComponent
   [junit4]   2> 200903 INFO  (coreLoadExecutor-580-thread-1) [    x:collection1] o.a.s.s.s.SolrSuggester init: {name=longRandomAnalyzingInfixSuggester,lookupImpl=AnalyzingInfixLookupFactory,dictionaryImpl=RandomTestDictionaryFactory,randDictMaxItems=100000,indexPath=long_random_analyzing_infix_suggester,suggestAnalyzerFieldType=text,buildOnCommit=false,buildOnStartup=false}
   [junit4]   2> 200905 INFO  (coreLoadExecutor-580-thread-1) [    x:collection1] o.a.s.s.s.SolrSuggester Dictionary loaded with params: {name=longRandomAnalyzingInfixSuggester,lookupImpl=AnalyzingInfixLookupFactory,dictionaryImpl=RandomTestDictionaryFactory,randDictMaxItems=100000,indexPath=long_random_analyzing_infix_suggester,suggestAnalyzerFieldType=text,buildOnCommit=false,buildOnStartup=false}
   [junit4]   2> 200905 INFO  (coreLoadExecutor-580-thread-1) [    x:collection1] o.a.s.h.c.SuggestComponent Initializing SuggestComponent
   [junit4]   2> 200905 INFO  (coreLoadExecutor-580-thread-1) [    x:collection1] o.a.s.s.s.SolrSuggester init: {name=shortRandomBlendedInfixSuggester,lookupImpl=BlendedInfixLookupFactory,dictionaryImpl=RandomTestDictionaryFactory,randDictMaxItems=100,blenderType=position_linear,suggestAnalyzerFieldType=text,indexPath=short_random_blended_infix_suggester,highlight=true,buildOnStartup=false,buildOnCommit=false}
   [junit4]   2> 200981 INFO  (coreLoadExecutor-580-thread-1) [    x:collection1] o.a.s.s.s.SolrSuggester Dictionary loaded with params: {name=shortRandomBlendedInfixSuggester,lookupImpl=BlendedInfixLookupFactory,dictionaryImpl=RandomTestDictionaryFactory,randDictMaxItems=100,blenderType=position_linear,suggestAnalyzerFieldType=text,indexPath=short_random_blended_infix_suggester,highlight=true,buildOnStartup=false,buildOnCommit=false}
   [junit4]   2> 200981 INFO  (coreLoadExecutor-580-thread-1) [    x:collection1] o.a.s.h.ReplicationHandler Commits will be reserved for 10000ms.
   [junit4]   2> 200983 INFO  (searcherExecutor-581-thread-1-processing-x:collection1) [    x:collection1] o.a.s.c.SolrCore [collection1] Registered new searcher Searcher@283eca58[collection1] main{ExitableDirectoryReader(UninvertingDirectoryReader())}
   [junit4]   2> 200985 INFO  (SUITE-InfixSuggestersTest-seed#[5273222CF93A20D5]-worker) [    ] o.a.s.SolrTestCaseJ4 ####initCore end
   [junit4]   2> 200985 INFO  (TEST-InfixSuggestersTest.testAnalyzingInfixSuggesterBuildThenReload-seed#[5273222CF93A20D5]) [    ] o.a.s.SolrTestCaseJ4 ###Starting testAnalyzingInfixSuggesterBuildThenReload
   [junit4]   2> 200990 INFO  (TEST-InfixSuggestersTest.testAnalyzingInfixSuggesterBuildThenReload-seed#[5273222CF93A20D5]) [    ] o.a.s.h.c.SuggestComponent SuggestComponent prepare with : qt=/suggest_analyzing_infix_short_dictionary&suggest=true&suggest.buildAll=true&wt=xml&indent=off
   [junit4]   2> 200990 INFO  (TEST-InfixSuggestersTest.testAnalyzingInfixSuggesterBuildThenReload-seed#[5273222CF93A20D5]) [    ] o.a.s.s.s.SolrSuggester SolrSuggester.build(shortRandomAnalyzingInfixSuggester)
   [junit4]   2> 201076 INFO  (TEST-InfixSuggestersTest.testAnalyzingInfixSuggesterBuildThenReload-seed#[5273222CF93A20D5]) [    ] o.a.s.s.s.RandomTestDictionaryFactory org.apache.solr.spelling.suggest.RandomTestDictionaryFactory$RandomTestDictionary.enabled.shortRandomAnalyzingInfixSuggester disabled after emitting 100 items.
   [junit4]   2> 201149 INFO  (TEST-InfixSuggestersTest.testAnalyzingInfixSuggesterBuildThenReload-seed#[5273222CF93A20D5]) [    ] o.a.s.h.c.SuggestComponent SuggestComponent process with : qt=/suggest_analyzing_infix_short_dictionary&suggest=true&suggest.buildAll=true&wt=xml&indent=off
   [junit4]   2> 201149 INFO  (TEST-InfixSuggestersTest.testAnalyzingInfixSuggesterBuildThenReload-seed#[5273222CF93A20D5]) [    ] o.a.s.c.S.Request [collection1]  webapp=null path=null params={qt=/suggest_analyzing_infix_short_dictionary&suggest.buildAll=true&wt=xml} status=0 QTime=159
   [junit4]   2> 201154 ERROR (TEST-InfixSuggestersTest.testAnalyzingInfixSuggesterBuildThenReload-seed#[5273222CF93A20D5]) [    ] o.a.s.c.CorePropertiesLocator Couldn't load core descriptor from C:\Users\jenkins\workspace\Lucene-Solr-master-Windows\solr\core\src\test-files\solr\collection1\core.properties:java.nio.file.NoSuchFileException: C:\Users\jenkins\workspace\Lucene-Solr-master-Windows\solr\core\src\test-files\solr\collection1\core.properties
   [junit4]   2> 201155 INFO  (TEST-InfixSuggestersTest.testAnalyzingInfixSuggesterBuildThenReload-seed#[5273222CF93A20D5]) [    ] o.a.s.c.SolrResourceLoader [null] Added 2 libs to classloader, from paths: [/C:/Users/jenkins/workspace/Lucene-Solr-master-Windows/solr/core/src/test-files/solr/collection1/lib, /C:/Users/jenkins/workspace/Lucene-Solr-master-Windows/solr/core/src/test-files/solr/collection1/lib/classes]
   [junit4]   2> 201203 INFO  (TEST-InfixSuggestersTest.testAnalyzingInfixSuggesterBuildThenReload-seed#[5273222CF93A20D5]) [    ] o.a.s.c.SolrConfig Using Lucene MatchVersion: 8.0.0
   [junit4]   2> 201222 INFO  (TEST-InfixSuggestersTest.testAnalyzingInfixSuggesterBuildThenReload-seed#[5273222CF93A20D5]) [    ] o.a.s.s.IndexSchema [collection1] Schema name=test
   [junit4]   2> 201278 INFO  (TEST-InfixSuggestersTest.testAnalyzingInfixSuggesterBuildThenReload-seed#[5273222CF93A20D5]) [    ] o.a.s.s.IndexSchema Loaded schema test/1.0 with uniqueid field id
   [junit4]   2> 201288 INFO  (TEST-InfixSuggestersTest.testAnalyzingInfixSuggesterBuildThenReload-seed#[5273222CF93A20D5]) [    ] o.a.s.c.CoreContainer Reloading SolrCore 'collection1' using configuration from instancedir C:\Users\jenkins\workspace\Lucene-Solr-master-Windows\solr\core\src\test-files\solr\collection1
   [junit4]   2> 201307 INFO  (TEST-InfixSuggestersTest.testAnalyzingInfixSuggesterBuildThenReload-seed#[5273222CF93A20D5]) [    x:collection1] o.a.s.m.r.SolrJmxReporter JMX monitoring for 'solr.core.collection1' (registry 'solr.core.collection1') enabled at server: com.sun.jmx.mbeanserver.JmxMBeanServer@40e935f0
   [junit4]   2> 201307 INFO  (TEST-InfixSuggestersTest.testAnalyzingInfixSuggesterBuildThenReload-seed#[5273222CF93A20D5]) [    x:collection1] o.a.s.c.SolrCore [[collection1] ] Opening new SolrCore at [C:\Users\jenkins\workspace\Lucene-Solr-master-Windows\solr\core\src\test-files\solr\collection1], dataDir=[C:\Users\jenkins\workspace\Lucene-Solr-master-Windows\solr\build\solr-core\test\J0\temp\solr.handler.component.InfixSuggestersTest_5273222CF93A20D5-001\init-core-data-001\]
   [junit4]   2> 201375 INFO  (TEST-InfixSuggestersTest.testAnalyzingInfixSuggesterBuildThenReload-seed#[5273222CF93A20D5]) [    x:collection1] o.a.s.u.CommitTracker Hard AutoCommit: disabled
   [junit4]   2> 201376 INFO  (TEST-InfixSuggestersTest.testAnalyzingInfixSuggesterBuildThenReload-seed#[5273222CF93A20D5]) [    x:collection1] o.a.s.u.CommitTracker Soft AutoCommit: disabled
   [junit4]   2> 201378 INFO  (TEST-InfixSuggestersTest.testAnalyzingInfixSuggesterBuildThenReload-seed#[5273222CF93A20D5]) [    x:collection1] o.a.s.s.SolrIndexSearcher Opening [Searcher@6a11994e[collection1] main]
   [junit4]   2> 201379 WARN  (TEST-InfixSuggestersTest.testAnalyzingInfixSuggesterBuildThenReload-seed#[5273222CF93A20D5]) [    x:collection1] o.a.s.r.ManagedResourceStorage Cannot write to config directory C:\Users\jenkins\workspace\Lucene-Solr-master-Windows\solr\core\src\test-files\solr\collection1\conf; switching to use InMemory storage instead.
   [junit4]   2> 201379 INFO  (TEST-InfixSuggestersTest.testAnalyzingInfixSuggesterBuildThenReload-seed#[5273222CF93A20D5]) [    x:collection1] o.a.s.h.c.SuggestComponent Initializing SuggestComponent
   [junit4]   2> 201379 INFO  (TEST-InfixSuggestersTest.testAnalyzingInfixSuggesterBuildThenReload-seed#[5273222CF93A20D5]) [    x:collection1] o.a.s.s.s.SolrSuggester init: {name=shortRandomAnalyzingInfixSuggester,lookupImpl=AnalyzingInfixLookupFactory,dictionaryImpl=RandomTestDictionaryFactory,randDictMaxItems=100,indexPath=short_random_analyzing_infix_suggester,suggestAnalyzerFieldType=text,buildOnCommit=false,buildOnStartup=false}
   [junit4]   2> 201382 INFO  (TEST-InfixSuggestersTest.testAnalyzingInfixSuggesterBuildThenReload-seed#[5273222CF93A20D5]) [    x:collection1] o.a.s.s.s.SolrSuggester Dictionary loaded with params: {name=shortRandomAnalyzingInfixSuggester,lookupImpl=AnalyzingInfixLookupFactory,dictionaryImpl=RandomTestDictionaryFactory,randDictMaxItems=100,indexPath=short_random_analyzing_infix_suggester,suggestAnalyzerFieldType=text,buildOnCommit=false,buildOnStartup=false}
   [junit4]   2> 201382 INFO  (TEST-InfixSuggestersTest.testAnalyzingInfixSuggesterBuildThenReload-seed#[5273222CF93A20D5]) [    x:collection1] o.a.s.h.c.SuggestComponent Initializing SuggestComponent
   [junit4]   2> 201382 INFO  (TEST-InfixSuggestersTest.testAnalyzingInfixSuggesterBuildThenReload-seed#[5273222CF93A20D5]) [    x:collection1] o.a.s.s.s.SolrSuggester init: {name=longRandomAnalyzingInfixSuggester,lookupImpl=AnalyzingInfixLookupFactory,dictionaryImpl=RandomTestDictionaryFactory,randDictMaxItems=100000,indexPath=long_random_analyzing_infix_suggester,suggestAnalyzerFieldType=text,buildOnCommit=false,buildOnStartup=false}
   [junit4]   2> 201383 INFO  (TEST-InfixSuggestersTest.testAnalyzingInfixSuggesterBuildThenReload-seed#[5273222CF93A20D5]) [    x:collection1] o.a.s.s.s.SolrSuggester Dictionary loaded with params: {name=longRandomAnalyzingInfixSuggester,lookupImpl=AnalyzingInfixLookupFactory,dictionaryImpl=RandomTestDictionaryFactory,randDictMaxItems=100000,indexPath=long_random_analyzing_infix_suggester,suggestAnalyzerFieldType=text,buildOnCommit=false,buildOnStartup=false}
   [junit4]   2> 201383 INFO  (TEST-InfixSuggestersTest.testAnalyzingInfixSuggesterBuildThenReload-seed#[5273222CF93A20D5]) [    x:collection1] o.a.s.h.c.SuggestComponent Initializing SuggestComponent
   [junit4]   2> 201383 INFO  (TEST-InfixSuggestersTest.testAnalyzingInfixSuggesterBuildThenReload-seed#[5273222CF93A20D5]) [    x:collection1] o.a.s.s.s.SolrSuggester init: {name=shortRandomBlendedInfixSuggester,lookupImpl=BlendedInfixLookupFactory,dictionaryImpl=RandomTestDictionaryFactory,randDictMaxItems=100,blenderType=position_linear,suggestAnalyzerFieldType=text,indexPath=short_random_blended_infix_suggester,highlight=true,buildOnStartup=false,buildOnCommit=false}
   [junit4]   2> 201383 INFO  (TEST-InfixSuggestersTest.testAnalyzingInfixSuggesterBuildThenReload-seed#[5273222CF93A20D5]) [    x:collection1] o.a.s.s.s.SolrSuggester Dictionary loaded with params: {name=shortRandomBlendedInfixSuggester,lookupImpl=BlendedInfixLookupFactory,dictionaryImpl=RandomTestDictionaryFactory,randDictMaxItems=100,blenderType=position_linear,suggestAnalyzerFieldType=text,indexPath=short_random_blended_infix_suggester,highlight=true,buildOnStartup=false,buildOnCommit=false}
   [junit4]   2> 201383 INFO  (TEST-InfixSuggestersTest.testAnalyzingInfixSuggesterBuildThenReload-seed#[5273222CF93A20D5]) [    x:collection1] o.a.s.h.ReplicationHandler Commits will be reserved for 10000ms.
   [junit4]   2> 201385 INFO  (searcherExecutor-585-thread-1-processing-x:collection1) [    x:collection1] o.a.s.c.SolrCore [collection1] Registered new searcher Searcher@6a11994e[collection1] main{ExitableDirectoryReader(UninvertingDirectoryReader())}
   [junit4]   2> 201385 INFO  (TEST-InfixSuggestersTest.testAnalyzingInfixSuggesterBuildThenReload-seed#[5273222CF93A20D5]) [    x:collection1] o.a.s.u.RandomMergePolicy RandomMergePolicy wrapping class org.apache.lucene.index.TieredMergePolicy: [TieredMergePolicy: maxMergeAtOnce=34, maxMergeAtOnceExplicit=10, maxMergedSegmentMB=86.3955078125, floorSegmentMB=1.732421875, forceMergeDeletesPctAllowed=9.749691368340306, segmentsPerTier=49.0, maxCFSSegmentSizeMB=8.796093022207999E12, noCFSRatio=1.0
   [junit4]   2> 201387 INFO  (TEST-InfixSuggestersTest.testAnalyzingInfixSuggesterBuildThenReload-seed#[5273222CF93A20D5]) [    x:collection1] o.a.s.u.DefaultSolrCoreState New IndexWriter is ready to be used.
   [junit4]   2> 201387 INFO  (TEST-InfixSuggestersTest.testAnalyzingInfixSuggesterBuildThenReload-seed#[5273222CF93A20D5]) [    x:collection1] o.a.s.s.SolrIndexSearcher Opening [Searcher@2131fc53[collection1] main]
   [junit4]   2> 201388 INFO  (TEST-InfixSuggestersTest.testAnalyzingInfixSuggesterBuildThenReload-seed#[5273222CF93A20D5]) [    x:collection1] o.a.s.c.SolrCore [collection1]  CLOSING SolrCore org.apache.solr.core.SolrCore@1ec8974c
   [junit4]   2> 201388 INFO  (TEST-InfixSuggestersTest.testAnalyzingInfixSuggesterBuildThenReload-seed#[5273222CF93A20D5]) [    x:collection1] o.a.s.m.SolrMetricManager Closing metric reporters for registry=solr.core.collection1, tag=516462412
   [junit4]   2> 201388 INFO  (TEST-InfixSuggestersTest.testAnalyzingInfixSuggesterBuildThenReload-seed#[5273222CF93A20D5]) [    x:collection1] o.a.s.m.r.SolrJmxReporter Closing reporter [org.apache.solr.metrics.reporters.SolrJmxReporter@64241cb7: rootName = null, domain = solr.core.collection1, service url = null, agent id = null] for registry solr.core.collection1 / com.codahale.metrics.MetricRegistry@2e656fbb
   [junit4]   2> 201388 INFO  (searcherExecutor-585-thread-1-processing-x:collection1) [    x:collection1] o.a.s.c.SolrCore [collection1] Registered new searcher Searcher@2131fc53[collection1] main{ExitableDirectoryReader(UninvertingDirectoryReader())}
   [junit4]   2> 201393 INFO  (TEST-InfixSuggestersTest.testAnalyzingInfixSuggesterBuildThenReload-seed#[5273222CF93A20D5]) [    x:collection1] o.a.s.SolrTestCaseJ4 ###Ending testAnalyzingInfixSuggesterBuildThenReload
   [junit4]   2> 201393 INFO  (TEST-InfixSuggestersTest.testBlendedInfixSuggesterBuildThenReload-seed#[5273222CF93A20D5]) [    x:collection1] o.a.s.SolrTestCaseJ4 ###Starting testBlendedInfixSuggesterBuildThenReload
   [junit4]   2> 201393 INFO  (TEST-InfixSuggestersTest.testBlendedInfixSuggesterBuildThenReload-seed#[5273222CF93A20D5]) [    x:collection1] o.a.s.h.c.SuggestComponent SuggestComponent prepare with : qt=/suggest_blended_infix_short_dictionary&suggest.onlyMorePopular=true&indent=off&suggest.count=10&suggest=true&suggest.collate=true&suggest.buildAll=true&suggest.dictionary=shortRandomBlendedInfixSuggester&wt=xml
   [junit4]   2> 201393 INFO  (TEST-InfixSuggestersTest.testBlendedInfixSuggesterBuildThenReload-seed#[5273222CF93A20D5]) [    x:collection1] o.a.s.s.s.SolrSuggester SolrSuggester.build(shortRandomBlendedInfixSuggester)
   [junit4]   2> 201425 INFO  (TEST-InfixSuggestersTest.testBlendedInfixSuggesterBuildThenReload-seed#[5273222CF93A20D5]) [    x:collection1] o.a.s.s.s.RandomTestDictionaryFactory org.apache.solr.spelling.suggest.RandomTestDictionaryFactory$RandomTestDictionary.enabled.shortRandomBlendedInfixSuggester disabled after emitting 100 items.
   [junit4]   2> 201459 INFO  (TEST-InfixSuggestersTest.testBlendedInfixSuggesterBuildThenReload-seed#[5273222CF93A20D5]) [    x:collection1] o.a.s.h.c.SuggestComponent SuggestComponent process with : qt=/suggest_blended_infix_short_dictionary&suggest.onlyMorePopular=true&indent=off&suggest.count=10&suggest=true&suggest.collate=true&suggest.buildAll=true&suggest.dictionary=shortRandomBlendedInfixSuggester&wt=xml
   [junit4]   2> 201459 INFO  (TEST-InfixSuggestersTest.testBlendedInfixSuggesterBuildThenReload-seed#[5273222CF93A20D5]) [    x:collection1] o.a.s.c.S.Request [collection1]  webapp=null path=null params={qt=/suggest_blended_infix_short_dictionary&suggest.buildAll=true&wt=xml} status=0 QTime=63
   [junit4]   2> 201460 ERROR (TEST-InfixSuggestersTest.testBlendedInfixSuggesterBuildThenReload-seed#[5273222CF93A20D5]) [    x:collection1] o.a.s.c.CorePropertiesLocator Couldn't load core descriptor from C:\Users\jenkins\workspace\Lucene-Solr-master-Windows\solr\core\src\test-files\solr\collection1\core.properties:java.nio.file.NoSuchFileException: C:\Users\jenkins\workspace\Lucene-Solr-master-Windows\solr\core\src\test-files\solr\collection1\core.properties
   [junit4]   2> 201461 INFO  (TEST-InfixSuggestersTest.testBlendedInfixSuggesterBuildThenReload-seed#[5273222CF93A20D5]) [    x:collection1] o.a.s.c.SolrResourceLoader [null] Added 2 libs to classloader, from paths: [/C:/Users/jenkins/workspace/Lucene-Solr-master-Windows/solr/core/src/test-files/solr/collection1/lib, /C:/Users/jenkins/workspace/Lucene-Solr-master-Windows/solr/core/src/test-files/solr/collection1/lib/classes]
   [junit4]   2> 201510 INFO  (TEST-InfixSuggestersTest.testBlendedInfixSuggesterBuildThenReload-seed#[5273222CF93A20D5]) [    x:collection1] o.a.s.c.SolrConfig Using Lucene MatchVersion: 8.0.0
   [junit4]   2> 201518 INFO  (TEST-InfixSuggestersTest.testBlendedInfixSuggesterBuildThenReload-seed#[5273222CF93A20D5]) [    x:collection1] o.a.s.s.IndexSchema [collection1] Schema name=test
   [junit4]   2> 201581 INFO  (TEST-InfixSuggestersTest.testBlendedInfixSuggesterBuildThenReload-seed#[5273222CF93A20D5]) [    x:collection1] o.a.s.s.IndexSchema Loaded schema test/1.0 with uniqueid field id
   [junit4]   2> 201590 INFO  (TEST-InfixSuggestersTest.testBlendedInfixSuggesterBuildThenReload-seed#[5273222CF93A20D5]) [    x:collection1] o.a.s.c.CoreContainer Reloading SolrCore 'collection1' using configuration from instancedir C:\Users\jenkins\workspace\Lucene-Solr-master-Windows\solr\core\src\test-files\solr\collection1
   [junit4]   2> 201607 INFO  (TEST-InfixSuggestersTest.testBlendedInfixSuggesterBuildThenReload-seed#[5273222CF93A20D5]) [    x:collection1] o.a.s.m.r.SolrJmxReporter JMX monitoring for 'solr.core.collection1' (registry 'solr.core.collection1') enabled at server: com.sun.jmx.mbeanserver.JmxMBeanServer@40e935f0
   [junit4]   2> 201607 INFO  (TEST-InfixSuggestersTest.testBlendedInfixSuggesterBuildThenReload-seed#[5273222CF93A20D5]) [    x:collection1] o.a.s.c.SolrCore [[collection1] ] Opening new SolrCore at [C:\Users\jenkins\workspace\Lucene-Solr-master-Windows\solr\core\src\test-files\solr\collection1], dataDir=[C:\Users\jenkins\workspace\Lucene-Solr-master-Windows\solr\build\solr-core\test\J0\temp\solr.handler.component.InfixSuggestersTest_5273222CF93A20D5-001\init-core-data-001\]
   [junit4]   2> 201673 INFO  (TEST-InfixSuggestersTest.testBlendedInfixSuggesterBuildThenReload-seed#[5273222CF93A20D5]) [    x:collection1] o.a.s.u.CommitTracker Hard AutoCommit: disabled
   [junit4]   2> 201673 INFO  (TEST-InfixSuggestersTest.testBlendedInfixSuggesterBuildThenReload-seed#[5273222CF93A20D5]) [    x:collection1] o.a.s.u.CommitTracker Soft AutoCommit: disabled
   [junit4]   2> 201674 INFO  (TEST-InfixSuggestersTest.testBlendedInfixSuggesterBuildThenReload-seed#[5273222CF93A20D5]) [    x:collection1] o.a.s.s.SolrIndexSearcher Opening [Searcher@7d508c09[collection1] main]
   [junit4]   2> 201674 WARN  (TEST-InfixSuggestersTest.testBlendedInfixSuggesterBuildThenReload-seed#[5273222CF93A20D5]) [    x:collection1] o.a.s.r.ManagedResourceStorage Cannot write to config directory C:\Users\jenkins\workspace\Lucene-Solr-master-Windows\solr\core\src\test-files\solr\collection1\conf; switching to use InMemory storage instead.
   [junit4]   2> 201675 INFO  (TEST-InfixSuggestersTest.testBlendedInfixSuggesterBuildThenReload-seed#[5273222CF93A20D5]) [    x:collection1] o.a.s.h.c.SuggestComponent Initializing SuggestComponent
   [junit4]   2> 201675 INFO  (TEST-InfixSuggestersTest.testBlendedInfixSuggesterBuildThenReload-seed#[5273222CF93A20D5]) [    x:collection1] o.a.s.s.s.SolrSuggester init: {name=shortRandomAnalyzingInfixSuggester,lookupImpl=AnalyzingInfixLookupFactory,dictionaryImpl=RandomTestDictionaryFactory,randDictMaxItems=100,indexPath=short_random_analyzing_infix_suggester,suggestAnalyzerFieldType=text,buildOnCommit=false,buildOnStartup=false}
   [junit4]   2> 201677 INFO  (TEST-InfixSuggestersTest.testBlendedInfixSuggesterBuildThenReload-seed#[5273222CF93A20D5]) [    x:collection1] o.a.s.s.s.SolrSuggester Dictionary loaded with params: {name=shortRandomAnalyzingInfixSuggester,lookupImpl=AnalyzingInfixLookupFactory,dictionaryImpl=RandomTestDictionaryFactory,randDictMaxItems=100,indexPath=short_random_analyzing_infix_suggester,suggestAnalyzerFieldType=text,buildOnCommit=false,buildOnStartup=false}
   [junit4]   2> 201677 INFO  (TEST-InfixSuggestersTest.testBlendedInfixSuggesterBuildThenReload-seed#[5273222CF93A20D5]) [    x:collection1] o.a.s.h.c.SuggestComponent Initializing SuggestComponent
   [junit4]   2> 201677 INFO  (TEST-InfixSuggestersTest.testBlendedInfixSuggesterBuildThenReload-seed#[5273222CF93A20D5]) [    x:collection1] o.a.s.s.s.SolrSuggester init: {name=longRandomAnalyzingInfixSuggester,lookupImpl=AnalyzingInfixLookupFactory,dictionaryImpl=RandomTestDictionaryFactory,randDictMaxItems=100000,indexPath=long_random_analyzing_infix_suggester,suggestAnalyzerFieldType=text,buildOnCommit=false,buildOnStartup=false}
   [junit4]   2> 201678 INFO  (TEST-InfixSuggestersTest.testBlendedInfixSuggesterBuildThenReload-seed#[5273222CF93A20D5]) [    x:collection1] o.a.s.s.s.SolrSuggester Dictionary loaded with params: {name=longRandomAnalyzingInfixSuggester,lookupImpl=AnalyzingInfixLookupFactory,dictionaryImpl=RandomTestDictionaryFactory,randDictMaxItems=100000,indexPath=long_random_analyzing_infix_suggester,suggestAnalyzerFieldType=text,buildOnCommit=false,buildOnStartup=false}
   [junit4]   2> 201678 INFO  (TEST-InfixSuggestersTest.testBlendedInfixSuggesterBuildThenReload-seed#[5273222CF93A20D5]) [    x:collection1] o.a.s.h.c.SuggestComponent Initializing SuggestComponent
   [junit4]   2> 201678 INFO  (TEST-InfixSuggestersTest.testBlendedInfixSuggesterBuildThenReload-seed#[5273222CF93A20D5]) [    x:collection1] o.a.s.s.s.SolrSuggester init: {name=shortRandomBlendedInfixSuggester,lookupImpl=BlendedInfixLookupFactory,dictionaryImpl=RandomTestDictionaryFactory,randDictMaxItems=100,blenderType=position_linear,suggestAnalyzerFieldType=text,indexPath=short_random_blended_infix_suggester,highlight=true,buildOnStartup=false,buildOnCommit=false}
   [junit4]   2> 201681 INFO  (TEST-InfixSuggestersTest.testBlendedInfixSuggesterBuildThenReload-seed#[5273222CF93A20D5]) [    x:collection1] o.a.s.s.s.SolrSuggester Dictionary loaded with params: {name=shortRandomBlendedInfixSuggester,lookupImpl=BlendedInfixLookupFactory,dictionaryImpl=RandomTestDictionaryFactory,randDictMaxItems=100,blenderType=position_linear,suggestAnalyzerFieldType=text,indexPath=short_random_blended_infix_suggester,highlight=true,buildOnStartup=false,buildOnCommit=false}
   [junit4]   2> 201681 INFO  (TEST-InfixSuggestersTest.testBlendedInfixSuggesterBuildThenReload-seed#[5273222CF93A20D5]) [    x:collection1] o.a.s.h.ReplicationHandler Commits will be reserved for 10000ms.
   [junit4]   2> 201682 INFO  (TEST-InfixSuggestersTest.testBlendedInfixSuggesterBuildThenReload-seed#[5273222CF93A20D5]) [    x:collection1] o.a.s.u.RandomMergePolicy RandomMergePolicy wrapping class org.apache.lucene.index.LogDocMergePolicy: [LogDocMergePolicy: minMergeSize=1000, mergeFactor=22, maxMergeSize=9223372036854775807, maxMergeSizeForForcedMerge=9223372036854775807, calibrateSizeByDeletes=false, maxMergeDocs=2147483647, maxCFSSegmentSizeMB=8.796093022207999E12, noCFSRatio=0.0]
   [junit4]   2> 201683 INFO  (searcherExecutor-589-thread-1-processing-x:collection1) [    x:collection1] o.a.s.c.SolrCore [collection1] Registered new searcher Searcher@7d508c09[collection1] main{ExitableDirectoryReader(UninvertingDirectoryReader())}
   [junit4]   2> 201684 INFO  (TEST-InfixSuggestersTest.testBlendedInfixSuggesterBuildThenReload-seed#[5273222CF93A20D5]) [    x:collection1] o.a.s.u.DefaultSolrCoreState New IndexWriter is ready to be used.
   [junit4]   2> 201684 INFO  (TEST-InfixSuggestersTest.testBlendedInfixSuggesterBuildThenReload-seed#[5273222CF93A20D5]) [    x:collection1] o.a.s.s.SolrIndexSearcher Opening [Searcher@3cb6353b[collection1] main]
   [junit4]   2> 201684 INFO  (TEST-InfixSuggestersTest.testBlendedInfixSuggesterBuildThenReload-seed#[5273222CF93A20D5]) [    x:collection1] o.a.s.c.SolrCore [collection1]  CLOSING SolrCore org.apache.solr.core.SolrCore@325c5b12
   [junit4]   2> 201684 INFO  (TEST-InfixSuggestersTest.testBlendedInfixSuggesterBuildThenReload-seed#[5273222CF93A20D5]) [    x:collection1] o.a.s.m.SolrMetricManager Closing metric reporters for registry=solr.core.collection1, tag=844913426
   [junit4]   2> 201684 INFO  (TEST-InfixSuggestersTest.testBlendedInfixSuggesterBuildThenReload-seed#[5273222CF93A20D5]) [    x:collection1] o.a.s.m.r.SolrJmxReporter Closing reporter [org.apache.solr.metrics.reporters.SolrJmxReporter@1410d8e6: rootName = null, domain = solr.core.collection1, service url = null, agent id = null] for registry solr.core.collection1 / com.codahale.metrics.MetricRegistry@2e656fbb
   [junit4]   2> 201686 INFO  (searcherExecutor-589-thread-1-processing-x:collection1) [    x:collection1] o.a.s.c.SolrCore [collection1] Registered new searcher Searcher@3cb6353b[collection1] main{ExitableDirectoryReader(UninvertingDirectoryReader())}
   [junit4]   2> 201690 INFO  (TEST-InfixSuggestersTest.testBlendedInfixSuggesterBuildThenReload-seed#[5273222CF93A20D5]) [    x:collection1] o.a.s.SolrTestCaseJ4 ###Ending testBlendedInfixSuggesterBuildThenReload
   [junit4]   2> 201692 INFO  (TEST-InfixSuggestersTest.testTwoSuggestersBuildThenReload-seed#[5273222CF93A20D5]) [    x:collection1] o.a.s.SolrTestCaseJ4 ###Starting testTwoSuggestersBuildThenReload
   [junit4]   2> 201692 INFO  (TEST-InfixSuggestersTest.testTwoSuggestersBuildThenReload-seed#[5273222CF93A20D5]) [    x:collection1] o.a.s.h.c.SuggestComponent SuggestComponent prepare with : qt=/suggest_analyzing_infix_short_dictionary&suggest=true&suggest.buildAll=true&wt=xml&indent=off
   [junit4]   2> 201692 INFO  (TEST-InfixSuggestersTest.testTwoSuggestersBuildThenReload-seed#[5273222CF93A20D5]) [    x:collection1] o.a.s.s.s.SolrSuggester SolrSuggester.build(shortRandomAnalyzingInfixSuggester)
   [junit4]   2> 201701 INFO  (TEST-InfixSuggestersTest.testTwoSuggestersBuildThenReload-seed#[5273222CF93A20D5]) [    x:collection1] o.a.s.s.s.RandomTestDictionaryFactory org.apache.solr.spelling.suggest.RandomTestDictionaryFactory$RandomTestDictionary.enabled.shortRandomAnalyzingInfixSuggester disabled after emitting 100 items.
   [junit4]   2> 201725 INFO  (TEST-InfixSuggestersTest.testTwoSuggestersBuildThenReload-seed#[5273222CF93A20D5]) [    x:collection1] o.a.s.h.c.SuggestComponent SuggestComponent process with : qt=/suggest_analyzing_infix_short_dictionary&suggest=true&suggest.buildAll=true&wt=xml&indent=off
   [junit4]   2> 201725 INFO  (TEST-InfixSuggestersTest.testTwoSuggestersBuildThenReload-seed#[5273222CF93A20D5]) [    x:collection1] o.a.s.c.S.Request [collection1]  webapp=null path=null params={qt=/suggest_analyzing_infix_short_dictionary&suggest.buildAll=true&wt=xml} status=0 QTime=33
   [junit4]   2> 201726 ERROR (TEST-InfixSuggestersTest.testTwoSuggestersBuildThenReload-seed#[5273222CF93A20D5]) [    x:collection1] o.a.s.c.CorePropertiesLocator Couldn't load core descriptor from C:\Users\jenkins\workspace\Lucene-Solr-master-Windows\solr\core\src\test-files\solr\collection1\core.properties:java.nio.file.NoSuchFileException: C:\Users\jenkins\workspace\Lucene-Solr-master-Windows\solr\core\src\test-files\solr\collection1\core.properties
   [junit4]   2> 201727 INFO  (TEST-InfixSuggestersTest.testTwoSuggestersBuildThenReload-seed#[5273222CF93A20D5]) [    x:collection1] o.a.s.c.SolrResourceLoader [null] Added 2 libs to classloader, from paths: [/C:/Users/jenkins/workspace/Lucene-Solr-master-Windows/solr/core/src/test-files/solr/collection1/lib, /C:/Users/jenkins/workspace/Lucene-Solr-master-Windows/solr/core/src/test-files/solr/collection1/lib/classes]
   [junit4]   2> 201768 INFO  (TEST-InfixSuggestersTest.testTwoSuggestersBuildThenReload-seed#[5273222CF93A20D5]) [    x:collection1] o.a.s.c.SolrConfig Using Lucene MatchVersion: 8.0.0
   [junit4]   2> 201775 INFO  (TEST-InfixSuggestersTest.testTwoSuggestersBuildThenReload-seed#[5273222CF93A20D5]) [    x:collection1] o.a.s.s.IndexSchema [collection1] Schema name=test
   [junit4]   2> 201837 INFO  (TEST-InfixSuggestersTest.testTwoSuggestersBuildThenReload-seed#[5273222CF93A20D5]) [    x:collection1] o.a.s.s.IndexSchema Loaded schema test/1.0 with uniqueid field id
   [junit4]   2> 201847 INFO  (TEST-InfixSuggestersTest.testTwoSuggestersBuildThenReload-seed#[5273222CF93A20D5]) [    x:collection1] o.a.s.c.CoreContainer Reloading SolrCore 'collection1' using configuration from instancedir C:\Users\jenkins\workspace\Lucene-Solr-master-Windows\solr\core\src\test-files\solr\collection1
   [junit4]   2> 201865 INFO  (TEST-InfixSuggestersTest.testTwoSuggestersBuildThenReload-seed#[5273222CF93A20D5]) [    x:collection1] o.a.s.m.r.SolrJmxReporter JMX monitoring for 'solr.core.collection1' (registry 'solr.core.collection1') enabled at server: com.sun.jmx.mbeanserver.JmxMBeanServer@40e935f0
   [junit4]   2> 201865 INFO  (TEST-InfixSuggestersTest.testTwoSuggestersBuildThenReload-seed#[5273222CF93A20D5]) [    x:collection1] o.a.s.c.SolrCore [[collection1] ] Opening new SolrCore at [C:\Users\jenkins\workspace\Lucene-Solr-master-Windows\solr\core\src\test-files\solr\collection1], dataDir=[C:\Users\jenkins\workspace\Lucene-Solr-master-Windows\solr\build\solr-core\test\J0\temp\solr.handler.component.InfixSuggestersTest_5273222CF93A20D5-001\init-core-data-001\]
   [junit4]   2> 201930 INFO  (TEST-InfixSuggestersTest.testTwoSuggestersBuildThenReload-seed#[5273222CF93A20D5]) [    x:collection1] o.a.s.u.CommitTracker Hard AutoCommit: disabled
   [junit4]   2> 201930 INFO  (TEST-InfixSuggestersTest.testTwoSuggestersBuildThenReload-seed#[5273222CF93A20D5]) [    x:collection1] o.a.s.u.CommitTracker Soft AutoCommit: disabled
   [junit4]   2> 201931 INFO  (TEST-InfixSuggestersTest.testTwoSuggestersBuildThenReload-seed#[5273222CF93A20D5]) [    x:collection1] o.a.s.s.SolrIndexSearcher Opening [Searcher@10e2fd11[collection1] main]
   [junit4]   2> 201931 WARN  (TEST-InfixSuggestersTest.testTwoSuggestersBuildThenReload-seed#[5273222CF93A20D5]) [    x:collection1] o.a.s.r.ManagedResourceStorage Cannot write to config directory C:\Users\jenkins\workspace\Lucene-Solr-master-Windows\solr\core\src\test-files\solr\collection1\conf; switching to use InMemory storage instead.
   [junit4]   2> 201931 INFO  (TEST-InfixSuggestersTest.testTwoSuggestersBuildThenReload-seed#[5273222CF93A20D5]) [    x:collection1] o.a.s.h.c.SuggestComponent Initializing SuggestComponent
   [junit4]   2> 201931 INFO  (TEST-InfixSuggestersTest.testTwoSuggestersBuildThenReload-seed#[5273222CF93A20D5]) [    x:collection1] o.a.s.s.s.SolrSuggester init: {name=shortRandomAnalyzingInfixSuggester,lookupImpl=AnalyzingInfixLookupFactory,dictionaryImpl=RandomTestDictionaryFactory,randDictMaxItems=100,indexPath=short_random_analyzing_infix_suggester,suggestAnalyzerFieldType=text,buildOnCommit=false,buildOnStartup=false}
   [junit4]   2> 201934 INFO  (TEST-InfixSuggestersTest.testTwoSuggestersBuildThenReload-seed#[5273222CF93A20D5]) [    x:collection1] o.a.s.s.s.SolrSuggester Dictionary loaded with params: {name=shortRandomAnalyzingInfixSuggester,lookupImpl=AnalyzingInfixLookupFactory,dictionaryImpl=RandomTestDictionaryFactory,randDictMaxItems=100,indexPath=short_random_analyzing_infix_suggester,suggestAnalyzerFieldType=text,buildOnCommit=false,buildOnStartup=false}
   [junit4]   2> 201934 INFO  (TEST-InfixSuggestersTest.testTwoSuggestersBuildThenReload-seed#[5273222CF93A20D5]) [    x:collection1] o.a.s.h.c.SuggestComponent Initializing SuggestComponent
   [junit4]   2> 201934 INFO  (TEST-InfixSuggestersTest.testTwoSuggestersBuildThenReload-seed#[5273222CF93A20D5]) [    x:collection1] o.a.s.s.s.SolrSuggester init: {name=longRandomAnalyzingInfixSuggester,lookupImpl=AnalyzingInfixLookupFactory,dictionaryImpl=RandomTestDictionaryFactory,randDictMaxItems=100000,indexPath=long_random_analyzing_infix_suggester,suggestAnalyzerFieldType=text,buildOnCommit=false,buildOnStartup=false}
   [junit4]   2> 201934 INFO  (TEST-InfixSuggestersTest.testTwoSuggestersBuildThenReload-seed#[5273222CF93A20D5]) [    x:collection1] o.a.s.s.s.SolrSuggester Dictionary loaded with params: {name=longRandomAnalyzingInfixSuggester,lookupImpl=AnalyzingInfixLookupFactory,dictionaryImpl=RandomTestDictionaryFactory,randDictMaxItems=100000,indexPath=long_random_analyzing_infix_suggester,suggestAnalyzerFieldType=text,buildOnCommit=false,buildOnStartup=false}
   [junit4]   2> 201934 INFO  (TEST-InfixSuggestersTest.testTwoSuggestersBuildThenReload-seed#[5273222CF93A20D5]) [    x:collection1] o.a.s.h.c.SuggestComponent Initializing SuggestComponent
   [junit4]   2> 201934 INFO  (TEST-InfixSuggestersTest.testTwoSuggestersBuildThenReload-seed#[5273222CF93A20D5]) [    x:collection1] o.a.s.s.s.SolrSuggester init: {name=shortRandomBlendedInfixSuggester,lookupImpl=BlendedInfixLookupFactory,dictionaryImpl=RandomTestDictionaryFactory,randDictMaxItems=100,blenderType=position_linear,suggestAnalyzerFieldType=text,indexPath=short_random_blended_infix_suggester,highlight=true,buildOnStartup=false,buildOnCommit=false}
   [junit4]   2> 201937 INFO  (TEST-InfixSuggestersTest.testTwoSuggestersBuildThenReload-seed#[5273222CF93A20D5]) [    x:collection1] o.a.s.s.s.SolrSuggester Dictionary loaded with params: {name=shortRandomBlendedInfixSuggester,lookupImpl=BlendedInfixLookupFactory,dictionaryImpl=RandomTestDictionaryFactory,randDictMaxItems=100,blenderType=position_linear,suggestAnalyzerFieldType=text,indexPath=short_random_blended_infix_suggester,highlight=true,buildOnStartup=false,buildOnCommit=false}
   [junit4]   2> 201937 INFO  (TEST-InfixSuggestersTest.testTwoSuggestersBuildThenReload-seed#[5273222CF93A20D5]) [    x:collection1] o.a.s.h.ReplicationHandler Commits will be reserved for 10000ms.
   [junit4]   2> 201940 INFO  (searcherExecutor-593-thread-1-processing-x:collection1) [    x:collection1] o.a.s.c.SolrCore [collection1] Registered new searcher Searcher@10e2fd11[collection1] main{ExitableDirectoryReader(UninvertingDirectoryReader())}
   [junit4]   2> 201940 INFO  (TEST-InfixSuggestersTest.testTwoSuggestersBuildThenReload-seed#[5273222CF93A20D5]) [    x:collection1] o.a.s.u.RandomMergePolicy RandomMergePolicy wrapping class org.apache.lucene.index.TieredMergePolicy: [TieredMergePolicy: maxMergeAtOnce=10, maxMergeAtOnceExplicit=37, maxMergedSegmentMB=10.5126953125, floorSegmentMB=0.52734375, forceMergeDeletesPctAllowed=12.18236679924149, segmentsPerTier=20.0, maxCFSSegmentSizeMB=8.796093022207999E12, noCFSRatio=0.0
   [junit4]   2> 201941 INFO  (TEST-InfixSuggestersTest.testTwoSuggestersBuildThenReload-seed#[5273222CF93A20D5]) [    x:collection1] o.a.s.u.DefaultSolrCoreState New IndexWriter is ready to be used.
   [junit4]   2> 201941 INFO  (TEST-InfixSuggestersTest.testTwoSuggestersBuildThenReload-seed#[5273222CF93A20D5]) [    x:collection1] o.a.s.s.SolrIndexSearcher Opening [Searcher@4b58383[collection1] main]
   [junit4]   2> 201941 INFO  (TEST-InfixSuggestersTest.testTwoSuggestersBuildThenReload-seed#[5273222CF93A20D5]) [    x:collection1] o.a.s.c.SolrCore [collection1]  CLOSING SolrCore org.apache.solr.core.SolrCore@4aee4829
   [junit4]   2> 201941 INFO  (TEST-InfixSuggestersTest.testTwoSuggestersBuildThenReload-seed#[5273222CF93A20D5]) [    x:collection1] o.a.s.m.SolrMetricManager Closing metric reporters for registry=solr.core.collection1, tag=1257130025
   [junit4]   2> 201941 INFO  (TEST-InfixSuggestersTest.testTwoSuggestersBuildThenReload-seed#[5273222CF93A20D5]) [    x:collection1] o.a.s.m.r.SolrJmxReporter Closing reporter [org.apache.solr.metrics.reporters.SolrJmxReporter@126dfac5: rootName = null, domain = solr.core.collection1, service url = null, agent id = null] for registry solr.core.collection1 / com.codahale.metrics.MetricRegistry@2e656fbb
   [junit4]   2> 201946 INFO  (searcherExecutor-593-thread-1-processing-x:collection1) [    x:collection1] o.a.s.c.SolrCore [collection1] Registered new searcher Searcher@4b58383[collection1] main{ExitableDirectoryReader(UninvertingDirectoryReader())}
   [junit4]   2> 201948 INFO  (TEST-InfixSuggestersTest.testTwoSuggestersBuildThenReload-seed#[5273222CF93A20D5]) [    x:collection1] o.a.s.h.c.SuggestComponent SuggestComponent prepare with : qt=/suggest_blended_infix_short_dictionary&suggest.onlyMorePopular=true&indent=off&suggest.count=10&suggest=true&suggest.collate=true&suggest.buildAll=true&suggest.dictionary=shortRandomBlendedInfixSuggester&wt=xml
   [junit4]   2> 201948 INFO  (TEST-InfixSuggestersTest.testTwoSuggestersBuildThenReload-seed#[5273222CF93A20D5]) [    x:collection1] o.a.s.s.s.SolrSuggester SolrSuggester.build(shortRandomBlendedInfixSuggester)
   [junit4]   2> 201964 INFO  (TEST-InfixSuggestersTest.testTwoSuggestersBuildThenReload-seed#[5273222CF93A20D5]) [    x:collection1] o.a.s.s.s.RandomTestDictionaryFactory org.apache.solr.spelling.suggest.RandomTestDictionaryFactory$RandomTestDictionary.enabled.shortRandomBlendedInfixSuggester disabled after emitting 100 items.
   [junit4]   2> 201989 INFO  (TEST-InfixSuggestersTest.testTwoSuggestersBuildThenReload-seed#[5273222CF93A20D5]) [    x:collection1] o.a.s.h.c.SuggestComponent SuggestComponent process with : qt=/suggest_blended_infix_short_dictionary&suggest.onlyMorePopular=true&indent=off&suggest.count=10&suggest=true&suggest.collate=true&suggest.buildAll=true&suggest.dictionary=shortRandomBlendedInfixSuggester&wt=xml
   [junit4]   2> 201989 INFO  (TEST-InfixSuggestersTest.testTwoSuggestersBuildThenReload-seed#[5273222CF93A20D5]) [    x:collection1] o.a.s.c.S.Request [collection1]  webapp=null path=null params={qt=/suggest_blended_infix_short_dictionary&suggest.buildAll=true&wt=xml} status=0 QTime=41
   [junit4]   2> 201990 ERROR (TEST-InfixSuggestersTest.testTwoSuggestersBuildThenReload-seed#[5273222CF93A20D5]) [    x:collection1] o.a.s.c.CorePropertiesLocator Couldn't load core descriptor from C:\Users\jenkins\workspace\Lucene-Solr-master-Windows\solr\core\src\test-files\solr\collection1\core.properties:java.nio.file.NoSuchFileException: C:\Users\jenkins\workspace\Lucene-Solr-master-Windows\solr\core\src\test-files\solr\collection1\core.properties
   [junit4]   2> 201991 INFO  (TEST-InfixSuggestersTest.testTwoSuggestersBuildThenReload-seed#[5273222CF93A20D5]) [    x:collection1] o.a.s.c.SolrResourceLoader [null] Added 2 libs to classloader, from paths: [/C:/Users/jenkins/workspace/Lucene-Solr-master-Windows/solr/core/src/test-files/solr/collection1/lib, /C:/Users/jenkins/workspace/Lucene-Solr-master-Windows/solr/core/src/test-files/solr/collection1/lib/classes]
   [junit4]   2> 202032 INFO  (TEST-InfixSuggestersTest.testTwoSuggestersBuildThenReload-seed#[5273222CF93A20D5]) [    x:collection1] o.a.s.c.SolrConfig Using Lucene MatchVersion: 8.0.0
   [junit4]   2> 202040 INFO  (TEST-InfixSuggestersTest.testTwoSuggestersBuildThenReload-seed#[5273222CF93A20D5]) [    x:collection1] o.a.s.s.IndexSchema [collection1] Schema name=test
   [junit4]   2> 202090 INFO  (TEST-InfixSuggestersTest.testTwoSuggestersBuildThenReload-seed#[5273222CF93A20D5]) [    x:collection1] o.a.s.s.IndexSchema Loaded schema test/1.0 with uniqueid field id
   [junit4]   2> 202099 INFO  (TEST-InfixSuggestersTest.testTwoSuggestersBuildThenReload-seed#[5273222CF93A20D5]) [    x:collection1] o.a.s.c.CoreContainer Reloading SolrCore 'collection1' using configuration from instancedir C:\Users\jenkins\workspace\Lucene-Solr-master-Windows\solr\core\src\test-files\solr\collection1
   [junit4]   2> 202116 INFO  (TEST-InfixSuggestersTest.testTwoSuggestersBuildThenReload-seed#[5273222CF93A20D5]) [    x:collection1] o.a.s.m.r.SolrJmxReporter JMX monitoring for 'solr.core.collection1' (registry 'solr.core.collection1') enabled at server: com.sun.jmx.mbeanserver.JmxMBeanServer@40e935f0
   [junit4]   2> 202116 INFO  (TEST-InfixSuggestersTest.testTwoSuggestersBuildThenReload-seed#[5273222CF93A20D5]) [    x:collection1] o.a.s.c.SolrCore [[collection1] ] Opening new SolrCore at [C:\Users\jenkins\workspace\Lucene-Solr-master-Windows\solr\core\src\test-files\solr\collection1], dataDir=[C:\Users\jenkins\workspace\Lucene-Solr-master-Windows\solr\build\solr-core\test\J0\temp\solr.handler.component.InfixSuggestersTest_5273222CF93A20D5-001\init-core-data-001\]
   [junit4]   2> 202182 INFO  (TEST-InfixSuggestersTest.testTwoSuggestersBuildThenReload-seed#[5273222CF93A20D5]) [    x:collection1] o.a.s.u.CommitTracker Hard AutoCommit: disabled
   [junit4]   2> 202182 INFO  (TEST-InfixSuggestersTest.testTwoSuggestersBuildThenReload-seed#[5273222CF93A20D5]) [    x:collection1] o.a.s.u.CommitTracker Soft AutoCommit: disabled
   [junit4]   2> 202183 INFO  (TEST-InfixSuggestersTest.testTwoSuggestersBuildThenReload-seed#[5273222CF93A20D5]) [    x:collection1] o.a.s.s.SolrIndexSearcher Opening [Searcher@35154eca[collection1] main]
   [junit4]   2> 202183 WARN  (TEST-InfixSuggestersTest.testTwoSuggestersBuildThenReload-seed#[5273222CF93A20D5]) [    x:collection1] o.a.s.r.ManagedResourceStorage Cannot write to config directory C:\Users\jenkins\workspace\Lucene-Solr-master-Windows\solr\core\src\test-files\solr\collection1\conf; switching to use InMemory storage instead.
   [junit4]   2> 202184 INFO  (TEST-InfixSuggestersTest.testTwoSuggestersBuildThenReload-seed#[5273222CF93A20D5]) [    x:collection1] o.a.s.h.c.SuggestComponent Initializing SuggestComponent
   [junit4]   2> 202184 INFO  (TEST-InfixSuggestersTest.testTwoSuggestersBuildThenReload-seed#[5273222CF93A20D5]) [    x:collection1] o.a.s.s.s.SolrSuggester init: {name=shortRandomAnalyzingInfixSuggester,lookupImpl=AnalyzingInfixLookupFactory,dictionaryImpl=RandomTestDictionaryFactory,randDictMaxItems=100,indexPath=short_random_analyzing_infix_suggester,suggestAnalyzerFieldType=text,buildOnCommit=false,buildOnStartup=false}
   [junit4]   2> 202187 INFO  (TEST-InfixSuggestersTest.testTwoSuggestersBuildThenReload-seed#[5273222CF93A20D5]) [    x:collection1] o.a.s.s.s.SolrSuggester Dictionary loaded with params: {name=shortRandomAnalyzingInfixSuggester,lookupImpl=AnalyzingInfixLookupFactory,dictionaryImpl=RandomTestDictionaryFactory,randDictMaxItems=100,indexPath=short_random_analyzing_infix_suggester,suggestAnalyzerFieldType=text,buildOnCommit=false,buildOnStartup=false}
   [junit4]   2> 202187 INFO  (TEST-InfixSuggestersTest.testTwoSuggestersBuildThenReload-seed#[5273222CF93A20D5]) [    x:collection1] o.a.s.h.c.SuggestComponent Initializing SuggestComponent
   [junit4]   2> 202187 INFO  (TEST-InfixSuggestersTest.testTwoSuggestersBuildThenReload-seed#[5273222CF93A20D5]) [    x:collection1] o.a.s.s.s.SolrSuggester init: {name=longRandomAnalyzingInfixSuggester,lookupImpl=AnalyzingInfixLookupFactory,dictionaryImpl=RandomTestDictionaryFactory,randDictMaxItems=100000,indexPath=long_random_analyzing_infix_suggester,suggestAnalyzerFieldType=text,buildOnCommit=false,buildOnStartup=false}
   [junit4]   2> 202189 INFO  (TEST-InfixSuggestersTest.testTwoSuggestersBuildThenReload-seed#[5273222CF93A20D5]) [    x:collection1] o.a.s.s.s.SolrSuggester Dictionary loaded with params: {name=longRandomAnalyzingInfixSuggester,lookupImpl=AnalyzingInfixLookupFactory,dictionaryImpl=RandomTestDictionaryFactory,randDictMaxItems=100000,indexPath=long_random_analyzing_infix_suggester,suggestAnalyzerFieldType=text,buildOnCommit=false,buildOnStartup=false}
   [junit4]   2> 202189 INFO  (TEST-InfixSuggestersTest.testTwoSuggestersBuildThenReload-seed#[5273222CF93A20D5]) [    x:collection1] o.a.s.h.c.SuggestComponent Initializing SuggestComponent
   [junit4]   2> 202189 INFO  (TEST-InfixSuggestersTest.testTwoSuggestersBuildThenReload-seed#[5273222CF93A20D5]) [    x:collection1] o.a.s.s.s.SolrSuggester init: {name=shortRandomBlendedInfixSuggester,lookupImpl=BlendedInfixLookupFactory,dictionaryImpl=RandomTestDictionaryFactory,randDictMaxItems=100,blenderType=position_linear,suggestAnalyzerFieldType=text,indexPath=short_random_blended_infix_suggester,highlight=true,buildOnStartup=false,buildOnCommit=false}
   [junit4]   2> 202191 INFO  (TEST-InfixSuggestersTest.testTwoSuggestersBuildThenReload-seed#[5273222CF93A20D5]) [    x:collection1] o.a.s.s.s.SolrSuggester Dictionary loaded with params: {name=shortRandomBlendedInfixSuggester,lookupImpl=BlendedInfixLookupFactory,dictionaryImpl=RandomTestDictionaryFactory,randDictMaxItems=100,blenderType=position_linear,suggestAnalyzerFieldType=text,indexPath=short_random_blended_infix_suggester,highlight=true,buildOnStartup=false,buildOnCommit=false}
   [junit4]   2> 202191 INFO  (TEST-InfixSuggestersTest.testTwoSuggestersBuildThenReload-seed#[5273222CF93A20D5]) [    x:collection1] o.a.s.h.ReplicationHandler Commits will be reserved for 10000ms.
   [junit4]   2> 202192 INFO  (TEST-InfixSuggestersTest.testTwoSuggestersBuildThenReload-seed#[5273222CF93A20D5]) [    x:collection1] o.a.s.u.RandomMergePolicy RandomMergePolicy wrapping class org.apache.lucene.index.LogDocMergePolicy: [LogDocMergePolicy: minMergeSize=1000, mergeFactor=10, maxMergeSize=9223372036854775807, maxMergeSizeForForcedMerge=9223372036854775807, calibrateSizeByDeletes=true, maxMergeDocs=2147483647, maxCFSSegmentSizeMB=8.796093022207999E12, noCFSRatio=0.0]
   [junit4]   2> 202192 INFO  (TEST-InfixSuggestersTest.testTwoSuggestersBuildThenReload-seed#[5273222CF93A20D5]) [    x:collection1] o.a.s.u.DefaultSolrCoreState New IndexWriter is ready to be used.
   [junit4]   2> 202192 INFO  (searcherExecutor-597-thread-1-processing-x:collection1) [    x:collection1] o.a.s.c.SolrCore [collection1] Registered new searcher Searcher@35154eca[collection1] main{ExitableDirectoryReader(UninvertingDirectoryReader())}
   [junit4]   2> 202192 INFO  (TEST-InfixSuggestersTest.testTwoSuggestersBuildThenReload-seed#[5273222CF93A20D5]) [    x:collection1] o.a.s.s.SolrIndexSearcher Opening [Searcher@62754f3d[collection1] main]
   [junit4]   2> 202193 INFO  (TEST-InfixSuggestersTest.testTwoSuggestersBuildThenReload-seed#[5273222CF93A20D5]) [    x:collection1] o.a.s.c.SolrCore [collection1]  CLOSING SolrCore org.apache.solr.core.SolrCore@159383f
   [junit4]   2> 202193 INFO  (TEST-InfixSuggestersTest.testTwoSuggestersBuildThenReload-seed#[5273222CF93A20D5]) [    x:collection1] o.a.s.m.SolrMetricManager Closing metric reporters for registry=solr.core.collection1, tag=22624319
   [junit4]   2> 202193 INFO  (TEST-InfixSuggestersTest.testTwoSuggestersBuildThenReload-seed#[5273222CF93A20D5]) [    x:collection1] o.a.s.m.r.SolrJmxReporter Closing reporter [org.apache.solr.metrics.reporters.SolrJmxReporter@36006ab6: rootName = null, domain = solr.core.collection1, service url = null, agent id = null] for registry solr.core.collection1 / com.codahale.metrics.MetricRegistry@2e656fbb
   [junit4]   2> 202193 INFO  (searcherExecutor-597-thread-1-processing-x:collection1) [    x:collection1] o.a.s.c.SolrCore [collection1] Registered new searcher Searcher@62754f3d[collection1] main{ExitableDirectoryReader(UninvertingDirectoryReader())}
   [junit4]   2> 202213 INFO  (TEST-InfixSuggestersTest.testTwoSuggestersBuildThenReload-seed#[5273222CF93A20D5]) [    x:collection1] o.a.s.SolrTestCaseJ4 ###Ending testTwoSuggestersBuildThenReload
   [junit4]   2> 202214 INFO  (TEST-InfixSuggestersTest.testBuildThen2xReload-seed#[5273222CF93A20D5]) [    x:collection1] o.a.s.SolrTestCaseJ4 ###Starting testBuildThen2xReload
   [junit4]   2> 202215 INFO  (TEST-InfixSuggestersTest.testBuildThen2xReload-seed#[5273222CF93A20D5]) [    x:collection1] o.a.s.h.c.SuggestComponent SuggestComponent prepare with : qt=/suggest_analyzing_infix_short_dictionary&suggest=true&suggest.buildAll=true&wt=xml&indent=off
   [junit4]   2> 202215 INFO  (TEST-InfixSuggestersTest.testBuildThen2xReload-seed#[5273222CF93A20D5]) [    x:collection1] o.a.s.s.s.SolrSuggester SolrSuggester.build(shortRandomAnalyzingInfixSuggester)
   [junit4]   2> 202223 INFO  (TEST-InfixSuggestersTest.testBuildThen2xReload-seed#[5273222CF93A20D5]) [    x:collection1] o.a.s.s.s.RandomTestDictionaryFactory org.apache.solr.spelling.suggest.RandomTestDictionaryFactory$RandomTestDictionary.enabled.shortRandomAnalyzingInfixSuggester disabled after emitting 100 items.
   [junit4]   2> 202249 INFO  (TEST-InfixSuggestersTest.testBuildThen2xReload-seed#[5273222CF93A20D5]) [    x:collection1] o.a.s.h.c.SuggestComponent SuggestComponent process with : qt=/suggest_analyzing_infix_short_dictionary&suggest=true&suggest.buildAll=true&wt=xml&indent=off
   [junit4]   2> 202249 INFO  (TEST-InfixSuggestersTest.testBuildThen2xReload-seed#[5273222CF93A20D5]) [    x:collection1] o.a.s.c.S.Request [collection1]  webapp=null path=null params={qt=/suggest_analyzing_infix_short_dictionary&suggest.buildAll=true&wt=xml} status=0 QTime=33
   [junit4]   2> 202249 ERROR (TEST-InfixSuggestersTest.testBuildThen2xReload-seed#[5273222CF93A20D5]) [    x:collection1] o.a.s.c.CorePropertiesLocator Couldn't load core descriptor from C:\Users\jenkins\workspace\Lucene-Solr-master-Windows\solr\core\src\test-files\solr\collection1\core.properties:java.nio.file.NoSuchFileException: C:\Users\jenkins\workspace\Lucene-Solr-master-Windows\solr\core\src\test-files\solr\collection1\core.properties
   [junit4]   2> 202250 INFO  (TEST-InfixSuggestersTest.testBuildThen2xReload-seed#[5273222CF93A20D5]) [    x:collection1] o.a.s.c.SolrResourceLoader [null] Added 2 libs to classloader, from paths: [/C:/Users/jenkins/workspace/Lucene-Solr-master-Windows/solr/core/src/test-files/solr/collection1/lib, /C:/Users/jenkins/workspace/Lucene-Solr-master-Windows/solr/core/src/test-files/solr/collection1/lib/classes]
   [junit4]   2> 202292 INFO  (TEST-InfixSuggestersTest.testBuildThen2xReload-seed#[5273222CF93A20D5]) [    x:collection1] o.a.s.c.SolrConfig Using Lucene MatchVersion: 8.0.0
   [junit4]   2> 202300 INFO  (TEST-InfixSuggestersTest.testBuildThen2xReload-seed#[5273222CF93A20D5]) [    x:collection1] o.a.s.s.IndexSchema [collection1] Schema name=test
   [junit4]   2> 202351 INFO  (TEST-InfixSuggestersTest.testBuildThen2xReload-seed#[5273222CF93A20D5]) [    x:collection1] o.a.s.s.IndexSchema Loaded schema test/1.0 with uniqueid field id
   [junit4]   2> 202361 INFO  (TEST-InfixSuggestersTest.testBuildThen2xReload-seed#[5273222CF93A20D5]) [    x:collection1] o.a.s.c.CoreContainer Reloading SolrCore 'collection1' using configuration from instancedir C:\Users\jenkins\workspace\Lucene-Solr-master-Windows\solr\core\src\test-files\solr\collection1
   [junit4]   2> 202379 INFO  (TEST-InfixSuggestersTest.testBuildThen2xReload-seed#[5273222CF93A20D5]) [    x:collection1] o.a.s.m.r.SolrJmxReporter JMX monitoring for 'solr.core.collection1' (registry 'solr.core.collection1') enabled at server: com.sun.jmx.mbeanserver.JmxMBeanServer@40e935f0
   [junit4]   2> 202379 INFO  (TEST-InfixSuggestersTest.testBuildThen2xReload-seed#[5273222CF93A20D5]) [    x:collection1] o.a.s.c.SolrCore [[collection1] ] Opening new SolrCore at [C:\Users\jenkins\workspace\Lucene-Solr-master-Windows\solr\core\src\test-files\solr\collection1], dataDir=[C:\Users\jenkins\workspace\Lucene-Solr-master-Windows\solr\build\solr-core\test\J0\temp\solr.handler.component.InfixSuggestersTest_5273222CF93A20D5-001\init-core-data-001\]
   [junit4]   2> 202445 INFO  (TEST-InfixSuggestersTest.testBuildThen2xReload-seed#[5273222CF93A20D5]) [    x:collection1] o.a.s.u.CommitTracker Hard AutoCommit: disabled
   [junit4]   2> 202445 INFO  (TEST-InfixSuggestersTest.testBuildThen2xReload-seed#[5273222CF93A20D5]) [    x:collection1] o.a.s.u.CommitTracker Soft AutoCommit: disabled
   [junit4]   2> 202446 INFO  (TEST-InfixSuggestersTest.testBuildThen2xReload-seed#[5273222CF93A20D5]) [    x:collection1] o.a.s.s.SolrIndexSearcher Opening [Searcher@1ce49cf3[collection1] main]
   [junit4]   2> 202447 WARN  (TEST-InfixSuggestersTest.testBuildThen2xReload-seed#[5273222CF93A20D5]) [    x:collection1] o.a.s.r.ManagedResourceStorage Cannot write to config directory C:\Users\jenkins\workspace\Lucene-Solr-master-Windows\solr\core\src\test-files\solr\collection1\conf; switching to use InMemory storage instead.
   [junit4]   2> 202447 INFO  (TEST-InfixSuggestersTest.testBuildThen2xReload-seed#[5273222CF93A20D5]) [    x:collection1] o.a.s.h.c.SuggestComponent Initializing SuggestComponent
   [junit4]   2> 202447 INFO  (TEST-InfixSuggestersTest.testBuildThen2xReload-seed#[5273222CF93A20D5]) [    x:collection1] o.a.s.s.s.SolrSuggester init: {name=shortRandomAnalyzingInfixSuggester,lookupImpl=AnalyzingInfixLookupFactory,dictionaryImpl=RandomTestDictionaryFactory,randDictMaxItems=100,indexPath=short_random_analyzing_infix_suggester,suggestAnalyzerFieldType=text,buildOnCommit=false,buildOnStartup=false}
   [junit4]   2> 202449 INFO  (TEST-InfixSuggestersTest.testBuildThen2xReload-seed#[5273222CF93A20D5]) [    x:collection1] o.a.s.s.s.SolrSuggester Dictionary loaded with params: {name=shortRandomAnalyzingInfixSuggester,lookupImpl=AnalyzingInfixLookupFactory,dictionaryImpl=RandomTestDictionaryFactory,randDictMaxItems=100,indexPath=short_random_analyzing_infix_suggester,suggestAnalyzerFieldType=text,buildOnCommit=false,buildOnStartup=false}
   [junit4]   2> 202449 INFO  (TEST-InfixSuggestersTest.testBuildThen2xReload-seed#[5273222CF93A20D5]) [    x:collection1] o.a.s.h.c.SuggestComponent Initializing SuggestComponent
   [junit4]   2> 202449 INFO  (TEST-InfixSuggestersTest.testBuildThen2xReload-seed#[5273222CF93A20D5]) [    x:collection1] o.a.s.s.s.SolrSuggester init: {name=longRandomAnalyzingInfixSuggester,lookupImpl=AnalyzingInfixLookupFactory,dictionaryImpl=RandomTestDictionaryFactory,randDictMaxItems=100000,indexPath=long_random_analyzing_infix_suggester,suggestAnalyzerFieldType=text,buildOnCommit=false,buildOnStartup=false}
   [junit4]   2> 202449 INFO  (TEST-InfixSuggestersTest.testBuildThen2xReload-seed#[5273222CF93A20D5]) [    x:collection1] o.a.s.s.s.SolrSuggester Dictionary loaded with params: {name=longRandomAnalyzingInfixSuggester,lookupImpl=AnalyzingInfixLookupFactory,dictionaryImpl=RandomTestDictionaryFactory,randDictMaxItems=100000,indexPath=long_random_analyzing_infix_suggester,suggestAnalyzerFieldType=text,buildOnCommit=false,buildOnStartup=false}
   [junit4]   2> 202449 INFO  (TEST-InfixSuggestersTest.testBuildThen2xReload-seed#[5273222CF93A20D5]) [    x:collection1] o.a.s.h.c.SuggestComponent Initializing SuggestComponent
   [junit4]   2> 202449 INFO  (TEST-InfixSuggestersTest.testBuildThen2xReload-seed#[5273222CF93A20D5]) [    x:collection1] o.a.s.s.s.SolrSuggester init: {name=shortRandomBlendedInfixSuggester,lookupImpl=BlendedInfixLookupFactory,dictionaryImpl=RandomTestDictionaryFactory,randDictMaxItems=100,blenderType=position_linear,suggestAnalyzerFieldType=text,indexPath=short_random_blended_infix_suggester,highlight=true,buildOnStartup=false,buildOnCommit=false}
   [junit4]   2> 202455 INFO  (TEST-InfixSuggestersTest.testBuildThen2xReload-seed#[5273222CF93A20D5]) [    x:collection1] o.a.s.s.s.SolrSuggester Dictionary loaded with params: {name=shortRandomBlendedInfixSuggester,lookupImpl=BlendedInfixLookupFactory,dictionaryImpl=RandomTestDictionaryFactory,randDictMaxItems=100,blenderType=position_linear,suggestAnalyzerFieldType=text,indexPath=short_random_blended_infix_suggester,highlight=true,buildOnStartup=false,buildOnCommit=false}
   [junit4]   2> 202455 INFO  (TEST-InfixSuggestersTest.testBuildThen2xReload-seed#[5273222CF93A20D5]) [    x:collection1] o.a.s.h.ReplicationHandler Commits will be reserved for 10000ms.
   [junit4]   2> 202455 INFO  (TEST-InfixSuggestersTest.testBuildThen2xReload-seed#[5273222CF93A20D5]) [    x:collection1] o.a.s.u.RandomMergePolicy RandomMergePolicy wrapping class org.apache.lucene.index.LogDocMergePolicy: [LogDocMergePolicy: minMergeSize=1000, mergeFactor=34, maxMergeSize=9223372036854775807, maxMergeSizeForForcedMerge=9223372036854775807, calibrateSizeByDeletes=false, maxMergeDocs=2147483647, maxCFSSegmentSizeMB=8.796093022207999E12, noCFSRatio=1.0]
   [junit4]   2> 202456 INFO  (TEST-InfixSuggestersTest.testBuildThen2xReload-seed#[5273222CF93A20D5]) [    x:collection1] o.a.s.u.DefaultSolrCoreState New IndexWriter is ready to be used.
   [junit4]   2> 202456 INFO  (searcherExecutor-601-thread-1-processing-x:collection1) [    x:collection1] o.a.s.c.SolrCore [collection1] Registered new searcher Searcher@1ce49cf3[collection1] main{ExitableDirectoryReader(UninvertingDirectoryReader())}
   [junit4]   2> 202456 INFO  (TEST-InfixSuggestersTest.testBuildThen2xReload-seed#[5273222CF93A20D5]) [    x:collection1] o.a.s.s.SolrIndexSearcher Opening [Searcher@4f54f851[collection1] main]
   [junit4]   2> 202457 INFO  (TEST-InfixSuggestersTest.testBuildThen2xReload-seed#[5273222CF93A20D5]) [    x:collection1] o.a.s.c.SolrCore [collection1]  CLOSING SolrCore org.apache.solr.core.SolrCore@217aaf5
   [junit4]   2> 202457 INFO  (TEST-InfixSuggestersTest.testBuildThen2xReload-seed#[5273222CF93A20D5]) [    x:collection1] o.a.s.m.SolrMetricManager Closing metric reporters for registry=solr.core.collection1, tag=35105525
   [junit4]   2> 202457 INFO  (TEST-InfixSuggestersTest.testBuildThen2xReload-seed#[5273222CF93A20D5]) [    x:collection1] o.a.s.m.r.SolrJmxReporter Closing reporter [org.apache.solr.metrics.reporters.SolrJmxReporter@6f84c76f: rootName = null, domain = solr.core.collection1, service url = null, agent id = null] for registry solr.core.collection1 / com.codahale.metrics.MetricRegistry@2e656fbb
   [junit4]   2> 202457 INFO  (searcherExecutor-601-thread-1-processing-x:collection1) [    x:collection1] o.a.s.c.SolrCore [collection1] Registered new searcher Searcher@4f54f851[collection1] main{ExitableDirectoryReader(UninvertingDirectoryReader())}
   [junit4]   2> 202462 ERROR (TEST-InfixSuggestersTest.testBuildThen2xReload-seed#[5273222CF93A20D5]) [    x:collection1] o.a.s.c.CorePropertiesLocator Couldn't load core descriptor from C:\Users\jenkins\workspace\Lucene-Solr-master-Windows\solr\core\src\test-files\solr\collection1\core.properties:java.nio.file.NoSuchFileException: C:\Users\jenkins\workspace\Lucene-Solr-master-Windows\solr\core\src\test-files\solr\collection1\core.properties
   [junit4]   2> 202464 INFO  (TEST-InfixSuggestersTest.testBuildThen2xReload-seed#[5273222CF93A20D5]) [    x:collection1] o.a.s.c.SolrResourceLoader [null] Added 2 libs to classloader, from paths: [/C:/Users/jenkins/workspace/Lucene-Solr-master-Windows/solr/core/src/test-files/solr/collection1/lib, /C:/Users/jenkins/workspace/Lucene-Solr-master-Windows/solr/core/src/test-files/solr/collection1/lib/classes]
   [junit4]   2> 202505 INFO  (TEST-InfixSuggestersTest.testBuildThen2xReload-seed#[5273222CF93A20D5]) [    x:collection1] o.a.s.c.SolrConfig Using Lucene MatchVersion: 8.0.0
   [junit4]   2> 202512 INFO  (TEST-InfixSuggestersTest.testBuildThen2xReload-seed#[5273222CF93A20D5]) [    x:collection1] o.a.s.s.IndexSchema [collection1] Schema name=test
   [junit4]   2> 202571 INFO  (TEST-InfixSuggestersTest.testBuildThen2xReload-seed#[5273222CF93A20D5]) [    x:collection1] o.a.s.s.IndexSchema Loaded schema test/1.0 with uniqueid field id
   [junit4]   2> 202580 INFO  (TEST-InfixSuggestersTest.testBuildThen2xReload-seed#[5273222CF93A20D5]) [    x:collection1] o.a.s.c.CoreContainer Reloading SolrCore 'collection1' using configuration from instancedir C:\Users\jenkins\workspace\Lucene-Solr-master-Windows\solr\core\src\test-files\solr\collection1
   [junit4]   2> 202596 INFO  (TEST-InfixSuggestersTest.testBuildThen2xReload-seed#[5273222CF93A20D5]) [    x:collection1] o.a.s.m.r.SolrJmxReporter JMX monitoring for 'solr.core.collection1' (registry 'solr.core.collection1') enabled at server: com.sun.jmx.mbeanserver.JmxMBeanServer@40e935f0
   [junit4]   2> 202596 INFO  (TEST-InfixSuggestersTest.testBuildThen2xReload-seed#[5273222CF93A20D5]) [    x:collection1] o.a.s.c.SolrCore [[collection1] ] Opening new SolrCore at [C:\Users\jenkins\workspace\Lucene-Solr-master-Windows\solr\core\src\test-files\solr\collection1], dataDir=[C:\Users\jenkins\workspace\Lucene-Solr-master-Windows\solr\build\solr-core\test\J0\temp\solr.handler.component.InfixSuggestersTest_5273222CF93A20D5-001\init-core-data-001\]
   [junit4]   2> 202659 INFO  (TEST-InfixSuggestersTest.testBuildThen2xReload-seed#[5273222CF93A20D5]) [    x:collection1] o.a.s.u.CommitTracker Hard AutoCommit: disabled
   [junit4]   2> 202659 INFO  (TEST-InfixSuggestersTest.testBuildThen2xReload-seed#[5273222CF93A20D5]) [    x:collection1] o.a.s.u.CommitTracker Soft AutoCommit: disabled
   [junit4]   2> 202660 INFO  (TEST-InfixSuggestersTest.testBuildThen2xReload-seed#[5273222CF93A20D5]) [    x:collection1] o.a.s.s.SolrIndexSearcher Opening [Searcher@73e9e5ac[collection1] main]
   [junit4]   2> 202660 WARN  (TEST-InfixSuggestersTest.testBuildThen2xReload-seed#[5273222CF93A20D5]) [    x:collection1] o.a.s.r.ManagedResourceStorage Cannot write to config directory C:\Users\jenkins\workspace\Lucene-Solr-master-Windows\solr\core\src\test-files\solr\collection1\conf; switching to use InMemory storage instead.
   [junit4]   2> 202661 INFO  (TEST-InfixSuggestersTest.testBuildThen2xReload-seed#[5273222CF93A20D5]) [    x:collection1] o.a.s.h.c.SuggestComponent Initializing SuggestComponent
   [junit4]   2> 202661 INFO  (TEST-InfixSuggestersTest.testBuildThen2xReload-seed#[5273222CF93A20D5]) [    x:collection1] o.a.s.s.s.SolrSuggester init: {name=shortRandomAnalyzingInfixSuggester,lookupImpl=AnalyzingInfixLookupFactory,dictionaryImpl=RandomTestDictionaryFactory,randDictMaxItems=100,indexPath=short_random_analyzing_infix_suggester,suggestAnalyzerFieldType=text,buildOnCommit=false,buildOnStartup=false}
   [junit4]   2> 202664 INFO  (TEST-InfixSuggestersTest.testBuildThen2xReload-seed#[5273222CF93A20D5]) [    x:collection1] o.a.s.s.s.SolrSuggester Dictionary loaded with params: {name=shortRandomAnalyzingInfixSuggester,lookupImpl=AnalyzingInfixLookupFactory,dictionaryImpl=RandomTestDictionaryFactory,randDictMaxItems=100,indexPath=short_random_analyzing_infix_suggester,suggestAnalyzerFieldType=text,buildOnCommit=false,buildOnStartup=false}
   [junit4]   2> 202664 INFO  (TEST-InfixSuggestersTest.testBuildThen2xReload-seed#[5273222CF93A20D5]) [    x:collection1] o.a.s.h.c.SuggestComponent Initializing SuggestComponent
   [junit4]   2> 202664 INFO  (TEST-InfixSuggestersTest.testBuildThen2xReload-seed#[5273222CF93A20D5]) [    x:collection1] o.a.s.s.s.SolrSuggester init: {name=longRandomAnalyzingInfixSuggester,lookupImpl=AnalyzingInfixLookupFactory,dictionaryImpl=RandomTestDictionaryFactory,randDictMaxItems=100000,indexPath=long_random_analyzing_infix_suggester,suggestAnalyzerFieldType=text,buildOnCommit=false,buildOnStartup=false}
   [junit4]   2> 202664 INFO  (TEST-InfixSuggestersTest.testBuildThen2xReload-seed#[5273222CF93A20D5]) [    x:collection1] o.a.s.s.s.SolrSuggester Dictionary loaded with params: {name=longRandomAnalyzingInfixSuggester,lookupImpl=AnalyzingInfixLookupFactory,dictionaryImpl=RandomTestDictionaryFactory,randDictMaxItems=100000,indexPath=long_random_analyzing_infix_suggester,suggestAnalyzerFieldType=text,buildOnCommit=false,buildOnStartup=false}
   [junit4]   2> 202664 INFO  (TEST-InfixSuggestersT

[...truncated too long message...]

ess$400(WindowsSelectorImpl.java:278)
   [junit4]   2>         at sun.nio.ch.WindowsSelectorImpl.doSelect(WindowsSelectorImpl.java:159)
   [junit4]   2>         at sun.nio.ch.SelectorImpl.lockAndDoSelect(SelectorImpl.java:86)
   [junit4]   2>         at sun.nio.ch.SelectorImpl.select(SelectorImpl.java:97)
   [junit4]   2>         at org.apache.zookeeper.ClientCnxnSocketNIO.doTransport(ClientCnxnSocketNIO.java:349)
   [junit4]   2>         at org.apache.zookeeper.ClientCnxn$SendThread.run(ClientCnxn.java:1141)
   [junit4]   2>   32) Thread[id=3125, name=searcherExecutor-651-thread-1, state=WAITING, group=TGRP-StreamExpressionTest]
   [junit4]   2>         at sun.misc.Unsafe.park(Native Method)
   [junit4]   2>         at java.util.concurrent.locks.LockSupport.park(LockSupport.java:175)
   [junit4]   2>         at java.util.concurrent.locks.AbstractQueuedSynchronizer$ConditionObject.await(AbstractQueuedSynchronizer.java:2039)
   [junit4]   2>         at java.util.concurrent.LinkedBlockingQueue.take(LinkedBlockingQueue.java:442)
   [junit4]   2>         at java.util.concurrent.ThreadPoolExecutor.getTask(ThreadPoolExecutor.java:1074)
   [junit4]   2>         at java.util.concurrent.ThreadPoolExecutor.runWorker(ThreadPoolExecutor.java:1134)
   [junit4]   2>         at java.util.concurrent.ThreadPoolExecutor$Worker.run(ThreadPoolExecutor.java:624)
   [junit4]   2>         at java.lang.Thread.run(Thread.java:748)
   [junit4]   2>   33) Thread[id=3114, name=Scheduler-235288832, state=WAITING, group=TGRP-StreamExpressionTest]
   [junit4]   2>         at sun.misc.Unsafe.park(Native Method)
   [junit4]   2>         at java.util.concurrent.locks.LockSupport.park(LockSupport.java:175)
   [junit4]   2>         at java.util.concurrent.locks.AbstractQueuedSynchronizer$ConditionObject.await(AbstractQueuedSynchronizer.java:2039)
   [junit4]   2>         at java.util.concurrent.ScheduledThreadPoolExecutor$DelayedWorkQueue.take(ScheduledThreadPoolExecutor.java:1081)
   [junit4]   2>         at java.util.concurrent.ScheduledThreadPoolExecutor$DelayedWorkQueue.take(ScheduledThreadPoolExecutor.java:809)
   [junit4]   2>         at java.util.concurrent.ThreadPoolExecutor.getTask(ThreadPoolExecutor.java:1074)
   [junit4]   2>         at java.util.concurrent.ThreadPoolExecutor.runWorker(ThreadPoolExecutor.java:1134)
   [junit4]   2>         at java.util.concurrent.ThreadPoolExecutor$Worker.run(ThreadPoolExecutor.java:624)
   [junit4]   2>         at java.lang.Thread.run(Thread.java:748)
   [junit4]   2>   34) Thread[id=3124, name=searcherExecutor-650-thread-1, state=WAITING, group=TGRP-StreamExpressionTest]
   [junit4]   2>         at sun.misc.Unsafe.park(Native Method)
   [junit4]   2>         at java.util.concurrent.locks.LockSupport.park(LockSupport.java:175)
   [junit4]   2>         at java.util.concurrent.locks.AbstractQueuedSynchronizer$ConditionObject.await(AbstractQueuedSynchronizer.java:2039)
   [junit4]   2>         at java.util.concurrent.LinkedBlockingQueue.take(LinkedBlockingQueue.java:442)
   [junit4]   2>         at java.util.concurrent.ThreadPoolExecutor.getTask(ThreadPoolExecutor.java:1074)
   [junit4]   2>         at java.util.concurrent.ThreadPoolExecutor.runWorker(ThreadPoolExecutor.java:1134)
   [junit4]   2>         at java.util.concurrent.ThreadPoolExecutor$Worker.run(ThreadPoolExecutor.java:624)
   [junit4]   2>         at java.lang.Thread.run(Thread.java:748)
   [junit4]   2>   35) Thread[id=3126, name=ScheduledTrigger-639-thread-4, state=WAITING, group=TGRP-StreamExpressionTest]
   [junit4]   2>         at sun.misc.Unsafe.park(Native Method)
   [junit4]   2>         at java.util.concurrent.locks.LockSupport.park(LockSupport.java:175)
   [junit4]   2>         at java.util.concurrent.locks.AbstractQueuedSynchronizer$ConditionObject.await(AbstractQueuedSynchronizer.java:2039)
   [junit4]   2>         at java.util.concurrent.ScheduledThreadPoolExecutor$DelayedWorkQueue.take(ScheduledThreadPoolExecutor.java:1088)
   [junit4]   2>         at java.util.concurrent.ScheduledThreadPoolExecutor$DelayedWorkQueue.take(ScheduledThreadPoolExecutor.java:809)
   [junit4]   2>         at java.util.concurrent.ThreadPoolExecutor.getTask(ThreadPoolExecutor.java:1074)
   [junit4]   2>         at java.util.concurrent.ThreadPoolExecutor.runWorker(ThreadPoolExecutor.java:1134)
   [junit4]   2>         at java.util.concurrent.ThreadPoolExecutor$Worker.run(ThreadPoolExecutor.java:624)
   [junit4]   2>         at java.lang.Thread.run(Thread.java:748)
   [junit4]   2>   36) Thread[id=3094, name=Thread-551, state=WAITING, group=TGRP-StreamExpressionTest]
   [junit4]   2>         at java.lang.Object.wait(Native Method)
   [junit4]   2>         at java.lang.Object.wait(Object.java:502)
   [junit4]   2>         at org.apache.solr.core.CloserThread.run(CoreContainer.java:1675)
   [junit4]   2>   37) Thread[id=3106, name=SUITE-StreamExpressionTest-seed#[2AEA13FFF5648378]-worker-SendThread(127.0.0.1:51495), state=RUNNABLE, group=TGRP-StreamExpressionTest]
   [junit4]   2>         at sun.nio.ch.WindowsSelectorImpl$SubSelector.poll0(Native Method)
   [junit4]   2>         at sun.nio.ch.WindowsSelectorImpl$SubSelector.poll(WindowsSelectorImpl.java:296)
   [junit4]   2>         at sun.nio.ch.WindowsSelectorImpl$SubSelector.access$400(WindowsSelectorImpl.java:278)
   [junit4]   2>         at sun.nio.ch.WindowsSelectorImpl.doSelect(WindowsSelectorImpl.java:159)
   [junit4]   2>         at sun.nio.ch.SelectorImpl.lockAndDoSelect(SelectorImpl.java:86)
   [junit4]   2>         at sun.nio.ch.SelectorImpl.select(SelectorImpl.java:97)
   [junit4]   2>         at org.apache.zookeeper.ClientCnxnSocketNIO.doTransport(ClientCnxnSocketNIO.java:349)
   [junit4]   2>         at org.apache.zookeeper.ClientCnxn$SendThread.run(ClientCnxn.java:1141)
   [junit4]   2>   38) Thread[id=3096, name=Thread-552, state=WAITING, group=TGRP-StreamExpressionTest]
   [junit4]   2>         at java.lang.Object.wait(Native Method)
   [junit4]   2>         at java.lang.Object.wait(Object.java:502)
   [junit4]   2>         at org.apache.solr.core.CloserThread.run(CoreContainer.java:1675)
   [junit4]   2> NOTE: test params are: codec=Asserting(Lucene70): {expr_s=BlockTreeOrds(blocksize=128), featureSet_s=Lucene50(blocksize=128), join2_s=PostingsFormat(name=Memory), multiDefault=PostingsFormat(name=Memory), checkpoint_ss=FSTOrd50, test_t=FSTOrd50, level1_s=BlockTreeOrds(blocksize=128), body_t=FSTOrd50, ident_s=Lucene50(blocksize=128), s_multi=BlockTreeOrds(blocksize=128), col_s=Lucene50(blocksize=128), level2_s=Lucene50(blocksize=128), whitetok=FSTOrd50, a_s=BlockTreeOrds(blocksize=128), term_s=PostingsFormat(name=Memory), a_t=PostingsFormat(name=Memory), side_s=FSTOrd50, id=FSTOrd50, text=BlockTreeOrds(blocksize=128)}, docValues:{expr_s=DocValuesFormat(name=Asserting), join2_s=DocValuesFormat(name=Lucene70), multiDefault=DocValuesFormat(name=Lucene70), price_f=DocValuesFormat(name=Lucene70), intDefault=DocValuesFormat(name=Direct), a_f=DocValuesFormat(name=Direct), join1_i=DocValuesFormat(name=Asserting), a_i=DocValuesFormat(name=Lucene70), join3_i=DocValuesFormat(name=Lucene70), test_i=DocValuesFormat(name=Lucene70), field_i=DocValuesFormat(name=Lucene70), level1_s=DocValuesFormat(name=Asserting), s_multi=DocValuesFormat(name=Asserting), col_s=DocValuesFormat(name=Direct), level2_s=DocValuesFormat(name=Direct), score_f=DocValuesFormat(name=Asserting), a_s=DocValuesFormat(name=Asserting), term_s=DocValuesFormat(name=Lucene70), id=DocValuesFormat(name=Lucene70), timestamp=DocValuesFormat(name=Lucene70), i_multi=DocValuesFormat(name=Lucene70), featureSet_s=DocValuesFormat(name=Direct), index_i=DocValuesFormat(name=Direct), test_dt=DocValuesFormat(name=Asserting), out_i=DocValuesFormat(name=Direct), checkpoint_ss=DocValuesFormat(name=Lucene70), ident_s=DocValuesFormat(name=Direct), order_i=DocValuesFormat(name=Lucene70), _version_=DocValuesFormat(name=Direct), side_s=DocValuesFormat(name=Lucene70), miles_i=DocValuesFormat(name=Direct)}, maxPointsInLeafNode=721, maxMBSortInHeap=7.4395499445361395, sim=RandomSimilarity(queryNorm=false): {}, locale=el, timezone=Canada/East-Saskatchewan
   [junit4]   2> NOTE: Windows 10 10.0 amd64/Oracle Corporation 1.8.0_144 (64-bit)/cpus=3,threads=85,free=161526280,total=313524224
   [junit4]   2> NOTE: All tests run in this JVM: [MultiplyEvaluatorTest, HttpSolrClientSSLAuthConPoolTest, ShardParamsTest, CosineEvaluatorTest, HttpSolrClientBuilderTest, SolrExampleJettyTest, MergeIndexesEmbeddedTest, JdbcTest, UuidEvaluatorTest, TestPolicy, ConcatOperationTest, GetByIdTest, ReverseEvaluatorTest, StreamingTest, CommonAdminParamsTest, LessThanEvaluatorTest, FacetFieldTest, TestToleratedUpdateError, ExclusiveOrEvaluatorTest, NotEvaluatorTest, TestDelegationTokenRequest, TestCloudSolrClientConnections, RecursiveEvaluatorTest, TestV1toV2ApiMapper, HyperbolicSineEvaluatorTest, TestCollectionStateWatchers, ArcSineEvaluatorTest, LargeVolumeJettyTest, CumulativeProbabilityEvaluatorTest, GraphTest, AppendEvaluatorTest, SolrQueryTest, PowerEvaluatorTest, TestLBHttpSolrClient, TestCollectionAdminRequest, SolrExceptionTest, FieldAnalysisResponseTest, NamedListTest, BasicHttpSolrClientTest, ConcurrentUpdateSolrClientBuilderTest, LBHttpSolrClientBuilderTest, JDBCStreamTest, SelectWithEvaluatorsTest, StreamExpressionTest]
   [junit4]   2> NOTE: reproduce with: ant test  -Dtestcase=StreamExpressionTest -Dtests.seed=2AEA13FFF5648378 -Dtests.slow=true -Dtests.locale=el -Dtests.timezone=Canada/East-Saskatchewan -Dtests.asserts=true -Dtests.file.encoding=ISO-8859-1
   [junit4] ERROR   0.00s J1 | StreamExpressionTest (suite) <<<
   [junit4]    > Throwable #1: java.lang.Exception: Suite timeout exceeded (>= 7200000 msec).
   [junit4]    > at __randomizedtesting.SeedInfo.seed([2AEA13FFF5648378]:0)
   [junit4] Completed [145/145 (1!)] on J1 in 7223.87s, 43 tests, 2 errors <<< FAILURES!

[...truncated 45989 lines...]


---------------------------------------------------------------------
To unsubscribe, e-mail: [hidden email]
For additional commands, e-mail: [hidden email]
Reply | Threaded
Open this post in threaded view
|

[JENKINS] Lucene-Solr-master-Windows (32bit/jdk1.8.0_144) - Build # 6955 - Still Unstable!

Policeman Jenkins Server-2
Build: https://jenkins.thetaphi.de/job/Lucene-Solr-master-Windows/6955/
Java: 32bit/jdk1.8.0_144 -server -XX:+UseParallelGC

1 tests failed.
FAILED:  junit.framework.TestSuite.org.apache.solr.handler.component.InfixSuggestersTest

Error Message:
Could not remove the following files (in the order of attempts):    C:\Users\jenkins\workspace\Lucene-Solr-master-Windows\solr\build\solr-core\test\J0\temp\solr.handler.component.InfixSuggestersTest_478BD8712BA9493F-001\init-core-data-001: java.nio.file.AccessDeniedException: C:\Users\jenkins\workspace\Lucene-Solr-master-Windows\solr\build\solr-core\test\J0\temp\solr.handler.component.InfixSuggestersTest_478BD8712BA9493F-001\init-core-data-001    C:\Users\jenkins\workspace\Lucene-Solr-master-Windows\solr\build\solr-core\test\J0\temp\solr.handler.component.InfixSuggestersTest_478BD8712BA9493F-001: java.nio.file.DirectoryNotEmptyException: C:\Users\jenkins\workspace\Lucene-Solr-master-Windows\solr\build\solr-core\test\J0\temp\solr.handler.component.InfixSuggestersTest_478BD8712BA9493F-001

Stack Trace:
java.io.IOException: Could not remove the following files (in the order of attempts):
   C:\Users\jenkins\workspace\Lucene-Solr-master-Windows\solr\build\solr-core\test\J0\temp\solr.handler.component.InfixSuggestersTest_478BD8712BA9493F-001\init-core-data-001: java.nio.file.AccessDeniedException: C:\Users\jenkins\workspace\Lucene-Solr-master-Windows\solr\build\solr-core\test\J0\temp\solr.handler.component.InfixSuggestersTest_478BD8712BA9493F-001\init-core-data-001
   C:\Users\jenkins\workspace\Lucene-Solr-master-Windows\solr\build\solr-core\test\J0\temp\solr.handler.component.InfixSuggestersTest_478BD8712BA9493F-001: java.nio.file.DirectoryNotEmptyException: C:\Users\jenkins\workspace\Lucene-Solr-master-Windows\solr\build\solr-core\test\J0\temp\solr.handler.component.InfixSuggestersTest_478BD8712BA9493F-001

        at __randomizedtesting.SeedInfo.seed([478BD8712BA9493F]:0)
        at org.apache.lucene.util.IOUtils.rm(IOUtils.java:329)
        at org.apache.lucene.util.TestRuleTemporaryFilesCleanup.afterAlways(TestRuleTemporaryFilesCleanup.java:216)
        at com.carrotsearch.randomizedtesting.rules.TestRuleAdapter$1.afterAlways(TestRuleAdapter.java:31)
        at com.carrotsearch.randomizedtesting.rules.StatementAdapter.evaluate(StatementAdapter.java:43)
        at com.carrotsearch.randomizedtesting.rules.StatementAdapter.evaluate(StatementAdapter.java:36)
        at org.apache.lucene.util.TestRuleAssertionsRequired$1.evaluate(TestRuleAssertionsRequired.java:53)
        at org.apache.lucene.util.TestRuleMarkFailure$1.evaluate(TestRuleMarkFailure.java:47)
        at org.apache.lucene.util.TestRuleIgnoreAfterMaxFailures$1.evaluate(TestRuleIgnoreAfterMaxFailures.java:64)
        at org.apache.lucene.util.TestRuleIgnoreTestSuites$1.evaluate(TestRuleIgnoreTestSuites.java:54)
        at com.carrotsearch.randomizedtesting.rules.StatementAdapter.evaluate(StatementAdapter.java:36)
        at com.carrotsearch.randomizedtesting.ThreadLeakControl$StatementRunner.run(ThreadLeakControl.java:368)
        at java.lang.Thread.run(Thread.java:748)




Build Log:
[...truncated 12318 lines...]
   [junit4] Suite: org.apache.solr.handler.component.InfixSuggestersTest
   [junit4]   2> 1345290 INFO  (SUITE-InfixSuggestersTest-seed#[478BD8712BA9493F]-worker) [    ] o.a.s.SolrTestCaseJ4 SecureRandom sanity checks: test.solr.allowed.securerandom=null & java.security.egd=file:/dev/./urandom
   [junit4]   2> Creating dataDir: C:\Users\jenkins\workspace\Lucene-Solr-master-Windows\solr\build\solr-core\test\J0\temp\solr.handler.component.InfixSuggestersTest_478BD8712BA9493F-001\init-core-data-001
   [junit4]   2> 1345292 WARN  (SUITE-InfixSuggestersTest-seed#[478BD8712BA9493F]-worker) [    ] o.a.s.SolrTestCaseJ4 startTrackingSearchers: numOpens=12 numCloses=12
   [junit4]   2> 1345294 INFO  (SUITE-InfixSuggestersTest-seed#[478BD8712BA9493F]-worker) [    ] o.a.s.SolrTestCaseJ4 Using PointFields (NUMERIC_POINTS_SYSPROP=true) w/NUMERIC_DOCVALUES_SYSPROP=true
   [junit4]   2> 1345299 INFO  (SUITE-InfixSuggestersTest-seed#[478BD8712BA9493F]-worker) [    ] o.a.s.SolrTestCaseJ4 Randomized ssl (false) and clientAuth (true) via: @org.apache.solr.util.RandomizeSSL(reason=, value=NaN, ssl=NaN, clientAuth=NaN)
   [junit4]   2> 1345300 INFO  (SUITE-InfixSuggestersTest-seed#[478BD8712BA9493F]-worker) [    ] o.a.s.SolrTestCaseJ4 ####initCore
   [junit4]   2> 1345300 INFO  (SUITE-InfixSuggestersTest-seed#[478BD8712BA9493F]-worker) [    ] o.a.s.c.SolrResourceLoader [null] Added 2 libs to classloader, from paths: [/C:/Users/jenkins/workspace/Lucene-Solr-master-Windows/solr/core/src/test-files/solr/collection1/lib, /C:/Users/jenkins/workspace/Lucene-Solr-master-Windows/solr/core/src/test-files/solr/collection1/lib/classes]
   [junit4]   2> 1345394 INFO  (SUITE-InfixSuggestersTest-seed#[478BD8712BA9493F]-worker) [    ] o.a.s.c.SolrConfig Using Lucene MatchVersion: 8.0.0
   [junit4]   2> 1345412 INFO  (SUITE-InfixSuggestersTest-seed#[478BD8712BA9493F]-worker) [    ] o.a.s.s.IndexSchema [null] Schema name=test
   [junit4]   2> 1345627 INFO  (SUITE-InfixSuggestersTest-seed#[478BD8712BA9493F]-worker) [    ] o.a.s.s.IndexSchema Loaded schema test/1.0 with uniqueid field id
   [junit4]   2> 1345793 INFO  (SUITE-InfixSuggestersTest-seed#[478BD8712BA9493F]-worker) [    ] o.a.s.m.r.SolrJmxReporter JMX monitoring for 'solr.node' (registry 'solr.node') enabled at server: com.sun.jmx.mbeanserver.JmxMBeanServer@83f82a
   [junit4]   2> 1345800 INFO  (SUITE-InfixSuggestersTest-seed#[478BD8712BA9493F]-worker) [    ] o.a.s.m.r.SolrJmxReporter JMX monitoring for 'solr.jvm' (registry 'solr.jvm') enabled at server: com.sun.jmx.mbeanserver.JmxMBeanServer@83f82a
   [junit4]   2> 1345801 INFO  (SUITE-InfixSuggestersTest-seed#[478BD8712BA9493F]-worker) [    ] o.a.s.m.r.SolrJmxReporter JMX monitoring for 'solr.jetty' (registry 'solr.jetty') enabled at server: com.sun.jmx.mbeanserver.JmxMBeanServer@83f82a
   [junit4]   2> 1345804 INFO  (coreLoadExecutor-3466-thread-1) [    ] o.a.s.c.TransientSolrCoreCacheDefault Allocating transient cache for 2147483647 transient cores
   [junit4]   2> 1345807 INFO  (coreLoadExecutor-3466-thread-1) [    x:collection1] o.a.s.c.SolrResourceLoader [null] Added 2 libs to classloader, from paths: [/C:/Users/jenkins/workspace/Lucene-Solr-master-Windows/solr/core/src/test-files/solr/collection1/lib, /C:/Users/jenkins/workspace/Lucene-Solr-master-Windows/solr/core/src/test-files/solr/collection1/lib/classes]
   [junit4]   2> 1345892 INFO  (coreLoadExecutor-3466-thread-1) [    x:collection1] o.a.s.c.SolrConfig Using Lucene MatchVersion: 8.0.0
   [junit4]   2> 1345898 INFO  (coreLoadExecutor-3466-thread-1) [    x:collection1] o.a.s.s.IndexSchema [collection1] Schema name=test
   [junit4]   2> 1346023 INFO  (coreLoadExecutor-3466-thread-1) [    x:collection1] o.a.s.s.IndexSchema Loaded schema test/1.0 with uniqueid field id
   [junit4]   2> 1346038 INFO  (coreLoadExecutor-3466-thread-1) [    x:collection1] o.a.s.c.CoreContainer Creating SolrCore 'collection1' using configuration from instancedir C:\Users\jenkins\workspace\Lucene-Solr-master-Windows\solr\core\src\test-files\solr\collection1, trusted=true
   [junit4]   2> 1346039 INFO  (coreLoadExecutor-3466-thread-1) [    x:collection1] o.a.s.m.r.SolrJmxReporter JMX monitoring for 'solr.core.collection1' (registry 'solr.core.collection1') enabled at server: com.sun.jmx.mbeanserver.JmxMBeanServer@83f82a
   [junit4]   2> 1346039 INFO  (coreLoadExecutor-3466-thread-1) [    x:collection1] o.a.s.c.SolrCore solr.RecoveryStrategy.Builder
   [junit4]   2> 1346039 INFO  (coreLoadExecutor-3466-thread-1) [    x:collection1] o.a.s.c.SolrCore [[collection1] ] Opening new SolrCore at [C:\Users\jenkins\workspace\Lucene-Solr-master-Windows\solr\core\src\test-files\solr\collection1], dataDir=[C:\Users\jenkins\workspace\Lucene-Solr-master-Windows\solr\build\solr-core\test\J0\temp\solr.handler.component.InfixSuggestersTest_478BD8712BA9493F-001\init-core-data-001\]
   [junit4]   2> 1346055 INFO  (coreLoadExecutor-3466-thread-1) [    x:collection1] o.a.s.u.RandomMergePolicy RandomMergePolicy wrapping class org.apache.lucene.index.AlcoholicMergePolicy: [AlcoholicMergePolicy: minMergeSize=0, mergeFactor=10, maxMergeSize=912814112, maxMergeSizeForForcedMerge=9223372036854775807, calibrateSizeByDeletes=true, maxMergeDocs=2147483647, maxCFSSegmentSizeMB=8.796093022207999E12, noCFSRatio=0.1]
   [junit4]   2> 1346198 INFO  (coreLoadExecutor-3466-thread-1) [    x:collection1] o.a.s.u.CommitTracker Hard AutoCommit: disabled
   [junit4]   2> 1346198 INFO  (coreLoadExecutor-3466-thread-1) [    x:collection1] o.a.s.u.CommitTracker Soft AutoCommit: disabled
   [junit4]   2> 1346198 INFO  (coreLoadExecutor-3466-thread-1) [    x:collection1] o.a.s.u.RandomMergePolicy RandomMergePolicy wrapping class org.apache.lucene.index.TieredMergePolicy: [TieredMergePolicy: maxMergeAtOnce=26, maxMergeAtOnceExplicit=49, maxMergedSegmentMB=21.9560546875, floorSegmentMB=1.4365234375, forceMergeDeletesPctAllowed=7.78444544803062, segmentsPerTier=47.0, maxCFSSegmentSizeMB=8.796093022207999E12, noCFSRatio=1.0
   [junit4]   2> 1346201 INFO  (coreLoadExecutor-3466-thread-1) [    x:collection1] o.a.s.s.SolrIndexSearcher Opening [Searcher@3c0b3f[collection1] main]
   [junit4]   2> 1346201 WARN  (coreLoadExecutor-3466-thread-1) [    x:collection1] o.a.s.r.ManagedResourceStorage Cannot write to config directory C:\Users\jenkins\workspace\Lucene-Solr-master-Windows\solr\core\src\test-files\solr\collection1\conf; switching to use InMemory storage instead.
   [junit4]   2> 1346201 INFO  (coreLoadExecutor-3466-thread-1) [    x:collection1] o.a.s.h.c.SuggestComponent Initializing SuggestComponent
   [junit4]   2> 1346201 INFO  (coreLoadExecutor-3466-thread-1) [    x:collection1] o.a.s.s.s.SolrSuggester init: {name=shortRandomAnalyzingInfixSuggester,lookupImpl=AnalyzingInfixLookupFactory,dictionaryImpl=RandomTestDictionaryFactory,randDictMaxItems=100,indexPath=short_random_analyzing_infix_suggester,suggestAnalyzerFieldType=text,buildOnCommit=false,buildOnStartup=false}
   [junit4]   2> 1346307 INFO  (coreLoadExecutor-3466-thread-1) [    x:collection1] o.a.s.s.s.SolrSuggester Dictionary loaded with params: {name=shortRandomAnalyzingInfixSuggester,lookupImpl=AnalyzingInfixLookupFactory,dictionaryImpl=RandomTestDictionaryFactory,randDictMaxItems=100,indexPath=short_random_analyzing_infix_suggester,suggestAnalyzerFieldType=text,buildOnCommit=false,buildOnStartup=false}
   [junit4]   2> 1346307 INFO  (coreLoadExecutor-3466-thread-1) [    x:collection1] o.a.s.h.c.SuggestComponent Initializing SuggestComponent
   [junit4]   2> 1346307 INFO  (coreLoadExecutor-3466-thread-1) [    x:collection1] o.a.s.s.s.SolrSuggester init: {name=longRandomAnalyzingInfixSuggester,lookupImpl=AnalyzingInfixLookupFactory,dictionaryImpl=RandomTestDictionaryFactory,randDictMaxItems=100000,indexPath=long_random_analyzing_infix_suggester,suggestAnalyzerFieldType=text,buildOnCommit=false,buildOnStartup=false}
   [junit4]   2> 1346310 INFO  (coreLoadExecutor-3466-thread-1) [    x:collection1] o.a.s.s.s.SolrSuggester Dictionary loaded with params: {name=longRandomAnalyzingInfixSuggester,lookupImpl=AnalyzingInfixLookupFactory,dictionaryImpl=RandomTestDictionaryFactory,randDictMaxItems=100000,indexPath=long_random_analyzing_infix_suggester,suggestAnalyzerFieldType=text,buildOnCommit=false,buildOnStartup=false}
   [junit4]   2> 1346310 INFO  (coreLoadExecutor-3466-thread-1) [    x:collection1] o.a.s.h.c.SuggestComponent Initializing SuggestComponent
   [junit4]   2> 1346310 INFO  (coreLoadExecutor-3466-thread-1) [    x:collection1] o.a.s.s.s.SolrSuggester init: {name=shortRandomBlendedInfixSuggester,lookupImpl=BlendedInfixLookupFactory,dictionaryImpl=RandomTestDictionaryFactory,randDictMaxItems=100,blenderType=position_linear,suggestAnalyzerFieldType=text,indexPath=short_random_blended_infix_suggester,highlight=true,buildOnStartup=false,buildOnCommit=false}
   [junit4]   2> 1346312 INFO  (coreLoadExecutor-3466-thread-1) [    x:collection1] o.a.s.s.s.SolrSuggester Dictionary loaded with params: {name=shortRandomBlendedInfixSuggester,lookupImpl=BlendedInfixLookupFactory,dictionaryImpl=RandomTestDictionaryFactory,randDictMaxItems=100,blenderType=position_linear,suggestAnalyzerFieldType=text,indexPath=short_random_blended_infix_suggester,highlight=true,buildOnStartup=false,buildOnCommit=false}
   [junit4]   2> 1346312 INFO  (coreLoadExecutor-3466-thread-1) [    x:collection1] o.a.s.h.ReplicationHandler Commits will be reserved for 10000ms.
   [junit4]   2> 1346313 INFO  (searcherExecutor-3467-thread-1-processing-x:collection1) [    x:collection1] o.a.s.c.SolrCore [collection1] Registered new searcher Searcher@3c0b3f[collection1] main{ExitableDirectoryReader(UninvertingDirectoryReader())}
   [junit4]   2> 1346319 INFO  (SUITE-InfixSuggestersTest-seed#[478BD8712BA9493F]-worker) [    ] o.a.s.SolrTestCaseJ4 ####initCore end
   [junit4]   2> 1346329 INFO  (TEST-InfixSuggestersTest.testBuildThen2xReload-seed#[478BD8712BA9493F]) [    ] o.a.s.SolrTestCaseJ4 ###Starting testBuildThen2xReload
   [junit4]   2> 1346330 INFO  (TEST-InfixSuggestersTest.testBuildThen2xReload-seed#[478BD8712BA9493F]) [    ] o.a.s.h.c.SuggestComponent SuggestComponent prepare with : qt=/suggest_analyzing_infix_short_dictionary&suggest=true&suggest.buildAll=true&wt=xml&indent=off
   [junit4]   2> 1346330 INFO  (TEST-InfixSuggestersTest.testBuildThen2xReload-seed#[478BD8712BA9493F]) [    ] o.a.s.s.s.SolrSuggester SolrSuggester.build(shortRandomAnalyzingInfixSuggester)
   [junit4]   2> 1346368 INFO  (TEST-InfixSuggestersTest.testBuildThen2xReload-seed#[478BD8712BA9493F]) [    ] o.a.s.s.s.RandomTestDictionaryFactory org.apache.solr.spelling.suggest.RandomTestDictionaryFactory$RandomTestDictionary.enabled.shortRandomAnalyzingInfixSuggester disabled after emitting 100 items.
   [junit4]   2> 1346513 INFO  (TEST-InfixSuggestersTest.testBuildThen2xReload-seed#[478BD8712BA9493F]) [    ] o.a.s.h.c.SuggestComponent SuggestComponent process with : qt=/suggest_analyzing_infix_short_dictionary&suggest=true&suggest.buildAll=true&wt=xml&indent=off
   [junit4]   2> 1346513 INFO  (TEST-InfixSuggestersTest.testBuildThen2xReload-seed#[478BD8712BA9493F]) [    ] o.a.s.c.S.Request [collection1]  webapp=null path=null params={qt=/suggest_analyzing_infix_short_dictionary&suggest.buildAll=true&wt=xml} status=0 QTime=183
   [junit4]   2> 1346522 ERROR (TEST-InfixSuggestersTest.testBuildThen2xReload-seed#[478BD8712BA9493F]) [    ] o.a.s.c.CorePropertiesLocator Couldn't load core descriptor from C:\Users\jenkins\workspace\Lucene-Solr-master-Windows\solr\core\src\test-files\solr\collection1\core.properties:java.nio.file.NoSuchFileException: C:\Users\jenkins\workspace\Lucene-Solr-master-Windows\solr\core\src\test-files\solr\collection1\core.properties
   [junit4]   2> 1346525 INFO  (TEST-InfixSuggestersTest.testBuildThen2xReload-seed#[478BD8712BA9493F]) [    ] o.a.s.c.SolrResourceLoader [null] Added 2 libs to classloader, from paths: [/C:/Users/jenkins/workspace/Lucene-Solr-master-Windows/solr/core/src/test-files/solr/collection1/lib, /C:/Users/jenkins/workspace/Lucene-Solr-master-Windows/solr/core/src/test-files/solr/collection1/lib/classes]
   [junit4]   2> 1346636 INFO  (TEST-InfixSuggestersTest.testBuildThen2xReload-seed#[478BD8712BA9493F]) [    ] o.a.s.c.SolrConfig Using Lucene MatchVersion: 8.0.0
   [junit4]   2> 1346669 INFO  (TEST-InfixSuggestersTest.testBuildThen2xReload-seed#[478BD8712BA9493F]) [    ] o.a.s.s.IndexSchema [collection1] Schema name=test
   [junit4]   2> 1346819 INFO  (TEST-InfixSuggestersTest.testBuildThen2xReload-seed#[478BD8712BA9493F]) [    ] o.a.s.s.IndexSchema Loaded schema test/1.0 with uniqueid field id
   [junit4]   2> 1346833 INFO  (TEST-InfixSuggestersTest.testBuildThen2xReload-seed#[478BD8712BA9493F]) [    ] o.a.s.c.CoreContainer Reloading SolrCore 'collection1' using configuration from instancedir C:\Users\jenkins\workspace\Lucene-Solr-master-Windows\solr\core\src\test-files\solr\collection1
   [junit4]   2> 1346875 INFO  (TEST-InfixSuggestersTest.testBuildThen2xReload-seed#[478BD8712BA9493F]) [    x:collection1] o.a.s.m.r.SolrJmxReporter JMX monitoring for 'solr.core.collection1' (registry 'solr.core.collection1') enabled at server: com.sun.jmx.mbeanserver.JmxMBeanServer@83f82a
   [junit4]   2> 1346876 INFO  (TEST-InfixSuggestersTest.testBuildThen2xReload-seed#[478BD8712BA9493F]) [    x:collection1] o.a.s.c.SolrCore [[collection1] ] Opening new SolrCore at [C:\Users\jenkins\workspace\Lucene-Solr-master-Windows\solr\core\src\test-files\solr\collection1], dataDir=[C:\Users\jenkins\workspace\Lucene-Solr-master-Windows\solr\build\solr-core\test\J0\temp\solr.handler.component.InfixSuggestersTest_478BD8712BA9493F-001\init-core-data-001\]
   [junit4]   2> 1347057 INFO  (TEST-InfixSuggestersTest.testBuildThen2xReload-seed#[478BD8712BA9493F]) [    x:collection1] o.a.s.u.CommitTracker Hard AutoCommit: disabled
   [junit4]   2> 1347057 INFO  (TEST-InfixSuggestersTest.testBuildThen2xReload-seed#[478BD8712BA9493F]) [    x:collection1] o.a.s.u.CommitTracker Soft AutoCommit: disabled
   [junit4]   2> 1347067 INFO  (TEST-InfixSuggestersTest.testBuildThen2xReload-seed#[478BD8712BA9493F]) [    x:collection1] o.a.s.s.SolrIndexSearcher Opening [Searcher@15c3fb8[collection1] main]
   [junit4]   2> 1347067 WARN  (TEST-InfixSuggestersTest.testBuildThen2xReload-seed#[478BD8712BA9493F]) [    x:collection1] o.a.s.r.ManagedResourceStorage Cannot write to config directory C:\Users\jenkins\workspace\Lucene-Solr-master-Windows\solr\core\src\test-files\solr\collection1\conf; switching to use InMemory storage instead.
   [junit4]   2> 1347067 INFO  (TEST-InfixSuggestersTest.testBuildThen2xReload-seed#[478BD8712BA9493F]) [    x:collection1] o.a.s.h.c.SuggestComponent Initializing SuggestComponent
   [junit4]   2> 1347067 INFO  (TEST-InfixSuggestersTest.testBuildThen2xReload-seed#[478BD8712BA9493F]) [    x:collection1] o.a.s.s.s.SolrSuggester init: {name=shortRandomAnalyzingInfixSuggester,lookupImpl=AnalyzingInfixLookupFactory,dictionaryImpl=RandomTestDictionaryFactory,randDictMaxItems=100,indexPath=short_random_analyzing_infix_suggester,suggestAnalyzerFieldType=text,buildOnCommit=false,buildOnStartup=false}
   [junit4]   2> 1347067 INFO  (TEST-InfixSuggestersTest.testBuildThen2xReload-seed#[478BD8712BA9493F]) [    x:collection1] o.a.s.s.s.SolrSuggester Dictionary loaded with params: {name=shortRandomAnalyzingInfixSuggester,lookupImpl=AnalyzingInfixLookupFactory,dictionaryImpl=RandomTestDictionaryFactory,randDictMaxItems=100,indexPath=short_random_analyzing_infix_suggester,suggestAnalyzerFieldType=text,buildOnCommit=false,buildOnStartup=false}
   [junit4]   2> 1347067 INFO  (TEST-InfixSuggestersTest.testBuildThen2xReload-seed#[478BD8712BA9493F]) [    x:collection1] o.a.s.h.c.SuggestComponent Initializing SuggestComponent
   [junit4]   2> 1347067 INFO  (TEST-InfixSuggestersTest.testBuildThen2xReload-seed#[478BD8712BA9493F]) [    x:collection1] o.a.s.s.s.SolrSuggester init: {name=longRandomAnalyzingInfixSuggester,lookupImpl=AnalyzingInfixLookupFactory,dictionaryImpl=RandomTestDictionaryFactory,randDictMaxItems=100000,indexPath=long_random_analyzing_infix_suggester,suggestAnalyzerFieldType=text,buildOnCommit=false,buildOnStartup=false}
   [junit4]   2> 1347080 INFO  (TEST-InfixSuggestersTest.testBuildThen2xReload-seed#[478BD8712BA9493F]) [    x:collection1] o.a.s.s.s.SolrSuggester Dictionary loaded with params: {name=longRandomAnalyzingInfixSuggester,lookupImpl=AnalyzingInfixLookupFactory,dictionaryImpl=RandomTestDictionaryFactory,randDictMaxItems=100000,indexPath=long_random_analyzing_infix_suggester,suggestAnalyzerFieldType=text,buildOnCommit=false,buildOnStartup=false}
   [junit4]   2> 1347080 INFO  (TEST-InfixSuggestersTest.testBuildThen2xReload-seed#[478BD8712BA9493F]) [    x:collection1] o.a.s.h.c.SuggestComponent Initializing SuggestComponent
   [junit4]   2> 1347080 INFO  (TEST-InfixSuggestersTest.testBuildThen2xReload-seed#[478BD8712BA9493F]) [    x:collection1] o.a.s.s.s.SolrSuggester init: {name=shortRandomBlendedInfixSuggester,lookupImpl=BlendedInfixLookupFactory,dictionaryImpl=RandomTestDictionaryFactory,randDictMaxItems=100,blenderType=position_linear,suggestAnalyzerFieldType=text,indexPath=short_random_blended_infix_suggester,highlight=true,buildOnStartup=false,buildOnCommit=false}
   [junit4]   2> 1347082 INFO  (TEST-InfixSuggestersTest.testBuildThen2xReload-seed#[478BD8712BA9493F]) [    x:collection1] o.a.s.s.s.SolrSuggester Dictionary loaded with params: {name=shortRandomBlendedInfixSuggester,lookupImpl=BlendedInfixLookupFactory,dictionaryImpl=RandomTestDictionaryFactory,randDictMaxItems=100,blenderType=position_linear,suggestAnalyzerFieldType=text,indexPath=short_random_blended_infix_suggester,highlight=true,buildOnStartup=false,buildOnCommit=false}
   [junit4]   2> 1347082 INFO  (TEST-InfixSuggestersTest.testBuildThen2xReload-seed#[478BD8712BA9493F]) [    x:collection1] o.a.s.h.ReplicationHandler Commits will be reserved for 10000ms.
   [junit4]   2> 1347083 INFO  (TEST-InfixSuggestersTest.testBuildThen2xReload-seed#[478BD8712BA9493F]) [    x:collection1] o.a.s.u.RandomMergePolicy RandomMergePolicy wrapping class org.apache.lucene.index.LogByteSizeMergePolicy: [LogByteSizeMergePolicy: minMergeSize=1677721, mergeFactor=43, maxMergeSize=2147483648, maxMergeSizeForForcedMerge=9223372036854775807, calibrateSizeByDeletes=false, maxMergeDocs=2147483647, maxCFSSegmentSizeMB=8.796093022207999E12, noCFSRatio=0.0]
   [junit4]   2> 1347086 INFO  (TEST-InfixSuggestersTest.testBuildThen2xReload-seed#[478BD8712BA9493F]) [    x:collection1] o.a.s.u.DefaultSolrCoreState New IndexWriter is ready to be used.
   [junit4]   2> 1347088 INFO  (searcherExecutor-3471-thread-1-processing-x:collection1) [    x:collection1] o.a.s.c.SolrCore [collection1] Registered new searcher Searcher@15c3fb8[collection1] main{ExitableDirectoryReader(UninvertingDirectoryReader())}
   [junit4]   2> 1347088 INFO  (TEST-InfixSuggestersTest.testBuildThen2xReload-seed#[478BD8712BA9493F]) [    x:collection1] o.a.s.s.SolrIndexSearcher Opening [Searcher@1676cb6[collection1] main]
   [junit4]   2> 1347088 INFO  (TEST-InfixSuggestersTest.testBuildThen2xReload-seed#[478BD8712BA9493F]) [    x:collection1] o.a.s.c.SolrCore [collection1]  CLOSING SolrCore org.apache.solr.core.SolrCore@1eae876
   [junit4]   2> 1347088 INFO  (TEST-InfixSuggestersTest.testBuildThen2xReload-seed#[478BD8712BA9493F]) [    x:collection1] o.a.s.m.SolrMetricManager Closing metric reporters for registry=solr.core.collection1, tag=32172150
   [junit4]   2> 1347089 INFO  (TEST-InfixSuggestersTest.testBuildThen2xReload-seed#[478BD8712BA9493F]) [    x:collection1] o.a.s.m.r.SolrJmxReporter Closing reporter [org.apache.solr.metrics.reporters.SolrJmxReporter@1c0882e: rootName = null, domain = solr.core.collection1, service url = null, agent id = null] for registry solr.core.collection1 / com.codahale.metrics.MetricRegistry@16d78cc
   [junit4]   2> 1347089 INFO  (searcherExecutor-3471-thread-1-processing-x:collection1) [    x:collection1] o.a.s.c.SolrCore [collection1] Registered new searcher Searcher@1676cb6[collection1] main{ExitableDirectoryReader(UninvertingDirectoryReader())}
   [junit4]   2> 1347099 ERROR (TEST-InfixSuggestersTest.testBuildThen2xReload-seed#[478BD8712BA9493F]) [    x:collection1] o.a.s.c.CorePropertiesLocator Couldn't load core descriptor from C:\Users\jenkins\workspace\Lucene-Solr-master-Windows\solr\core\src\test-files\solr\collection1\core.properties:java.nio.file.NoSuchFileException: C:\Users\jenkins\workspace\Lucene-Solr-master-Windows\solr\core\src\test-files\solr\collection1\core.properties
   [junit4]   2> 1347100 INFO  (TEST-InfixSuggestersTest.testBuildThen2xReload-seed#[478BD8712BA9493F]) [    x:collection1] o.a.s.c.SolrResourceLoader [null] Added 2 libs to classloader, from paths: [/C:/Users/jenkins/workspace/Lucene-Solr-master-Windows/solr/core/src/test-files/solr/collection1/lib, /C:/Users/jenkins/workspace/Lucene-Solr-master-Windows/solr/core/src/test-files/solr/collection1/lib/classes]
   [junit4]   2> 1347220 INFO  (TEST-InfixSuggestersTest.testBuildThen2xReload-seed#[478BD8712BA9493F]) [    x:collection1] o.a.s.c.SolrConfig Using Lucene MatchVersion: 8.0.0
   [junit4]   2> 1347236 INFO  (TEST-InfixSuggestersTest.testBuildThen2xReload-seed#[478BD8712BA9493F]) [    x:collection1] o.a.s.s.IndexSchema [collection1] Schema name=test
   [junit4]   2> 1347349 INFO  (TEST-InfixSuggestersTest.testBuildThen2xReload-seed#[478BD8712BA9493F]) [    x:collection1] o.a.s.s.IndexSchema Loaded schema test/1.0 with uniqueid field id
   [junit4]   2> 1347363 INFO  (TEST-InfixSuggestersTest.testBuildThen2xReload-seed#[478BD8712BA9493F]) [    x:collection1] o.a.s.c.CoreContainer Reloading SolrCore 'collection1' using configuration from instancedir C:\Users\jenkins\workspace\Lucene-Solr-master-Windows\solr\core\src\test-files\solr\collection1
   [junit4]   2> 1347393 INFO  (TEST-InfixSuggestersTest.testBuildThen2xReload-seed#[478BD8712BA9493F]) [    x:collection1] o.a.s.m.r.SolrJmxReporter JMX monitoring for 'solr.core.collection1' (registry 'solr.core.collection1') enabled at server: com.sun.jmx.mbeanserver.JmxMBeanServer@83f82a
   [junit4]   2> 1347393 INFO  (TEST-InfixSuggestersTest.testBuildThen2xReload-seed#[478BD8712BA9493F]) [    x:collection1] o.a.s.c.SolrCore [[collection1] ] Opening new SolrCore at [C:\Users\jenkins\workspace\Lucene-Solr-master-Windows\solr\core\src\test-files\solr\collection1], dataDir=[C:\Users\jenkins\workspace\Lucene-Solr-master-Windows\solr\build\solr-core\test\J0\temp\solr.handler.component.InfixSuggestersTest_478BD8712BA9493F-001\init-core-data-001\]
   [junit4]   2> 1347523 INFO  (TEST-InfixSuggestersTest.testBuildThen2xReload-seed#[478BD8712BA9493F]) [    x:collection1] o.a.s.u.CommitTracker Hard AutoCommit: disabled
   [junit4]   2> 1347523 INFO  (TEST-InfixSuggestersTest.testBuildThen2xReload-seed#[478BD8712BA9493F]) [    x:collection1] o.a.s.u.CommitTracker Soft AutoCommit: disabled
   [junit4]   2> 1347525 INFO  (TEST-InfixSuggestersTest.testBuildThen2xReload-seed#[478BD8712BA9493F]) [    x:collection1] o.a.s.s.SolrIndexSearcher Opening [Searcher@d8c7c7[collection1] main]
   [junit4]   2> 1347525 WARN  (TEST-InfixSuggestersTest.testBuildThen2xReload-seed#[478BD8712BA9493F]) [    x:collection1] o.a.s.r.ManagedResourceStorage Cannot write to config directory C:\Users\jenkins\workspace\Lucene-Solr-master-Windows\solr\core\src\test-files\solr\collection1\conf; switching to use InMemory storage instead.
   [junit4]   2> 1347527 INFO  (TEST-InfixSuggestersTest.testBuildThen2xReload-seed#[478BD8712BA9493F]) [    x:collection1] o.a.s.h.c.SuggestComponent Initializing SuggestComponent
   [junit4]   2> 1347527 INFO  (TEST-InfixSuggestersTest.testBuildThen2xReload-seed#[478BD8712BA9493F]) [    x:collection1] o.a.s.s.s.SolrSuggester init: {name=shortRandomAnalyzingInfixSuggester,lookupImpl=AnalyzingInfixLookupFactory,dictionaryImpl=RandomTestDictionaryFactory,randDictMaxItems=100,indexPath=short_random_analyzing_infix_suggester,suggestAnalyzerFieldType=text,buildOnCommit=false,buildOnStartup=false}
   [junit4]   2> 1347529 INFO  (TEST-InfixSuggestersTest.testBuildThen2xReload-seed#[478BD8712BA9493F]) [    x:collection1] o.a.s.s.s.SolrSuggester Dictionary loaded with params: {name=shortRandomAnalyzingInfixSuggester,lookupImpl=AnalyzingInfixLookupFactory,dictionaryImpl=RandomTestDictionaryFactory,randDictMaxItems=100,indexPath=short_random_analyzing_infix_suggester,suggestAnalyzerFieldType=text,buildOnCommit=false,buildOnStartup=false}
   [junit4]   2> 1347529 INFO  (TEST-InfixSuggestersTest.testBuildThen2xReload-seed#[478BD8712BA9493F]) [    x:collection1] o.a.s.h.c.SuggestComponent Initializing SuggestComponent
   [junit4]   2> 1347529 INFO  (TEST-InfixSuggestersTest.testBuildThen2xReload-seed#[478BD8712BA9493F]) [    x:collection1] o.a.s.s.s.SolrSuggester init: {name=longRandomAnalyzingInfixSuggester,lookupImpl=AnalyzingInfixLookupFactory,dictionaryImpl=RandomTestDictionaryFactory,randDictMaxItems=100000,indexPath=long_random_analyzing_infix_suggester,suggestAnalyzerFieldType=text,buildOnCommit=false,buildOnStartup=false}
   [junit4]   2> 1347530 INFO  (TEST-InfixSuggestersTest.testBuildThen2xReload-seed#[478BD8712BA9493F]) [    x:collection1] o.a.s.s.s.SolrSuggester Dictionary loaded with params: {name=longRandomAnalyzingInfixSuggester,lookupImpl=AnalyzingInfixLookupFactory,dictionaryImpl=RandomTestDictionaryFactory,randDictMaxItems=100000,indexPath=long_random_analyzing_infix_suggester,suggestAnalyzerFieldType=text,buildOnCommit=false,buildOnStartup=false}
   [junit4]   2> 1347530 INFO  (TEST-InfixSuggestersTest.testBuildThen2xReload-seed#[478BD8712BA9493F]) [    x:collection1] o.a.s.h.c.SuggestComponent Initializing SuggestComponent
   [junit4]   2> 1347530 INFO  (TEST-InfixSuggestersTest.testBuildThen2xReload-seed#[478BD8712BA9493F]) [    x:collection1] o.a.s.s.s.SolrSuggester init: {name=shortRandomBlendedInfixSuggester,lookupImpl=BlendedInfixLookupFactory,dictionaryImpl=RandomTestDictionaryFactory,randDictMaxItems=100,blenderType=position_linear,suggestAnalyzerFieldType=text,indexPath=short_random_blended_infix_suggester,highlight=true,buildOnStartup=false,buildOnCommit=false}
   [junit4]   2> 1347530 INFO  (TEST-InfixSuggestersTest.testBuildThen2xReload-seed#[478BD8712BA9493F]) [    x:collection1] o.a.s.s.s.SolrSuggester Dictionary loaded with params: {name=shortRandomBlendedInfixSuggester,lookupImpl=BlendedInfixLookupFactory,dictionaryImpl=RandomTestDictionaryFactory,randDictMaxItems=100,blenderType=position_linear,suggestAnalyzerFieldType=text,indexPath=short_random_blended_infix_suggester,highlight=true,buildOnStartup=false,buildOnCommit=false}
   [junit4]   2> 1347531 INFO  (TEST-InfixSuggestersTest.testBuildThen2xReload-seed#[478BD8712BA9493F]) [    x:collection1] o.a.s.h.ReplicationHandler Commits will be reserved for 10000ms.
   [junit4]   2> 1347533 INFO  (TEST-InfixSuggestersTest.testBuildThen2xReload-seed#[478BD8712BA9493F]) [    x:collection1] o.a.s.u.RandomMergePolicy RandomMergePolicy wrapping class org.apache.lucene.index.TieredMergePolicy: [TieredMergePolicy: maxMergeAtOnce=39, maxMergeAtOnceExplicit=28, maxMergedSegmentMB=9.56640625, floorSegmentMB=1.21875, forceMergeDeletesPctAllowed=26.09576190264534, segmentsPerTier=50.0, maxCFSSegmentSizeMB=8.796093022207999E12, noCFSRatio=0.8409073836807125
   [junit4]   2> 1347533 INFO  (TEST-InfixSuggestersTest.testBuildThen2xReload-seed#[478BD8712BA9493F]) [    x:collection1] o.a.s.u.DefaultSolrCoreState New IndexWriter is ready to be used.
   [junit4]   2> 1347536 INFO  (searcherExecutor-3475-thread-1-processing-x:collection1) [    x:collection1] o.a.s.c.SolrCore [collection1] Registered new searcher Searcher@d8c7c7[collection1] main{ExitableDirectoryReader(UninvertingDirectoryReader())}
   [junit4]   2> 1347536 INFO  (TEST-InfixSuggestersTest.testBuildThen2xReload-seed#[478BD8712BA9493F]) [    x:collection1] o.a.s.s.SolrIndexSearcher Opening [Searcher@527ceb[collection1] main]
   [junit4]   2> 1347537 INFO  (TEST-InfixSuggestersTest.testBuildThen2xReload-seed#[478BD8712BA9493F]) [    x:collection1] o.a.s.c.SolrCore [collection1]  CLOSING SolrCore org.apache.solr.core.SolrCore@198795d
   [junit4]   2> 1347537 INFO  (TEST-InfixSuggestersTest.testBuildThen2xReload-seed#[478BD8712BA9493F]) [    x:collection1] o.a.s.m.SolrMetricManager Closing metric reporters for registry=solr.core.collection1, tag=26769757
   [junit4]   2> 1347537 INFO  (TEST-InfixSuggestersTest.testBuildThen2xReload-seed#[478BD8712BA9493F]) [    x:collection1] o.a.s.m.r.SolrJmxReporter Closing reporter [org.apache.solr.metrics.reporters.SolrJmxReporter@1b84cbb: rootName = null, domain = solr.core.collection1, service url = null, agent id = null] for registry solr.core.collection1 / com.codahale.metrics.MetricRegistry@16d78cc
   [junit4]   2> 1347539 INFO  (searcherExecutor-3475-thread-1-processing-x:collection1) [    x:collection1] o.a.s.c.SolrCore [collection1] Registered new searcher Searcher@527ceb[collection1] main{ExitableDirectoryReader(UninvertingDirectoryReader())}
   [junit4]   2> 1347549 INFO  (TEST-InfixSuggestersTest.testBuildThen2xReload-seed#[478BD8712BA9493F]) [    x:collection1] o.a.s.SolrTestCaseJ4 ###Ending testBuildThen2xReload
   [junit4]   2> 1347563 INFO  (TEST-InfixSuggestersTest.testReloadDuringBuild-seed#[478BD8712BA9493F]) [    x:collection1] o.a.s.SolrTestCaseJ4 ###Starting testReloadDuringBuild
   [junit4]   2> 1347565 ERROR (TEST-InfixSuggestersTest.testReloadDuringBuild-seed#[478BD8712BA9493F]) [    x:collection1] o.a.s.c.CorePropertiesLocator Couldn't load core descriptor from C:\Users\jenkins\workspace\Lucene-Solr-master-Windows\solr\core\src\test-files\solr\collection1\core.properties:java.nio.file.NoSuchFileException: C:\Users\jenkins\workspace\Lucene-Solr-master-Windows\solr\core\src\test-files\solr\collection1\core.properties
   [junit4]   2> 1347566 INFO  (TEST-InfixSuggestersTest.testReloadDuringBuild-seed#[478BD8712BA9493F]) [    x:collection1] o.a.s.c.SolrResourceLoader [null] Added 2 libs to classloader, from paths: [/C:/Users/jenkins/workspace/Lucene-Solr-master-Windows/solr/core/src/test-files/solr/collection1/lib, /C:/Users/jenkins/workspace/Lucene-Solr-master-Windows/solr/core/src/test-files/solr/collection1/lib/classes]
   [junit4]   2> 1347575 INFO  (AnalyzingInfixSuggesterTest-1440-thread-1-processing-x:collection1) [    x:collection1] o.a.s.h.c.SuggestComponent SuggestComponent prepare with : qt=/suggest_analyzing_infix_long_dictionary&suggest=true&suggest.buildAll=true&wt=xml&indent=off
   [junit4]   2> 1347575 INFO  (AnalyzingInfixSuggesterTest-1440-thread-1-processing-x:collection1) [    x:collection1] o.a.s.s.s.SolrSuggester SolrSuggester.build(longRandomAnalyzingInfixSuggester)
   [junit4]   2> 1347749 INFO  (AnalyzingInfixSuggesterTest-1440-thread-1-processing-x:collection1) [    x:collection1] o.a.s.s.s.RandomTestDictionaryFactory org.apache.solr.spelling.suggest.RandomTestDictionaryFactory$RandomTestDictionary.enabled.longRandomAnalyzingInfixSuggester emitted 1000 items.
   [junit4]   2> 1347762 INFO  (TEST-InfixSuggestersTest.testReloadDuringBuild-seed#[478BD8712BA9493F]) [    x:collection1] o.a.s.c.SolrConfig Using Lucene MatchVersion: 8.0.0
   [junit4]   2> 1347772 INFO  (TEST-InfixSuggestersTest.testReloadDuringBuild-seed#[478BD8712BA9493F]) [    x:collection1] o.a.s.s.IndexSchema [collection1] Schema name=test
   [junit4]   2> 1347831 INFO  (AnalyzingInfixSuggesterTest-1440-thread-1-processing-x:collection1) [    x:collection1] o.a.s.s.s.RandomTestDictionaryFactory org.apache.solr.spelling.suggest.RandomTestDictionaryFactory$RandomTestDictionary.enabled.longRandomAnalyzingInfixSuggester emitted 2000 items.
   [junit4]   2> 1347892 INFO  (TEST-InfixSuggestersTest.testReloadDuringBuild-seed#[478BD8712BA9493F]) [    x:collection1] o.a.s.s.IndexSchema Loaded schema test/1.0 with uniqueid field id
   [junit4]   2> 1347906 INFO  (TEST-InfixSuggestersTest.testReloadDuringBuild-seed#[478BD8712BA9493F]) [    x:collection1] o.a.s.c.CoreContainer Reloading SolrCore 'collection1' using configuration from instancedir C:\Users\jenkins\workspace\Lucene-Solr-master-Windows\solr\core\src\test-files\solr\collection1
   [junit4]   2> 1347919 INFO  (AnalyzingInfixSuggesterTest-1440-thread-1-processing-x:collection1) [    x:collection1] o.a.s.s.s.RandomTestDictionaryFactory org.apache.solr.spelling.suggest.RandomTestDictionaryFactory$RandomTestDictionary.enabled.longRandomAnalyzingInfixSuggester emitted 3000 items.
   [junit4]   2> 1347942 INFO  (TEST-InfixSuggestersTest.testReloadDuringBuild-seed#[478BD8712BA9493F]) [    x:collection1] o.a.s.m.r.SolrJmxReporter JMX monitoring for 'solr.core.collection1' (registry 'solr.core.collection1') enabled at server: com.sun.jmx.mbeanserver.JmxMBeanServer@83f82a
   [junit4]   2> 1347942 INFO  (TEST-InfixSuggestersTest.testReloadDuringBuild-seed#[478BD8712BA9493F]) [    x:collection1] o.a.s.c.SolrCore [[collection1] ] Opening new SolrCore at [C:\Users\jenkins\workspace\Lucene-Solr-master-Windows\solr\core\src\test-files\solr\collection1], dataDir=[C:\Users\jenkins\workspace\Lucene-Solr-master-Windows\solr\build\solr-core\test\J0\temp\solr.handler.component.InfixSuggestersTest_478BD8712BA9493F-001\init-core-data-001\]
   [junit4]   2> 1348010 INFO  (AnalyzingInfixSuggesterTest-1440-thread-1-processing-x:collection1) [    x:collection1] o.a.s.s.s.RandomTestDictionaryFactory org.apache.solr.spelling.suggest.RandomTestDictionaryFactory$RandomTestDictionary.enabled.longRandomAnalyzingInfixSuggester emitted 4000 items.
   [junit4]   2> 1348071 INFO  (AnalyzingInfixSuggesterTest-1440-thread-1-processing-x:collection1) [    x:collection1] o.a.s.s.s.RandomTestDictionaryFactory org.apache.solr.spelling.suggest.RandomTestDictionaryFactory$RandomTestDictionary.enabled.longRandomAnalyzingInfixSuggester emitted 5000 items.
   [junit4]   2> 1348134 INFO  (AnalyzingInfixSuggesterTest-1440-thread-1-processing-x:collection1) [    x:collection1] o.a.s.s.s.RandomTestDictionaryFactory org.apache.solr.spelling.suggest.RandomTestDictionaryFactory$RandomTestDictionary.enabled.longRandomAnalyzingInfixSuggester emitted 6000 items.
   [junit4]   2> 1348157 INFO  (TEST-InfixSuggestersTest.testReloadDuringBuild-seed#[478BD8712BA9493F]) [    x:collection1] o.a.s.u.CommitTracker Hard AutoCommit: disabled
   [junit4]   2> 1348157 INFO  (TEST-InfixSuggestersTest.testReloadDuringBuild-seed#[478BD8712BA9493F]) [    x:collection1] o.a.s.u.CommitTracker Soft AutoCommit: disabled
   [junit4]   2> 1348157 INFO  (TEST-InfixSuggestersTest.testReloadDuringBuild-seed#[478BD8712BA9493F]) [    x:collection1] o.a.s.s.SolrIndexSearcher Opening [Searcher@a47c91[collection1] main]
   [junit4]   2> 1348163 WARN  (TEST-InfixSuggestersTest.testReloadDuringBuild-seed#[478BD8712BA9493F]) [    x:collection1] o.a.s.r.ManagedResourceStorage Cannot write to config directory C:\Users\jenkins\workspace\Lucene-Solr-master-Windows\solr\core\src\test-files\solr\collection1\conf; switching to use InMemory storage instead.
   [junit4]   2> 1348163 INFO  (TEST-InfixSuggestersTest.testReloadDuringBuild-seed#[478BD8712BA9493F]) [    x:collection1] o.a.s.h.c.SuggestComponent Initializing SuggestComponent
   [junit4]   2> 1348163 INFO  (TEST-InfixSuggestersTest.testReloadDuringBuild-seed#[478BD8712BA9493F]) [    x:collection1] o.a.s.s.s.SolrSuggester init: {name=shortRandomAnalyzingInfixSuggester,lookupImpl=AnalyzingInfixLookupFactory,dictionaryImpl=RandomTestDictionaryFactory,randDictMaxItems=100,indexPath=short_random_analyzing_infix_suggester,suggestAnalyzerFieldType=text,buildOnCommit=false,buildOnStartup=false}
   [junit4]   2> 1348165 INFO  (TEST-InfixSuggestersTest.testReloadDuringBuild-seed#[478BD8712BA9493F]) [    x:collection1] o.a.s.s.s.SolrSuggester Dictionary loaded with params: {name=shortRandomAnalyzingInfixSuggester,lookupImpl=AnalyzingInfixLookupFactory,dictionaryImpl=RandomTestDictionaryFactory,randDictMaxItems=100,indexPath=short_random_analyzing_infix_suggester,suggestAnalyzerFieldType=text,buildOnCommit=false,buildOnStartup=false}
   [junit4]   2> 1348165 INFO  (TEST-InfixSuggestersTest.testReloadDuringBuild-seed#[478BD8712BA9493F]) [    x:collection1] o.a.s.h.c.SuggestComponent Initializing SuggestComponent
   [junit4]   2> 1348165 INFO  (TEST-InfixSuggestersTest.testReloadDuringBuild-seed#[478BD8712BA9493F]) [    x:collection1] o.a.s.s.s.SolrSuggester init: {name=longRandomAnalyzingInfixSuggester,lookupImpl=AnalyzingInfixLookupFactory,dictionaryImpl=RandomTestDictionaryFactory,randDictMaxItems=100000,indexPath=long_random_analyzing_infix_suggester,suggestAnalyzerFieldType=text,buildOnCommit=false,buildOnStartup=false}
   [junit4]   2> 1348166 INFO  (TEST-InfixSuggestersTest.testReloadDuringBuild-seed#[478BD8712BA9493F]) [    x:collection1] o.a.s.s.s.SolrSuggester Dictionary loaded with params: {name=longRandomAnalyzingInfixSuggester,lookupImpl=AnalyzingInfixLookupFactory,dictionaryImpl=RandomTestDictionaryFactory,randDictMaxItems=100000,indexPath=long_random_analyzing_infix_suggester,suggestAnalyzerFieldType=text,buildOnCommit=false,buildOnStartup=false}
   [junit4]   2> 1348166 INFO  (TEST-InfixSuggestersTest.testReloadDuringBuild-seed#[478BD8712BA9493F]) [    x:collection1] o.a.s.h.c.SuggestComponent Initializing SuggestComponent
   [junit4]   2> 1348166 INFO  (TEST-InfixSuggestersTest.testReloadDuringBuild-seed#[478BD8712BA9493F]) [    x:collection1] o.a.s.s.s.SolrSuggester init: {name=shortRandomBlendedInfixSuggester,lookupImpl=BlendedInfixLookupFactory,dictionaryImpl=RandomTestDictionaryFactory,randDictMaxItems=100,blenderType=position_linear,suggestAnalyzerFieldType=text,indexPath=short_random_blended_infix_suggester,highlight=true,buildOnStartup=false,buildOnCommit=false}
   [junit4]   2> 1348167 INFO  (TEST-InfixSuggestersTest.testReloadDuringBuild-seed#[478BD8712BA9493F]) [    x:collection1] o.a.s.s.s.SolrSuggester Dictionary loaded with params: {name=shortRandomBlendedInfixSuggester,lookupImpl=BlendedInfixLookupFactory,dictionaryImpl=RandomTestDictionaryFactory,randDictMaxItems=100,blenderType=position_linear,suggestAnalyzerFieldType=text,indexPath=short_random_blended_infix_suggester,highlight=true,buildOnStartup=false,buildOnCommit=false}
   [junit4]   2> 1348167 INFO  (TEST-InfixSuggestersTest.testReloadDuringBuild-seed#[478BD8712BA9493F]) [    x:collection1] o.a.s.h.ReplicationHandler Commits will be reserved for 10000ms.
   [junit4]   2> 1348167 INFO  (TEST-InfixSuggestersTest.testReloadDuringBuild-seed#[478BD8712BA9493F]) [    x:collection1] o.a.s.u.RandomMergePolicy RandomMergePolicy wrapping class org.apache.lucene.index.TieredMergePolicy: [TieredMergePolicy: maxMergeAtOnce=31, maxMergeAtOnceExplicit=40, maxMergedSegmentMB=57.3359375, floorSegmentMB=1.0400390625, forceMergeDeletesPctAllowed=17.960332028492864, segmentsPerTier=17.0, maxCFSSegmentSizeMB=8.796093022207999E12, noCFSRatio=0.0
   [junit4]   2> 1348168 INFO  (TEST-InfixSuggestersTest.testReloadDuringBuild-seed#[478BD8712BA9493F]) [    x:collection1] o.a.s.u.DefaultSolrCoreState New IndexWriter is ready to be used.
   [junit4]   2> 1348198 INFO  (searcherExecutor-3479-thread-1-processing-x:collection1) [    x:collection1] o.a.s.c.SolrCore [collection1] Registered new searcher Searcher@a47c91[collection1] main{ExitableDirectoryReader(UninvertingDirectoryReader())}
   [junit4]   2> 1348198 INFO  (TEST-InfixSuggestersTest.testReloadDuringBuild-seed#[478BD8712BA9493F]) [    x:collection1] o.a.s.s.SolrIndexSearcher Opening [Searcher@1671d78[collection1] main]
   [junit4]   2> 1348199 INFO  (TEST-InfixSuggestersTest.testReloadDuringBuild-seed#[478BD8712BA9493F]) [    x:collection1] o.a.s.c.SolrCore [collection1]  CLOSING SolrCore org.apache.solr.core.SolrCore@1103866
   [junit4]   2> 1348199 INFO  (TEST-InfixSuggestersTest.testReloadDuringBuild-seed#[478BD8712BA9493F]) [    x:collection1] o.a.s.m.SolrMetricManager Closing metric reporters for registry=solr.core.collection1, tag=17840230
   [junit4]   2> 1348199 INFO  (TEST-InfixSuggestersTest.testReloadDuringBuild-seed#[478BD8712BA9493F]) [    x:collection1] o.a.s.m.r.SolrJmxReporter Closing reporter [org.apache.solr.metrics.reporters.SolrJmxReporter@2ea62e: rootName = null, domain = solr.core.collection1, service url = null, agent id = null] for registry solr.core.collection1 / com.codahale.metrics.MetricRegistry@16d78cc
   [junit4]   2> 1348201 INFO  (searcherExecutor-3479-thread-1-processing-x:collection1) [    x:collection1] o.a.s.c.SolrCore [collection1] Registered new searcher Searcher@1671d78[collection1] main{ExitableDirectoryReader(UninvertingDirectoryReader())}
   [junit4]   2> 1348509 ERROR (AnalyzingInfixSuggesterTest-1440-thread-1-processing-x:collection1) [    x:collection1] o.a.s.h.RequestHandlerBase org.apache.solr.update.SolrCoreState$CoreIsClosedException: Suggester build has been interrupted by a core reload or shutdown.
   [junit4]   2> at org.apache.solr.spelling.suggest.SolrSuggester.build(SolrSuggester.java:183)
   [junit4]   2> at org.apache.solr.handler.component.SuggestComponent.prepare(SuggestComponent.java:182)
   [junit4]   2> at org.apache.solr.handler.component.SearchHandler.handleRequestBody(SearchHandler.java:269)
   [junit4]   2> at org.apache.solr.handler.RequestHandlerBase.handleRequest(RequestHandlerBase.java:177)
   [junit4]   2> at org.apache.solr.core.SolrCore.execute(SolrCore.java:2484)
   [junit4]   2> at org.apache.solr.util.TestHarness.query(TestHarness.java:337)
   [junit4]   2> at org.apache.solr.util.TestHarness.query(TestHarness.java:319)
   [junit4]   2> at org.apache.solr.SolrTestCaseJ4.assertQ(SolrTestCaseJ4.java:858)
   [junit4]   2> at org.apache.solr.SolrTestCaseJ4.assertQ(SolrTestCaseJ4.java:844)
   [junit4]   2> at org.apache.solr.handler.component.InfixSuggestersTest.lambda$null$0(InfixSuggestersTest.java:102)
   [junit4]   2> at org.apache.lucene.util.LuceneTestCase.expectThrows(LuceneTestCase.java:2682)
   [junit4]   2> at org.apache.solr.handler.component.InfixSuggestersTest.lambda$testReloadDuringBuild$1(InfixSuggestersTest.java:101)
   [junit4]   2> at java.util.concurrent.FutureTask.run(FutureTask.java:266)
   [junit4]   2> at org.apache.solr.common.util.ExecutorUtil$MDCAwareThreadPoolExecutor.lambda$execute$0(ExecutorUtil.java:188)
   [junit4]   2> at java.util.concurrent.ThreadPoolExecutor.runWorker(ThreadPoolExecutor.java:1149)
   [junit4]   2> at java.util.concurrent.ThreadPoolExecutor$Worker.run(ThreadPoolExecutor.java:624)
   [junit4]   2> at java.lang.Thread.run(Thread.java:748)
   [junit4]   2> Caused by: org.apache.lucene.store.AlreadyClosedException: this IndexWriter is closed
   [junit4]   2> at org.apache.lucene.index.IndexWriter.ensureOpen(IndexWriter.java:896)
   [junit4]   2> at org.apache.lucene.index.IndexWriter.ensureOpen(IndexWriter.java:910)
   [junit4]   2> at org.apache.lucene.index.IndexWriter.updateDocument(IndexWriter.java:1711)
   [junit4]   2> at org.apache.lucene.index.IndexWriter.addDocument(IndexWriter.java:1460)
   [junit4]   2> at org.apache.lucene.search.suggest.analyzing.AnalyzingInfixSuggester.add(AnalyzingInfixSuggester.java:398)
   [junit4]   2> at org.apache.lucene.search.suggest.analyzing.AnalyzingInfixSuggester.build(AnalyzingInfixSuggester.java:312)
   [junit4]   2> at org.apache.lucene.search.suggest.Lookup.build(Lookup.java:190)
   [junit4]   2> at org.apache.solr.spelling.suggest.SolrSuggester.build(SolrSuggester.java:181)
   [junit4]   2> ... 16 more
   [junit4]   2>
   [junit4]   2> 1348509 INFO  (AnalyzingInfixSuggesterTest-1440-thread-1-processing-x:collection1) [    x:collection1] o.a.s.c.S.Request [collection1]  webapp=null path=null params={qt=/suggest_analyzing_infix_long_dictionary&suggest.buildAll=true&wt=xml} status=500 QTime=933
   [junit4]   2> 1348510 ERROR (AnalyzingInfixSuggesterTest-1440-thread-1-processing-x:collection1) [    x:collection1] o.a.s.SolrTestCaseJ4 REQUEST FAILED: qt=/suggest_analyzing_infix_long_dictionary&suggest.buildAll=true&wt=xml:org.apache.solr.update.SolrCoreState$CoreIsClosedException: Suggester build has been interrupted by a core reload or shutdown.
   [junit4]   2> at org.apache.solr.spelling.suggest.SolrSuggester.build(SolrSuggester.java:183)
   [junit4]   2> at org.apache.solr.handler.component.SuggestComponent.prepare(SuggestComponent.java:182)
   [junit4]   2> at org.apache.solr.handler.component.SearchHandler.handleRequestBody(SearchHandler.java:269)
   [junit4]   2> at org.apache.solr.handler.RequestHandlerBase.handleRequest(RequestHandlerBase.java:177)
   [junit4]   2> at org.apache.solr.core.SolrCore.execute(SolrCore.java:2484)
   [junit4]   2> at org.apache.solr.util.TestHarness.query(TestHarness.java:337)
   [junit4]   2> at org.apache.solr.util.TestHarness.query(TestHarness.java:319)
   [junit4]   2> at org.apache.solr.SolrTestCaseJ4.assertQ(SolrTestCaseJ4.java:858)
   [junit4]   2> at org.apache.solr.SolrTestCaseJ4.assertQ(SolrTestCaseJ4.java:844)
   [junit4]   2> at org.apache.solr.handler.component.InfixSuggestersTest.lambda$null$0(InfixSuggestersTest.java:102)
   [junit4]   2> at org.apache.lucene.util.LuceneTestCase.expectThrows(LuceneTestCase.java:2682)
   [junit4]   2> at org.apache.solr.handler.component.InfixSuggestersTest.lambda$testReloadDuringBuild$1(InfixSuggestersTest.java:101)
   [junit4]   2> at java.util.concurrent.FutureTask.run(FutureTask.java:266)
   [junit4]   2> at org.apache.solr.common.util.ExecutorUtil$MDCAwareThreadPoolExecutor.lambda$execute$0(ExecutorUtil.java:188)
   [junit4]   2> at java.util.concurrent.ThreadPoolExecutor.runWorker(ThreadPoolExecutor.java:1149)
   [junit4]   2> at java.util.concurrent.ThreadPoolExecutor$Worker.run(ThreadPoolExecutor.java:624)
   [junit4]   2> at java.lang.Thread.run(Thread.java:748)
   [junit4]   2> Caused by: org.apache.lucene.store.AlreadyClosedException: this IndexWriter is closed
   [junit4]   2> at org.apache.lucene.index.IndexWriter.ensureOpen(IndexWriter.java:896)
   [junit4]   2> at org.apache.lucene.index.IndexWriter.ensureOpen(IndexWriter.java:910)
   [junit4]   2> at org.apache.lucene.index.IndexWriter.updateDocument(IndexWriter.java:1711)
   [junit4]   2> at org.apache.lucene.index.IndexWriter.addDocument(IndexWriter.java:1460)
   [junit4]   2> at org.apache.lucene.search.suggest.analyzing.AnalyzingInfixSuggester.add(AnalyzingInfixSuggester.java:398)
   [junit4]   2> at org.apache.lucene.search.suggest.analyzing.AnalyzingInfixSuggester.build(AnalyzingInfixSuggester.java:312)
   [junit4]   2> at org.apache.lucene.search.suggest.Lookup.build(Lookup.java:190)
   [junit4]   2> at org.apache.solr.spelling.suggest.SolrSuggester.build(SolrSuggester.java:181)
   [junit4]   2> ... 16 more
   [junit4]   2>
   [junit4]   2> 1348510 INFO  (TEST-InfixSuggestersTest.testReloadDuringBuild-seed#[478BD8712BA9493F]) [    x:collection1] o.a.s.SolrTestCaseJ4 ###Ending testReloadDuringBuild
   [junit4]   2> 1348518 INFO  (TEST-InfixSuggestersTest.testBlendedInfixSuggesterBuildThenReload-seed#[478BD8712BA9493F]) [    x:collection1] o.a.s.SolrTestCaseJ4 ###Starting testBlendedInfixSuggesterBuildThenReload
   [junit4]   2> 1348518 INFO  (TEST-InfixSuggestersTest.testBlendedInfixSuggesterBuildThenReload-seed#[478BD8712BA9493F]) [    x:collection1] o.a.s.h.c.SuggestComponent SuggestComponent prepare with : qt=/suggest_blended_infix_short_dictionary&suggest.onlyMorePopular=true&indent=off&suggest.count=10&suggest=true&suggest.collate=true&suggest.buildAll=true&suggest.dictionary=shortRandomBlendedInfixSuggester&wt=xml
   [junit4]   2> 1348518 INFO  (TEST-InfixSuggestersTest.testBlendedInfixSuggesterBuildThenReload-seed#[478BD8712BA9493F]) [    x:collection1] o.a.s.s.s.SolrSuggester SolrSuggester.build(shortRandomBlendedInfixSuggester)
   [junit4]   2> 1348544 INFO  (TEST-InfixSuggestersTest.testBlendedInfixSuggesterBuildThenReload-seed#[478BD8712BA9493F]) [    x:collection1] o.a.s.s.s.RandomTestDictionaryFactory org.apache.solr.spelling.suggest.RandomTestDictionaryFactory$RandomTestDictionary.enabled.shortRandomBlendedInfixSuggester disabled after emitting 100 items.
   [junit4]   2> 1348600 INFO  (TEST-InfixSuggestersTest.testBlendedInfixSuggesterBuildThenReload-seed#[478BD8712BA9493F]) [    x:collection1] o.a.s.h.c.SuggestComponent SuggestComponent process with : qt=/suggest_blended_infix_short_dictionary&suggest.onlyMorePopular=true&indent=off&suggest.count=10&suggest=true&suggest.collate=true&suggest.buildAll=true&suggest.dictionary=shortRandomBlendedInfixSuggester&wt=xml
   [junit4]   2> 1348600 INFO  (TEST-InfixSuggestersTest.testBlendedInfixSuggesterBuildThenReload-seed#[478BD8712BA9493F]) [    x:collection1] o.a.s.c.S.Request [collection1]  webapp=null path=null params={qt=/suggest_blended_infix_short_dictionary&suggest.buildAll=true&wt=xml} status=0 QTime=82
   [junit4]   2> 1348601 ERROR (TEST-InfixSuggestersTest.testBlendedInfixSuggesterBuildThenReload-seed#[478BD8712BA9493F]) [    x:collection1] o.a.s.c.CorePropertiesLocator Couldn't load core descriptor from C:\Users\jenkins\workspace\Lucene-Solr-master-Windows\solr\core\src\test-files\solr\collection1\core.properties:java.nio.file.NoSuchFileException: C:\Users\jenkins\workspace\Lucene-Solr-master-Windows\solr\core\src\test-files\solr\collection1\core.properties
   [junit4]   2> 1348602 INFO  (TEST-InfixSuggestersTest.testBlendedInfixSuggesterBuildThenReload-seed#[478BD8712BA9493F]) [    x:collection1] o.a.s.c.SolrResourceLoader [null] Added 2 libs to classloader, from paths: [/C:/Users/jenkins/workspace/Lucene-Solr-master-Windows/solr/core/src/test-files/solr/collection1/lib, /C:/Users/jenkins/workspace/Lucene-Solr-master-Windows/solr/core/src/test-files/solr/collection1/lib/classes]
   [junit4]   2> 1348679 INFO  (TEST-InfixSuggestersTest.testBlendedInfixSuggesterBuildThenReload-seed#[478BD8712BA9493F]) [    x:collection1] o.a.s.c.SolrConfig Using Lucene MatchVersion: 8.0.0
   [junit4]   2> 1348690 INFO  (TEST-InfixSuggestersTest.testBlendedInfixSuggesterBuildThenReload-seed#[478BD8712BA9493F]) [    x:collection1] o.a.s.s.IndexSchema [collection1] Schema name=test
   [junit4]   2> 1348801 INFO  (TEST-InfixSuggestersTest.testBlendedInfixSuggesterBuildThenReload-seed#[478BD8712BA9493F]) [    x:collection1] o.a.s.s.IndexSchema Loaded schema test/1.0 with uniqueid field id
   [junit4]   2> 1348816 INFO  (TEST-InfixSuggestersTest.testBlendedInfixSuggesterBuildThenReload-seed#[478BD8712BA9493F]) [    x:collection1] o.a.s.c.CoreContainer Reloading SolrCore 'collection1' using configuration from instancedir C:\Users\jenkins\workspace\Lucene-Solr-master-Windows\solr\core\src\test-files\solr\collection1
   [junit4]   2> 1348873 INFO  (TEST-InfixSuggestersTest.testBlendedInfixSuggesterBuildThenReload-seed#[478BD8712BA9493F]) [    x:collection1] o.a.s.m.r.SolrJmxReporter JMX monitoring for 'solr.core.collection1' (registry 'solr.core.collection1') enabled at server: com.sun.jmx.mbeanserver.JmxMBeanServer@83f82a
   [junit4]   2> 1348873 INFO  (TEST-InfixSuggestersTest.testBlendedInfixSuggesterBuildThenReload-seed#[478BD8712BA9493F]) [    x:collection1] o.a.s.c.SolrCore [[collection1] ] Opening new SolrCore at [C:\Users\jenkins\workspace\Lucene-Solr-master-Windows\solr\core\src\test-files\solr\collection1], dataDir=[C:\Users\jenkins\workspace\Lucene-Solr-master-Windows\solr\build\solr-core\test\J0\temp\solr.handler.component.InfixSuggestersTest_478BD8712BA9493F-001\init-core-data-001\]
   [junit4]   2> 1349010 INFO  (TEST-InfixSuggestersTest.testBlendedInfixSuggesterBuildThenReload-seed#[478BD8712BA9493F]) [    x:collection1] o.a.s.u.CommitTracker Hard AutoCommit: disabled
   [junit4]   2> 1349010 INFO  (TEST-InfixSuggestersTest.testBlendedInfixSuggesterBuildThenReload-seed#[478BD8712BA9493F]) [    x:collection1] o.a.s.u.CommitTracker Soft AutoCommit: disabled
   [junit4]   2> 1349011 INFO  (TEST-InfixSuggestersTest.testBlendedInfixSuggesterBuildThenReload-seed#[478BD8712BA9493F]) [    x:collection1] o.a.s.s.SolrIndexSearcher Opening [Searcher@183da94[collection1] main]
   [junit4]   2> 1349013 WARN  (TEST-InfixSuggestersTest.testBlendedInfixSuggesterBuildThenReload-seed#[478BD8712BA9493F]) [    x:collection1] o.a.s.r.ManagedResourceStorage Cannot write to config directory C:\Users\jenkins\workspace\Lucene-Solr-master-Windows\solr\core\src\test-files\solr\collection1\conf; switching to use InMemory storage instead.
   [junit4]   2> 1349013 INFO  (TEST-InfixSuggestersTest.testBlendedInfixSuggesterBuildThenReload-seed#[478BD8712BA9493F]) [    x:collection1] o.a.s.h.c.SuggestComponent Initializing SuggestComponent
   [junit4]   2> 1349013 INFO  (TEST-InfixSuggestersTest.testBlendedInfixSuggesterBuildThenReload-seed#[478BD8712BA9493F]) [    x:collection1] o.a.s.s.s.SolrSuggester init: {name=shortRandomAnalyzingInfixSuggester,lookupImpl=AnalyzingInfixLookupFactory,dictionaryImpl=RandomTestDictionaryFactory,randDictMaxItems=100,indexPath=short_random_analyzing_infix_suggester,suggestAnalyzerFieldType=text,buildOnCommit=false,buildOnStartup=false}
   [junit4]   2> 1349015 INFO  (TEST-InfixSuggestersTest.testBlendedInfixSuggesterBuildThenReload-seed#[478BD8712BA9493F]) [    x:collection1] o.a.s.s.s.SolrSuggester Dictionary loaded with params: {name=shortRandomAnalyzingInfixSuggester,lookupImpl=AnalyzingInfixLookupFactory,dictionaryImpl=RandomTestDictionaryFactory,randDictMaxItems=100,indexPath=short_random_analyzing_infix_suggester,suggestAnalyzerFieldType=text,buildOnCommit=false,buildOnStartup=false}
   [junit4]   2> 1349015 INFO  (TEST-InfixSuggestersTest.testBlendedInfixSuggesterBuildThenReload-seed#[478BD8712BA9493F]) [    x:collection1] o.a.s.h.c.SuggestComponent Initializing SuggestComponent
   [junit4]   2> 1349015 INFO  (TEST-InfixSuggestersTest.testBlendedInfixSuggesterBuildThenReload-seed#[478BD8712BA9493F]) [    x:collection1] o.a.s.s.s.SolrSuggester init: {name=longRandomAnalyzingInfixSuggester,lookupImpl=AnalyzingInfixLookupFactory,dictionaryImpl=RandomTestDictionaryFactory,randDictMaxItems=100000,indexPath=long_random_analyzing_infix_suggester,suggestAnalyzerFieldType=text,buildOnCommit=false,buildOnStartup=false}
   [junit4]   2> 1349018 INFO  (TEST-InfixSuggestersTest.testBlendedInfixSuggesterBuildThenReload-seed#[478BD8712BA9493F]) [    x:collection1] o.a.s.s.s.SolrSuggester Dictionary loaded with params: {name=longRandomAnalyzingInfixSuggester,lookupImpl=AnalyzingInfixLookupFactory,dictionaryImpl=RandomTestDictionaryFactory,randDictMaxItems=100000,indexPath=long_random_analyzing_infix_suggester,suggestAnalyzerFieldType=text,buildOnCommit=false,buildOnStartup=false}
   [junit4]   2> 1349018 INFO  (TEST-InfixSuggestersTest.testBlendedInfixSuggesterBuildThenReload-seed#[478BD8712BA9493F]) [    x:collection1] o.a.s.h.c.SuggestComponent Initializing SuggestComponent
   [junit4]   2> 1349018 INFO  (TEST-InfixSuggestersTest.testBlendedInfixSuggesterBuildThenReload-seed#[478BD8712BA9493F]) [    x:collection1] o.a.s.s.s.SolrSuggester init: {name=shortRandomBlendedInfixSuggester,lookupImpl=BlendedInfixLookupFactory,dictionaryImpl=RandomTestDictionaryFactory,randDictMaxItems=100,blenderType=position_linear,suggestAnalyzerFieldType=text,indexPath=short_random_blended_infix_suggester,highlight=true,buildOnStartup=false,buildOnCommit=false}
   [junit4]   2> 1349021 INFO  (TEST-InfixSuggestersTest.testBlendedInfixSuggesterBuildThenReload-seed#[478BD8712BA9493F]) [    x:collection1] o.a.s.s.s.SolrSuggester Dictionary loaded with params: {name=shortRandomBlendedInfixSuggester,lookupImpl=BlendedInfixLookupFactory,dictionaryImpl=RandomTestDictionaryFactory,randDictMaxItems=100,blenderType=position_linear,suggestAnalyzerFieldType=text,indexPath=short_random_blended_infix_suggester,highlight=true,buildOnStartup=false,buildOnCommit=false}
   [junit4]   2> 1349021 INFO  (TEST-InfixSuggestersTest.testBlendedInfixSuggesterBuildThenReload-seed#[478BD8712BA9493F]) [    x:collection1] o.a.s.h.ReplicationHandler Commits will be reserved for 10000ms.
   [junit4]   2> 1349023 INFO  (searcherExecutor-3483-thread-1-processing-x:collection1) [    x:collection1] o.a.s.c.SolrCore [collection1] Registered new searcher Searcher@183da94[collection1] main{ExitableDirectoryReader(UninvertingDirectoryReader())}
   [junit4]   2> 1349024 INFO  (TEST-InfixSuggestersTest.testBlendedInfixSuggesterBuildThenReload-seed#[478BD8712BA9493F]) [    x:collection1] o.a.s.u.RandomMergePolicy RandomMergePolicy wrapping class org.apache.lucene.index.LogByteSizeMergePolicy: [LogByteSizeMergePolicy: minMergeSize=1677721, mergeFactor=20, maxMergeSize=2147483648, maxMergeSizeForForcedMerge=9223372036854775807, calibrateSizeByDeletes=false, maxMergeDocs=2147483647, maxCFSSegmentSizeMB=8.796093022207999E12, noCFSRatio=0.5689740234986277]
   [junit4]   2> 1349024 INFO  (TEST-InfixSuggestersTest.testBlendedInfixSuggesterBuildThenReload-seed#[478BD8712BA9493F]) [    x:collection1] o.a.s.u.DefaultSolrCoreState New IndexWriter is ready to be used.
   [junit4]   2> 1349024 INFO  (TEST-InfixSuggestersTest.testBlendedInfixSuggesterBuildThenReload-seed#[478BD8712BA9493F]) [    x:collection1] o.a.s.s.SolrIndexSearcher Opening [Searcher@130c66f[collection1] main]
   [junit4]   2> 1349026 INFO  (searcherExecutor-3483-thread-1-processing-x:collection1) [    x:collection1] o.a.s.c.SolrCore [collection1] Registered new searcher Searcher@130c66f[collection1] main{ExitableDirectoryReader(UninvertingDirectoryReader())}
   [junit4]   2> 1349027 INFO  (TEST-InfixSuggestersTest.testBlendedInfixSuggesterBuildThenReload-seed#[478BD8712BA9493F]) [    x:collection1] o.a.s.c.SolrCore [collection1]  CLOSING SolrCore org.apache.solr.core.SolrCore@78fb7b
   [junit4]   2> 1349027 INFO  (TEST-InfixSuggestersTest.testBlendedInfixSuggesterBuildThenReload-seed#[478BD8712BA9493F]) [    x:collection1] o.a.s.m.SolrMetricManager Closing metric reporters for registry=solr.core.collection1, tag=7928699
   [junit4]   2> 1349027 INFO  (TEST-InfixSuggestersTest.testBlendedInfixSuggesterBuildThenReload-seed#[478BD8712BA9493F]) [    x:collection1] o.a.s.m.r.SolrJmxReporter Closing reporter [org.apache.solr.metrics.reporters.SolrJmxReporter@57f8e7: rootName = null, domain = solr.core.collection1, service url = null, agent id = null] for registry solr.core.collection1 / com.codahale.metrics.MetricRegistry@16d78cc
   [junit4]   2> 1349040 INFO  (TEST-InfixSuggestersTest.testBlendedInfixSuggesterBuildThenReload-seed#[478BD8712BA9493F]) [    x:collection1] o.a.s.SolrTestCaseJ4 ###Ending testBlendedInfixSuggesterBuildThenReload
   [junit4]   2> 1349050 INFO  (TEST-InfixSuggestersTest.testAnalyzingInfixSuggesterBuildThenReload-seed#[478BD8712BA9493F]) [    x:collection1] o.a.s.SolrTestCaseJ4 ###Starting testAnalyzingInfixSuggesterBuildThenReload
   [junit4]   2> 1349050 INFO  (TEST-InfixSuggestersTest.testAnalyzingInfixSuggesterBuildThenReload-seed#[478BD8712BA9493F]) [    x:collection1] o.a.s.h.c.SuggestComponent SuggestComponent prepare with : qt=/suggest_analyzing_infix_short_dictionary&suggest=true&suggest.buildAll=true&wt=xml&indent=off
   [junit4]   2> 1349050 INFO  (TEST-InfixSuggestersTest.testAnalyzingInfixSuggesterBuildThenReload-seed#[478BD8712BA9493F]) [    x:collection1] o.a.s.s.s.SolrSuggester SolrSuggester.build(shortRandomAnalyzingInfixSuggester)
   [junit4]   2> 1349058 INFO  (TEST-InfixSuggestersTest.testAnalyzingInfixSuggesterBuildThenReload-seed#[478BD8712BA9493F]) [    x:collection1] o.a.s.s.s.RandomTestDictionaryFactory org.apache.solr.spelling.suggest.RandomTestDictionaryFactory$RandomTestDictionary.enabled.shortRandomAnalyzingInfixSuggester disabled after emitting 100 items.
   [junit4]   2> 1349092 INFO  (TEST-InfixSuggestersTest.testAnalyzingInfixSuggesterBuildThenReload-seed#[478BD8712BA9493F]) [    x:collection1] o.a.s.h.c.SuggestComponent SuggestComponent process with : qt=/suggest_analyzing_infix_short_dictionary&suggest=true&suggest.buildAll=true&wt=xml&indent=off
   [junit4]   2> 1349093 INFO  (TEST-InfixSuggestersTest.testAnalyzingInfixSuggesterBuildThenReload-seed#[478BD8712BA9493F]) [    x:collection1] o.a.s.c.S.Request [collection1]  webapp=null path=null params={qt=/suggest_analyzing_infix_short_dictionary&suggest.buildAll=true&wt=xml} status=0 QTime=42
   [junit4]   2> 1349093 ERROR (TEST-InfixSuggestersTest.testAnalyzingInfixSuggesterBuildThenReload-seed#[478BD8712BA9493F]) [    x:collection1] o.a.s.c.CorePropertiesLocator Couldn't load core descriptor from C:\Users\jenkins\workspace\Lucene-Solr-master-Windows\solr\core\src\test-files\solr\collection1\core.properties:java.nio.file.NoSuchFileException: C:\Users\jenkins\workspace\Lucene-Solr-master-Windows\solr\core\src\test-files\solr\collection1\core.properties
   [junit4]   2> 1349095 INFO  (TEST-InfixSuggestersTest.testAnalyzingInfixSuggesterBuildThenReload-seed#[478BD8712BA9493F]) [    x:collection1] o.a.s.c.SolrResourceLoader [null] Added 2 libs to classloader, from paths: [/C:/Users/jenkins/workspace/Lucene-Solr-master-Windows/solr/core/src/test-files/solr/collection1/lib, /C:/Users/jenkins/workspace/Lucene-Solr-master-Windows/solr/core/src/test-files/solr/collection1/lib/classes]
   [junit4]   2> 1349168 INFO  (TEST-InfixSuggestersTest.testAnalyzingInfixSuggesterBuildThenReload-seed#[478BD8712BA9493F]) [    x:collection1] o.a.s.c.SolrConfig Using Lucene MatchVersion: 8.0.0
   [junit4]   2> 1349179 INFO  (TEST-InfixSuggestersTest.testAnalyzingInfixSuggesterBuildThenReload-seed#[478BD8712BA9493F]) [    x:collection1] o.a.s.s.IndexSchema [collection1] Schema name=test
   [junit4]   2> 1349302 INFO  (TEST-InfixSuggestersTest.testAnalyzingInfixSuggesterBuildThenReload-seed#[478BD8712BA9493F]) [    x:collection1] o.a.s.s.IndexSchema Loaded schema test/1.0 with uniqueid field id
   [junit4]   2> 1349322 INFO  (TEST-InfixSuggestersTest.testAnalyzingInfixSuggesterBuildThenReload-seed#[478BD8712BA9493F]) [    x:collection1] o.a.s.c.CoreContainer Reloading SolrCore 'collection1' using configuration from instancedir C:\Users\jenkins\workspace\Lucene-Solr-master-Windows\solr\core\src\test-files\solr\collection1
   [junit4]   2> 1349349 INFO  (TEST-InfixSuggestersTest.testAnalyzingInfixSuggesterBuildThenReload-seed#[478BD8712BA9493F]) [    x:collection1] o.a.s.m.r.SolrJmxReporter JMX monitoring for 'solr.core.collection1' (registry 'solr.core.collection1') enabled at server: com.sun.jmx.mbeanserver.JmxMBeanServer@83f82a
   [junit4]   2> 1349349 INFO  (TEST-InfixSuggestersTest.testAnalyzingInfixSuggesterBuildThenReload-seed#[478BD8712BA9493F]) [    x:collection1] o.a.s.c.SolrCore [[collection1] ] Opening new SolrCore at [C:\Users\jenkins\workspace\Lucene-Solr-master-Windows\solr\core\src\test-files\solr\collection1], dataDir=[C:\Users\jenkins\workspace\Lucene-Solr-master-Windows\solr\build\solr-core\test\J0\temp\solr.handler.component.InfixSuggestersTest_478BD8712BA9493F-001\init-core-data-001\]
   [junit4]   2> 1349481 INFO  (TEST-InfixSuggestersTest.testAnalyzingInfixSuggesterBuildThenReload-seed#[478BD8712BA9493F]) [    x:collection1] o.a.s.u.CommitTracker Hard AutoCommit: disabled
   [junit4]   2> 1349481 INFO  (TEST-InfixSuggestersTest.testAnalyzingInfixSuggesterBuildThenReload-seed#[478BD8712BA9493F]) [    x:collection1] o.a.s.u.CommitTracker Soft AutoCommit: disabled
   [junit4]   2> 1349483 INFO  (TEST-InfixSuggestersTest.testAnalyzingInfixSuggesterBuildThenReload-seed#[478BD8712BA9493F]) [    x:collection1] o.a.s.s.SolrIndexSearcher Opening [Searcher@1a48d9e[collection1] main]
   [junit4]   2> 1349483 WARN  (TEST-InfixSuggestersTest.testAnalyzingInfixSuggesterBuildThenReload-seed#[478BD8712BA9493F]) [    x:collection1] o.a.s.r.ManagedResourceStorage Cannot write to config directory C:\Users\jenkins\workspace\Lucene-Solr-master-Windows\solr\core\src\test-files\solr\collection1\conf; switching to use InMemory storage instead.
   [junit4]   2> 1349484 INFO  (TEST-InfixSuggestersTest.testAnalyzingInfixSuggesterBuildThenReload-seed#[478BD8712BA9493F]) [    x:collection1] o.a.s.h.c.SuggestComponent Initializing SuggestComponent
   [junit4]   2> 1349484 INFO  (TEST-InfixSuggestersTest.testAnalyzingInfixSuggesterBuildThenReload-seed#[478BD8712BA9493F]) [    x:collection1] o.a.s.s.s.SolrSuggester init: {name=shortRandomAnalyzingInfixSuggester,lookupImpl=AnalyzingInfixLookupFactory,dictionaryImpl=RandomTestDictionaryFactory,randDictMaxItems=100,indexPath=short_random_analyzing_infix_suggester,suggestAnalyzerFieldType=text,buildOnCommit=false,buildOnStartup=false}
   [junit4]   2> 1349487 INFO  (TEST-InfixSuggestersTest.testAnalyzingInfixSuggesterBuildThenReload-seed#[478BD8712BA9493F]) [    x:collection1] o.a.s.s.s.SolrSuggester Dictionary loaded with params: {name=shortRandomAnalyzingInfixSuggester,lookupImpl=AnalyzingInfixLookupFactory,dictionaryImpl=RandomTestDictionaryFactory,randDictMaxItems=100,indexPath=short_random_analyzing_infix_suggester,suggestAnalyzerFieldType=text,buildOnCommit=false,buildOnStartup=false}
   [junit4]   2> 1349487 INFO  (TEST-InfixSuggestersTest.testAnalyzingInfixSuggesterBuildThenReload-seed#[478BD8712BA9493F]) [    x:collection1] o.a.s.h.c.SuggestComponent Initializing SuggestComponent
   [junit4]   2> 1349487 INFO  (TEST-InfixSuggestersTest.testAnalyzingInfixSuggesterBuildThenReload-seed#[478BD8712BA9493F]) [    x:collection1] o.a.s.s.s.SolrSuggester init: {name=longRandomAnalyzingInfixSuggester,lookupImpl=AnalyzingInfixLookupFactory,dictionaryImpl=RandomTestDictionaryFactory,randDictMaxItems=100000,indexPath=long_random_analyzing_infix_suggester,suggestAnalyzerFieldType=text,buildOnCommit=false,buildOnStartup=false}
   [junit4]   2> 1349489 INFO  (TEST-InfixSuggestersTest.testAnalyzingInfixSuggesterBuildThenReload-seed#[478BD8712BA9493F]) [    x:collection1] o.a.s.s.s.SolrSuggester Dictionary loaded with params: {name=longRandomAnalyzingInfixSuggester,lookupImpl=AnalyzingInfixLookupFactory,dictionaryImpl=RandomTestDictionaryFactory,randDictMaxItems=100000,indexPath=long_random_analyzing_infix_suggester,suggestAnalyzerFieldType=text,buildOnCommit=false,buildOnStartup=false}
   [junit4]   2> 1349489 INFO  (TEST-InfixSuggestersTest.testAnalyzingInfixSuggesterBuildThenReload-seed#[478BD8712BA9493F]) [    x:collection1] o.a.s.h.c.SuggestComponent Initializing SuggestComponent
   [junit4]   2> 1349489 INFO  (TEST-InfixSuggestersTest.testAnalyzingInfixSuggesterBuildThenReload-seed#[478BD8712BA9493F]) [    x:collection1] o.a.s.s.s.SolrSuggester init: {name=shortRandomBlendedInfixSuggester,lookupImpl=BlendedInfixLookupFactory,dictionaryImpl=RandomTestDictionaryFactory,randDictMaxItems=100,blenderType=position_linear,suggestAnalyzerFieldType=text,indexPath=short_random_blended_infix_suggester,highlight=true,buildOnStartup=false,buildOnCommit=false}
   [junit4]   2> 1349491 INFO  (TEST-InfixSuggestersTest.testAnalyzingInfixSuggesterBuildThenReload-seed#[478BD8712BA9493F]) [    x:collection1] o.a.s.s.s.SolrSuggester Dictionary loaded with params: {name=shortRandomBlendedInfixSuggester,lookupImpl=BlendedInfixLookupFactory,dictionaryImpl=RandomTestDictionaryFactory,randDictMaxItems=100,blenderType=position_linear,suggestAnalyzerFieldType=text,indexPath=short_random_blended_infix_suggester,highlight=true,buildOnStartup=false,buildOnCommit=false}
   [junit4]   2> 1349491 INFO  (TEST-InfixSuggestersTest.testAnalyzingInfixSuggesterBuildThenReload-seed#[478BD8712BA9493F]) [    x:collection1] o.a.s.h.ReplicationHandler Commits will be reserved for 10000ms.
   [junit4]   2> 1349492 INFO  (TEST-InfixSuggestersTest.testAnalyzingInfixSuggesterBuildThenReload-seed#[478BD8712BA9493F]) [    x:collection1] o.a.s.u.RandomMergePolicy RandomMergePolicy wrapping class org.apache.lucene.index.TieredMergePolicy: [TieredMergePolicy: maxMergeAtOnce=49, maxMergeAtOnceExplicit=44, maxMergedSegmentMB=10.2265625, floorSegmentMB=1.66015625, forceMergeDeletesPctAllowed=0.26713344563291774, segmentsPerTier=32.0, maxCFSSegmentSizeMB=8.796093022207999E12, noCFSRatio=0.10700758171377585
   [junit4]   2> 1349494 INFO  (TEST-InfixSuggestersTest.testAnalyzingInfixSuggesterBuildThenReload-seed#[478BD8712BA9493F]) [    x:collection1] o.a.s.u.DefaultSolrCoreState New IndexWriter is ready to be used.
   [junit4]   2> 1349498 INFO  (searcherExecutor-3487-thread-1-processing-x:collection1) [    x:collection1] o.a.s.c.SolrCore [collection1] Registered new searcher Searcher@1a48d9e[collection1] main{ExitableDirectoryReader(UninvertingDirectoryReader())}
   [junit4]   2> 1349498 INFO  (TEST-InfixSuggestersTest.testAnalyzingInfixSuggesterBuildThenReload-seed#[478BD8712BA9493F]) [    x:collection1] o.a.s.s.SolrIndexSearcher Opening [Searcher@13c31b[collection1] main]
   [junit4]   2> 1349499 INFO  (TEST-InfixSuggestersTest.testAnalyzingInfixSuggesterBuildThenReload-seed#[478BD8712BA9493F]) [    x:collection1] o.a.s.c.SolrCore [collection1]  CLOSING SolrCore org.apache.solr.core.SolrCore@1a771b8
   [junit4]   2> 1349499 INFO  (TEST-InfixSuggestersTest.testAnalyzingInfixSuggesterBuildThenReload-seed#[478BD8712BA9493F]) [    x:collection1] o.a.s.m.SolrMetricManager Closing metric reporters for registry=solr.core.collection1, tag=27750840
   [junit4]   2> 1349499 INFO  (TEST-InfixSuggestersTest.testAnalyzingInfixSuggesterBuildThenReload-seed#[478BD8712BA9493F]) [    x:collection1] o.a.s.m.r.SolrJmxReporter Closing reporter [org.apache.solr.metrics.reporters.SolrJmxReporter@fea90d: rootName = null, domain = solr.core.collection1, service url = null, agent id = null] for registry solr.core.collection1 / com.codahale.metrics.MetricRegistry@16d78cc
   [junit4]   2> 1349502 INFO  (searcherExecutor-3487-thread-1-processing-x:collection1) [    x:collection1] o.a.s.c.SolrCore [collection1] Registered new searcher Searcher@13c31b[collection1] main{ExitableDirectoryReader(UninvertingDirectoryReader())}
   [junit4]   2> 1349508 INFO  (TEST-InfixSuggestersTest.testAnalyzingInfixSuggesterBuildThenReload-seed#[478BD8712BA9493F]) [    x:collection1] o.a.s.SolrTestCaseJ4 ###Ending testAnalyzingInfixSuggesterBuildThenReload
   [junit4]   2> 1349526 INFO  (TEST-InfixSuggestersTest.testShutdownDuringBuild-seed#[478BD8712BA9493F]) [    x:collection1] o.a.s.SolrTestCaseJ4 ###Starting testShutdownDuringBuild
   [junit4]   2> 1349528 INFO  (AnalyzingInfixSuggesterTest-1441-thread-1-processing-x:collection1) [    x:collection1] o.a.s.h.c.SuggestComponent SuggestComponent prepare with : qt=/suggest_analyzing_infix_long_dictionary&suggest=true&suggest.buildAll=true&wt=xml&indent=off
   [junit4]   2> 1349528 INFO  (AnalyzingInfixSuggesterTest-1441-thread-1-processing-x:collection1) [    x:collection1] o.a.s.s.s.SolrSuggester SolrSuggester.build(longRandomAnalyzingInfixSuggester)
   [junit4]   2> 1349576 INFO  (AnalyzingInfixSuggesterTest-1441-thread-1-processing-x:collection1) [    x:collection1] o.a.s.s.s.RandomTestDictionaryFactory org.apache.solr.spelling.suggest.RandomTestDictionaryFactory$RandomTestDictionary.enabled.longRandomAnalyzingInfixSuggester emitted 1000 items.
   [junit4]   2> 1349621 INFO  (AnalyzingInfixSuggesterTest-1441-thread-1-processing-x:collection1) [    x:collection1] o.a.s.s.s.RandomTestDictionaryFactory org.apache.solr.spelling.suggest.RandomTestDictionaryFactory$RandomTestDictionary.enabled.longRandomAnalyzingInfixSuggester emitted 2000 items.
   [junit4]   2> 1349660 INFO  (TEST-InfixSuggestersTest.testShutdownDuringBuild-seed#[478BD8712BA9493F]) [    x:collection1] o.a.s.c.CoreContainer Shutting down CoreContainer instance=24015931
   [junit4]   2> 1349660 INFO  (TEST-InfixSuggestersTest.testShutdownDuringBuild-seed#[478BD8712BA9493F]) [    x:collection1] o.a.s.m.SolrMetricManager Closing metric reporters for registry=solr.node, tag=null
   [junit4]   2> 1349660 INFO  (TEST-InfixSuggestersTest.testShutdownDuringBuild-seed#[478BD8712BA9493F]) [    x:collection1] o.a.s.m.r.SolrJmxReporter Closing reporter [org.apache.solr.metrics.reporters.SolrJmxReporter@c814f8: rootName = null, domain = solr.node, service url = null, agent id = null] for registry solr.node / com.codahale.metrics.MetricRegistry@9d18dc
   [junit4]   2> 1349665 INFO  (TEST-InfixSuggestersTest.testShutdownDuringBuild-seed#[478BD8712BA9493F]) [    x:collection1] o.a.s.m.SolrMetricManager Closing metric reporters for registry=solr.jvm, tag=null
   [junit4]   2> 1349665 INFO  (TEST-InfixSuggestersTest.testShutdownDuringBuild-seed#[478BD8712BA9493F]) [    x:collection1] o.a.s.m.r.SolrJmxReporter Closing reporter [org.apache.solr.metrics.reporters.SolrJmxReporter@18138d3: rootName = null, domain = solr.jvm, service url = null, agent id = null] for registry solr.jvm / com.codahale.metrics.MetricRegistry@8da6df
   [junit4]   2> 1349670 INFO  (TEST-InfixSuggestersTest.testShutdownDuringBuild-seed#[478BD8712BA9493F]) [    x:collection1] o.a.s.m.SolrMetricManager Closing metric reporters for registry=solr.jetty, tag=null
   [junit4]   2> 1349670 INFO  (TEST-InfixSuggestersTest.testShutdownDuringBuild-seed#[478BD8712BA9493F]) [    x:collection1] o.a.s.m.r.SolrJmxReporter Closing reporter [org.apache.solr.metrics.reporters.SolrJmxReporter@847137: rootName = null, domain = solr.jetty, service url = null, agent id = null] for registry solr.jetty / com.codahale.metrics.MetricRegistry@b22816
   [junit4]   2> 1349670 INFO  (AnalyzingInfixSuggesterTest-1441-thread-1-processing-x:collection1) [    x:collection1] o.a.s.s.s.RandomTestDictionaryFactory org.apache.solr.spelling.suggest.RandomTestDictionaryFactory$RandomTestDictionary.enabled.longRandomAnalyzingInfixSuggester emitted 3000 items.
   [junit4]   2> 1349719 INFO  (coreCloseExecutor-3491-thread-1-processing-x:collection1) [    x:collection1] o.a.s.c.SolrCore [collection1]  CLOSING SolrCore org.apache.solr.core.SolrCore@10dd4c6
   [junit4]   2> 1349719 INFO  (coreCloseExecutor-3491-thread-1-processing-x:collection1) [    x:collection1] o.a.s.m.SolrMetricManager Closing metric reporters for registry=solr.core.collection1, tag=17683654
   [junit4]   2> 1349719 INFO  (coreCloseExecutor-3491-thread-1-processing-x:collection1) [    x:collection1] o.a.s.m.r.SolrJmxReporter Closing reporter [org.apache.solr.metrics.reporters.SolrJmxReporter@866297: rootName = null, domain = solr.core.collection1, service url = null, agent id = null] for registry solr.core.collection1 / com.codahale.metrics.MetricRegistry@16d78cc
   [junit4]   2> 1349913 ERROR (AnalyzingInfixSuggesterTest-1441-thread-1-processing-x:collection1) [    x:collection1] o.a.s.h.RequestHandlerBase org.apache.solr.update.SolrCoreState$CoreIsClosedException: Suggester build has been interrupted by a core reload or shutdown.
   [junit4]   2> at org.apache.solr.spelling.suggest.SolrSuggester.build(SolrSuggester.java:183)
   [junit4]   2> at org.apache.solr.handler.component.SuggestComponent.prepare(SuggestComponent.java:182)
   [junit4]   2> at org.apache.solr.handler.component.SearchHandler.handleRequestBody(SearchHandler.java:269)
   [junit4]   2> at org.apache.solr.handler.RequestHandlerBase.handleRequest(RequestHandlerBase.java:177)
   [junit4]   2> at org.apache.solr.core.SolrCore.execute(SolrCore.java:2484)
   [junit4]   2> at org.apache.solr.util.TestHarness.query(TestHarness.java:337)
   [junit4]   2> at org.apache.solr.util.TestHarness.query(TestHarness.java:319)
   [junit4]   2> at org.apache.solr.SolrTestCaseJ4.assertQ(SolrTestCaseJ4.java:858)
   [junit4]   2> at org.apache.solr.SolrTestCaseJ4.assertQ(SolrTestCaseJ4.java:844)
   [junit4]   2> at org.apache.solr.handler.component.InfixSuggestersTest.lambda$null$2(InfixSuggestersTest.java:122)
   [junit4]   2> at org.apache.lucene.util.LuceneTestCase.expectThrows(LuceneTestCase.java:2682)
   [junit4]   2> at org.apache.solr.handler.component.InfixSuggestersTest.lambda$testShutdownDuringBuild$3(InfixSuggestersTest.java:121)
   [junit4]   2> at java.util.concurrent.FutureTask.run(FutureTask.java:266)
   [junit4]   2> at org.apache.solr.common.util.ExecutorUtil$MDCAwareThreadPoolExecutor.lambda$execute$0(ExecutorUtil.java:188)
   [junit4]   2> at java.util.concurrent.ThreadPoolExecutor.runWorker(ThreadPoolExecutor.java:1149)
   [junit4]   2> at java.util.concurrent.ThreadPoolExecutor$Worker.run(ThreadPoolExecutor.java:624)
   [junit4]   2> at java.lang.Thread.run(Thread.java:748)
   [junit4]   2> Caused by: org.apache.lucene.store.AlreadyClosedException: this IndexWriter is closed
   [junit4]   2> at org.apache.lucene.index.IndexWriter.ensureOpen(IndexWriter.java:896)
   [junit4]   2> at org.apache.lucene.index.IndexWriter.ensureOpen(IndexWriter.java:910)
   [junit4]   2> at org.apache.lucene.index.IndexWriter.updateDocument(IndexWriter.java:1711)
   [junit4]   2> at org.apache.lucene.index.IndexWriter.addDocument(IndexWriter.java:1460)
   [junit4]   2> at org.apache.lucene.search.suggest.analyzing.AnalyzingInfixSuggester.add(AnalyzingInfixSuggester.java:398)
   [junit4]   2> at org.apache.lucene.search.suggest.analyzing.AnalyzingInfixSuggester.build(AnalyzingInfixSuggester.java:312)
   [junit4]   2> at org.apache.lucene.search.suggest.Lookup.build(Lookup.java:190)
   [junit4]   2> at org.apache.solr.spelling.suggest.SolrSuggester.build(SolrSuggester.java:181)
   [junit4]   2> ... 16 more
   [junit4]   2>
   [junit4]   2> 1349913 INFO  (AnalyzingInfixSuggesterTest-1441-thread-1-processing-x:collection1) [    x:collection1] o.a.s.c.S.Request [collection1]  webapp=null path=null params={qt=/suggest_analyzing_infix_long_dictionary&suggest.buildAll=true&wt=xml} status=500 QTime=385
   [junit4]   2> 1349913 ERROR (AnalyzingInfixSuggesterTest-1441-thread-1-processing-x:collection1) [    x:collection1] o.a.s.SolrTestCaseJ4 REQUEST FAILED: qt=/suggest_analyzing_infix_long_dictionary&suggest.buildAll=true&wt=xml:org.apache.solr.update.SolrCoreState$CoreIsClosedException: Suggester build has been interrupted by a core reload or shutdown.
   [junit4]   2> at org.apache.solr.spelling.suggest.SolrSuggester.build(SolrSuggester.java:183)
   [junit4]   2> at org.apache.solr.handler.component.SuggestComponent.prepare(SuggestComponent.java:182)
   [junit4]   2> at org.apache.solr.handler.component.SearchHandler.handleRequestBody(SearchHandler.java:269)
   [junit4]   2> at org.apache.solr.handler.RequestHandlerBase.handleRequest(RequestHandlerBase.java:177)
   [junit4]   2> at org.apache.solr.core.SolrCore.execute(SolrCore.java:2484)
   [junit4]   2> at org.apache.solr.util.TestHarness.query(TestHarness.java:337)
   [junit4]   2> at org.apache.solr.util.TestHarness.query(TestHarness.java:319)
   [junit4]   2> at org.apache.solr.SolrTestCaseJ4.assertQ(SolrTestCaseJ4.java:858)
   [junit4]   2> at org.apache.solr.SolrTestCaseJ4.assertQ(SolrTestCaseJ4.java:844)
   [junit4]   2> at org.apache.solr.handler.component.InfixSuggestersTest.lambda$null$2(InfixSuggestersTest.java:122)
   [junit4]   2> at org.apache.lucene.util.LuceneTestCase.expectThrows(LuceneTestCase.java:2682)
   [junit4]   2> at org.apache.solr.handler.component.InfixSuggestersTest.lambda$testShutdownDuringBuild$3(InfixSuggestersTest.java:121)
   [junit4]   2> at java.util.concurrent.FutureTask.run(FutureTask.java:266)
   [junit4]   2> at org.apache.solr.common.util.ExecutorUtil$MDCAwareThreadPoolExecutor.lambda$execute$0(ExecutorUtil.java:188)
   [junit4]   2> at java.util.concurrent.ThreadPoolExecutor.runWorker(ThreadPoolExecutor.java:1149)
   [junit4]   2> at java.util.concurrent.ThreadPoolExecutor$Worker.run(ThreadPoolExecutor.java:624)
   [junit4]   2> at java.lang.Thread.run(Thread.java:748)
   [junit4]   2> Caused by: org.apache.lucene.store.AlreadyClosedException: this IndexWriter is closed
   [junit4]   2> at org.apache.lucene.index.IndexWriter.ensureOpen(IndexWriter.java:896)
   [junit4]   2> at org.apache.lucene.index.IndexWriter.ensureOpen(IndexWriter.java:910)
   [junit4]   2> at org.apache.lucene.index.IndexWriter.updateDocument(IndexWriter.java:1711)
   [junit4]   2> at org.apache.lucene.index.IndexWriter.addDocument(IndexWriter.java:1460)
   [junit4]   2> at org.apache.lucene.search.suggest.analyzing.AnalyzingInfixSuggester.add(AnalyzingInfixSuggester.java:398)
   [junit4]   2> at org.apache.lucene.search.suggest.analyzing.AnalyzingInfixSuggester.build(AnalyzingInfixSuggester.java:312)
   [junit4]   2> at org.apache.lucene.search.suggest.Lookup.build(Lookup.java:190)
   [junit4]   2> at org.apache.solr.spelling.suggest.SolrSuggester.build(SolrSuggester.java:181)
   [junit4]   2> ... 16 more
   [junit4]   2>
   [junit4]   2> 1349932 INFO  (TEST-InfixSuggestersTest.testShutdownDuringBuild-seed#[478BD8712BA9493F]) [    x:collection1] o.a.s.SolrTestCaseJ4 ####initCore
   [junit4]   2> 1349934 INFO  (TEST-InfixSuggestersTest.testShutdownDuringBuild-seed#[478BD8712BA9493F]) [    x:collection1] o.a.s.c.SolrResourceLoader [null] Added 2 libs to classloader, from paths: [/C:/Users/jenkins/workspace/Lucene-Solr-master-Windows/solr/core/src/test-files/solr/collection1/lib, /C:/Users/jenkins/workspace/Lucene-Solr-master-Windows/solr/core/src/test-files/solr/collection1/lib/classes]
   [junit4]   2> 1349998 INFO  (TEST-InfixSuggestersTest.testShutdownDuringBuild-seed#[478BD8712BA9493F]) [    x:collection1] o.a.s.c.SolrConfig Using Lucene MatchVersion: 8.0.0
   [junit4]   2> 1350009 INFO  (TEST-InfixSuggestersTest.testShutdownDuringBuild-seed#[478BD8712BA9493F]) [    x:collection1] o.a.s.s.IndexSchema [null] Schema name=test
   [junit4]   2> 1350191 INFO  (TEST-InfixSuggestersTest.testShutdownDuringBuild-seed#[478BD8712BA9493F]) [    x:collection1] o.a.s.s.IndexSchema Loaded schema test/1.0 with uniqueid field id
   [junit4]   2> 1350397 INFO  (TEST-InfixSuggestersTest.testShutdownDuringBuild-seed#[478BD8712BA9493F]) [    x:collection1] o.a.s.m.r.SolrJmxReporter JMX monitoring for 'solr.node' (registry 'solr.node') enabled at server: com.sun.jmx.mbeanserver.JmxMBeanServer@83f82a
   [junit4]   2> 1350407 INFO  (TEST-InfixSuggestersTest.testShutdownDuringBuild-seed#[478BD8712BA9493F]) [    x:collection1] o.a.s.m.r.SolrJmxReporter JMX monitoring for 'solr.jvm' (registry 'solr.jvm') enabled at server: com.sun.jmx.mbeanserver.JmxMBeanServer@83f82a
   [junit4]   2> 1350407 INFO  (TEST-InfixSuggestersTest.testShutdownDuringBuild-seed#[478BD8712BA9493F]) [    x:collection1] o.a.s.m.r.SolrJmxReporter JMX monitoring for 'solr.jetty' (registry 'solr.jetty') enabled at server: com.sun.jmx.mbeanserver.JmxMBeanServer@83f82a
   [junit4]   2> 1350422 INFO  (coreLoadExecutor-3498-thread-1-processing-x:collection1) [    x:collection1] o.a.s.c.TransientSolrCoreCacheDefault Allocating transient cache for 2147483647 transient cores
   [junit4]   2> 1350425 INFO  (coreLoadExecutor-3498-thread-1-processing-x:collection1) [    x:collection1] o.a.s.c.SolrResourceLoader [null] Added 2 libs to classloader, from paths: [/C:/Users/jenkins/workspace/Lucene-Solr-master-Windows/solr/core/src/test-files/solr/collection1/lib, /C:/Users/jenkins/workspace/Lucene-Solr-master-Windows/solr/core/src/test-files/solr/collection1/lib/classes]
   [junit4]   2> 1350531 INFO  (coreLoadExecutor-3498-thread-1-processing-x:collection1) [    x:collection1] o.a.s.c.SolrConfig Using Lucene MatchVersion: 8.0.0
   [junit4]   2> 1350543 INFO  (coreLoadExecutor-3498-thread-1-processing-x:collection1) [    x:collection1] o.a.s.s.IndexSchema [collection1] Schema name=test
   [junit4]   2> 1350669 INFO  (coreLoadExecutor-3498-thread-1-processing-x:collection1) [    x:collection1] o.a.s.s.IndexSchema Loaded schema test/1.0 with uniqueid field id
   [junit4]   2> 1350685 INFO  (coreLoadExecutor-3498-thread-1-processing-x:collection1) [    x:collection1] o.a.s.c.CoreContainer Creating SolrCore 'collection1' using configuration from instancedir C:\Users\jenkins\workspace\Lucene-Solr-master-Windows\solr\core\src\test-files\solr\collection1, trusted=true
   [junit4]   2> 1350685 INFO  (coreLoadExecutor-3498-thread-1-processing-x:collection1) [    x:collection1] o.a.s.m.r.SolrJmxReporter JMX monitoring for 'solr.core.collection1' (registry 'solr.core.collection1') enabled at server: com.sun.jmx.mbeanserver.JmxMBeanServer@83f82a
   [junit4]   2> 1350685 INFO  (coreLoadExecutor-3498-thread-1-processing-x:collection1) [    x:collection1] o.a.s.c.SolrCore solr.RecoveryStrategy.Builder
   [junit4]   2> 1350685 INFO  (coreLoadExecutor-3498-thread-1-processing-x:collection1) [    x:collection1] o.a.s.c.SolrCore [[collection1] ] Opening new SolrCore at [C:\Users\jenkins\workspace\Lucene-Solr-master-Windows\solr\core\src\test-files\solr\collection1], dataDir=[C:\Users\jenkins\workspace\Lucene-Solr-master-Windows\solr\build\solr-core\test\J0\temp\solr.handler.component.InfixSuggestersTest_478BD8712BA9493F-001\init-core-data-001\]
   [junit4]   2> 1350896 INFO  (coreLoadExecutor-3498-thread-1-processing-x:collection1) [    x:collection1] o.a.s.u.CommitTracker Hard AutoCommit: disabled
   [junit4]   2> 1350896 INFO  (coreLoadExecutor-3498-thread-1-processing-x:collection1) [    x:collection1] o.a.s.u.CommitTracker Soft AutoCommit: disabled
   [junit4]   2> 1350901 INFO  (coreLoadExecutor-3498-thread-1-processing-x:collection1) [    x:collection1] o.a.s.u.RandomMergePolicy RandomMergePolicy wrapping class org.apache.lucene.index.AlcoholicMergePolicy: [AlcoholicMergePolicy: minMergeSize=0, mergeFactor=10, maxMergeSize=912814112, maxMergeSizeForForcedMerge=9223372036854775807, calibrateSizeByDeletes=true, maxMergeDocs=2147483647, maxCFSSegmentSizeMB=8.796093022207999E12, noCFSRatio=0.1]
   [junit4]   2> 1350902 INFO  (coreLoadExecutor-3498-thread-1-processing-x:collection1) [    x:collection1] o.a.s.s.SolrIndexSearcher Opening [Searcher@143469[collection1] main]
   [junit4]   2> 1350903 WARN  (coreLoadExecutor-3498-thread-1-processing-x:collection1) [    x:collection1] o.a.s.r.ManagedResourceStorage Cannot write to config directory C:\Users\jenkins\workspace\Lucene-Solr-master-Windows\solr\core\src\test-files\solr\collection1\conf; switching to use InMemory storage instead.
   [junit4]   2> 1350903 INFO  (coreLoadExecutor-3498-thread-1-processing-x:collection1) [    x:collection1] o.a.s.h.c.SuggestComponent Initializing SuggestComponent
   [junit4]   2> 1350904 INFO  (coreLoadExecutor-3498-thread-1-processing-x:collection1) [    x:collection1] o.a.s.s.s.SolrSuggester init: {name=shortRandomAnalyzingInfixSuggester,lookupImpl=AnalyzingInfixLookupFactory,dictionaryImpl=RandomTestDictionaryFactory,randDictMaxItems=100,indexPath=short_random_analyzing_infix_suggester,suggestAnalyzerFieldType=text,buildOnCommit=false,buildOnStartup=false}
   [junit4]  

[...truncated too long message...]

cy RandomMergePolicy wrapping class org.apache.lucene.index.TieredMergePolicy: [TieredMergePolicy: maxMergeAtOnce=16, maxMergeAtOnceExplicit=49, maxMergedSegmentMB=21.8564453125, floorSegmentMB=0.58203125, forceMergeDeletesPctAllowed=17.779831716958945, segmentsPerTier=11.0, maxCFSSegmentSizeMB=8.796093022207999E12, noCFSRatio=0.26570276802985615
   [junit4]   2> 1354045 INFO  (TEST-InfixSuggestersTest.test2xBuildReload-seed#[478BD8712BA9493F]) [    x:collection1] o.a.s.u.DefaultSolrCoreState New IndexWriter is ready to be used.
   [junit4]   2> 1354045 INFO  (TEST-InfixSuggestersTest.test2xBuildReload-seed#[478BD8712BA9493F]) [    x:collection1] o.a.s.s.SolrIndexSearcher Opening [Searcher@5585ed[collection1] main]
   [junit4]   2> 1354047 INFO  (TEST-InfixSuggestersTest.test2xBuildReload-seed#[478BD8712BA9493F]) [    x:collection1] o.a.s.c.SolrCore [collection1]  CLOSING SolrCore org.apache.solr.core.SolrCore@8e0882
   [junit4]   2> 1354047 INFO  (TEST-InfixSuggestersTest.test2xBuildReload-seed#[478BD8712BA9493F]) [    x:collection1] o.a.s.m.SolrMetricManager Closing metric reporters for registry=solr.core.collection1, tag=9308290
   [junit4]   2> 1354047 INFO  (TEST-InfixSuggestersTest.test2xBuildReload-seed#[478BD8712BA9493F]) [    x:collection1] o.a.s.m.r.SolrJmxReporter Closing reporter [org.apache.solr.metrics.reporters.SolrJmxReporter@5b3690: rootName = null, domain = solr.core.collection1, service url = null, agent id = null] for registry solr.core.collection1 / com.codahale.metrics.MetricRegistry@143fc1b
   [junit4]   2> 1354049 INFO  (searcherExecutor-3515-thread-1-processing-x:collection1) [    x:collection1] o.a.s.c.SolrCore [collection1] Registered new searcher Searcher@5585ed[collection1] main{ExitableDirectoryReader(UninvertingDirectoryReader())}
   [junit4]   2> 1354057 INFO  (TEST-InfixSuggestersTest.test2xBuildReload-seed#[478BD8712BA9493F]) [    x:collection1] o.a.s.SolrTestCaseJ4 ###Ending test2xBuildReload
   [junit4]   2> 1354058 INFO  (SUITE-InfixSuggestersTest-seed#[478BD8712BA9493F]-worker) [    x:collection1] o.a.s.SolrTestCaseJ4 ###deleteCore
   [junit4]   2> 1354058 INFO  (SUITE-InfixSuggestersTest-seed#[478BD8712BA9493F]-worker) [    x:collection1] o.a.s.c.CoreContainer Shutting down CoreContainer instance=19878156
   [junit4]   2> 1354058 INFO  (SUITE-InfixSuggestersTest-seed#[478BD8712BA9493F]-worker) [    x:collection1] o.a.s.m.SolrMetricManager Closing metric reporters for registry=solr.node, tag=null
   [junit4]   2> 1354058 INFO  (SUITE-InfixSuggestersTest-seed#[478BD8712BA9493F]-worker) [    x:collection1] o.a.s.m.r.SolrJmxReporter Closing reporter [org.apache.solr.metrics.reporters.SolrJmxReporter@1e35701: rootName = null, domain = solr.node, service url = null, agent id = null] for registry solr.node / com.codahale.metrics.MetricRegistry@18b7f8b
   [junit4]   2> 1354062 INFO  (SUITE-InfixSuggestersTest-seed#[478BD8712BA9493F]-worker) [    x:collection1] o.a.s.m.SolrMetricManager Closing metric reporters for registry=solr.jvm, tag=null
   [junit4]   2> 1354062 INFO  (SUITE-InfixSuggestersTest-seed#[478BD8712BA9493F]-worker) [    x:collection1] o.a.s.m.r.SolrJmxReporter Closing reporter [org.apache.solr.metrics.reporters.SolrJmxReporter@1157391: rootName = null, domain = solr.jvm, service url = null, agent id = null] for registry solr.jvm / com.codahale.metrics.MetricRegistry@8da6df
   [junit4]   2> 1354067 INFO  (SUITE-InfixSuggestersTest-seed#[478BD8712BA9493F]-worker) [    x:collection1] o.a.s.m.SolrMetricManager Closing metric reporters for registry=solr.jetty, tag=null
   [junit4]   2> 1354067 INFO  (SUITE-InfixSuggestersTest-seed#[478BD8712BA9493F]-worker) [    x:collection1] o.a.s.m.r.SolrJmxReporter Closing reporter [org.apache.solr.metrics.reporters.SolrJmxReporter@1db7681: rootName = null, domain = solr.jetty, service url = null, agent id = null] for registry solr.jetty / com.codahale.metrics.MetricRegistry@b22816
   [junit4]   2> 1354071 INFO  (coreCloseExecutor-3519-thread-1-processing-x:collection1) [    x:collection1] o.a.s.c.SolrCore [collection1]  CLOSING SolrCore org.apache.solr.core.SolrCore@1037b9a
   [junit4]   2> 1354072 INFO  (coreCloseExecutor-3519-thread-1-processing-x:collection1) [    x:collection1] o.a.s.m.SolrMetricManager Closing metric reporters for registry=solr.core.collection1, tag=17005466
   [junit4]   2> 1354072 INFO  (coreCloseExecutor-3519-thread-1-processing-x:collection1) [    x:collection1] o.a.s.m.r.SolrJmxReporter Closing reporter [org.apache.solr.metrics.reporters.SolrJmxReporter@c39802: rootName = null, domain = solr.core.collection1, service url = null, agent id = null] for registry solr.core.collection1 / com.codahale.metrics.MetricRegistry@143fc1b
   [junit4]   2> 1354088 INFO  (SUITE-InfixSuggestersTest-seed#[478BD8712BA9493F]-worker) [    x:collection1] o.a.s.SolrTestCaseJ4 ------------------------------------------------------- Done waiting for tracked resources to be released
   [junit4]   2> NOTE: test params are: codec=Asserting(Lucene70): {textgrams=BlockTreeOrds(blocksize=128), text=Lucene50(blocksize=128), exacttext=PostingsFormat(name=LuceneVarGapDocFreqInterval)}, docValues:{weight=DocValuesFormat(name=Lucene70), text=DocValuesFormat(name=Asserting)}, maxPointsInLeafNode=730, maxMBSortInHeap=5.778444544803062, sim=RandomSimilarity(queryNorm=true): {}, locale=ar-IQ, timezone=US/Mountain
   [junit4]   2> NOTE: Windows 10 10.0 x86/Oracle Corporation 1.8.0_144 (32-bit)/cpus=3,threads=1,free=66333616,total=405536768
   [junit4]   2> NOTE: All tests run in this JVM: [TestCursorMarkWithoutUniqueKey, TestEmbeddedSolrServerAdminHandler, QueryParsingTest, ScriptEngineTest, CloudMLTQParserTest, TestSimpleTextCodec, ConcurrentDeleteAndCreateCollectionTest, SegmentsInfoRequestHandlerTest, TestLMDirichletSimilarityFactory, ResponseHeaderTest, OutputWriterTest, TestOnReconnectListenerSupport, AssignTest, TestSkipOverseerOperations, VersionInfoTest, OverseerTest, TestExportWriter, AddBlockUpdateTest, DeleteReplicaTest, TestSchemaSimilarityResource, BaseCdcrDistributedZkTest, DocValuesMissingTest, UniqFieldsUpdateProcessorFactoryTest, TestSolrQueryResponse, CoreAdminRequestStatusTest, BufferStoreTest, TestHighlightDedupGrouping, TestPseudoReturnFields, TestPayloadCheckQParserPlugin, DocValuesNotIndexedTest, LeaderElectionContextKeyTest, RecoveryZkTest, SyncSliceTest, SolrGraphiteReporterTest, CoreAdminHandlerTest, DirectUpdateHandlerTest, TestBlendedInfixSuggestions, TestCustomSort, TestInPlaceUpdatesStandalone, TestClusterProperties, TestTrieFacet, TestIndexingPerformance, TestStressRecovery, DeleteLastCustomShardedReplicaTest, NoCacheHeaderTest, StressHdfsTest, ParsingFieldUpdateProcessorsTest, MoveReplicaHDFSTest, LeaderElectionTest, TestTolerantUpdateProcessorCloud, TestClassicSimilarityFactory, HdfsLockFactoryTest, HttpTriggerListenerTest, SolrCoreTest, TestSha256AuthenticationProvider, TestNumericTerms64, DistributedFacetExistsSmallTest, MinimalSchemaTest, TestFreeTextSuggestions, TestQueryWrapperFilter, TestNoOpRegenerator, SuggesterTest, ReplaceNodeTest, TestReloadAndDeleteDocs, TestDistributedSearch, TestScoreJoinQPScore, ExecutePlanActionTest, ZkCLITest, PeerSyncWithIndexFingerprintCachingTest, TestRawTransformer, ClassificationUpdateProcessorFactoryTest, CSVRequestHandlerTest, ResponseLogComponentTest, SSLMigrationTest, TestNumericRangeQuery64, DocExpirationUpdateProcessorFactoryTest, SimpleFacetsTest, TestPolicyCloud, LeaderFailureAfterFreshStartTest, PropertiesRequestHandlerTest, TestRebalanceLeaders, TestAddFieldRealTimeGet, CursorPagingTest, TestPhraseSuggestions, TestApiFramework, SolrCloudExampleTest, TestSolrCoreParser, IndexSchemaTest, ZkControllerTest, CurrencyFieldTypeTest, ExplicitHLLTest, TestStandardQParsers, ClusterStateUpdateTest, TestCSVResponseWriter, CloudExitableDirectoryReaderTest, NumericFieldsTest, PeerSyncTest, TestRecoveryHdfs, TestDistributedStatsComponentCardinality, TestImplicitCoreProperties, TestCloudPivotFacet, HdfsRecoverLeaseTest, SolrInfoBeanTest, AutoAddReplicasIntegrationTest, AliasIntegrationTest, TestSmileRequest, TestFuzzyAnalyzedSuggestions, SuggestComponentContextFilterQueryTest, AnalyticsQueryTest, MultiThreadedOCPTest, TestMacroExpander, HdfsChaosMonkeyNothingIsSafeTest, SuggesterWFSTTest, ReturnFieldsTest, TlogReplayBufferedWhileIndexingTest, TestEmbeddedSolrServerSchemaAPI, TestPushWriter, HdfsBasicDistributedZk2Test, DistanceFunctionTest, TestMissingGroups, InfixSuggestersTest]
   [junit4]   2> NOTE: reproduce with: ant test  -Dtestcase=InfixSuggestersTest -Dtests.seed=478BD8712BA9493F -Dtests.slow=true -Dtests.locale=ar-IQ -Dtests.timezone=US/Mountain -Dtests.asserts=true -Dtests.file.encoding=UTF-8
   [junit4] ERROR   0.00s J0 | InfixSuggestersTest (suite) <<<
   [junit4]    > Throwable #1: java.io.IOException: Could not remove the following files (in the order of attempts):
   [junit4]    >    C:\Users\jenkins\workspace\Lucene-Solr-master-Windows\solr\build\solr-core\test\J0\temp\solr.handler.component.InfixSuggestersTest_478BD8712BA9493F-001\init-core-data-001: java.nio.file.AccessDeniedException: C:\Users\jenkins\workspace\Lucene-Solr-master-Windows\solr\build\solr-core\test\J0\temp\solr.handler.component.InfixSuggestersTest_478BD8712BA9493F-001\init-core-data-001
   [junit4]    >    C:\Users\jenkins\workspace\Lucene-Solr-master-Windows\solr\build\solr-core\test\J0\temp\solr.handler.component.InfixSuggestersTest_478BD8712BA9493F-001: java.nio.file.DirectoryNotEmptyException: C:\Users\jenkins\workspace\Lucene-Solr-master-Windows\solr\build\solr-core\test\J0\temp\solr.handler.component.InfixSuggestersTest_478BD8712BA9493F-001
   [junit4]    > at __randomizedtesting.SeedInfo.seed([478BD8712BA9493F]:0)
   [junit4]    > at org.apache.lucene.util.IOUtils.rm(IOUtils.java:329)
   [junit4]    > at java.lang.Thread.run(Thread.java:748)
   [junit4] Completed [249/745 (1!)] on J0 in 8.85s, 7 tests, 1 error <<< FAILURES!

[...truncated 44346 lines...]


---------------------------------------------------------------------
To unsubscribe, e-mail: [hidden email]
For additional commands, e-mail: [hidden email]
Reply | Threaded
Open this post in threaded view
|

[JENKINS] Lucene-Solr-master-Windows (64bit/jdk1.8.0_144) - Build # 6956 - Still Unstable!

Policeman Jenkins Server-2
Build: https://jenkins.thetaphi.de/job/Lucene-Solr-master-Windows/6956/
Java: 64bit/jdk1.8.0_144 -XX:-UseCompressedOops -XX:+UseG1GC

1 tests failed.
FAILED:  junit.framework.TestSuite.org.apache.solr.core.TestSolrIndexConfig

Error Message:
Could not remove the following files (in the order of attempts):    C:\Users\jenkins\workspace\Lucene-Solr-master-Windows\solr\build\solr-core\test\J1\temp\solr.core.TestSolrIndexConfig_8C6FF671EFE9C986-001\init-core-data-001: java.nio.file.AccessDeniedException: C:\Users\jenkins\workspace\Lucene-Solr-master-Windows\solr\build\solr-core\test\J1\temp\solr.core.TestSolrIndexConfig_8C6FF671EFE9C986-001\init-core-data-001    C:\Users\jenkins\workspace\Lucene-Solr-master-Windows\solr\build\solr-core\test\J1\temp\solr.core.TestSolrIndexConfig_8C6FF671EFE9C986-001: java.nio.file.DirectoryNotEmptyException: C:\Users\jenkins\workspace\Lucene-Solr-master-Windows\solr\build\solr-core\test\J1\temp\solr.core.TestSolrIndexConfig_8C6FF671EFE9C986-001

Stack Trace:
java.io.IOException: Could not remove the following files (in the order of attempts):
   C:\Users\jenkins\workspace\Lucene-Solr-master-Windows\solr\build\solr-core\test\J1\temp\solr.core.TestSolrIndexConfig_8C6FF671EFE9C986-001\init-core-data-001: java.nio.file.AccessDeniedException: C:\Users\jenkins\workspace\Lucene-Solr-master-Windows\solr\build\solr-core\test\J1\temp\solr.core.TestSolrIndexConfig_8C6FF671EFE9C986-001\init-core-data-001
   C:\Users\jenkins\workspace\Lucene-Solr-master-Windows\solr\build\solr-core\test\J1\temp\solr.core.TestSolrIndexConfig_8C6FF671EFE9C986-001: java.nio.file.DirectoryNotEmptyException: C:\Users\jenkins\workspace\Lucene-Solr-master-Windows\solr\build\solr-core\test\J1\temp\solr.core.TestSolrIndexConfig_8C6FF671EFE9C986-001

        at __randomizedtesting.SeedInfo.seed([8C6FF671EFE9C986]:0)
        at org.apache.lucene.util.IOUtils.rm(IOUtils.java:329)
        at org.apache.lucene.util.TestRuleTemporaryFilesCleanup.afterAlways(TestRuleTemporaryFilesCleanup.java:216)
        at com.carrotsearch.randomizedtesting.rules.TestRuleAdapter$1.afterAlways(TestRuleAdapter.java:31)
        at com.carrotsearch.randomizedtesting.rules.StatementAdapter.evaluate(StatementAdapter.java:43)
        at com.carrotsearch.randomizedtesting.rules.StatementAdapter.evaluate(StatementAdapter.java:36)
        at org.apache.lucene.util.TestRuleAssertionsRequired$1.evaluate(TestRuleAssertionsRequired.java:53)
        at org.apache.lucene.util.TestRuleMarkFailure$1.evaluate(TestRuleMarkFailure.java:47)
        at org.apache.lucene.util.TestRuleIgnoreAfterMaxFailures$1.evaluate(TestRuleIgnoreAfterMaxFailures.java:64)
        at org.apache.lucene.util.TestRuleIgnoreTestSuites$1.evaluate(TestRuleIgnoreTestSuites.java:54)
        at com.carrotsearch.randomizedtesting.rules.StatementAdapter.evaluate(StatementAdapter.java:36)
        at com.carrotsearch.randomizedtesting.ThreadLeakControl$StatementRunner.run(ThreadLeakControl.java:368)
        at java.lang.Thread.run(Thread.java:748)




Build Log:
[...truncated 11946 lines...]
   [junit4] Suite: org.apache.solr.core.TestSolrIndexConfig
   [junit4]   2> Creating dataDir: C:\Users\jenkins\workspace\Lucene-Solr-master-Windows\solr\build\solr-core\test\J1\temp\solr.core.TestSolrIndexConfig_8C6FF671EFE9C986-001\init-core-data-001
   [junit4]   2> 533159 WARN  (SUITE-TestSolrIndexConfig-seed#[8C6FF671EFE9C986]-worker) [    ] o.a.s.SolrTestCaseJ4 startTrackingSearchers: numOpens=10 numCloses=10
   [junit4]   2> 533159 INFO  (SUITE-TestSolrIndexConfig-seed#[8C6FF671EFE9C986]-worker) [    ] o.a.s.SolrTestCaseJ4 Using PointFields (NUMERIC_POINTS_SYSPROP=true) w/NUMERIC_DOCVALUES_SYSPROP=true
   [junit4]   2> 533163 INFO  (SUITE-TestSolrIndexConfig-seed#[8C6FF671EFE9C986]-worker) [    ] o.a.s.SolrTestCaseJ4 Randomized ssl (false) and clientAuth (false) via: @org.apache.solr.util.RandomizeSSL(reason=, value=NaN, ssl=NaN, clientAuth=NaN)
   [junit4]   2> 533163 INFO  (SUITE-TestSolrIndexConfig-seed#[8C6FF671EFE9C986]-worker) [    ] o.a.s.SolrTestCaseJ4 SecureRandom sanity checks: test.solr.allowed.securerandom=null & java.security.egd=file:/dev/./urandom
   [junit4]   2> 533164 INFO  (SUITE-TestSolrIndexConfig-seed#[8C6FF671EFE9C986]-worker) [    ] o.a.s.SolrTestCaseJ4 ####initCore
   [junit4]   2> 533164 INFO  (SUITE-TestSolrIndexConfig-seed#[8C6FF671EFE9C986]-worker) [    ] o.a.s.c.SolrResourceLoader [null] Added 2 libs to classloader, from paths: [/C:/Users/jenkins/workspace/Lucene-Solr-master-Windows/solr/core/src/test-files/solr/collection1/lib, /C:/Users/jenkins/workspace/Lucene-Solr-master-Windows/solr/core/src/test-files/solr/collection1/lib/classes]
   [junit4]   2> 533191 INFO  (SUITE-TestSolrIndexConfig-seed#[8C6FF671EFE9C986]-worker) [    ] o.a.s.u.SolrIndexConfig IndexWriter infoStream solr logging is enabled
   [junit4]   2> 533191 INFO  (SUITE-TestSolrIndexConfig-seed#[8C6FF671EFE9C986]-worker) [    ] o.a.s.c.SolrConfig Using Lucene MatchVersion: 8.0.0
   [junit4]   2> 533200 INFO  (SUITE-TestSolrIndexConfig-seed#[8C6FF671EFE9C986]-worker) [    ] o.a.s.s.IndexSchema [null] Schema name=test
   [junit4]   2> 533320 INFO  (SUITE-TestSolrIndexConfig-seed#[8C6FF671EFE9C986]-worker) [    ] o.a.s.s.IndexSchema Loaded schema test/1.0 with uniqueid field id
   [junit4]   2> 533398 INFO  (SUITE-TestSolrIndexConfig-seed#[8C6FF671EFE9C986]-worker) [    ] o.a.s.m.r.SolrJmxReporter JMX monitoring for 'solr.node' (registry 'solr.node') enabled at server: com.sun.jmx.mbeanserver.JmxMBeanServer@35daa4a8
   [junit4]   2> 533403 INFO  (SUITE-TestSolrIndexConfig-seed#[8C6FF671EFE9C986]-worker) [    ] o.a.s.m.r.SolrJmxReporter JMX monitoring for 'solr.jvm' (registry 'solr.jvm') enabled at server: com.sun.jmx.mbeanserver.JmxMBeanServer@35daa4a8
   [junit4]   2> 533404 INFO  (SUITE-TestSolrIndexConfig-seed#[8C6FF671EFE9C986]-worker) [    ] o.a.s.m.r.SolrJmxReporter JMX monitoring for 'solr.jetty' (registry 'solr.jetty') enabled at server: com.sun.jmx.mbeanserver.JmxMBeanServer@35daa4a8
   [junit4]   2> 533465 INFO  (coreLoadExecutor-2677-thread-1) [    ] o.a.s.c.TransientSolrCoreCacheDefault Allocating transient cache for 2147483647 transient cores
   [junit4]   2> 533466 INFO  (coreLoadExecutor-2677-thread-1) [    x:collection1] o.a.s.c.SolrResourceLoader [null] Added 2 libs to classloader, from paths: [/C:/Users/jenkins/workspace/Lucene-Solr-master-Windows/solr/core/src/test-files/solr/collection1/lib, /C:/Users/jenkins/workspace/Lucene-Solr-master-Windows/solr/core/src/test-files/solr/collection1/lib/classes]
   [junit4]   2> 533530 INFO  (coreLoadExecutor-2677-thread-1) [    x:collection1] o.a.s.u.SolrIndexConfig IndexWriter infoStream solr logging is enabled
   [junit4]   2> 533530 INFO  (coreLoadExecutor-2677-thread-1) [    x:collection1] o.a.s.c.SolrConfig Using Lucene MatchVersion: 8.0.0
   [junit4]   2> 533544 INFO  (coreLoadExecutor-2677-thread-1) [    x:collection1] o.a.s.s.IndexSchema [collection1] Schema name=test
   [junit4]   2> 533689 INFO  (coreLoadExecutor-2677-thread-1) [    x:collection1] o.a.s.s.IndexSchema Loaded schema test/1.0 with uniqueid field id
   [junit4]   2> 533701 INFO  (coreLoadExecutor-2677-thread-1) [    x:collection1] o.a.s.c.CoreContainer Creating SolrCore 'collection1' using configuration from instancedir C:\Users\jenkins\workspace\Lucene-Solr-master-Windows\solr\core\src\test-files\solr\collection1, trusted=true
   [junit4]   2> 533701 INFO  (coreLoadExecutor-2677-thread-1) [    x:collection1] o.a.s.m.r.SolrJmxReporter JMX monitoring for 'solr.core.collection1' (registry 'solr.core.collection1') enabled at server: com.sun.jmx.mbeanserver.JmxMBeanServer@35daa4a8
   [junit4]   2> 533702 INFO  (coreLoadExecutor-2677-thread-1) [    x:collection1] o.a.s.c.SolrCore solr.RecoveryStrategy.Builder
   [junit4]   2> 533702 INFO  (coreLoadExecutor-2677-thread-1) [    x:collection1] o.a.s.c.SolrCore [[collection1] ] Opening new SolrCore at [C:\Users\jenkins\workspace\Lucene-Solr-master-Windows\solr\core\src\test-files\solr\collection1], dataDir=[C:\Users\jenkins\workspace\Lucene-Solr-master-Windows\solr\build\solr-core\test\J1\temp\solr.core.TestSolrIndexConfig_8C6FF671EFE9C986-001\init-core-data-001\]
   [junit4]   2> 533707 INFO  (coreLoadExecutor-2677-thread-1) [    x:collection1] o.a.s.u.RandomMergePolicy RandomMergePolicy wrapping class org.apache.lucene.index.LogDocMergePolicy: [LogDocMergePolicy: minMergeSize=1000, mergeFactor=12, maxMergeSize=9223372036854775807, maxMergeSizeForForcedMerge=9223372036854775807, calibrateSizeByDeletes=false, maxMergeDocs=2147483647, maxCFSSegmentSizeMB=8.796093022207999E12, noCFSRatio=0.0]
   [junit4]   2> 533708 INFO  (coreLoadExecutor-2677-thread-1) [    x:collection1] o.a.s.u.LoggingInfoStream [IFD][coreLoadExecutor-2677-thread-1]: init: current segments file is "segments"; deletionPolicy=org.apache.solr.core.IndexDeletionPolicyWrapper@660e250d
   [junit4]   2> 533708 INFO  (coreLoadExecutor-2677-thread-1) [    x:collection1] o.a.s.u.LoggingInfoStream [IFD][coreLoadExecutor-2677-thread-1]: now checkpoint "" [0 segments ; isCommit = false]
   [junit4]   2> 533708 INFO  (coreLoadExecutor-2677-thread-1) [    x:collection1] o.a.s.u.LoggingInfoStream [IFD][coreLoadExecutor-2677-thread-1]: 0 msec to checkpoint
   [junit4]   2> 533708 INFO  (coreLoadExecutor-2677-thread-1) [    x:collection1] o.a.s.u.LoggingInfoStream [IW][coreLoadExecutor-2677-thread-1]: init: create=true
   [junit4]   2> 533709 INFO  (coreLoadExecutor-2677-thread-1) [    x:collection1] o.a.s.u.LoggingInfoStream [IW][coreLoadExecutor-2677-thread-1]:
   [junit4]   2> dir=NRTCachingDirectory(MMapDirectory@C:\Users\jenkins\workspace\Lucene-Solr-master-Windows\solr\build\solr-core\test\J1\temp\solr.core.TestSolrIndexConfig_8C6FF671EFE9C986-001\init-core-data-001\index lockFactory=org.apache.lucene.store.NativeFSLockFactory@60426f2; maxCacheMB=48.0 maxMergeSizeMB=4.0)
   [junit4]   2> index=
   [junit4]   2> version=8.0.0
   [junit4]   2> analyzer=org.apache.solr.update.SolrIndexConfig$DelayedSchemaAnalyzer
   [junit4]   2> ramBufferSizeMB=100.0
   [junit4]   2> maxBufferedDocs=-1
   [junit4]   2> mergedSegmentWarmer=null
   [junit4]   2> delPolicy=org.apache.solr.core.IndexDeletionPolicyWrapper
   [junit4]   2> commit=null
   [junit4]   2> openMode=CREATE
   [junit4]   2> similarity=org.apache.solr.search.similarities.MockConfigurableSimilarity
   [junit4]   2> mergeScheduler=ConcurrentMergeScheduler: maxThreadCount=-1, maxMergeCount=-1, ioThrottle=true
   [junit4]   2> codec=Asserting(Lucene70): {}, docValues:{}, maxPointsInLeafNode=673, maxMBSortInHeap=6.587294226183197
   [junit4]   2> infoStream=org.apache.solr.update.LoggingInfoStream
   [junit4]   2> mergePolicy=RandomMergePolicy([LogDocMergePolicy: minMergeSize=1000, mergeFactor=12, maxMergeSize=9223372036854775807, maxMergeSizeForForcedMerge=9223372036854775807, calibrateSizeByDeletes=false, maxMergeDocs=2147483647, maxCFSSegmentSizeMB=8.796093022207999E12, noCFSRatio=0.0])
   [junit4]   2> indexerThreadPool=org.apache.lucene.index.DocumentsWriterPerThreadPool@c3c8ab8
   [junit4]   2> readerPooling=true
   [junit4]   2> perThreadHardLimitMB=1945
   [junit4]   2> useCompoundFile=true
   [junit4]   2> commitOnClose=true
   [junit4]   2> indexSort=null
   [junit4]   2> writer=org.apache.solr.update.SolrIndexWriter@7b14603
   [junit4]   2>
   [junit4]   2> 533709 INFO  (coreLoadExecutor-2677-thread-1) [    x:collection1] o.a.s.u.LoggingInfoStream [IW][coreLoadExecutor-2677-thread-1]: MMapDirectory.UNMAP_SUPPORTED=true
   [junit4]   2> 533709 INFO  (coreLoadExecutor-2677-thread-1) [    x:collection1] o.a.s.u.LoggingInfoStream [IW][coreLoadExecutor-2677-thread-1]: now flush at close
   [junit4]   2> 533709 INFO  (coreLoadExecutor-2677-thread-1) [    x:collection1] o.a.s.u.LoggingInfoStream [IW][coreLoadExecutor-2677-thread-1]:   start flush: applyAllDeletes=true
   [junit4]   2> 533709 INFO  (coreLoadExecutor-2677-thread-1) [    x:collection1] o.a.s.u.LoggingInfoStream [IW][coreLoadExecutor-2677-thread-1]:   index before flush
   [junit4]   2> 533709 INFO  (coreLoadExecutor-2677-thread-1) [    x:collection1] o.a.s.u.LoggingInfoStream [DW][coreLoadExecutor-2677-thread-1]: startFullFlush
   [junit4]   2> 533709 INFO  (coreLoadExecutor-2677-thread-1) [    x:collection1] o.a.s.u.LoggingInfoStream [DW][coreLoadExecutor-2677-thread-1]: coreLoadExecutor-2677-thread-1 finishFullFlush success=true
   [junit4]   2> 533709 INFO  (coreLoadExecutor-2677-thread-1) [    x:collection1] o.a.s.u.LoggingInfoStream [IW][coreLoadExecutor-2677-thread-1]: now apply all deletes for all segments buffered updates bytesUsed=0 reader pool bytesUsed=0
   [junit4]   2> 533709 INFO  (coreLoadExecutor-2677-thread-1) [    x:collection1] o.a.s.u.LoggingInfoStream [BD][coreLoadExecutor-2677-thread-1]: waitApply: no deletes to apply
   [junit4]   2> 533709 INFO  (coreLoadExecutor-2677-thread-1) [    x:collection1] o.a.s.u.LoggingInfoStream [MS][coreLoadExecutor-2677-thread-1]: initDynamicDefaults spins=false maxThreadCount=1 maxMergeCount=6
   [junit4]   2> 533710 INFO  (coreLoadExecutor-2677-thread-1) [    x:collection1] o.a.s.u.LoggingInfoStream [MS][coreLoadExecutor-2677-thread-1]: updateMergeThreads ioThrottle=true targetMBPerSec=10240.0 MB/sec
   [junit4]   2> 533710 INFO  (coreLoadExecutor-2677-thread-1) [    x:collection1] o.a.s.u.LoggingInfoStream [MS][coreLoadExecutor-2677-thread-1]: now merge
   [junit4]   2> 533710 INFO  (coreLoadExecutor-2677-thread-1) [    x:collection1] o.a.s.u.LoggingInfoStream [MS][coreLoadExecutor-2677-thread-1]:   index:
   [junit4]   2> 533710 INFO  (coreLoadExecutor-2677-thread-1) [    x:collection1] o.a.s.u.LoggingInfoStream [MS][coreLoadExecutor-2677-thread-1]:   no more merges pending; now return
   [junit4]   2> 533710 INFO  (coreLoadExecutor-2677-thread-1) [    x:collection1] o.a.s.u.LoggingInfoStream [IW][coreLoadExecutor-2677-thread-1]: waitForMerges
   [junit4]   2> 533710 INFO  (coreLoadExecutor-2677-thread-1) [    x:collection1] o.a.s.u.LoggingInfoStream [IW][coreLoadExecutor-2677-thread-1]: waitForMerges done
   [junit4]   2> 533710 INFO  (coreLoadExecutor-2677-thread-1) [    x:collection1] o.a.s.u.LoggingInfoStream [IW][coreLoadExecutor-2677-thread-1]: commit: start
   [junit4]   2> 533710 INFO  (coreLoadExecutor-2677-thread-1) [    x:collection1] o.a.s.u.LoggingInfoStream [IW][coreLoadExecutor-2677-thread-1]: commit: enter lock
   [junit4]   2> 533710 INFO  (coreLoadExecutor-2677-thread-1) [    x:collection1] o.a.s.u.LoggingInfoStream [IW][coreLoadExecutor-2677-thread-1]: commit: now prepare
   [junit4]   2> 533710 INFO  (coreLoadExecutor-2677-thread-1) [    x:collection1] o.a.s.u.LoggingInfoStream [IW][coreLoadExecutor-2677-thread-1]: prepareCommit: flush
   [junit4]   2> 533710 INFO  (coreLoadExecutor-2677-thread-1) [    x:collection1] o.a.s.u.LoggingInfoStream [IW][coreLoadExecutor-2677-thread-1]:   index before flush
   [junit4]   2> 533710 INFO  (coreLoadExecutor-2677-thread-1) [    x:collection1] o.a.s.u.LoggingInfoStream [DW][coreLoadExecutor-2677-thread-1]: startFullFlush
   [junit4]   2> 533710 INFO  (coreLoadExecutor-2677-thread-1) [    x:collection1] o.a.s.u.LoggingInfoStream [IW][coreLoadExecutor-2677-thread-1]: now apply all deletes for all segments buffered updates bytesUsed=0 reader pool bytesUsed=0
   [junit4]   2> 533710 INFO  (coreLoadExecutor-2677-thread-1) [    x:collection1] o.a.s.u.LoggingInfoStream [BD][coreLoadExecutor-2677-thread-1]: waitApply: no deletes to apply
   [junit4]   2> 533710 INFO  (coreLoadExecutor-2677-thread-1) [    x:collection1] o.a.s.u.LoggingInfoStream [DW][coreLoadExecutor-2677-thread-1]: coreLoadExecutor-2677-thread-1 finishFullFlush success=true
   [junit4]   2> 533710 INFO  (coreLoadExecutor-2677-thread-1) [    x:collection1] o.a.s.u.LoggingInfoStream [IW][coreLoadExecutor-2677-thread-1]: startCommit(): start
   [junit4]   2> 533710 INFO  (coreLoadExecutor-2677-thread-1) [    x:collection1] o.a.s.u.LoggingInfoStream [IW][coreLoadExecutor-2677-thread-1]: startCommit index= changeCount=2
   [junit4]   2> 533712 INFO  (coreLoadExecutor-2677-thread-1) [    x:collection1] o.a.s.u.LoggingInfoStream [IW][coreLoadExecutor-2677-thread-1]: startCommit: wrote pending segments file "pending_segments_1"
   [junit4]   2> 533712 INFO  (coreLoadExecutor-2677-thread-1) [    x:collection1] o.a.s.u.LoggingInfoStream [IW][coreLoadExecutor-2677-thread-1]: done all syncs: []
   [junit4]   2> 533712 INFO  (coreLoadExecutor-2677-thread-1) [    x:collection1] o.a.s.u.LoggingInfoStream [IW][coreLoadExecutor-2677-thread-1]: commit: pendingCommit != null
   [junit4]   2> 533713 INFO  (coreLoadExecutor-2677-thread-1) [    x:collection1] o.a.s.u.LoggingInfoStream [IW][coreLoadExecutor-2677-thread-1]: commit: done writing segments file "segments_1"
   [junit4]   2> 533713 INFO  (coreLoadExecutor-2677-thread-1) [    x:collection1] o.a.s.u.LoggingInfoStream [IFD][coreLoadExecutor-2677-thread-1]: now checkpoint "" [0 segments ; isCommit = true]
   [junit4]   2> 533713 INFO  (coreLoadExecutor-2677-thread-1) [    x:collection1] o.a.s.u.LoggingInfoStream [IFD][coreLoadExecutor-2677-thread-1]: 0 msec to checkpoint
   [junit4]   2> 533713 INFO  (coreLoadExecutor-2677-thread-1) [    x:collection1] o.a.s.u.LoggingInfoStream [IW][coreLoadExecutor-2677-thread-1]: commit: took 3.4 msec
   [junit4]   2> 533713 INFO  (coreLoadExecutor-2677-thread-1) [    x:collection1] o.a.s.u.LoggingInfoStream [IW][coreLoadExecutor-2677-thread-1]: commit: done
   [junit4]   2> 533713 INFO  (coreLoadExecutor-2677-thread-1) [    x:collection1] o.a.s.u.LoggingInfoStream [IW][coreLoadExecutor-2677-thread-1]: rollback
   [junit4]   2> 533713 INFO  (coreLoadExecutor-2677-thread-1) [    x:collection1] o.a.s.u.LoggingInfoStream [IW][coreLoadExecutor-2677-thread-1]: all running merges have aborted
   [junit4]   2> 533713 INFO  (coreLoadExecutor-2677-thread-1) [    x:collection1] o.a.s.u.LoggingInfoStream [IW][coreLoadExecutor-2677-thread-1]: rollback: done finish merges
   [junit4]   2> 533713 INFO  (coreLoadExecutor-2677-thread-1) [    x:collection1] o.a.s.u.LoggingInfoStream [DW][coreLoadExecutor-2677-thread-1]: abort
   [junit4]   2> 533713 INFO  (coreLoadExecutor-2677-thread-1) [    x:collection1] o.a.s.u.LoggingInfoStream [DW][coreLoadExecutor-2677-thread-1]: done abort success=true
   [junit4]   2> 533713 INFO  (coreLoadExecutor-2677-thread-1) [    x:collection1] o.a.s.u.LoggingInfoStream [IW][coreLoadExecutor-2677-thread-1]: rollback: infos=
   [junit4]   2> 533713 INFO  (coreLoadExecutor-2677-thread-1) [    x:collection1] o.a.s.u.LoggingInfoStream [IFD][coreLoadExecutor-2677-thread-1]: now checkpoint "" [0 segments ; isCommit = false]
   [junit4]   2> 533713 INFO  (coreLoadExecutor-2677-thread-1) [    x:collection1] o.a.s.u.LoggingInfoStream [IFD][coreLoadExecutor-2677-thread-1]: 0 msec to checkpoint
   [junit4]   2> 533789 WARN  (coreLoadExecutor-2677-thread-1) [    x:collection1] o.a.s.c.RequestHandlers no default request handler is registered (either '/select' or 'standard')
   [junit4]   2> 533790 INFO  (coreLoadExecutor-2677-thread-1) [    x:collection1] o.a.s.u.CommitTracker Hard AutoCommit: disabled
   [junit4]   2> 533790 INFO  (coreLoadExecutor-2677-thread-1) [    x:collection1] o.a.s.u.CommitTracker Soft AutoCommit: disabled
   [junit4]   2> 533790 INFO  (coreLoadExecutor-2677-thread-1) [    x:collection1] o.a.s.u.RandomMergePolicy RandomMergePolicy wrapping class org.apache.lucene.index.LogDocMergePolicy: [LogDocMergePolicy: minMergeSize=1000, mergeFactor=23, maxMergeSize=9223372036854775807, maxMergeSizeForForcedMerge=9223372036854775807, calibrateSizeByDeletes=false, maxMergeDocs=2147483647, maxCFSSegmentSizeMB=8.796093022207999E12, noCFSRatio=0.10076204072213946]
   [junit4]   2> 533791 INFO  (coreLoadExecutor-2677-thread-1) [    x:collection1] o.a.s.u.LoggingInfoStream [IFD][coreLoadExecutor-2677-thread-1]: init: current segments file is "segments_1"; deletionPolicy=org.apache.solr.core.IndexDeletionPolicyWrapper@660e250d
   [junit4]   2> 533791 INFO  (coreLoadExecutor-2677-thread-1) [    x:collection1] o.a.s.u.LoggingInfoStream [IFD][coreLoadExecutor-2677-thread-1]: init: load commit "segments_1"
   [junit4]   2> 533792 INFO  (coreLoadExecutor-2677-thread-1) [    x:collection1] o.a.s.u.LoggingInfoStream [IFD][coreLoadExecutor-2677-thread-1]: now checkpoint "" [0 segments ; isCommit = false]
   [junit4]   2> 533792 INFO  (coreLoadExecutor-2677-thread-1) [    x:collection1] o.a.s.u.LoggingInfoStream [IFD][coreLoadExecutor-2677-thread-1]: 0 msec to checkpoint
   [junit4]   2> 533792 INFO  (coreLoadExecutor-2677-thread-1) [    x:collection1] o.a.s.u.LoggingInfoStream [IW][coreLoadExecutor-2677-thread-1]: init: create=false
   [junit4]   2> 533792 INFO  (coreLoadExecutor-2677-thread-1) [    x:collection1] o.a.s.u.LoggingInfoStream [IW][coreLoadExecutor-2677-thread-1]:
   [junit4]   2> dir=NRTCachingDirectory(MMapDirectory@C:\Users\jenkins\workspace\Lucene-Solr-master-Windows\solr\build\solr-core\test\J1\temp\solr.core.TestSolrIndexConfig_8C6FF671EFE9C986-001\init-core-data-001\index lockFactory=org.apache.lucene.store.NativeFSLockFactory@60426f2; maxCacheMB=48.0 maxMergeSizeMB=4.0)
   [junit4]   2> index=
   [junit4]   2> version=8.0.0
   [junit4]   2> analyzer=org.apache.solr.update.SolrIndexConfig$DelayedSchemaAnalyzer
   [junit4]   2> ramBufferSizeMB=100.0
   [junit4]   2> maxBufferedDocs=-1
   [junit4]   2> mergedSegmentWarmer=null
   [junit4]   2> delPolicy=org.apache.solr.core.IndexDeletionPolicyWrapper
   [junit4]   2> commit=null
   [junit4]   2> openMode=APPEND
   [junit4]   2> similarity=org.apache.solr.search.similarities.MockConfigurableSimilarity
   [junit4]   2> mergeScheduler=ConcurrentMergeScheduler: maxThreadCount=-1, maxMergeCount=-1, ioThrottle=true
   [junit4]   2> codec=Asserting(Lucene70): {}, docValues:{}, maxPointsInLeafNode=673, maxMBSortInHeap=6.587294226183197
   [junit4]   2> infoStream=org.apache.solr.update.LoggingInfoStream
   [junit4]   2> mergePolicy=RandomMergePolicy([LogDocMergePolicy: minMergeSize=1000, mergeFactor=23, maxMergeSize=9223372036854775807, maxMergeSizeForForcedMerge=9223372036854775807, calibrateSizeByDeletes=false, maxMergeDocs=2147483647, maxCFSSegmentSizeMB=8.796093022207999E12, noCFSRatio=0.10076204072213946])
   [junit4]   2> indexerThreadPool=org.apache.lucene.index.DocumentsWriterPerThreadPool@11b99424
   [junit4]   2> readerPooling=true
   [junit4]   2> perThreadHardLimitMB=1945
   [junit4]   2> useCompoundFile=true
   [junit4]   2> commitOnClose=true
   [junit4]   2> indexSort=null
   [junit4]   2> writer=org.apache.solr.update.SolrIndexWriter@7a1e028c
   [junit4]   2>
   [junit4]   2> 533792 INFO  (coreLoadExecutor-2677-thread-1) [    x:collection1] o.a.s.u.LoggingInfoStream [IW][coreLoadExecutor-2677-thread-1]: MMapDirectory.UNMAP_SUPPORTED=true
   [junit4]   2> 533792 INFO  (coreLoadExecutor-2677-thread-1) [    x:collection1] o.a.s.u.LoggingInfoStream [IW][coreLoadExecutor-2677-thread-1]: flush at getReader
   [junit4]   2> 533792 INFO  (coreLoadExecutor-2677-thread-1) [    x:collection1] o.a.s.u.LoggingInfoStream [DW][coreLoadExecutor-2677-thread-1]: startFullFlush
   [junit4]   2> 533792 INFO  (coreLoadExecutor-2677-thread-1) [    x:collection1] o.a.s.u.LoggingInfoStream [IW][coreLoadExecutor-2677-thread-1]: now apply all deletes for all segments buffered updates bytesUsed=0 reader pool bytesUsed=0
   [junit4]   2> 533792 INFO  (coreLoadExecutor-2677-thread-1) [    x:collection1] o.a.s.u.LoggingInfoStream [BD][coreLoadExecutor-2677-thread-1]: waitApply: no deletes to apply
   [junit4]   2> 533792 INFO  (coreLoadExecutor-2677-thread-1) [    x:collection1] o.a.s.u.LoggingInfoStream [IW][coreLoadExecutor-2677-thread-1]: incRefDeleter for NRT reader version=2 segments=
   [junit4]   2> 533792 INFO  (coreLoadExecutor-2677-thread-1) [    x:collection1] o.a.s.u.LoggingInfoStream [IW][coreLoadExecutor-2677-thread-1]: return reader version=2 reader=StandardDirectoryReader(segments_1:2:nrt)
   [junit4]   2> 533792 INFO  (coreLoadExecutor-2677-thread-1) [    x:collection1] o.a.s.u.LoggingInfoStream [DW][coreLoadExecutor-2677-thread-1]: coreLoadExecutor-2677-thread-1 finishFullFlush success=true
   [junit4]   2> 533792 INFO  (coreLoadExecutor-2677-thread-1) [    x:collection1] o.a.s.u.LoggingInfoStream [IW][coreLoadExecutor-2677-thread-1]: getReader took 0 msec
   [junit4]   2> 533792 INFO  (coreLoadExecutor-2677-thread-1) [    x:collection1] o.a.s.s.SolrIndexSearcher Opening [Searcher@986b5a8[collection1] main]
   [junit4]   2> 533793 WARN  (coreLoadExecutor-2677-thread-1) [    x:collection1] o.a.s.r.ManagedResourceStorage Cannot write to config directory C:\Users\jenkins\workspace\Lucene-Solr-master-Windows\solr\core\src\test-files\solr\collection1\conf; switching to use InMemory storage instead.
   [junit4]   2> 533793 INFO  (coreLoadExecutor-2677-thread-1) [    x:collection1] o.a.s.h.ReplicationHandler Commits will be reserved for 10000ms.
   [junit4]   2> 533794 INFO  (searcherExecutor-2678-thread-1-processing-x:collection1) [    x:collection1] o.a.s.c.SolrCore [collection1] Registered new searcher Searcher@986b5a8[collection1] main{ExitableDirectoryReader(UninvertingDirectoryReader())}
   [junit4]   2> 533795 INFO  (SUITE-TestSolrIndexConfig-seed#[8C6FF671EFE9C986]-worker) [    ] o.a.s.SolrTestCaseJ4 ####initCore end
   [junit4]   2> 533798 INFO  (TEST-TestSolrIndexConfig.testIndexConfigParsing-seed#[8C6FF671EFE9C986]) [    ] o.a.s.SolrTestCaseJ4 ###Starting testIndexConfigParsing
   [junit4]   2> 533798 INFO  (TEST-TestSolrIndexConfig.testIndexConfigParsing-seed#[8C6FF671EFE9C986]) [    ] o.a.s.u.RandomMergePolicy RandomMergePolicy wrapping class org.apache.lucene.index.TieredMergePolicy: [TieredMergePolicy: maxMergeAtOnce=19, maxMergeAtOnceExplicit=41, maxMergedSegmentMB=51.1953125, floorSegmentMB=1.1279296875, forceMergeDeletesPctAllowed=29.569203714293945, segmentsPerTier=47.0, maxCFSSegmentSizeMB=8.796093022207999E12, noCFSRatio=0.2518020307607086
   [junit4]   2> 533798 INFO  (TEST-TestSolrIndexConfig.testIndexConfigParsing-seed#[8C6FF671EFE9C986]) [    ] o.a.s.SolrTestCaseJ4 ###Ending testIndexConfigParsing
   [junit4]   2> 533800 INFO  (TEST-TestSolrIndexConfig.testLiveWriter-seed#[8C6FF671EFE9C986]) [    ] o.a.s.SolrTestCaseJ4 ###Starting testLiveWriter
   [junit4]   2> 533800 INFO  (TEST-TestSolrIndexConfig.testLiveWriter-seed#[8C6FF671EFE9C986]) [    ] o.a.s.SolrTestCaseJ4 ###Ending testLiveWriter
   [junit4]   2> 533801 INFO  (SUITE-TestSolrIndexConfig-seed#[8C6FF671EFE9C986]-worker) [    ] o.a.s.SolrTestCaseJ4 ###deleteCore
   [junit4]   2> 533801 INFO  (SUITE-TestSolrIndexConfig-seed#[8C6FF671EFE9C986]-worker) [    ] o.a.s.c.CoreContainer Shutting down CoreContainer instance=1264314318
   [junit4]   2> 533801 INFO  (SUITE-TestSolrIndexConfig-seed#[8C6FF671EFE9C986]-worker) [    ] o.a.s.m.SolrMetricManager Closing metric reporters for registry=solr.node, tag=null
   [junit4]   2> 533801 INFO  (SUITE-TestSolrIndexConfig-seed#[8C6FF671EFE9C986]-worker) [    ] o.a.s.m.r.SolrJmxReporter Closing reporter [org.apache.solr.metrics.reporters.SolrJmxReporter@50b6419: rootName = null, domain = solr.node, service url = null, agent id = null] for registry solr.node / com.codahale.metrics.MetricRegistry@5ac72f6b
   [junit4]   2> 533803 INFO  (SUITE-TestSolrIndexConfig-seed#[8C6FF671EFE9C986]-worker) [    ] o.a.s.m.SolrMetricManager Closing metric reporters for registry=solr.jvm, tag=null
   [junit4]   2> 533804 INFO  (SUITE-TestSolrIndexConfig-seed#[8C6FF671EFE9C986]-worker) [    ] o.a.s.m.r.SolrJmxReporter Closing reporter [org.apache.solr.metrics.reporters.SolrJmxReporter@8dff524: rootName = null, domain = solr.jvm, service url = null, agent id = null] for registry solr.jvm / com.codahale.metrics.MetricRegistry@69237ade
   [junit4]   2> 533806 INFO  (SUITE-TestSolrIndexConfig-seed#[8C6FF671EFE9C986]-worker) [    ] o.a.s.m.SolrMetricManager Closing metric reporters for registry=solr.jetty, tag=null
   [junit4]   2> 533806 INFO  (SUITE-TestSolrIndexConfig-seed#[8C6FF671EFE9C986]-worker) [    ] o.a.s.m.r.SolrJmxReporter Closing reporter [org.apache.solr.metrics.reporters.SolrJmxReporter@1e72ccd: rootName = null, domain = solr.jetty, service url = null, agent id = null] for registry solr.jetty / com.codahale.metrics.MetricRegistry@342164e
   [junit4]   2> 533806 INFO  (coreCloseExecutor-2682-thread-1) [    x:collection1] o.a.s.c.SolrCore [collection1]  CLOSING SolrCore org.apache.solr.core.SolrCore@e4c7e10
   [junit4]   2> 533806 INFO  (coreCloseExecutor-2682-thread-1) [    x:collection1] o.a.s.m.SolrMetricManager Closing metric reporters for registry=solr.core.collection1, tag=239894032
   [junit4]   2> 533806 INFO  (coreCloseExecutor-2682-thread-1) [    x:collection1] o.a.s.m.r.SolrJmxReporter Closing reporter [org.apache.solr.metrics.reporters.SolrJmxReporter@2b93fb8b: rootName = null, domain = solr.core.collection1, service url = null, agent id = null] for registry solr.core.collection1 / com.codahale.metrics.MetricRegistry@7ec4c76f
   [junit4]   2> 533811 INFO  (coreCloseExecutor-2682-thread-1) [    x:collection1] o.a.s.u.LoggingInfoStream [IW][coreCloseExecutor-2682-thread-1]: now flush at close
   [junit4]   2> 533811 INFO  (coreCloseExecutor-2682-thread-1) [    x:collection1] o.a.s.u.LoggingInfoStream [IW][coreCloseExecutor-2682-thread-1]:   start flush: applyAllDeletes=true
   [junit4]   2> 533811 INFO  (coreCloseExecutor-2682-thread-1) [    x:collection1] o.a.s.u.LoggingInfoStream [IW][coreCloseExecutor-2682-thread-1]:   index before flush
   [junit4]   2> 533811 INFO  (coreCloseExecutor-2682-thread-1) [    x:collection1] o.a.s.u.LoggingInfoStream [DW][coreCloseExecutor-2682-thread-1]: startFullFlush
   [junit4]   2> 533811 INFO  (coreCloseExecutor-2682-thread-1) [    x:collection1] o.a.s.u.LoggingInfoStream [DW][coreCloseExecutor-2682-thread-1]: coreCloseExecutor-2682-thread-1 finishFullFlush success=true
   [junit4]   2> 533811 INFO  (coreCloseExecutor-2682-thread-1) [    x:collection1] o.a.s.u.LoggingInfoStream [IW][coreCloseExecutor-2682-thread-1]: now apply all deletes for all segments buffered updates bytesUsed=0 reader pool bytesUsed=0
   [junit4]   2> 533811 INFO  (coreCloseExecutor-2682-thread-1) [    x:collection1] o.a.s.u.LoggingInfoStream [BD][coreCloseExecutor-2682-thread-1]: waitApply: no deletes to apply
   [junit4]   2> 533812 INFO  (coreCloseExecutor-2682-thread-1) [    x:collection1] o.a.s.u.LoggingInfoStream [MS][coreCloseExecutor-2682-thread-1]: initDynamicDefaults spins=false maxThreadCount=1 maxMergeCount=6
   [junit4]   2> 533812 INFO  (coreCloseExecutor-2682-thread-1) [    x:collection1] o.a.s.u.LoggingInfoStream [MS][coreCloseExecutor-2682-thread-1]: updateMergeThreads ioThrottle=true targetMBPerSec=10240.0 MB/sec
   [junit4]   2> 533812 INFO  (coreCloseExecutor-2682-thread-1) [    x:collection1] o.a.s.u.LoggingInfoStream [MS][coreCloseExecutor-2682-thread-1]: now merge
   [junit4]   2> 533812 INFO  (coreCloseExecutor-2682-thread-1) [    x:collection1] o.a.s.u.LoggingInfoStream [MS][coreCloseExecutor-2682-thread-1]:   index:
   [junit4]   2> 533812 INFO  (coreCloseExecutor-2682-thread-1) [    x:collection1] o.a.s.u.LoggingInfoStream [MS][coreCloseExecutor-2682-thread-1]:   no more merges pending; now return
   [junit4]   2> 533812 INFO  (coreCloseExecutor-2682-thread-1) [    x:collection1] o.a.s.u.LoggingInfoStream [IW][coreCloseExecutor-2682-thread-1]: waitForMerges
   [junit4]   2> 533812 INFO  (coreCloseExecutor-2682-thread-1) [    x:collection1] o.a.s.u.LoggingInfoStream [IW][coreCloseExecutor-2682-thread-1]: waitForMerges done
   [junit4]   2> 533812 INFO  (coreCloseExecutor-2682-thread-1) [    x:collection1] o.a.s.u.LoggingInfoStream [IW][coreCloseExecutor-2682-thread-1]: commit: start
   [junit4]   2> 533812 INFO  (coreCloseExecutor-2682-thread-1) [    x:collection1] o.a.s.u.LoggingInfoStream [IW][coreCloseExecutor-2682-thread-1]: commit: enter lock
   [junit4]   2> 533812 INFO  (coreCloseExecutor-2682-thread-1) [    x:collection1] o.a.s.u.LoggingInfoStream [IW][coreCloseExecutor-2682-thread-1]: commit: now prepare
   [junit4]   2> 533812 INFO  (coreCloseExecutor-2682-thread-1) [    x:collection1] o.a.s.u.LoggingInfoStream [IW][coreCloseExecutor-2682-thread-1]: prepareCommit: flush
   [junit4]   2> 533812 INFO  (coreCloseExecutor-2682-thread-1) [    x:collection1] o.a.s.u.LoggingInfoStream [IW][coreCloseExecutor-2682-thread-1]:   index before flush
   [junit4]   2> 533812 INFO  (coreCloseExecutor-2682-thread-1) [    x:collection1] o.a.s.u.LoggingInfoStream [DW][coreCloseExecutor-2682-thread-1]: startFullFlush
   [junit4]   2> 533812 INFO  (coreCloseExecutor-2682-thread-1) [    x:collection1] o.a.s.u.LoggingInfoStream [IW][coreCloseExecutor-2682-thread-1]: now apply all deletes for all segments buffered updates bytesUsed=0 reader pool bytesUsed=0
   [junit4]   2> 533812 INFO  (coreCloseExecutor-2682-thread-1) [    x:collection1] o.a.s.u.LoggingInfoStream [BD][coreCloseExecutor-2682-thread-1]: waitApply: no deletes to apply
   [junit4]   2> 533812 INFO  (coreCloseExecutor-2682-thread-1) [    x:collection1] o.a.s.u.LoggingInfoStream [DW][coreCloseExecutor-2682-thread-1]: coreCloseExecutor-2682-thread-1 finishFullFlush success=true
   [junit4]   2> 533812 INFO  (coreCloseExecutor-2682-thread-1) [    x:collection1] o.a.s.u.LoggingInfoStream [IW][coreCloseExecutor-2682-thread-1]: startCommit(): start
   [junit4]   2> 533812 INFO  (coreCloseExecutor-2682-thread-1) [    x:collection1] o.a.s.u.LoggingInfoStream [IW][coreCloseExecutor-2682-thread-1]:   skip startCommit(): no changes pending
   [junit4]   2> 533812 INFO  (coreCloseExecutor-2682-thread-1) [    x:collection1] o.a.s.u.LoggingInfoStream [IW][coreCloseExecutor-2682-thread-1]: commit: pendingCommit == null; skip
   [junit4]   2> 533812 INFO  (coreCloseExecutor-2682-thread-1) [    x:collection1] o.a.s.u.LoggingInfoStream [IW][coreCloseExecutor-2682-thread-1]: commit: took 0.3 msec
   [junit4]   2> 533812 INFO  (coreCloseExecutor-2682-thread-1) [    x:collection1] o.a.s.u.LoggingInfoStream [IW][coreCloseExecutor-2682-thread-1]: commit: done
   [junit4]   2> 533812 INFO  (coreCloseExecutor-2682-thread-1) [    x:collection1] o.a.s.u.LoggingInfoStream [IW][coreCloseExecutor-2682-thread-1]: rollback
   [junit4]   2> 533812 INFO  (coreCloseExecutor-2682-thread-1) [    x:collection1] o.a.s.u.LoggingInfoStream [IW][coreCloseExecutor-2682-thread-1]: all running merges have aborted
   [junit4]   2> 533812 INFO  (coreCloseExecutor-2682-thread-1) [    x:collection1] o.a.s.u.LoggingInfoStream [IW][coreCloseExecutor-2682-thread-1]: rollback: done finish merges
   [junit4]   2> 533812 INFO  (coreCloseExecutor-2682-thread-1) [    x:collection1] o.a.s.u.LoggingInfoStream [DW][coreCloseExecutor-2682-thread-1]: abort
   [junit4]   2> 533812 INFO  (coreCloseExecutor-2682-thread-1) [    x:collection1] o.a.s.u.LoggingInfoStream [DW][coreCloseExecutor-2682-thread-1]: done abort success=true
   [junit4]   2> 533812 INFO  (coreCloseExecutor-2682-thread-1) [    x:collection1] o.a.s.u.LoggingInfoStream [IW][coreCloseExecutor-2682-thread-1]: rollback: infos=
   [junit4]   2> 533812 INFO  (coreCloseExecutor-2682-thread-1) [    x:collection1] o.a.s.u.LoggingInfoStream [IFD][coreCloseExecutor-2682-thread-1]: now checkpoint "" [0 segments ; isCommit = false]
   [junit4]   2> 533812 INFO  (coreCloseExecutor-2682-thread-1) [    x:collection1] o.a.s.u.LoggingInfoStream [IFD][coreCloseExecutor-2682-thread-1]: 0 msec to checkpoint
   [junit4]   2> 533813 INFO  (SUITE-TestSolrIndexConfig-seed#[8C6FF671EFE9C986]-worker) [    ] o.a.s.SolrTestCaseJ4 ------------------------------------------------------- Done waiting for tracked resources to be released
   [junit4]   2> Oct 12, 2017 1:09:39 PM com.carrotsearch.randomizedtesting.ThreadLeakControl checkThreadLeaks
   [junit4]   2> WARNING: Will linger awaiting termination of 1 leaked thread(s).
   [junit4]   2> NOTE: test params are: codec=Asserting(Lucene70): {}, docValues:{}, maxPointsInLeafNode=673, maxMBSortInHeap=6.587294226183197, sim=RandomSimilarity(queryNorm=false): {}, locale=pt-BR, timezone=America/St_Thomas
   [junit4]   2> NOTE: Windows 10 10.0 amd64/Oracle Corporation 1.8.0_144 (64-bit)/cpus=3,threads=1,free=99280568,total=536870912
   [junit4]   2> NOTE: All tests run in this JVM: [DeleteShardTest, TestLuceneMatchVersion, AssignBackwardCompatibilityTest, TestMultiWordSynonyms, TestDefaultStatsCache, TestRangeQuery, TestRandomCollapseQParserPlugin, CollectionsAPISolrJTest, EnumFieldTest, ShowFileRequestHandlerTest, SampleTest, TestSubQueryTransformerCrossCore, HdfsWriteToMultipleCollectionsTest, BasicFunctionalityTest, TestPerFieldSimilarity, AutoAddReplicasPlanActionTest, TestDynamicLoading, TestConfigSetsAPIZkFailure, DocumentAnalysisRequestHandlerTest, DistributedIntervalFacetingTest, MetricsHandlerTest, TestBM25SimilarityFactory, TestJavabinTupleStreamParser, OpenCloseCoreStressTest, HLLUtilTest, TestDocumentBuilder, SaslZkACLProviderTest, TestDistributedGrouping, LeaderFailoverAfterPartitionTest, TestInPlaceUpdatesDistrib, TestComponentsName, ComputePlanActionTest, TestRealTimeGet, TestSolrCloudWithDelegationTokens, TestSortByMinMaxFunction, JavabinLoaderTest, AddSchemaFieldsUpdateProcessorFactoryTest, LukeRequestHandlerTest, TestScoreJoinQPNoScore, SimpleMLTQParserTest, HdfsSyncSliceTest, FileUtilsTest, TestGeoJSONResponseWriter, TestManagedSchema, ConfigSetsAPITest, HdfsNNFailoverTest, HdfsRecoveryZkTest, TestSolrConfigHandler, CursorMarkTest, TestMergePolicyConfig, TestHighFrequencyDictionaryFactory, TestRandomRequestDistribution, CreateCollectionCleanupTest, BasicZkTest, TestSolrIndexConfig]
   [junit4]   2> NOTE: reproduce with: ant test  -Dtestcase=TestSolrIndexConfig -Dtests.seed=8C6FF671EFE9C986 -Dtests.slow=true -Dtests.locale=pt-BR -Dtests.timezone=America/St_Thomas -Dtests.asserts=true -Dtests.file.encoding=Cp1252
   [junit4] ERROR   0.00s J1 | TestSolrIndexConfig (suite) <<<
   [junit4]    > Throwable #1: java.io.IOException: Could not remove the following files (in the order of attempts):
   [junit4]    >    C:\Users\jenkins\workspace\Lucene-Solr-master-Windows\solr\build\solr-core\test\J1\temp\solr.core.TestSolrIndexConfig_8C6FF671EFE9C986-001\init-core-data-001: java.nio.file.AccessDeniedException: C:\Users\jenkins\workspace\Lucene-Solr-master-Windows\solr\build\solr-core\test\J1\temp\solr.core.TestSolrIndexConfig_8C6FF671EFE9C986-001\init-core-data-001
   [junit4]    >    C:\Users\jenkins\workspace\Lucene-Solr-master-Windows\solr\build\solr-core\test\J1\temp\solr.core.TestSolrIndexConfig_8C6FF671EFE9C986-001: java.nio.file.DirectoryNotEmptyException: C:\Users\jenkins\workspace\Lucene-Solr-master-Windows\solr\build\solr-core\test\J1\temp\solr.core.TestSolrIndexConfig_8C6FF671EFE9C986-001
   [junit4]    > at __randomizedtesting.SeedInfo.seed([8C6FF671EFE9C986]:0)
   [junit4]    > at org.apache.lucene.util.IOUtils.rm(IOUtils.java:329)
   [junit4]    > at java.lang.Thread.run(Thread.java:748)
   [junit4] Completed [151/745 (1!)] on J1 in 0.94s, 2 tests, 1 error <<< FAILURES!

[...truncated 48942 lines...]


---------------------------------------------------------------------
To unsubscribe, e-mail: [hidden email]
For additional commands, e-mail: [hidden email]