[JENKINS] Lucene-Solr-tests-only-3.x-java7 - Build # 1461 - Failure

classic Classic list List threaded Threaded
1 message Options
Reply | Threaded
Open this post in threaded view
|

[JENKINS] Lucene-Solr-tests-only-3.x-java7 - Build # 1461 - Failure

Apache Jenkins Server-2
Build: https://builds.apache.org/job/Lucene-Solr-tests-only-3.x-java7/1461/

2 tests failed.
FAILED:  junit.framework.TestSuite.org.apache.solr.update.processor.SignatureUpdateProcessorFactoryTest

Error Message:
Cannot delete /usr/home/hudson/hudson-slave/workspace/Lucene-Solr-tests-only-3.x-java7/checkout/solr/build/solr-core/test/4/solrtest-SignatureUpdateProcessorFactoryTest-1325885063258/index/_a.tii

Stack Trace:
java.io.IOException: Cannot delete /usr/home/hudson/hudson-slave/workspace/Lucene-Solr-tests-only-3.x-java7/checkout/solr/build/solr-core/test/4/solrtest-SignatureUpdateProcessorFactoryTest-1325885063258/index/_a.tii
        at org.apache.lucene.store.FSDirectory.deleteFile(FSDirectory.java:296)
        at org.apache.lucene.store.MockDirectoryWrapper.deleteFile(MockDirectoryWrapper.java:395)
        at org.apache.lucene.store.MockDirectoryWrapper.crash(MockDirectoryWrapper.java:268)
        at org.apache.lucene.store.MockDirectoryWrapper.close(MockDirectoryWrapper.java:559)
        at org.apache.solr.SolrTestCaseJ4.closeDirectories(SolrTestCaseJ4.java:82)
        at org.apache.solr.SolrTestCaseJ4.deleteCore(SolrTestCaseJ4.java:290)
        at org.apache.solr.SolrTestCaseJ4.afterClassSolrTestCase(SolrTestCaseJ4.java:72)


FAILED:  junit.framework.TestSuite.org.apache.solr.update.processor.SignatureUpdateProcessorFactoryTest

Error Message:
java.lang.AssertionError: directory of test was not closed, opened from: org.apache.solr.core.MockDirectoryFactory.open(MockDirectoryFactory.java:34)

Stack Trace:
java.lang.RuntimeException: java.lang.AssertionError: directory of test was not closed, opened from: org.apache.solr.core.MockDirectoryFactory.open(MockDirectoryFactory.java:34)
        at org.apache.lucene.util.LuceneTestCase.afterClassLuceneTestCaseJ4(LuceneTestCase.java:310)
        at org.apache.lucene.util.LuceneTestCase.checkResourcesAfterClass(LuceneTestCase.java:349)
        at org.apache.lucene.util.LuceneTestCase.afterClassLuceneTestCaseJ4(LuceneTestCase.java:278)




Build Log (for compile errors):
[...truncated 15163 lines...]



---------------------------------------------------------------------
To unsubscribe, e-mail: [hidden email]
For additional commands, e-mail: [hidden email]