[JENKINS] Lucene-Solr-tests-only-4.x - Build # 321 - Failure

classic Classic list List threaded Threaded
1 message Options
Reply | Threaded
Open this post in threaded view
|

[JENKINS] Lucene-Solr-tests-only-4.x - Build # 321 - Failure

Apache Jenkins Server-2
Build: https://builds.apache.org/job/Lucene-Solr-tests-only-4.x/321/

1 tests failed.
FAILED:  junit.framework.TestSuite.org.apache.solr.cloud.SyncSliceTest

Error Message:
ERROR: SolrIndexSearcher opens=24 closes=23

Stack Trace:
java.lang.AssertionError: ERROR: SolrIndexSearcher opens=24 closes=23
        at __randomizedtesting.SeedInfo.seed([8AA555345225E9B5]:0)
        at org.junit.Assert.fail(Assert.java:93)
        at org.apache.solr.SolrTestCaseJ4.endTrackingSearchers(SolrTestCaseJ4.java:216)
        at org.apache.solr.SolrTestCaseJ4.afterClass(SolrTestCaseJ4.java:82)
        at sun.reflect.GeneratedMethodAccessor15.invoke(Unknown Source)
        at sun.reflect.DelegatingMethodAccessorImpl.invoke(DelegatingMethodAccessorImpl.java:43)
        at java.lang.reflect.Method.invoke(Method.java:616)
        at com.carrotsearch.randomizedtesting.RandomizedRunner.invoke(RandomizedRunner.java:1995)
        at com.carrotsearch.randomizedtesting.RandomizedRunner.access$1100(RandomizedRunner.java:132)
        at com.carrotsearch.randomizedtesting.RandomizedRunner$5.evaluate(RandomizedRunner.java:754)
        at com.carrotsearch.randomizedtesting.rules.SystemPropertiesRestoreRule$1.evaluate(SystemPropertiesRestoreRule.java:53)
        at org.apache.lucene.util.AbstractBeforeAfterRule$1.evaluate(AbstractBeforeAfterRule.java:45)
        at org.apache.lucene.util.TestRuleReportUncaughtExceptions$1.evaluate(TestRuleReportUncaughtExceptions.java:68)
        at org.apache.lucene.util.TestRuleStoreClassName$1.evaluate(TestRuleStoreClassName.java:38)
        at org.apache.lucene.util.TestRuleIcuHack$1.evaluate(TestRuleIcuHack.java:51)
        at com.carrotsearch.randomizedtesting.rules.SystemPropertiesInvariantRule$1.evaluate(SystemPropertiesInvariantRule.java:55)
        at org.apache.lucene.util.TestRuleNoInstanceHooksOverrides$1.evaluate(TestRuleNoInstanceHooksOverrides.java:53)
        at org.apache.lucene.util.TestRuleNoStaticHooksShadowing$1.evaluate(TestRuleNoStaticHooksShadowing.java:52)
        at org.apache.lucene.util.TestRuleAssertionsRequired$1.evaluate(TestRuleAssertionsRequired.java:36)
        at org.apache.lucene.util.TestRuleMarkFailure$1.evaluate(TestRuleMarkFailure.java:48)
        at org.apache.lucene.util.TestRuleIgnoreAfterMaxFailures$1.evaluate(TestRuleIgnoreAfterMaxFailures.java:70)
        at org.apache.lucene.util.TestRuleIgnoreTestSuites$1.evaluate(TestRuleIgnoreTestSuites.java:55)
        at com.carrotsearch.randomizedtesting.RandomizedRunner.runSuite(RandomizedRunner.java:605)
        at com.carrotsearch.randomizedtesting.RandomizedRunner.access$400(RandomizedRunner.java:132)
        at com.carrotsearch.randomizedtesting.RandomizedRunner$2.run(RandomizedRunner.java:551)




Build Log:
[...truncated 9855 lines...]
[junit4:junit4]   2>
[junit4:junit4]   2> 67603 T5695 oasc.LeaderElector$1.process WARNING  org.apache.zookeeper.KeeperException$SessionExpiredException: KeeperErrorCode = Session expired for /overseer_elect/election
[junit4:junit4]   2> at org.apache.zookeeper.KeeperException.create(KeeperException.java:118)
[junit4:junit4]   2> at org.apache.zookeeper.KeeperException.create(KeeperException.java:42)
[junit4:junit4]   2> at org.apache.zookeeper.ZooKeeper.getChildren(ZooKeeper.java:1249)
[junit4:junit4]   2> at org.apache.solr.common.cloud.SolrZkClient$6.execute(SolrZkClient.java:266)
[junit4:junit4]   2> at org.apache.solr.common.cloud.SolrZkClient$6.execute(SolrZkClient.java:263)
[junit4:junit4]   2> at org.apache.solr.common.cloud.ZkCmdExecutor.retryOperation(ZkCmdExecutor.java:67)
[junit4:junit4]   2> at org.apache.solr.common.cloud.SolrZkClient.getChildren(SolrZkClient.java:263)
[junit4:junit4]   2> at org.apache.solr.cloud.LeaderElector.checkIfIamLeader(LeaderElector.java:91)
[junit4:junit4]   2> at org.apache.solr.cloud.LeaderElector.access$000(LeaderElector.java:57)
[junit4:junit4]   2> at org.apache.solr.cloud.LeaderElector$1.process(LeaderElector.java:125)
[junit4:junit4]   2> at org.apache.zookeeper.ClientCnxn$EventThread.processEvent(ClientCnxn.java:526)
[junit4:junit4]   2> at org.apache.zookeeper.ClientCnxn$EventThread.run(ClientCnxn.java:502)
[junit4:junit4]   2>
[junit4:junit4]   2> 67604 T5695 oascc.ZkStateReader$3.process Updating live nodes
[junit4:junit4]   2> 67604 T5695 oascc.ZkStateReader$3.process WARNING ZooKeeper watch triggered, but Solr cannot talk to ZK
[junit4:junit4]   2> 67604 T5695 oaz.ClientCnxn$EventThread.run EventThread shut down
[junit4:junit4]   2> 93311 T5682 oasc.SyncStrategy.syncToMe Could not tell a replica to recover org.apache.solr.client.solrj.SolrServerException: IOException occured when talking to server at: http://127.0.0.1:14591/solr/collection1
[junit4:junit4]   2> at org.apache.solr.client.solrj.impl.HttpSolrServer.request(HttpSolrServer.java:414)
[junit4:junit4]   2> at org.apache.solr.client.solrj.impl.HttpSolrServer.request(HttpSolrServer.java:182)
[junit4:junit4]   2> at org.apache.solr.cloud.SyncStrategy.syncToMe(SyncStrategy.java:237)
[junit4:junit4]   2> at org.apache.solr.cloud.SyncStrategy.syncReplicas(SyncStrategy.java:119)
[junit4:junit4]   2> at org.apache.solr.cloud.SyncStrategy.sync(SyncStrategy.java:82)
[junit4:junit4]   2> at org.apache.solr.cloud.ShardLeaderElectionContext.runLeaderProcess(ElectionContext.java:158)
[junit4:junit4]   2> at org.apache.solr.cloud.LeaderElector.runIamLeaderProcess(LeaderElector.java:151)
[junit4:junit4]   2> at org.apache.solr.cloud.LeaderElector.checkIfIamLeader(LeaderElector.java:96)
[junit4:junit4]   2> at org.apache.solr.cloud.LeaderElector.access$000(LeaderElector.java:57)
[junit4:junit4]   2> at org.apache.solr.cloud.LeaderElector$1.process(LeaderElector.java:125)
[junit4:junit4]   2> at org.apache.zookeeper.ClientCnxn$EventThread.processEvent(ClientCnxn.java:526)
[junit4:junit4]   2> at org.apache.zookeeper.ClientCnxn$EventThread.run(ClientCnxn.java:502)
[junit4:junit4]   2> Caused by: org.apache.http.conn.ConnectTimeoutException: Connect to 127.0.0.1:14591 timed out
[junit4:junit4]   2> at org.apache.http.conn.scheme.PlainSocketFactory.connectSocket(PlainSocketFactory.java:125)
[junit4:junit4]   2> at org.apache.http.impl.conn.DefaultClientConnectionOperator.openConnection(DefaultClientConnectionOperator.java:148)
[junit4:junit4]   2> at org.apache.http.impl.conn.AbstractPoolEntry.open(AbstractPoolEntry.java:150)
[junit4:junit4]   2> at org.apache.http.impl.conn.AbstractPooledConnAdapter.open(AbstractPooledConnAdapter.java:121)
[junit4:junit4]   2> at org.apache.http.impl.client.DefaultRequestDirector.tryConnect(DefaultRequestDirector.java:575)
[junit4:junit4]   2> at org.apache.http.impl.client.DefaultRequestDirector.execute(DefaultRequestDirector.java:425)
[junit4:junit4]   2> at org.apache.http.impl.client.AbstractHttpClient.execute(AbstractHttpClient.java:820)
[junit4:junit4]   2> at org.apache.http.impl.client.AbstractHttpClient.execute(AbstractHttpClient.java:754)
[junit4:junit4]   2> at org.apache.http.impl.client.AbstractHttpClient.execute(AbstractHttpClient.java:732)
[junit4:junit4]   2> at org.apache.solr.client.solrj.impl.HttpSolrServer.request(HttpSolrServer.java:353)
[junit4:junit4]   2> ... 11 more
[junit4:junit4]   2>
[junit4:junit4]   2> 93311 T5682 oasc.RecoveryStrategy.close WARNING Stopping recovery for core collection1 zkNodeName=127.0.0.1:14601_solr_collection1
[junit4:junit4]   2> 93312 T5682 oasc.LeaderElector$1.process WARNING  org.apache.zookeeper.KeeperException$SessionExpiredException: KeeperErrorCode = Session expired for /overseer/queue/qn-
[junit4:junit4]   2> at org.apache.zookeeper.KeeperException.create(KeeperException.java:118)
[junit4:junit4]   2> at org.apache.zookeeper.KeeperException.create(KeeperException.java:42)
[junit4:junit4]   2> at org.apache.zookeeper.ZooKeeper.create(ZooKeeper.java:643)
[junit4:junit4]   2> at org.apache.solr.common.cloud.SolrZkClient$5.execute(SolrZkClient.java:244)
[junit4:junit4]   2> at org.apache.solr.common.cloud.SolrZkClient$5.execute(SolrZkClient.java:241)
[junit4:junit4]   2> at org.apache.solr.common.cloud.ZkCmdExecutor.retryOperation(ZkCmdExecutor.java:67)
[junit4:junit4]   2> at org.apache.solr.common.cloud.SolrZkClient.create(SolrZkClient.java:241)
[junit4:junit4]   2> at org.apache.solr.cloud.DistributedQueue.offer(DistributedQueue.java:236)
[junit4:junit4]   2> at org.apache.solr.cloud.ZkController.publish(ZkController.java:734)
[junit4:junit4]   2> at org.apache.solr.cloud.ShardLeaderElectionContext.runLeaderProcess(ElectionContext.java:168)
[junit4:junit4]   2> at org.apache.solr.cloud.LeaderElector.runIamLeaderProcess(LeaderElector.java:151)
[junit4:junit4]   2> at org.apache.solr.cloud.LeaderElector.checkIfIamLeader(LeaderElector.java:96)
[junit4:junit4]   2> at org.apache.solr.cloud.LeaderElector.access$000(LeaderElector.java:57)
[junit4:junit4]   2> at org.apache.solr.cloud.LeaderElector$1.process(LeaderElector.java:125)
[junit4:junit4]   2> at org.apache.zookeeper.ClientCnxn$EventThread.processEvent(ClientCnxn.java:526)
[junit4:junit4]   2> at org.apache.zookeeper.ClientCnxn$EventThread.run(ClientCnxn.java:502)
[junit4:junit4]   2>
[junit4:junit4]   2> 93312 T5682 oascc.ZkStateReader$3.process Updating live nodes
[junit4:junit4]   2> 93312 T5682 oascc.ZkStateReader$3.process WARNING ZooKeeper watch triggered, but Solr cannot talk to ZK
[junit4:junit4]   2> 93312 T5682 oasc.LeaderElector$1.process WARNING  org.apache.zookeeper.KeeperException$SessionExpiredException: KeeperErrorCode = Session expired for /overseer_elect/election
[junit4:junit4]   2> at org.apache.zookeeper.KeeperException.create(KeeperException.java:118)
[junit4:junit4]   2> at org.apache.zookeeper.KeeperException.create(KeeperException.java:42)
[junit4:junit4]   2> at org.apache.zookeeper.ZooKeeper.getChildren(ZooKeeper.java:1249)
[junit4:junit4]   2> at org.apache.solr.common.cloud.SolrZkClient$6.execute(SolrZkClient.java:266)
[junit4:junit4]   2> at org.apache.solr.common.cloud.SolrZkClient$6.execute(SolrZkClient.java:263)
[junit4:junit4]   2> at org.apache.solr.common.cloud.ZkCmdExecutor.retryOperation(ZkCmdExecutor.java:67)
[junit4:junit4]   2> at org.apache.solr.common.cloud.SolrZkClient.getChildren(SolrZkClient.java:263)
[junit4:junit4]   2> at org.apache.solr.cloud.LeaderElector.checkIfIamLeader(LeaderElector.java:91)
[junit4:junit4]   2> at org.apache.solr.cloud.LeaderElector.access$000(LeaderElector.java:57)
[junit4:junit4]   2> at org.apache.solr.cloud.LeaderElector$1.process(LeaderElector.java:125)
[junit4:junit4]   2> at org.apache.zookeeper.ClientCnxn$EventThread.processEvent(ClientCnxn.java:526)
[junit4:junit4]   2> at org.apache.zookeeper.ClientCnxn$EventThread.run(ClientCnxn.java:502)
[junit4:junit4]   2>
[junit4:junit4]   2> 93313 T5682 oaz.ClientCnxn$EventThread.run EventThread shut down
[junit4:junit4]   2> 93479 T5676 C146 P14601 oasc.SolrException.log SEVERE shard update error StdNode: http://127.0.0.1:14591/solr/collection1/:org.apache.solr.client.solrj.SolrServerException: Server refused connection at: http://127.0.0.1:14591/solr/collection1
[junit4:junit4]   2> at org.apache.solr.client.solrj.impl.HttpSolrServer.request(HttpSolrServer.java:407)
[junit4:junit4]   2> at org.apache.solr.client.solrj.impl.HttpSolrServer.request(HttpSolrServer.java:182)
[junit4:junit4]   2> at org.apache.solr.update.SolrCmdDistributor$1.call(SolrCmdDistributor.java:336)
[junit4:junit4]   2> at org.apache.solr.update.SolrCmdDistributor$1.call(SolrCmdDistributor.java:317)
[junit4:junit4]   2> at java.util.concurrent.FutureTask$Sync.innerRun(FutureTask.java:334)
[junit4:junit4]   2> at java.util.concurrent.FutureTask.run(FutureTask.java:166)
[junit4:junit4]   2> at java.util.concurrent.Executors$RunnableAdapter.call(Executors.java:471)
[junit4:junit4]   2> at java.util.concurrent.FutureTask$Sync.innerRun(FutureTask.java:334)
[junit4:junit4]   2> at java.util.concurrent.FutureTask.run(FutureTask.java:166)
[junit4:junit4]   2> at org.apache.solr.update.SolrCmdDistributor$BoundedExecutor$1.run(SolrCmdDistributor.java:538)
[junit4:junit4]   2> at java.util.concurrent.ThreadPoolExecutor.runWorker(ThreadPoolExecutor.java:1110)
[junit4:junit4]   2> at java.util.concurrent.ThreadPoolExecutor$Worker.run(ThreadPoolExecutor.java:603)
[junit4:junit4]   2> at java.lang.Thread.run(Thread.java:679)
[junit4:junit4]   2> Caused by: org.apache.http.conn.HttpHostConnectException: Connection to http://127.0.0.1:14591 refused
[junit4:junit4]   2> at org.apache.http.impl.conn.DefaultClientConnectionOperator.openConnection(DefaultClientConnectionOperator.java:158)
[junit4:junit4]   2> at org.apache.http.impl.conn.AbstractPoolEntry.open(AbstractPoolEntry.java:150)
[junit4:junit4]   2> at org.apache.http.impl.conn.AbstractPooledConnAdapter.open(AbstractPooledConnAdapter.java:121)
[junit4:junit4]   2> at org.apache.http.impl.client.DefaultRequestDirector.tryConnect(DefaultRequestDirector.java:575)
[junit4:junit4]   2> at org.apache.http.impl.client.DefaultRequestDirector.execute(DefaultRequestDirector.java:425)
[junit4:junit4]   2> at org.apache.http.impl.client.AbstractHttpClient.execute(AbstractHttpClient.java:820)
[junit4:junit4]   2> at org.apache.http.impl.client.AbstractHttpClient.execute(AbstractHttpClient.java:754)
[junit4:junit4]   2> at org.apache.http.impl.client.AbstractHttpClient.execute(AbstractHttpClient.java:732)
[junit4:junit4]   2> at org.apache.solr.client.solrj.impl.HttpSolrServer.request(HttpSolrServer.java:353)
[junit4:junit4]   2> ... 12 more
[junit4:junit4]   2> Caused by: java.net.ConnectException: Operation timed out
[junit4:junit4]   2> at java.net.PlainSocketImpl.socketConnect(Native Method)
[junit4:junit4]   2> at java.net.AbstractPlainSocketImpl.doConnect(AbstractPlainSocketImpl.java:327)
[junit4:junit4]   2> at java.net.AbstractPlainSocketImpl.connectToAddress(AbstractPlainSocketImpl.java:193)
[junit4:junit4]   2> at java.net.AbstractPlainSocketImpl.connect(AbstractPlainSocketImpl.java:180)
[junit4:junit4]   2> at java.net.SocksSocketImpl.connect(SocksSocketImpl.java:384)
[junit4:junit4]   2> at java.net.Socket.connect(Socket.java:546)
[junit4:junit4]   2> at org.apache.http.conn.scheme.PlainSocketFactory.connectSocket(PlainSocketFactory.java:123)
[junit4:junit4]   2> at org.apache.http.impl.conn.DefaultClientConnectionOperator.openConnection(DefaultClientConnectionOperator.java:148)
[junit4:junit4]   2> ... 20 more
[junit4:junit4]   2>
[junit4:junit4]   2> 159030 T5636 oas.SolrTestCaseJ4.endTrackingSearchers SEVERE ERROR: SolrIndexSearcher opens=24 closes=23
[junit4:junit4]   2> NOTE: test params are: codec=Lucene40: {range_facet_l=Pulsing40(freqCutoff=7 minBlockSize=31 maxBlockSize=67), text=PostingsFormat(name=NestedPulsing), _version_=PostingsFormat(name=Direct), rnd_b=PostingsFormat(name=Memory doPackFST= true), intDefault=PostingsFormat(name=Direct), id=PostingsFormat(name=Memory doPackFST= true), timestamp=Pulsing40(freqCutoff=7 minBlockSize=31 maxBlockSize=67), a_t=Pulsing40(freqCutoff=7 minBlockSize=31 maxBlockSize=67), range_facet_sl=PostingsFormat(name=Memory doPackFST= true), range_facet_si=Pulsing40(freqCutoff=7 minBlockSize=31 maxBlockSize=67), other_tl1=PostingsFormat(name=Direct), multiDefault=Pulsing40(freqCutoff=7 minBlockSize=31 maxBlockSize=67), a_si=PostingsFormat(name=Direct)}, sim=RandomSimilarityProvider(queryNorm=true,coord=true): {}, locale=vi_VN, timezone=America/Chicago
[junit4:junit4]   2> NOTE: FreeBSD 9.0-RELEASE amd64/Sun Microsystems Inc. 1.6.0_32 (64-bit)/cpus=16,threads=6,free=244178896,total=341966848
[junit4:junit4]   2> NOTE: All tests run in this JVM: [NumericFieldsTest, MinimalSchemaTest, TestNorwegianLightStemFilterFactory, TestBinaryField, OutputWriterTest, TestFrenchMinimalStemFilterFactory, DOMUtilTest, LegacyHTMLStripCharFilterTest, AnalysisAfterCoreReloadTest, SuggesterTest, TestReversedWildcardFilterFactory, SuggesterTSTTest, TestJapaneseIterationMarkCharFilterFactory, PreAnalyzedFieldTest, JSONWriterTest, TestSlowSynonymFilter, TestHTMLStripCharFilterFactory, TestJapaneseBaseFormFilterFactory, PrimitiveFieldTypeTest, DirectUpdateHandlerOptimizeTest, DirectUpdateHandlerTest, TestCJKWidthFilterFactory, TestQuerySenderListener, TestCSVLoader, TestCollationKeyFilterFactory, CacheHeaderTest, BasicDistributedZkTest, CurrencyFieldTest, SystemInfoHandlerTest, TestGermanLightStemFilterFactory, SuggesterWFSTTest, TestPortugueseStemFilterFactory, DisMaxRequestHandlerTest, TestFunctionQuery, DateFieldTest, TestPerFieldSimilarity, TestMappingCharFilterFactory, TestThaiWordFilterFactory, TestExtendedDismaxParser, ShowFileRequestHandlerTest, CommonGramsQueryFilterFactoryTest, QueryElevationComponentTest, TestQueryUtils, TestLatvianStemFilterFactory, AutoCommitTest, TestChineseFilterFactory, CopyFieldTest, TestGermanStemFilterFactory, RequiredFieldsTest, TestPropInject, TestPortugueseMinimalStemFilterFactory, EchoParamsTest, TestStemmerOverrideFilterFactory, TestRTGBase, BadComponentTest, TestSynonymFilterFactory, XmlUpdateRequestHandlerTest, SimpleFacetsTest, SolrCoreCheckLockOnStartupTest, TestDictionaryCompoundWordTokenFilterFactory, TestJoin, TestGalicianStemFilterFactory, FastVectorHighlighterTest, LeaderElectionIntegrationTest, TestIndexingPerformance, RecoveryZkTest, SpatialFilterTest, TestStressRecovery, PluginInfoTest, TestBM25SimilarityFactory, HighlighterTest, BasicFunctionalityTest, TestWordDelimiterFilterFactory, TestPhraseSuggestions, TestGroupingSearch, FileBasedSpellCheckerTest, ConvertedLegacyTest, PeerSyncTest, SortByFunctionTest, SignatureUpdateProcessorFactoryTest, TestJmxIntegration, SampleTest, CoreAdminHandlerTest, TestTrie, SolrRequestParserTest, QueryEqualityTest, TestCSVResponseWriter, MoreLikeThisHandlerTest, DocumentBuilderTest, MBeansHandlerTest, DistributedQueryElevationComponentTest, BinaryUpdateRequestHandlerTest, QueryParsingTest, TermsComponentTest, SolrInfoMBeanTest, TestPHPSerializedResponseWriter, FieldAnalysisRequestHandlerTest, PingRequestHandlerTest, TermVectorComponentTest, TestSurroundQueryParser, DocumentAnalysisRequestHandlerTest, TestSolrQueryParser, ReturnFieldsTest, SearchHandlerTest, LoggingHandlerTest, SolrCmdDistributorTest, CSVRequestHandlerTest, TestFoldingMultitermQuery, UpdateRequestProcessorFactoryTest, TestWriterPerf, SOLR749Test, TestMergePolicyConfig, TestLFUCache, SolrIndexConfigTest, TestJapaneseKatakanaStemFilterFactory, TestSolrCoreProperties, TestJmxMonitoredMap, TestJapaneseTokenizerFactory, TestHyphenationCompoundWordTokenFilterFactory, TestDFRSimilarityFactory, TestCodecSupport, TimeZoneUtilsTest, DateMathParserTest, TestGreekLowerCaseFilterFactory, TestMultiWordSynonyms, TestCapitalizationFilterFactory, ResourceLoaderTest, TestDelimitedPayloadTokenFilterFactory, TestBadConfig, TestBrazilianStemFilterFactory, TestIrishLowerCaseFilterFactory, UUIDFieldTest, SnowballPorterFilterFactoryTest, TestFrenchLightStemFilterFactory, TestHunspellStemFilterFactory, TestPorterStemFilterFactory, TestArabicFilters, ZkNodePropsTest, TestRemoveDuplicatesTokenFilterFactory, TestFinnishLightStemFilterFactory, TestRussianLightStemFilterFactory, TestCJKTokenizerFactory, TestChineseTokenizerFactory, SyncSliceTest]
[junit4:junit4]   2> NOTE: reproduce with: ant test  -Dtestcase=SyncSliceTest -Dtests.seed=8AA555345225E9B5 -Dtests.multiplier=3 -Dtests.slow=true -Dtests.locale=vi_VN -Dtests.timezone=America/Chicago -Dtests.file.encoding=UTF-8
[junit4:junit4]   2>
[junit4:junit4] ERROR   0.00s J0 | SyncSliceTest (suite)
[junit4:junit4]    > Throwable #1: java.lang.AssertionError: ERROR: SolrIndexSearcher opens=24 closes=23
[junit4:junit4]    > at __randomizedtesting.SeedInfo.seed([8AA555345225E9B5]:0)
[junit4:junit4]    > at org.junit.Assert.fail(Assert.java:93)
[junit4:junit4]    > at org.apache.solr.SolrTestCaseJ4.endTrackingSearchers(SolrTestCaseJ4.java:216)
[junit4:junit4]    > at org.apache.solr.SolrTestCaseJ4.afterClass(SolrTestCaseJ4.java:82)
[junit4:junit4]    > at sun.reflect.GeneratedMethodAccessor15.invoke(Unknown Source)
[junit4:junit4]    > at sun.reflect.DelegatingMethodAccessorImpl.invoke(DelegatingMethodAccessorImpl.java:43)
[junit4:junit4]    > at java.lang.reflect.Method.invoke(Method.java:616)
[junit4:junit4]    > at com.carrotsearch.randomizedtesting.RandomizedRunner.invoke(RandomizedRunner.java:1995)
[junit4:junit4]    > at com.carrotsearch.randomizedtesting.RandomizedRunner.access$1100(RandomizedRunner.java:132)
[junit4:junit4]    > at com.carrotsearch.randomizedtesting.RandomizedRunner$5.evaluate(RandomizedRunner.java:754)
[junit4:junit4]    > at com.carrotsearch.randomizedtesting.rules.SystemPropertiesRestoreRule$1.evaluate(SystemPropertiesRestoreRule.java:53)
[junit4:junit4]    > at org.apache.lucene.util.AbstractBeforeAfterRule$1.evaluate(AbstractBeforeAfterRule.java:45)
[junit4:junit4]    > at org.apache.lucene.util.TestRuleReportUncaughtExceptions$1.evaluate(TestRuleReportUncaughtExceptions.java:68)
[junit4:junit4]    > at org.apache.lucene.util.TestRuleStoreClassName$1.evaluate(TestRuleStoreClassName.java:38)
[junit4:junit4]    > at org.apache.lucene.util.TestRuleIcuHack$1.evaluate(TestRuleIcuHack.java:51)
[junit4:junit4]    > at com.carrotsearch.randomizedtesting.rules.SystemPropertiesInvariantRule$1.evaluate(SystemPropertiesInvariantRule.java:55)
[junit4:junit4]    > at org.apache.lucene.util.TestRuleNoInstanceHooksOverrides$1.evaluate(TestRuleNoInstanceHooksOverrides.java:53)
[junit4:junit4]    > at org.apache.lucene.util.TestRuleNoStaticHooksShadowing$1.evaluate(TestRuleNoStaticHooksShadowing.java:52)
[junit4:junit4]    > at org.apache.lucene.util.TestRuleAssertionsRequired$1.evaluate(TestRuleAssertionsRequired.java:36)
[junit4:junit4]    > at org.apache.lucene.util.TestRuleMarkFailure$1.evaluate(TestRuleMarkFailure.java:48)
[junit4:junit4]    > at org.apache.lucene.util.TestRuleIgnoreAfterMaxFailures$1.evaluate(TestRuleIgnoreAfterMaxFailures.java:70)
[junit4:junit4]    > at org.apache.lucene.util.TestRuleIgnoreTestSuites$1.evaluate(TestRuleIgnoreTestSuites.java:55)
[junit4:junit4]    > at com.carrotsearch.randomizedtesting.RandomizedRunner.runSuite(RandomizedRunner.java:605)
[junit4:junit4]    > at com.carrotsearch.randomizedtesting.RandomizedRunner.access$400(RandomizedRunner.java:132)
[junit4:junit4]    > at com.carrotsearch.randomizedtesting.RandomizedRunner$2.run(RandomizedRunner.java:551)
[junit4:junit4]    >
[junit4:junit4] Completed on J0 in 159.06s, 1 test, 1 failure <<< FAILURES!
[...truncated 21 lines...]

[...truncated 10027 lines...]

[...truncated 10027 lines...]

[...truncated 10027 lines...]

[...truncated 10027 lines...]

[...truncated 9971 lines...]
[junit4:junit4]   2> 159030 T5636 oas.SolrTestCaseJ4.endTrackingSearchers SEVERE ERROR: SolrIndexSearcher opens=24 closes=23
[junit4:junit4]   2> NOTE: test params are: codec=Lucene40: {range_facet_l=Pulsing40(freqCutoff=7 minBlockSize=31 maxBlockSize=67), text=PostingsFormat(name=NestedPulsing), _version_=PostingsFormat(name=Direct), rnd_b=PostingsFormat(name=Memory doPackFST= true), intDefault=PostingsFormat(name=Direct), id=PostingsFormat(name=Memory doPackFST= true), timestamp=Pulsing40(freqCutoff=7 minBlockSize=31 maxBlockSize=67), a_t=Pulsing40(freqCutoff=7 minBlockSize=31 maxBlockSize=67), range_facet_sl=PostingsFormat(name=Memory doPackFST= true), range_facet_si=Pulsing40(freqCutoff=7 minBlockSize=31 maxBlockSize=67), other_tl1=PostingsFormat(name=Direct), multiDefault=Pulsing40(freqCutoff=7 minBlockSize=31 maxBlockSize=67), a_si=PostingsFormat(name=Direct)}, sim=RandomSimilarityProvider(queryNorm=true,coord=true): {}, locale=vi_VN, timezone=America/Chicago
[junit4:junit4]   2> NOTE: FreeBSD 9.0-RELEASE amd64/Sun Microsystems Inc. 1.6.0_32 (64-bit)/cpus=16,threads=6,free=244178896,total=341966848
[junit4:junit4]   2> NOTE: All tests run in this JVM: [NumericFieldsTest, MinimalSchemaTest, TestNorwegianLightStemFilterFactory, TestBinaryField, OutputWriterTest, TestFrenchMinimalStemFilterFactory, DOMUtilTest, LegacyHTMLStripCharFilterTest, AnalysisAfterCoreReloadTest, SuggesterTest, TestReversedWildcardFilterFactory, SuggesterTSTTest, TestJapaneseIterationMarkCharFilterFactory, PreAnalyzedFieldTest, JSONWriterTest, TestSlowSynonymFilter, TestHTMLStripCharFilterFactory, TestJapaneseBaseFormFilterFactory, PrimitiveFieldTypeTest, DirectUpdateHandlerOptimizeTest, DirectUpdateHandlerTest, TestCJKWidthFilterFactory, TestQuerySenderListener, TestCSVLoader, TestCollationKeyFilterFactory, CacheHeaderTest, BasicDistributedZkTest, CurrencyFieldTest, SystemInfoHandlerTest, TestGermanLightStemFilterFactory, SuggesterWFSTTest, TestPortugueseStemFilterFactory, DisMaxRequestHandlerTest, TestFunctionQuery, DateFieldTest, TestPerFieldSimilarity, TestMappingCharFilterFactory, TestThaiWordFilterFactory, TestExtendedDismaxParser, ShowFileRequestHandlerTest, CommonGramsQueryFilterFactoryTest, QueryElevationComponentTest, TestQueryUtils, TestLatvianStemFilterFactory, AutoCommitTest, TestChineseFilterFactory, CopyFieldTest, TestGermanStemFilterFactory, RequiredFieldsTest, TestPropInject, TestPortugueseMinimalStemFilterFactory, EchoParamsTest, TestStemmerOverrideFilterFactory, TestRTGBase, BadComponentTest, TestSynonymFilterFactory, XmlUpdateRequestHandlerTest, SimpleFacetsTest, SolrCoreCheckLockOnStartupTest, TestDictionaryCompoundWordTokenFilterFactory, TestJoin, TestGalicianStemFilterFactory, FastVectorHighlighterTest, LeaderElectionIntegrationTest, TestIndexingPerformance, RecoveryZkTest, SpatialFilterTest, TestStressRecovery, PluginInfoTest, TestBM25SimilarityFactory, HighlighterTest, BasicFunctionalityTest, TestWordDelimiterFilterFactory, TestPhraseSuggestions, TestGroupingSearch, FileBasedSpellCheckerTest, ConvertedLegacyTest, PeerSyncTest, SortByFunctionTest, SignatureUpdateProcessorFactoryTest, TestJmxIntegration, SampleTest, CoreAdminHandlerTest, TestTrie, SolrRequestParserTest, QueryEqualityTest, TestCSVResponseWriter, MoreLikeThisHandlerTest, DocumentBuilderTest, MBeansHandlerTest, DistributedQueryElevationComponentTest, BinaryUpdateRequestHandlerTest, QueryParsingTest, TermsComponentTest, SolrInfoMBeanTest, TestPHPSerializedResponseWriter, FieldAnalysisRequestHandlerTest, PingRequestHandlerTest, TermVectorComponentTest, TestSurroundQueryParser, DocumentAnalysisRequestHandlerTest, TestSolrQueryParser, ReturnFieldsTest, SearchHandlerTest, LoggingHandlerTest, SolrCmdDistributorTest, CSVRequestHandlerTest, TestFoldingMultitermQuery, UpdateRequestProcessorFactoryTest, TestWriterPerf, SOLR749Test, TestMergePolicyConfig, TestLFUCache, SolrIndexConfigTest, TestJapaneseKatakanaStemFilterFactory, TestSolrCoreProperties, TestJmxMonitoredMap, TestJapaneseTokenizerFactory, TestHyphenationCompoundWordTokenFilterFactory, TestDFRSimilarityFactory, TestCodecSupport, TimeZoneUtilsTest, DateMathParserTest, TestGreekLowerCaseFilterFactory, TestMultiWordSynonyms, TestCapitalizationFilterFactory, ResourceLoaderTest, TestDelimitedPayloadTokenFilterFactory, TestBadConfig, TestBrazilianStemFilterFactory, TestIrishLowerCaseFilterFactory, UUIDFieldTest, SnowballPorterFilterFactoryTest, TestFrenchLightStemFilterFactory, TestHunspellStemFilterFactory, TestPorterStemFilterFactory, TestArabicFilters, ZkNodePropsTest, TestRemoveDuplicatesTokenFilterFactory, TestFinnishLightStemFilterFactory, TestRussianLightStemFilterFactory, TestCJKTokenizerFactory, TestChineseTokenizerFactory, SyncSliceTest]
[junit4:junit4]   2> NOTE: reproduce with: ant test  -Dtestcase=SyncSliceTest -Dtests.seed=8AA555345225E9B5 -Dtests.multiplier=3 -Dtests.slow=true -Dtests.locale=vi_VN -Dtests.timezone=America/Chicago -Dtests.file.encoding=UTF-8
[junit4:junit4]   2>
[junit4:junit4] ERROR   0.00s J0 | SyncSliceTest (suite)
[junit4:junit4]    > Throwable #1: java.lang.AssertionError: ERROR: SolrIndexSearcher opens=24 closes=23
[junit4:junit4]    > at __randomizedtesting.SeedInfo.seed([8AA555345225E9B5]:0)
[junit4:junit4]    > at org.junit.Assert.fail(Assert.java:93)
[junit4:junit4]    > at org.apache.solr.SolrTestCaseJ4.endTrackingSearchers(SolrTestCaseJ4.java:216)
[junit4:junit4]    > at org.apache.solr.SolrTestCaseJ4.afterClass(SolrTestCaseJ4.java:82)
[junit4:junit4]    > at sun.reflect.GeneratedMethodAccessor15.invoke(Unknown Source)
[junit4:junit4]    > at sun.reflect.DelegatingMethodAccessorImpl.invoke(DelegatingMethodAccessorImpl.java:43)
[junit4:junit4]    > at java.lang.reflect.Method.invoke(Method.java:616)
[junit4:junit4]    > at com.carrotsearch.randomizedtesting.RandomizedRunner.invoke(RandomizedRunner.java:1995)
[junit4:junit4]    > at com.carrotsearch.randomizedtesting.RandomizedRunner.access$1100(RandomizedRunner.java:132)
[junit4:junit4]    > at com.carrotsearch.randomizedtesting.RandomizedRunner$5.evaluate(RandomizedRunner.java:754)
[junit4:junit4]    > at com.carrotsearch.randomizedtesting.rules.SystemPropertiesRestoreRule$1.evaluate(SystemPropertiesRestoreRule.java:53)
[junit4:junit4]    > at org.apache.lucene.util.AbstractBeforeAfterRule$1.evaluate(AbstractBeforeAfterRule.java:45)
[junit4:junit4]    > at org.apache.lucene.util.TestRuleReportUncaughtExceptions$1.evaluate(TestRuleReportUncaughtExceptions.java:68)
[junit4:junit4]    > at org.apache.lucene.util.TestRuleStoreClassName$1.evaluate(TestRuleStoreClassName.java:38)
[junit4:junit4]    > at org.apache.lucene.util.TestRuleIcuHack$1.evaluate(TestRuleIcuHack.java:51)
[junit4:junit4]    > at com.carrotsearch.randomizedtesting.rules.SystemPropertiesInvariantRule$1.evaluate(SystemPropertiesInvariantRule.java:55)
[junit4:junit4]    > at org.apache.lucene.util.TestRuleNoInstanceHooksOverrides$1.evaluate(TestRuleNoInstanceHooksOverrides.java:53)
[junit4:junit4]    > at org.apache.lucene.util.TestRuleNoStaticHooksShadowing$1.evaluate(TestRuleNoStaticHooksShadowing.java:52)
[junit4:junit4]    > at org.apache.lucene.util.TestRuleAssertionsRequired$1.evaluate(TestRuleAssertionsRequired.java:36)
[junit4:junit4]    > at org.apache.lucene.util.TestRuleMarkFailure$1.evaluate(TestRuleMarkFailure.java:48)
[junit4:junit4]    > at org.apache.lucene.util.TestRuleIgnoreAfterMaxFailures$1.evaluate(TestRuleIgnoreAfterMaxFailures.java:70)
[junit4:junit4]    > at org.apache.lucene.util.TestRuleIgnoreTestSuites$1.evaluate(TestRuleIgnoreTestSuites.java:55)
[junit4:junit4]    > at com.carrotsearch.randomizedtesting.RandomizedRunner.runSuite(RandomizedRunner.java:605)
[junit4:junit4]    > at com.carrotsearch.randomizedtesting.RandomizedRunner.access$400(RandomizedRunner.java:132)
[junit4:junit4]    > at com.carrotsearch.randomizedtesting.RandomizedRunner$2.run(RandomizedRunner.java:551)
[junit4:junit4]    >
[junit4:junit4] Completed on J0 in 159.06s, 1 test, 1 failure <<< FAILURES!
[junit4:junit4]  
[junit4:junit4] JVM J0:     0.83 ..   915.92 =   915.09s
[junit4:junit4] JVM J1:     0.82 ..   909.37 =   908.55s
[junit4:junit4] Execution time total: 15 minutes 16 seconds
[junit4:junit4] Tests summary: 305 suites, 1085 tests, 1 suite-level error, 5 ignored

BUILD FAILED
/usr/home/hudson/hudson-slave/workspace/Lucene-Solr-tests-only-4.x/checkout/build.xml:29: The following error occurred while executing this line:
/usr/home/hudson/hudson-slave/workspace/Lucene-Solr-tests-only-4.x/checkout/solr/build.xml:144: The following error occurred while executing this line:
/usr/home/hudson/hudson-slave/workspace/Lucene-Solr-tests-only-4.x/checkout/lucene/module-build.xml:62: The following error occurred while executing this line:
/usr/home/hudson/hudson-slave/workspace/Lucene-Solr-tests-only-4.x/checkout/lucene/common-build.xml:1094: The following error occurred while executing this line:
/usr/home/hudson/hudson-slave/workspace/Lucene-Solr-tests-only-4.x/checkout/lucene/common-build.xml:789: There were test failures: 305 suites, 1085 tests, 1 suite-level error, 5 ignored

Total time: 28 minutes 41 seconds
Build step 'Execute shell' marked build as failure
Archiving artifacts
Recording test results
Publishing Clover coverage report...
No Clover report will be published due to a Build Failure
Email was triggered for: Failure
Sending email for trigger: Failure




---------------------------------------------------------------------
To unsubscribe, e-mail: [hidden email]
For additional commands, e-mail: [hidden email]