[JENKINS] Lucene-Solr-tests-only-trunk - Build # 12040 - Failure

classic Classic list List threaded Threaded
1 message Options
Reply | Threaded
Open this post in threaded view
|

[JENKINS] Lucene-Solr-tests-only-trunk - Build # 12040 - Failure

Apache Jenkins Server-2
Build: https://builds.apache.org/job/Lucene-Solr-tests-only-trunk/12040/

1 tests failed.
FAILED:  junit.framework.TestSuite.org.apache.solr.update.processor.SignatureUpdateProcessorFactoryTest

Error Message:
java.lang.AssertionError: directory of test was not closed, opened from: org.apache.solr.core.MockDirectoryFactory.create(MockDirectoryFactory.java:34)

Stack Trace:
java.lang.RuntimeException: java.lang.AssertionError: directory of test was not closed, opened from: org.apache.solr.core.MockDirectoryFactory.create(MockDirectoryFactory.java:34)
        at org.apache.lucene.util.LuceneTestCase.afterClassLuceneTestCaseJ4(LuceneTestCase.java:405)
        at org.apache.lucene.util.LuceneTestCase.checkResourcesAfterClass(LuceneTestCase.java:445)
        at org.apache.lucene.util.LuceneTestCase.afterClassLuceneTestCaseJ4(LuceneTestCase.java:373)




Build Log (for compile errors):
[...truncated 8179 lines...]



---------------------------------------------------------------------
To unsubscribe, e-mail: [hidden email]
For additional commands, e-mail: [hidden email]