[JENKINS] Lucene-Solr-tests-only-trunk - Build # 14921 - Failure

classic Classic list List threaded Threaded
2 messages Options
Reply | Threaded
Open this post in threaded view
|

[JENKINS] Lucene-Solr-tests-only-trunk - Build # 14921 - Failure

Apache Jenkins Server-2
Build: https://builds.apache.org/job/Lucene-Solr-tests-only-trunk/14921/

1 tests failed.
REGRESSION:  org.apache.solr.cloud.FullSolrCloudTest.testDistribSearch

Error Message:
Shard still reported as live in zk

Stack Trace:
java.lang.AssertionError: Shard still reported as live in zk
        at __randomizedtesting.SeedInfo.seed([9D62B7EF64A572D1:1C8439F713FA12ED]:0)
        at org.junit.Assert.fail(Assert.java:93)
        at org.apache.solr.cloud.FullSolrCloudTest.brindDownShardIndexSomeDocsAndRecover(FullSolrCloudTest.java:715)
        at org.apache.solr.cloud.FullSolrCloudTest.doTest(FullSolrCloudTest.java:559)
        at org.apache.solr.BaseDistributedSearchTestCase.testDistribSearch(BaseDistributedSearchTestCase.java:679)
        at sun.reflect.NativeMethodAccessorImpl.invoke0(Native Method)
        at sun.reflect.NativeMethodAccessorImpl.invoke(NativeMethodAccessorImpl.java:57)
        at sun.reflect.DelegatingMethodAccessorImpl.invoke(DelegatingMethodAccessorImpl.java:43)
        at java.lang.reflect.Method.invoke(Method.java:616)
        at com.carrotsearch.randomizedtesting.RandomizedRunner.invoke(RandomizedRunner.java:1995)
        at com.carrotsearch.randomizedtesting.RandomizedRunner.access$1100(RandomizedRunner.java:132)
        at com.carrotsearch.randomizedtesting.RandomizedRunner$6.evaluate(RandomizedRunner.java:818)
        at com.carrotsearch.randomizedtesting.RandomizedRunner$7.evaluate(RandomizedRunner.java:877)
        at com.carrotsearch.randomizedtesting.RandomizedRunner$8.evaluate(RandomizedRunner.java:891)
        at com.carrotsearch.randomizedtesting.rules.SystemPropertiesRestoreRule$1.evaluate(SystemPropertiesRestoreRule.java:53)
        at org.apache.lucene.util.TestRuleSetupTeardownChained$1.evaluate(TestRuleSetupTeardownChained.java:50)
        at org.apache.lucene.util.TestRuleFieldCacheSanity$1.evaluate(TestRuleFieldCacheSanity.java:32)
        at org.apache.lucene.util.AbstractBeforeAfterRule$1.evaluate(AbstractBeforeAfterRule.java:45)
        at com.carrotsearch.randomizedtesting.rules.SystemPropertiesInvariantRule$1.evaluate(SystemPropertiesInvariantRule.java:55)
        at org.apache.lucene.util.TestRuleReportUncaughtExceptions$1.evaluate(TestRuleReportUncaughtExceptions.java:68)
        at org.apache.lucene.util.TestRuleThreadAndTestName$1.evaluate(TestRuleThreadAndTestName.java:48)
        at org.apache.lucene.util.TestRuleIgnoreAfterMaxFailures$1.evaluate(TestRuleIgnoreAfterMaxFailures.java:70)
        at org.apache.lucene.util.TestRuleMarkFailure$1.evaluate(TestRuleMarkFailure.java:48)
        at com.carrotsearch.randomizedtesting.RandomizedRunner.runSingleTest(RandomizedRunner.java:825)
        at com.carrotsearch.randomizedtesting.RandomizedRunner.access$700(RandomizedRunner.java:132)
        at com.carrotsearch.randomizedtesting.RandomizedRunner$3$1.run(RandomizedRunner.java:671)
        at com.carrotsearch.randomizedtesting.RandomizedRunner$3.evaluate(RandomizedRunner.java:697)
        at com.carrotsearch.randomizedtesting.RandomizedRunner$4.evaluate(RandomizedRunner.java:736)
        at com.carrotsearch.randomizedtesting.RandomizedRunner$5.evaluate(RandomizedRunner.java:747)
        at com.carrotsearch.randomizedtesting.rules.SystemPropertiesRestoreRule$1.evaluate(SystemPropertiesRestoreRule.java:53)
        at org.apache.lucene.util.AbstractBeforeAfterRule$1.evaluate(AbstractBeforeAfterRule.java:45)
        at org.apache.lucene.util.TestRuleReportUncaughtExceptions$1.evaluate(TestRuleReportUncaughtExceptions.java:68)
        at org.apache.lucene.util.TestRuleStoreClassName$1.evaluate(TestRuleStoreClassName.java:38)
        at org.apache.lucene.util.TestRuleIcuHack$1.evaluate(TestRuleIcuHack.java:51)
        at com.carrotsearch.randomizedtesting.rules.SystemPropertiesInvariantRule$1.evaluate(SystemPropertiesInvariantRule.java:55)
        at org.apache.lucene.util.TestRuleNoInstanceHooksOverrides$1.evaluate(TestRuleNoInstanceHooksOverrides.java:53)
        at org.apache.lucene.util.TestRuleNoStaticHooksShadowing$1.evaluate(TestRuleNoStaticHooksShadowing.java:52)
        at org.apache.lucene.util.TestRuleAssertionsRequired$1.evaluate(TestRuleAssertionsRequired.java:36)
        at org.apache.lucene.util.TestRuleMarkFailure$1.evaluate(TestRuleMarkFailure.java:48)
        at org.apache.lucene.util.TestRuleIgnoreAfterMaxFailures$1.evaluate(TestRuleIgnoreAfterMaxFailures.java:70)
        at org.apache.lucene.util.TestRuleIgnoreTestSuites$1.evaluate(TestRuleIgnoreTestSuites.java:55)
        at com.carrotsearch.randomizedtesting.RandomizedRunner.runSuite(RandomizedRunner.java:605)
        at com.carrotsearch.randomizedtesting.RandomizedRunner.access$400(RandomizedRunner.java:132)
        at com.carrotsearch.randomizedtesting.RandomizedRunner$2.run(RandomizedRunner.java:551)




Build Log:
[...truncated 12565 lines...]
[junit4:junit4]   2> 83711 T1185 oaz.ClientCnxn$SendThread.startConnect Opening socket connection to server localhost/127.0.0.1:28168
[junit4:junit4]   2> 93863 T1198 oaz.ClientCnxn$SendThread.run Client session timed out, have not heard from server in 12001ms for sessionid 0x138b19425aa0006, closing socket connection and attempting reconnect
[junit4:junit4]   2> 93864 T1185 oaz.ClientCnxn$SendThread.run Client session timed out, have not heard from server in 12001ms for sessionid 0x138b19425aa0005, closing socket connection and attempting reconnect
[junit4:junit4]   2> 93964 T1162 oaz.ClientCnxn$EventThread.run EventThread shut down
[junit4:junit4]   2> 93964 T1128 oaz.ZooKeeper.close Session: 0x138b19425aa0003 closed
[junit4:junit4]   2> 93966 T1128 oejsh.ContextHandler.doStop stopped o.e.j.s.ServletContextHandler{/solr,null}
[junit4:junit4]   2> 94018 T1128 oasc.ChaosMonkey.monkeyLog monkey: stop shard! 28175
[junit4:junit4]   2> 94018 T1128 oasc.ChaosMonkey.monkeyLog monkey: stop shard! 28177
[junit4:junit4]   2> 94018 T1128 oasc.CoreContainer.shutdown Shutting down CoreContainer instance=1184885397
[junit4:junit4]   2> 94018 T1128 oasc.RecoveryStrategy.close WARNING Stopping recovery for core collection1 zkNodeName=127.0.0.1:28177_solr_collection1
[junit4:junit4]   2> 94019 T1128 oasc.SolrCore.close [collection1]  CLOSING SolrCore org.apache.solr.core.SolrCore@54d9f8e
[junit4:junit4]   2> 94020 T1128 oasc.SolrCore.closeSearcher [collection1] Closing main searcher on request.
[junit4:junit4]   2> 94020 T1128 oasu.DirectUpdateHandler2.close closing DirectUpdateHandler2{commits=7,autocommits=0,soft autocommits=0,optimizes=0,rollbacks=0,expungeDeletes=0,docsPending=0,adds=0,deletesById=0,deletesByQuery=0,errors=0,cumulative_adds=36,cumulative_deletesById=0,cumulative_deletesByQuery=0,cumulative_errors=0}
[junit4:junit4]   2> 94022 T1128 oasc.RecoveryStrategy.close WARNING Stopping recovery for core collection1 zkNodeName=127.0.0.1:28177_solr_collection1
[junit4:junit4]   2> 95247 T1199 oasc.SyncStrategy.syncToMe Could not tell a replica to recover org.apache.solr.client.solrj.SolrServerException: IOException occured when talking to server at: http://127.0.0.1:28175/solr/collection1
[junit4:junit4]   2> at org.apache.solr.client.solrj.impl.HttpSolrServer.request(HttpSolrServer.java:414)
[junit4:junit4]   2> at org.apache.solr.client.solrj.impl.HttpSolrServer.request(HttpSolrServer.java:182)
[junit4:junit4]   2> at org.apache.solr.cloud.SyncStrategy.syncToMe(SyncStrategy.java:237)
[junit4:junit4]   2> at org.apache.solr.cloud.SyncStrategy.syncReplicas(SyncStrategy.java:119)
[junit4:junit4]   2> at org.apache.solr.cloud.SyncStrategy.sync(SyncStrategy.java:82)
[junit4:junit4]   2> at org.apache.solr.cloud.ShardLeaderElectionContext.runLeaderProcess(ElectionContext.java:158)
[junit4:junit4]   2> at org.apache.solr.cloud.LeaderElector.runIamLeaderProcess(LeaderElector.java:151)
[junit4:junit4]   2> at org.apache.solr.cloud.LeaderElector.checkIfIamLeader(LeaderElector.java:96)
[junit4:junit4]   2> at org.apache.solr.cloud.LeaderElector.access$000(LeaderElector.java:57)
[junit4:junit4]   2> at org.apache.solr.cloud.LeaderElector$1.process(LeaderElector.java:125)
[junit4:junit4]   2> at org.apache.zookeeper.ClientCnxn$EventThread.processEvent(ClientCnxn.java:526)
[junit4:junit4]   2> at org.apache.zookeeper.ClientCnxn$EventThread.run(ClientCnxn.java:502)
[junit4:junit4]   2> Caused by: org.apache.http.conn.ConnectTimeoutException: Connect to 127.0.0.1:28175 timed out
[junit4:junit4]   2> at org.apache.http.conn.scheme.PlainSocketFactory.connectSocket(PlainSocketFactory.java:125)
[junit4:junit4]   2> at org.apache.http.impl.conn.DefaultClientConnectionOperator.openConnection(DefaultClientConnectionOperator.java:148)
[junit4:junit4]   2> at org.apache.http.impl.conn.AbstractPoolEntry.open(AbstractPoolEntry.java:150)
[junit4:junit4]   2> at org.apache.http.impl.conn.AbstractPooledConnAdapter.open(AbstractPooledConnAdapter.java:121)
[junit4:junit4]   2> at org.apache.http.impl.client.DefaultRequestDirector.tryConnect(DefaultRequestDirector.java:575)
[junit4:junit4]   2> at org.apache.http.impl.client.DefaultRequestDirector.execute(DefaultRequestDirector.java:425)
[junit4:junit4]   2> at org.apache.http.impl.client.AbstractHttpClient.execute(AbstractHttpClient.java:820)
[junit4:junit4]   2> at org.apache.http.impl.client.AbstractHttpClient.execute(AbstractHttpClient.java:754)
[junit4:junit4]   2> at org.apache.http.impl.client.AbstractHttpClient.execute(AbstractHttpClient.java:732)
[junit4:junit4]   2> at org.apache.solr.client.solrj.impl.HttpSolrServer.request(HttpSolrServer.java:353)
[junit4:junit4]   2> ... 11 more
[junit4:junit4]   2>
[junit4:junit4]   2> 95248 T1199 oasc.RecoveryStrategy.close WARNING Stopping recovery for core collection1 zkNodeName=127.0.0.1:28179_solr_collection1
[junit4:junit4]   2> 95534 T1198 oaz.ClientCnxn$SendThread.startConnect Opening socket connection to server localhost/127.0.0.1:28168
[junit4:junit4]   2> 95905 T1185 oaz.ClientCnxn$SendThread.startConnect Opening socket connection to server localhost/127.0.0.1:28168
[junit4:junit4]   2> 105965 T1198 oaz.ClientCnxn$SendThread.run Client session timed out, have not heard from server in 12001ms for sessionid 0x138b19425aa0006, closing socket connection and attempting reconnect
[junit4:junit4]   2> 106068 T1186 oaz.ClientCnxn$EventThread.run EventThread shut down
[junit4:junit4]   2> 106068 T1128 oaz.ZooKeeper.close Session: 0x138b19425aa0005 closed
[junit4:junit4]   2> 106070 T1128 oejsh.ContextHandler.doStop stopped o.e.j.s.ServletContextHandler{/solr,null}
[junit4:junit4]   2> 106122 T1128 oasc.ChaosMonkey.monkeyLog monkey: stop shard! 28179
[junit4:junit4]   2> 106122 T1128 oasc.CoreContainer.shutdown Shutting down CoreContainer instance=410987208
[junit4:junit4]   2> 106122 T1128 oasc.RecoveryStrategy.close WARNING Stopping recovery for core collection1 zkNodeName=127.0.0.1:28179_solr_collection1
[junit4:junit4]   2> 107187 T1198 oaz.ClientCnxn$SendThread.startConnect Opening socket connection to server localhost/127.0.0.1:28168
[junit4:junit4]   2> 118168 T1128 oaz.ZooKeeper.close Session: 0x138b19425aa0006 closed
[junit4:junit4]   2> 118169 T1128 oejsh.ContextHandler.doStop stopped o.e.j.s.ServletContextHandler{/solr,null}
[junit4:junit4]   2> 118261 T1128 oas.SolrTestCaseJ4.tearDown ###Ending testDistribSearch
[junit4:junit4]   1>        /solr/collections/control_collection/leader_elect/control_shard/election/88015442578898946-127.0.0.1:28171_solr_collection1-n_0000000000 (0)
[junit4:junit4]   1>     /solr/collections/control_collection/leaders (1)
[junit4:junit4]   1>      /solr/collections/control_collection/leaders/control_shard (0)
[junit4:junit4]   1>      DATA:
[junit4:junit4]   1>          {
[junit4:junit4]   1>            "core":"collection1",
[junit4:junit4]   1>            "node_name":"127.0.0.1:28171_solr",
[junit4:junit4]   1>            "base_url":"http://127.0.0.1:28171/solr"}
[junit4:junit4]   1>   /solr/clusterstate.json (0)
[junit4:junit4]   1>   DATA:
[junit4:junit4]   1>       {
[junit4:junit4]   1>         "collection1":{
[junit4:junit4]   1>           "shard1":{
[junit4:junit4]   1>             "127.0.0.1:28173_solr_collection1":{
[junit4:junit4]   1>               "shard":"shard1",
[junit4:junit4]   1>               "roles":null,
[junit4:junit4]   1>               "leader":"true",
[junit4:junit4]   1>               "state":"active",
[junit4:junit4]   1>               "core":"collection1",
[junit4:junit4]   1>               "collection":"collection1",
[junit4:junit4]   1>               "node_name":"127.0.0.1:28173_solr",
[junit4:junit4]   1>               "base_url":"http://127.0.0.1:28173/solr"},
[junit4:junit4]   1>             "127.0.0.1:28177_solr_collection1":{
[junit4:junit4]   1>               "shard":"shard1",
[junit4:junit4]   1>               "roles":null,
[junit4:junit4]   1>               "state":"active",
[junit4:junit4]   1>               "core":"collection1",
[junit4:junit4]   1>               "collection":"collection1",
[junit4:junit4]   1>               "node_name":"127.0.0.1:28177_solr",
[junit4:junit4]   1>               "base_url":"http://127.0.0.1:28177/solr"}},
[junit4:junit4]   1>           "shard2":{
[junit4:junit4]   1>             "127.0.0.1:28175_solr_collection1":{
[junit4:junit4]   1>               "shard":"shard2",
[junit4:junit4]   1>               "leader":"true",
[junit4:junit4]   1>               "roles":null,
[junit4:junit4]   1>               "state":"active",
[junit4:junit4]   1>               "core":"collection1",
[junit4:junit4]   1>               "collection":"collection1",
[junit4:junit4]   1>               "node_name":"127.0.0.1:28175_solr",
[junit4:junit4]   1>               "base_url":"http://127.0.0.1:28175/solr"},
[junit4:junit4]   1>             "127.0.0.1:28179_solr_collection1":{
[junit4:junit4]   1>               "shard":"shard2",
[junit4:junit4]   1>               "roles":null,
[junit4:junit4]   1>               "state":"active",
[junit4:junit4]   1>               "core":"collection1",
[junit4:junit4]   1>               "collection":"collection1",
[junit4:junit4]   1>               "node_name":"127.0.0.1:28179_solr",
[junit4:junit4]   1>               "base_url":"http://127.0.0.1:28179/solr"}}},
[junit4:junit4]   1>         "control_collection":{"control_shard":{"127.0.0.1:28171_solr_collection1":{
[junit4:junit4]   1>               "shard":"control_shard",
[junit4:junit4]   1>               "roles":null,
[junit4:junit4]   1>               "leader":"true",
[junit4:junit4]   1>               "state":"active",
[junit4:junit4]   1>               "core":"collection1",
[junit4:junit4]   1>               "collection":"control_collection",
[junit4:junit4]   1>               "node_name":"127.0.0.1:28171_solr",
[junit4:junit4]   1>               "base_url":"http://127.0.0.1:28171/solr"}}}}
[junit4:junit4]   1>  /zookeeper (1)
[junit4:junit4]   1>  DATA:
[junit4:junit4]   1>      
[junit4:junit4]   1>
[junit4:junit4]   2> NOTE: reproduce with: ant test  -Dtestcase=FullSolrCloudTest -Dtests.method=testDistribSearch -Dtests.seed=9D62B7EF64A572D1 -Dtests.multiplier=3 -Dtests.slow=true -Dtests.locale=de_CH -Dtests.timezone=America/Blanc-Sablon -Dtests.file.encoding=ISO-8859-1
[junit4:junit4]   1>
[junit4:junit4]   2>
[junit4:junit4]    > (@AfterClass output)
[junit4:junit4]   2> 118288 T1128 oas.SolrTestCaseJ4.deleteCore ###deleteCore
[junit4:junit4]   2> 119169 T1199 oasc.SolrCore.close [collection1]  CLOSING SolrCore org.apache.solr.core.SolrCore@6e1fd915
[junit4:junit4]   2> 119171 T1199 oasc.SolrCore.closeSearcher [collection1] Closing main searcher on request.
[junit4:junit4]   2> 119173 T1199 oasu.DirectUpdateHandler2.close closing DirectUpdateHandler2{commits=6,autocommits=0,soft autocommits=0,optimizes=0,rollbacks=0,expungeDeletes=0,docsPending=0,adds=0,deletesById=0,deletesByQuery=0,errors=0,cumulative_adds=36,cumulative_deletesById=0,cumulative_deletesByQuery=0,cumulative_errors=0}
[junit4:junit4]   2> 119174 T1199 oasc.RecoveryStrategy.close WARNING Stopping recovery for core collection1 zkNodeName=127.0.0.1:28179_solr_collection1
[junit4:junit4]   2> 119175 T1199 oasc.LeaderElector$1.process WARNING  org.apache.zookeeper.KeeperException$SessionExpiredException: KeeperErrorCode = Session expired for /overseer/queue/qn-
[junit4:junit4]   2> at org.apache.zookeeper.KeeperException.create(KeeperException.java:118)
[junit4:junit4]   2> at org.apache.zookeeper.KeeperException.create(KeeperException.java:42)
[junit4:junit4]   2> at org.apache.zookeeper.ZooKeeper.create(ZooKeeper.java:643)
[junit4:junit4]   2> at org.apache.solr.common.cloud.SolrZkClient$5.execute(SolrZkClient.java:244)
[junit4:junit4]   2> at org.apache.solr.common.cloud.SolrZkClient$5.execute(SolrZkClient.java:241)
[junit4:junit4]   2> at org.apache.solr.common.cloud.ZkCmdExecutor.retryOperation(ZkCmdExecutor.java:67)
[junit4:junit4]   2> at org.apache.solr.common.cloud.SolrZkClient.create(SolrZkClient.java:241)
[junit4:junit4]   2> at org.apache.solr.cloud.DistributedQueue.offer(DistributedQueue.java:236)
[junit4:junit4]   2> at org.apache.solr.cloud.ZkController.publish(ZkController.java:734)
[junit4:junit4]   2> at org.apache.solr.cloud.ShardLeaderElectionContext.runLeaderProcess(ElectionContext.java:168)
[junit4:junit4]   2> at org.apache.solr.cloud.LeaderElector.runIamLeaderProcess(LeaderElector.java:151)
[junit4:junit4]   2> at org.apache.solr.cloud.LeaderElector.checkIfIamLeader(LeaderElector.java:96)
[junit4:junit4]   2> at org.apache.solr.cloud.LeaderElector.access$000(LeaderElector.java:57)
[junit4:junit4]   2> at org.apache.solr.cloud.LeaderElector$1.process(LeaderElector.java:125)
[junit4:junit4]   2> at org.apache.zookeeper.ClientCnxn$EventThread.processEvent(ClientCnxn.java:526)
[junit4:junit4]   2> at org.apache.zookeeper.ClientCnxn$EventThread.run(ClientCnxn.java:502)
[junit4:junit4]   2>
[junit4:junit4]   2> 119175 T1199 oascc.ZkStateReader$3.process Updating live nodes
[junit4:junit4]   2> 119175 T1199 oascc.ZkStateReader$3.process WARNING ZooKeeper watch triggered, but Solr cannot talk to ZK
[junit4:junit4]   2> 119175 T1199 oascc.ConnectionManager.process Watcher org.apache.solr.common.cloud.ConnectionManager@51f09baf name:ZooKeeperConnection Watcher:127.0.0.1:28168/solr got event WatchedEvent state:Disconnected type:None path:null path:null type:None
[junit4:junit4]   2> 119176 T1199 oaz.ClientCnxn$EventThread.run EventThread shut down
[junit4:junit4]   2> NOTE: test params are: codec=Asserting, sim=RandomSimilarityProvider(queryNorm=true,coord=false): {}, locale=de_CH, timezone=America/Blanc-Sablon
[junit4:junit4]   2> NOTE: FreeBSD 9.0-RELEASE amd64/Sun Microsystems Inc. 1.6.0_32 (64-bit)/cpus=16,threads=2,free=65245480,total=225837056
[junit4:junit4]   2> NOTE: All tests run in this JVM: [BadIndexSchemaTest, RAMDirectoryFactoryTest, NoCacheHeaderTest, SpellPossibilityIteratorTest, UUIDFieldTest, SuggesterFSTTest, TestUtils, QueryEqualityTest, ReturnFieldsTest, TestConfig, TestSolrXMLSerializer, SpellCheckCollatorTest, TestValueSourceCache, TestCSVResponseWriter, TestJapaneseTokenizerFactory, SampleTest, TestFastLRUCache, TestGermanNormalizationFilterFactory, TestArbitraryIndexDir, XsltUpdateRequestHandlerTest, JsonLoaderTest, LeaderElectionTest, ZkControllerTest, StandardRequestHandlerTest, TestDocumentBuilder, TestCJKBigramFilterFactory, TestPortugueseLightStemFilterFactory, DistributedTermsComponentTest, TestKeywordMarkerFilterFactory, PolyFieldTest, TestJmxMonitoredMap, TestRealTimeGet, TermVectorComponentTest, CSVRequestHandlerTest, FileBasedSpellCheckerTest, TestPluginEnable, TestLMJelinekMercerSimilarityFactory, TestIndonesianStemFilterFactory, TestQueryTypes, ZkCLITest, TestXIncludeConfig, DocumentBuilderTest, TestLMDirichletSimilarityFactory, TestSystemIdResolver, TestOmitPositions, CircularListTest, TestCollationField, TestJapaneseIterationMarkCharFilterFactory, TestShingleFilterFactory, TestGroupingSearch, SolrCoreTest, TestWikipediaTokenizerFactory, WordBreakSolrSpellCheckerTest, DistanceFunctionTest, TestHunspellStemFilterFactory, PrimUtilsTest, SortByFunctionTest, LoggingHandlerTest, TestQuerySenderNoQuery, TestSort, TestCoreContainer, TestRussianLightStemFilterFactory, TimeZoneUtilsTest, TestHindiFilters, TestKeepFilterFactory, TestPropInjectDefaults, UpdateParamsTest, TestPseudoReturnFields, SignatureUpdateProcessorFactoryTest, DebugComponentTest, OverseerTest, FullSolrCloudTest]
[junit4:junit4]   2>
[junit4:junit4] Completed on J1 in 119.30s, 1 test, 1 failure <<< FAILURES!
[...truncated 615 lines...]

[...truncated 13331 lines...]

[...truncated 13331 lines...]

[...truncated 13331 lines...]

[...truncated 13331 lines...]

[...truncated 13316 lines...]
BUILD FAILED
/usr/home/hudson/hudson-slave/workspace/Lucene-Solr-tests-only-trunk/checkout/build.xml:29: The following error occurred while executing this line:
/usr/home/hudson/hudson-slave/workspace/Lucene-Solr-tests-only-trunk/checkout/solr/build.xml:144: The following error occurred while executing this line:
/usr/home/hudson/hudson-slave/workspace/Lucene-Solr-tests-only-trunk/checkout/lucene/module-build.xml:62: The following error occurred while executing this line:
/usr/home/hudson/hudson-slave/workspace/Lucene-Solr-tests-only-trunk/checkout/lucene/common-build.xml:1094: The following error occurred while executing this line:
/usr/home/hudson/hudson-slave/workspace/Lucene-Solr-tests-only-trunk/checkout/lucene/common-build.xml:789: There were test failures: 297 suites, 1054 tests, 1 failure, 5 ignored

Total time: 29 minutes 51 seconds
Build step 'Execute shell' marked build as failure
Archiving artifacts
Recording test results
Publishing Clover coverage report...
No Clover report will be published due to a Build Failure
Email was triggered for: Failure
Sending email for trigger: Failure




---------------------------------------------------------------------
To unsubscribe, e-mail: [hidden email]
For additional commands, e-mail: [hidden email]
Reply | Threaded
Open this post in threaded view
|

[JENKINS] Lucene-Solr-tests-only-trunk - Build # 14922 - Still Failing

Apache Jenkins Server-2
Build: https://builds.apache.org/job/Lucene-Solr-tests-only-trunk/14922/

2 tests failed.
FAILED:  junit.framework.TestSuite.org.apache.solr.cloud.SyncSliceTest

Error Message:
ERROR: SolrIndexSearcher opens=24 closes=23

Stack Trace:
java.lang.AssertionError: ERROR: SolrIndexSearcher opens=24 closes=23
        at __randomizedtesting.SeedInfo.seed([747F9BFECA4C10AD]:0)
        at org.junit.Assert.fail(Assert.java:93)
        at org.apache.solr.SolrTestCaseJ4.endTrackingSearchers(SolrTestCaseJ4.java:216)
        at org.apache.solr.SolrTestCaseJ4.afterClass(SolrTestCaseJ4.java:82)
        at sun.reflect.GeneratedMethodAccessor16.invoke(Unknown Source)
        at sun.reflect.DelegatingMethodAccessorImpl.invoke(DelegatingMethodAccessorImpl.java:43)
        at java.lang.reflect.Method.invoke(Method.java:616)
        at com.carrotsearch.randomizedtesting.RandomizedRunner.invoke(RandomizedRunner.java:1995)
        at com.carrotsearch.randomizedtesting.RandomizedRunner.access$1100(RandomizedRunner.java:132)
        at com.carrotsearch.randomizedtesting.RandomizedRunner$5.evaluate(RandomizedRunner.java:754)
        at com.carrotsearch.randomizedtesting.rules.SystemPropertiesRestoreRule$1.evaluate(SystemPropertiesRestoreRule.java:53)
        at org.apache.lucene.util.AbstractBeforeAfterRule$1.evaluate(AbstractBeforeAfterRule.java:45)
        at org.apache.lucene.util.TestRuleReportUncaughtExceptions$1.evaluate(TestRuleReportUncaughtExceptions.java:68)
        at org.apache.lucene.util.TestRuleStoreClassName$1.evaluate(TestRuleStoreClassName.java:38)
        at org.apache.lucene.util.TestRuleIcuHack$1.evaluate(TestRuleIcuHack.java:51)
        at com.carrotsearch.randomizedtesting.rules.SystemPropertiesInvariantRule$1.evaluate(SystemPropertiesInvariantRule.java:55)
        at org.apache.lucene.util.TestRuleNoInstanceHooksOverrides$1.evaluate(TestRuleNoInstanceHooksOverrides.java:53)
        at org.apache.lucene.util.TestRuleNoStaticHooksShadowing$1.evaluate(TestRuleNoStaticHooksShadowing.java:52)
        at org.apache.lucene.util.TestRuleAssertionsRequired$1.evaluate(TestRuleAssertionsRequired.java:36)
        at org.apache.lucene.util.TestRuleMarkFailure$1.evaluate(TestRuleMarkFailure.java:48)
        at org.apache.lucene.util.TestRuleIgnoreAfterMaxFailures$1.evaluate(TestRuleIgnoreAfterMaxFailures.java:70)
        at org.apache.lucene.util.TestRuleIgnoreTestSuites$1.evaluate(TestRuleIgnoreTestSuites.java:55)
        at com.carrotsearch.randomizedtesting.RandomizedRunner.runSuite(RandomizedRunner.java:605)
        at com.carrotsearch.randomizedtesting.RandomizedRunner.access$400(RandomizedRunner.java:132)
        at com.carrotsearch.randomizedtesting.RandomizedRunner$2.run(RandomizedRunner.java:551)


FAILED:  org.apache.solr.cloud.FullSolrCloudTest.testDistribSearch

Error Message:
Shard still reported as live in zk

Stack Trace:
java.lang.AssertionError: Shard still reported as live in zk
        at __randomizedtesting.SeedInfo.seed([747F9BFECA4C10AD:F59915E6BD137091]:0)
        at org.junit.Assert.fail(Assert.java:93)
        at org.apache.solr.cloud.FullSolrCloudTest.brindDownShardIndexSomeDocsAndRecover(FullSolrCloudTest.java:715)
        at org.apache.solr.cloud.FullSolrCloudTest.doTest(FullSolrCloudTest.java:559)
        at org.apache.solr.BaseDistributedSearchTestCase.testDistribSearch(BaseDistributedSearchTestCase.java:679)
        at sun.reflect.NativeMethodAccessorImpl.invoke0(Native Method)
        at sun.reflect.NativeMethodAccessorImpl.invoke(NativeMethodAccessorImpl.java:57)
        at sun.reflect.DelegatingMethodAccessorImpl.invoke(DelegatingMethodAccessorImpl.java:43)
        at java.lang.reflect.Method.invoke(Method.java:616)
        at com.carrotsearch.randomizedtesting.RandomizedRunner.invoke(RandomizedRunner.java:1995)
        at com.carrotsearch.randomizedtesting.RandomizedRunner.access$1100(RandomizedRunner.java:132)
        at com.carrotsearch.randomizedtesting.RandomizedRunner$6.evaluate(RandomizedRunner.java:818)
        at com.carrotsearch.randomizedtesting.RandomizedRunner$7.evaluate(RandomizedRunner.java:877)
        at com.carrotsearch.randomizedtesting.RandomizedRunner$8.evaluate(RandomizedRunner.java:891)
        at com.carrotsearch.randomizedtesting.rules.SystemPropertiesRestoreRule$1.evaluate(SystemPropertiesRestoreRule.java:53)
        at org.apache.lucene.util.TestRuleSetupTeardownChained$1.evaluate(TestRuleSetupTeardownChained.java:50)
        at org.apache.lucene.util.TestRuleFieldCacheSanity$1.evaluate(TestRuleFieldCacheSanity.java:32)
        at org.apache.lucene.util.AbstractBeforeAfterRule$1.evaluate(AbstractBeforeAfterRule.java:45)
        at com.carrotsearch.randomizedtesting.rules.SystemPropertiesInvariantRule$1.evaluate(SystemPropertiesInvariantRule.java:55)
        at org.apache.lucene.util.TestRuleReportUncaughtExceptions$1.evaluate(TestRuleReportUncaughtExceptions.java:68)
        at org.apache.lucene.util.TestRuleThreadAndTestName$1.evaluate(TestRuleThreadAndTestName.java:48)
        at org.apache.lucene.util.TestRuleIgnoreAfterMaxFailures$1.evaluate(TestRuleIgnoreAfterMaxFailures.java:70)
        at org.apache.lucene.util.TestRuleMarkFailure$1.evaluate(TestRuleMarkFailure.java:48)
        at com.carrotsearch.randomizedtesting.RandomizedRunner.runSingleTest(RandomizedRunner.java:825)
        at com.carrotsearch.randomizedtesting.RandomizedRunner.access$700(RandomizedRunner.java:132)
        at com.carrotsearch.randomizedtesting.RandomizedRunner$3$1.run(RandomizedRunner.java:671)
        at com.carrotsearch.randomizedtesting.RandomizedRunner$3.evaluate(RandomizedRunner.java:697)
        at com.carrotsearch.randomizedtesting.RandomizedRunner$4.evaluate(RandomizedRunner.java:736)
        at com.carrotsearch.randomizedtesting.RandomizedRunner$5.evaluate(RandomizedRunner.java:747)
        at com.carrotsearch.randomizedtesting.rules.SystemPropertiesRestoreRule$1.evaluate(SystemPropertiesRestoreRule.java:53)
        at org.apache.lucene.util.AbstractBeforeAfterRule$1.evaluate(AbstractBeforeAfterRule.java:45)
        at org.apache.lucene.util.TestRuleReportUncaughtExceptions$1.evaluate(TestRuleReportUncaughtExceptions.java:68)
        at org.apache.lucene.util.TestRuleStoreClassName$1.evaluate(TestRuleStoreClassName.java:38)
        at org.apache.lucene.util.TestRuleIcuHack$1.evaluate(TestRuleIcuHack.java:51)
        at com.carrotsearch.randomizedtesting.rules.SystemPropertiesInvariantRule$1.evaluate(SystemPropertiesInvariantRule.java:55)
        at org.apache.lucene.util.TestRuleNoInstanceHooksOverrides$1.evaluate(TestRuleNoInstanceHooksOverrides.java:53)
        at org.apache.lucene.util.TestRuleNoStaticHooksShadowing$1.evaluate(TestRuleNoStaticHooksShadowing.java:52)
        at org.apache.lucene.util.TestRuleAssertionsRequired$1.evaluate(TestRuleAssertionsRequired.java:36)
        at org.apache.lucene.util.TestRuleMarkFailure$1.evaluate(TestRuleMarkFailure.java:48)
        at org.apache.lucene.util.TestRuleIgnoreAfterMaxFailures$1.evaluate(TestRuleIgnoreAfterMaxFailures.java:70)
        at org.apache.lucene.util.TestRuleIgnoreTestSuites$1.evaluate(TestRuleIgnoreTestSuites.java:55)
        at com.carrotsearch.randomizedtesting.RandomizedRunner.runSuite(RandomizedRunner.java:605)
        at com.carrotsearch.randomizedtesting.RandomizedRunner.access$400(RandomizedRunner.java:132)
        at com.carrotsearch.randomizedtesting.RandomizedRunner$2.run(RandomizedRunner.java:551)




Build Log:
[...truncated 11691 lines...]
[junit4:junit4]   2> 82160 T5003 oazs.SessionTrackerImpl.run SessionTrackerImpl exited loop!
[junit4:junit4]   2> 92280 T5070 oaz.ClientCnxn$SendThread.run Client session timed out, have not heard from server in 12001ms for sessionid 0x138b26ce3300006, closing socket connection and attempting reconnect
[junit4:junit4]   2> 92280 T5057 oaz.ClientCnxn$SendThread.run Client session timed out, have not heard from server in 12001ms for sessionid 0x138b26ce3300005, closing socket connection and attempting reconnect
[junit4:junit4]   2> 92381 T5034 oaz.ClientCnxn$EventThread.run EventThread shut down
[junit4:junit4]   2> 92381 T5000 oaz.ZooKeeper.close Session: 0x138b26ce3300003 closed
[junit4:junit4]   2> 92382 T5000 oejsh.ContextHandler.doStop stopped o.e.j.s.ServletContextHandler{/solr,null}
[junit4:junit4]   2> 92435 T5000 oasc.ChaosMonkey.monkeyLog monkey: stop shard! 61570
[junit4:junit4]   2> 92435 T5000 oasc.ChaosMonkey.monkeyLog monkey: stop shard! 38417
[junit4:junit4]   2> 92435 T5000 oasc.CoreContainer.shutdown Shutting down CoreContainer instance=1318924704
[junit4:junit4]   2> 92435 T5000 oasc.RecoveryStrategy.close WARNING Stopping recovery for core collection1 zkNodeName=127.0.0.1:38417_solr_collection1
[junit4:junit4]   2> 92436 T5000 oasc.SolrCore.close [collection1]  CLOSING SolrCore org.apache.solr.core.SolrCore@3e9a4780
[junit4:junit4]   2> 92437 T5000 oasc.SolrCore.closeSearcher [collection1] Closing main searcher on request.
[junit4:junit4]   2> 92437 T5000 oasu.DirectUpdateHandler2.close closing DirectUpdateHandler2{commits=7,autocommits=0,soft autocommits=0,optimizes=0,rollbacks=0,expungeDeletes=0,docsPending=0,adds=0,deletesById=0,deletesByQuery=0,errors=0,cumulative_adds=36,cumulative_deletesById=0,cumulative_deletesByQuery=0,cumulative_errors=0}
[junit4:junit4]   2> 92439 T5000 oasc.RecoveryStrategy.close WARNING Stopping recovery for core collection1 zkNodeName=127.0.0.1:38417_solr_collection1
[junit4:junit4]   2> 93549 T5070 oaz.ClientCnxn$SendThread.startConnect Opening socket connection to server localhost/127.0.0.1:59844
[junit4:junit4]   2> 93877 T5071 oasc.SyncStrategy.syncToMe Could not tell a replica to recover org.apache.solr.client.solrj.SolrServerException: IOException occured when talking to server at: http://127.0.0.1:61570/solr/collection1
[junit4:junit4]   2> at org.apache.solr.client.solrj.impl.HttpSolrServer.request(HttpSolrServer.java:414)
[junit4:junit4]   2> at org.apache.solr.client.solrj.impl.HttpSolrServer.request(HttpSolrServer.java:182)
[junit4:junit4]   2> at org.apache.solr.cloud.SyncStrategy.syncToMe(SyncStrategy.java:237)
[junit4:junit4]   2> at org.apache.solr.cloud.SyncStrategy.syncReplicas(SyncStrategy.java:119)
[junit4:junit4]   2> at org.apache.solr.cloud.SyncStrategy.sync(SyncStrategy.java:82)
[junit4:junit4]   2> at org.apache.solr.cloud.ShardLeaderElectionContext.runLeaderProcess(ElectionContext.java:158)
[junit4:junit4]   2> at org.apache.solr.cloud.LeaderElector.runIamLeaderProcess(LeaderElector.java:151)
[junit4:junit4]   2> at org.apache.solr.cloud.LeaderElector.checkIfIamLeader(LeaderElector.java:96)
[junit4:junit4]   2> at org.apache.solr.cloud.LeaderElector.access$000(LeaderElector.java:57)
[junit4:junit4]   2> at org.apache.solr.cloud.LeaderElector$1.process(LeaderElector.java:125)
[junit4:junit4]   2> at org.apache.zookeeper.ClientCnxn$EventThread.processEvent(ClientCnxn.java:526)
[junit4:junit4]   2> at org.apache.zookeeper.ClientCnxn$EventThread.run(ClientCnxn.java:502)
[junit4:junit4]   2> Caused by: org.apache.http.conn.ConnectTimeoutException: Connect to 127.0.0.1:61570 timed out
[junit4:junit4]   2> at org.apache.http.conn.scheme.PlainSocketFactory.connectSocket(PlainSocketFactory.java:125)
[junit4:junit4]   2> at org.apache.http.impl.conn.DefaultClientConnectionOperator.openConnection(DefaultClientConnectionOperator.java:148)
[junit4:junit4]   2> at org.apache.http.impl.conn.AbstractPoolEntry.open(AbstractPoolEntry.java:150)
[junit4:junit4]   2> at org.apache.http.impl.conn.AbstractPooledConnAdapter.open(AbstractPooledConnAdapter.java:121)
[junit4:junit4]   2> at org.apache.http.impl.client.DefaultRequestDirector.tryConnect(DefaultRequestDirector.java:575)
[junit4:junit4]   2> at org.apache.http.impl.client.DefaultRequestDirector.execute(DefaultRequestDirector.java:425)
[junit4:junit4]   2> at org.apache.http.impl.client.AbstractHttpClient.execute(AbstractHttpClient.java:820)
[junit4:junit4]   2> at org.apache.http.impl.client.AbstractHttpClient.execute(AbstractHttpClient.java:754)
[junit4:junit4]   2> at org.apache.http.impl.client.AbstractHttpClient.execute(AbstractHttpClient.java:732)
[junit4:junit4]   2> at org.apache.solr.client.solrj.impl.HttpSolrServer.request(HttpSolrServer.java:353)
[junit4:junit4]   2> ... 11 more
[junit4:junit4]   2>
[junit4:junit4]   2> 93878 T5071 oasc.RecoveryStrategy.close WARNING Stopping recovery for core collection1 zkNodeName=127.0.0.1:33096_solr_collection1
[junit4:junit4]   2> 94276 T5057 oaz.ClientCnxn$SendThread.startConnect Opening socket connection to server localhost/127.0.0.1:59844
[junit4:junit4]   2> 104382 T5070 oaz.ClientCnxn$SendThread.run Client session timed out, have not heard from server in 12001ms for sessionid 0x138b26ce3300006, closing socket connection and attempting reconnect
[junit4:junit4]   2> 104483 T5058 oaz.ClientCnxn$EventThread.run EventThread shut down
[junit4:junit4]   2> 104483 T5000 oaz.ZooKeeper.close Session: 0x138b26ce3300005 closed
[junit4:junit4]   2> 104484 T5000 oejsh.ContextHandler.doStop stopped o.e.j.s.ServletContextHandler{/solr,null}
[junit4:junit4]   2> 104537 T5000 oasc.ChaosMonkey.monkeyLog monkey: stop shard! 33096
[junit4:junit4]   2> 104537 T5000 oasc.CoreContainer.shutdown Shutting down CoreContainer instance=1926744539
[junit4:junit4]   2> 104537 T5000 oasc.RecoveryStrategy.close WARNING Stopping recovery for core collection1 zkNodeName=127.0.0.1:33096_solr_collection1
[junit4:junit4]   2> 105757 T5070 oaz.ClientCnxn$SendThread.startConnect Opening socket connection to server localhost/127.0.0.1:59844
[junit4:junit4]   2> 116585 T5000 oaz.ZooKeeper.close Session: 0x138b26ce3300006 closed
[junit4:junit4]   2> 116587 T5000 oejsh.ContextHandler.doStop stopped o.e.j.s.ServletContextHandler{/solr,null}
[junit4:junit4]   2> 116677 T5000 oas.SolrTestCaseJ4.tearDown ###Ending testDistribSearch
[junit4:junit4]   1>        /solr/collections/control_collection/leader_elect/control_shard/election/88016373471510530-127.0.0.1:41993_solr_collection1-n_0000000000 (0)
[junit4:junit4]   1>     /solr/collections/control_collection/leaders (1)
[junit4:junit4]   1>      /solr/collections/control_collection/leaders/control_shard (0)
[junit4:junit4]   1>      DATA:
[junit4:junit4]   1>          {
[junit4:junit4]   1>            "core":"collection1",
[junit4:junit4]   1>            "node_name":"127.0.0.1:41993_solr",
[junit4:junit4]   1>            "base_url":"http://127.0.0.1:41993/solr"}
[junit4:junit4]   1>   /solr/clusterstate.json (0)
[junit4:junit4]   1>   DATA:
[junit4:junit4]   1>       {
[junit4:junit4]   1>         "collection1":{
[junit4:junit4]   1>           "shard1":{
[junit4:junit4]   1>             "127.0.0.1:31866_solr_collection1":{
[junit4:junit4]   1>               "shard":"shard1",
[junit4:junit4]   1>               "roles":null,
[junit4:junit4]   1>               "leader":"true",
[junit4:junit4]   1>               "state":"active",
[junit4:junit4]   1>               "core":"collection1",
[junit4:junit4]   1>               "collection":"collection1",
[junit4:junit4]   1>               "node_name":"127.0.0.1:31866_solr",
[junit4:junit4]   1>               "base_url":"http://127.0.0.1:31866/solr"},
[junit4:junit4]   1>             "127.0.0.1:38417_solr_collection1":{
[junit4:junit4]   1>               "shard":"shard1",
[junit4:junit4]   1>               "roles":null,
[junit4:junit4]   1>               "state":"active",
[junit4:junit4]   1>               "core":"collection1",
[junit4:junit4]   1>               "collection":"collection1",
[junit4:junit4]   1>               "node_name":"127.0.0.1:38417_solr",
[junit4:junit4]   1>               "base_url":"http://127.0.0.1:38417/solr"}},
[junit4:junit4]   1>           "shard2":{
[junit4:junit4]   1>             "127.0.0.1:61570_solr_collection1":{
[junit4:junit4]   1>               "shard":"shard2",
[junit4:junit4]   1>               "leader":"true",
[junit4:junit4]   1>               "roles":null,
[junit4:junit4]   1>               "state":"active",
[junit4:junit4]   1>               "core":"collection1",
[junit4:junit4]   1>               "collection":"collection1",
[junit4:junit4]   1>               "node_name":"127.0.0.1:61570_solr",
[junit4:junit4]   1>               "base_url":"http://127.0.0.1:61570/solr"},
[junit4:junit4]   1>             "127.0.0.1:33096_solr_collection1":{
[junit4:junit4]   1>               "shard":"shard2",
[junit4:junit4]   1>               "roles":null,
[junit4:junit4]   1>               "state":"active",
[junit4:junit4]   1>               "core":"collection1",
[junit4:junit4]   1>               "collection":"collection1",
[junit4:junit4]   1>               "node_name":"127.0.0.1:33096_solr",
[junit4:junit4]   1>               "base_url":"http://127.0.0.1:33096/solr"}}},
[junit4:junit4]   1>         "control_collection":{"control_shard":{"127.0.0.1:41993_solr_collection1":{
[junit4:junit4]   1>               "shard":"control_shard",
[junit4:junit4]   1>               "roles":null,
[junit4:junit4]   1>               "leader":"true",
[junit4:junit4]   1>               "state":"active",
[junit4:junit4]   1>               "core":"collection1",
[junit4:junit4]   1>               "collection":"control_collection",
[junit4:junit4]   1>               "node_name":"127.0.0.1:41993_solr",
[junit4:junit4]   1>               "base_url":"http://127.0.0.1:41993/solr"}}}}
[junit4:junit4]   1>  /zookeeper (1)
[junit4:junit4]   1>  DATA:
[junit4:junit4]   1>      
[junit4:junit4]   1>
[junit4:junit4]   2> NOTE: reproduce with: ant test  -Dtestcase=FullSolrCloudTest -Dtests.method=testDistribSearch -Dtests.seed=747F9BFECA4C10AD -Dtests.multiplier=3 -Dtests.slow=true -Dtests.locale=es_PE -Dtests.timezone=Pacific/Chuuk -Dtests.file.encoding=ISO8859-1
[junit4:junit4]   1>
[junit4:junit4]   2>
[junit4:junit4]    > (@AfterClass output)
[junit4:junit4]   2> 116713 T5000 oas.SolrTestCaseJ4.deleteCore ###deleteCore
[junit4:junit4]   2> 117586 T5071 oasc.SolrCore.close [collection1]  CLOSING SolrCore org.apache.solr.core.SolrCore@49a5271
[junit4:junit4]   2> 117588 T5071 oasc.SolrCore.closeSearcher [collection1] Closing main searcher on request.
[junit4:junit4]   2> 117590 T5071 oasu.DirectUpdateHandler2.close closing DirectUpdateHandler2{commits=6,autocommits=0,soft autocommits=0,optimizes=0,rollbacks=0,expungeDeletes=0,docsPending=0,adds=0,deletesById=0,deletesByQuery=0,errors=0,cumulative_adds=36,cumulative_deletesById=0,cumulative_deletesByQuery=0,cumulative_errors=0}
[junit4:junit4]   2> 117591 T5071 oasc.RecoveryStrategy.close WARNING Stopping recovery for core collection1 zkNodeName=127.0.0.1:33096_solr_collection1
[junit4:junit4]   2> 117591 T5071 oasc.LeaderElector$1.process WARNING  org.apache.zookeeper.KeeperException$SessionExpiredException: KeeperErrorCode = Session expired for /overseer/queue/qn-
[junit4:junit4]   2> at org.apache.zookeeper.KeeperException.create(KeeperException.java:118)
[junit4:junit4]   2> at org.apache.zookeeper.KeeperException.create(KeeperException.java:42)
[junit4:junit4]   2> at org.apache.zookeeper.ZooKeeper.create(ZooKeeper.java:643)
[junit4:junit4]   2> at org.apache.solr.common.cloud.SolrZkClient$5.execute(SolrZkClient.java:244)
[junit4:junit4]   2> at org.apache.solr.common.cloud.SolrZkClient$5.execute(SolrZkClient.java:241)
[junit4:junit4]   2> at org.apache.solr.common.cloud.ZkCmdExecutor.retryOperation(ZkCmdExecutor.java:67)
[junit4:junit4]   2> at org.apache.solr.common.cloud.SolrZkClient.create(SolrZkClient.java:241)
[junit4:junit4]   2> at org.apache.solr.cloud.DistributedQueue.offer(DistributedQueue.java:236)
[junit4:junit4]   2> at org.apache.solr.cloud.ZkController.publish(ZkController.java:734)
[junit4:junit4]   2> at org.apache.solr.cloud.ShardLeaderElectionContext.runLeaderProcess(ElectionContext.java:168)
[junit4:junit4]   2> at org.apache.solr.cloud.LeaderElector.runIamLeaderProcess(LeaderElector.java:151)
[junit4:junit4]   2> at org.apache.solr.cloud.LeaderElector.checkIfIamLeader(LeaderElector.java:96)
[junit4:junit4]   2> at org.apache.solr.cloud.LeaderElector.access$000(LeaderElector.java:57)
[junit4:junit4]   2> at org.apache.solr.cloud.LeaderElector$1.process(LeaderElector.java:125)
[junit4:junit4]   2> at org.apache.zookeeper.ClientCnxn$EventThread.processEvent(ClientCnxn.java:526)
[junit4:junit4]   2> at org.apache.zookeeper.ClientCnxn$EventThread.run(ClientCnxn.java:502)
[junit4:junit4]   2>
[junit4:junit4]   2> 117592 T5071 oascc.ZkStateReader$3.process Updating live nodes
[junit4:junit4]   2> 117592 T5071 oascc.ZkStateReader$3.process WARNING ZooKeeper watch triggered, but Solr cannot talk to ZK
[junit4:junit4]   2> 117592 T5071 oascc.ConnectionManager.process Watcher org.apache.solr.common.cloud.ConnectionManager@7d0dd40d name:ZooKeeperConnection Watcher:127.0.0.1:59844/solr got event WatchedEvent state:Disconnected type:None path:null path:null type:None
[junit4:junit4]   2> 117593 T5071 oaz.ClientCnxn$EventThread.run EventThread shut down
[junit4:junit4]   2> NOTE: test params are: codec=Asserting, sim=DefaultSimilarity, locale=es_PE, timezone=Pacific/Chuuk
[junit4:junit4]   2> NOTE: FreeBSD 9.0-RELEASE amd64/Sun Microsystems Inc. 1.6.0_32 (64-bit)/cpus=16,threads=1,free=151279384,total=357433344
[junit4:junit4]   2> NOTE: All tests run in this JVM: [TestHTMLStripCharFilterFactory, TestFoldingMultitermQuery, EchoParamsTest, TestCharFilters, BasicFunctionalityTest, TestSearchPerf, TestJapaneseKatakanaStemFilterFactory, DateFieldTest, XmlUpdateRequestHandlerTest, SolrRequestParserTest, TestTypeTokenFilterFactory, FastVectorHighlighterTest, TestExtendedDismaxParser, TestJmxIntegration, ZkNodePropsTest, AutoCommitTest, TestRandomFaceting, TestStressVersions, TestDistributedSearch, SimpleFacetsTest, SpatialFilterTest, PreAnalyzedFieldTest, SystemInfoHandlerTest, UpdateRequestProcessorFactoryTest, TestSolrQueryParser, TestCapitalizationFilterFactory, DistributedQueryElevationComponentTest, TestSolrCoreProperties, HighlighterTest, TestNorwegianLightStemFilterFactory, TestCodecSupport, TestStandardFactories, TestRemoveDuplicatesTokenFilterFactory, TestDistributedGrouping, OutputWriterTest, SuggesterWFSTTest, TestFunctionQuery, MoreLikeThisHandlerTest, LeaderElectionIntegrationTest, TestArabicFilters, TestHyphenationCompoundWordTokenFilterFactory, ShowFileRequestHandlerTest, CommonGramsQueryFilterFactoryTest, TermsComponentTest, PluginInfoTest, LukeRequestHandlerTest, ConvertedLegacyTest, TestUpdate, TestStemmerOverrideFilterFactory, RecoveryZkTest, TestTrimFilterFactory, DirectUpdateHandlerOptimizeTest, FullSolrCloudDistribCmdsTest, TestPatternTokenizerFactory, SolrInfoMBeanTest, MinimalSchemaTest, TestIndexingPerformance, JSONWriterTest, TestFaceting, BinaryUpdateRequestHandlerTest, DOMUtilTest, TestBulgarianStemFilterFactory, DirectUpdateHandlerTest, TestHashPartitioner, TestGreekLowerCaseFilterFactory, SuggesterTest, TestCSVLoader, TestPatternReplaceCharFilterFactory, TestSwedishLightStemFilterFactory, SuggesterTSTTest, CopyFieldTest, RequestHandlersTest, CoreAdminHandlerTest, FullSolrCloudTest]
[junit4:junit4]   2>
[junit4:junit4] Completed on J0 in 117.72s, 1 test, 1 failure <<< FAILURES!
[...truncated 445 lines...]
[junit4:junit4]   2>
[junit4:junit4]   2> 67919 T5521 oasc.LeaderElector$1.process WARNING  org.apache.zookeeper.KeeperException$SessionExpiredException: KeeperErrorCode = Session expired for /overseer_elect/election
[junit4:junit4]   2> at org.apache.zookeeper.KeeperException.create(KeeperException.java:118)
[junit4:junit4]   2> at org.apache.zookeeper.KeeperException.create(KeeperException.java:42)
[junit4:junit4]   2> at org.apache.zookeeper.ZooKeeper.getChildren(ZooKeeper.java:1249)
[junit4:junit4]   2> at org.apache.solr.common.cloud.SolrZkClient$6.execute(SolrZkClient.java:266)
[junit4:junit4]   2> at org.apache.solr.common.cloud.SolrZkClient$6.execute(SolrZkClient.java:263)
[junit4:junit4]   2> at org.apache.solr.common.cloud.ZkCmdExecutor.retryOperation(ZkCmdExecutor.java:67)
[junit4:junit4]   2> at org.apache.solr.common.cloud.SolrZkClient.getChildren(SolrZkClient.java:263)
[junit4:junit4]   2> at org.apache.solr.cloud.LeaderElector.checkIfIamLeader(LeaderElector.java:91)
[junit4:junit4]   2> at org.apache.solr.cloud.LeaderElector.access$000(LeaderElector.java:57)
[junit4:junit4]   2> at org.apache.solr.cloud.LeaderElector$1.process(LeaderElector.java:125)
[junit4:junit4]   2> at org.apache.zookeeper.ClientCnxn$EventThread.processEvent(ClientCnxn.java:526)
[junit4:junit4]   2> at org.apache.zookeeper.ClientCnxn$EventThread.run(ClientCnxn.java:502)
[junit4:junit4]   2>
[junit4:junit4]   2> 67920 T5521 oascc.ZkStateReader$3.process Updating live nodes
[junit4:junit4]   2> 67920 T5521 oascc.ZkStateReader$3.process WARNING ZooKeeper watch triggered, but Solr cannot talk to ZK
[junit4:junit4]   2> 67920 T5521 oaz.ClientCnxn$EventThread.run EventThread shut down
[junit4:junit4]   2> 93666 T5508 oasc.SyncStrategy.syncToMe Could not tell a replica to recover org.apache.solr.client.solrj.SolrServerException: IOException occured when talking to server at: http://127.0.0.1:16267/solr/collection1
[junit4:junit4]   2> at org.apache.solr.client.solrj.impl.HttpSolrServer.request(HttpSolrServer.java:414)
[junit4:junit4]   2> at org.apache.solr.client.solrj.impl.HttpSolrServer.request(HttpSolrServer.java:182)
[junit4:junit4]   2> at org.apache.solr.cloud.SyncStrategy.syncToMe(SyncStrategy.java:237)
[junit4:junit4]   2> at org.apache.solr.cloud.SyncStrategy.syncReplicas(SyncStrategy.java:119)
[junit4:junit4]   2> at org.apache.solr.cloud.SyncStrategy.sync(SyncStrategy.java:82)
[junit4:junit4]   2> at org.apache.solr.cloud.ShardLeaderElectionContext.runLeaderProcess(ElectionContext.java:158)
[junit4:junit4]   2> at org.apache.solr.cloud.LeaderElector.runIamLeaderProcess(LeaderElector.java:151)
[junit4:junit4]   2> at org.apache.solr.cloud.LeaderElector.checkIfIamLeader(LeaderElector.java:96)
[junit4:junit4]   2> at org.apache.solr.cloud.LeaderElector.access$000(LeaderElector.java:57)
[junit4:junit4]   2> at org.apache.solr.cloud.LeaderElector$1.process(LeaderElector.java:125)
[junit4:junit4]   2> at org.apache.zookeeper.ClientCnxn$EventThread.processEvent(ClientCnxn.java:526)
[junit4:junit4]   2> at org.apache.zookeeper.ClientCnxn$EventThread.run(ClientCnxn.java:502)
[junit4:junit4]   2> Caused by: org.apache.http.conn.ConnectTimeoutException: Connect to 127.0.0.1:16267 timed out
[junit4:junit4]   2> at org.apache.http.conn.scheme.PlainSocketFactory.connectSocket(PlainSocketFactory.java:125)
[junit4:junit4]   2> at org.apache.http.impl.conn.DefaultClientConnectionOperator.openConnection(DefaultClientConnectionOperator.java:148)
[junit4:junit4]   2> at org.apache.http.impl.conn.AbstractPoolEntry.open(AbstractPoolEntry.java:150)
[junit4:junit4]   2> at org.apache.http.impl.conn.AbstractPooledConnAdapter.open(AbstractPooledConnAdapter.java:121)
[junit4:junit4]   2> at org.apache.http.impl.client.DefaultRequestDirector.tryConnect(DefaultRequestDirector.java:575)
[junit4:junit4]   2> at org.apache.http.impl.client.DefaultRequestDirector.execute(DefaultRequestDirector.java:425)
[junit4:junit4]   2> at org.apache.http.impl.client.AbstractHttpClient.execute(AbstractHttpClient.java:820)
[junit4:junit4]   2> at org.apache.http.impl.client.AbstractHttpClient.execute(AbstractHttpClient.java:754)
[junit4:junit4]   2> at org.apache.http.impl.client.AbstractHttpClient.execute(AbstractHttpClient.java:732)
[junit4:junit4]   2> at org.apache.solr.client.solrj.impl.HttpSolrServer.request(HttpSolrServer.java:353)
[junit4:junit4]   2> ... 11 more
[junit4:junit4]   2>
[junit4:junit4]   2> 93667 T5508 oasc.RecoveryStrategy.close WARNING Stopping recovery for core collection1 zkNodeName=127.0.0.1:17929_solr_collection1
[junit4:junit4]   2> 93667 T5508 oasc.LeaderElector$1.process WARNING  org.apache.zookeeper.KeeperException$SessionExpiredException: KeeperErrorCode = Session expired for /overseer/queue/qn-
[junit4:junit4]   2> at org.apache.zookeeper.KeeperException.create(KeeperException.java:118)
[junit4:junit4]   2> at org.apache.zookeeper.KeeperException.create(KeeperException.java:42)
[junit4:junit4]   2> at org.apache.zookeeper.ZooKeeper.create(ZooKeeper.java:643)
[junit4:junit4]   2> at org.apache.solr.common.cloud.SolrZkClient$5.execute(SolrZkClient.java:244)
[junit4:junit4]   2> at org.apache.solr.common.cloud.SolrZkClient$5.execute(SolrZkClient.java:241)
[junit4:junit4]   2> at org.apache.solr.common.cloud.ZkCmdExecutor.retryOperation(ZkCmdExecutor.java:67)
[junit4:junit4]   2> at org.apache.solr.common.cloud.SolrZkClient.create(SolrZkClient.java:241)
[junit4:junit4]   2> at org.apache.solr.cloud.DistributedQueue.offer(DistributedQueue.java:236)
[junit4:junit4]   2> at org.apache.solr.cloud.ZkController.publish(ZkController.java:734)
[junit4:junit4]   2> at org.apache.solr.cloud.ShardLeaderElectionContext.runLeaderProcess(ElectionContext.java:168)
[junit4:junit4]   2> at org.apache.solr.cloud.LeaderElector.runIamLeaderProcess(LeaderElector.java:151)
[junit4:junit4]   2> at org.apache.solr.cloud.LeaderElector.checkIfIamLeader(LeaderElector.java:96)
[junit4:junit4]   2> at org.apache.solr.cloud.LeaderElector.access$000(LeaderElector.java:57)
[junit4:junit4]   2> at org.apache.solr.cloud.LeaderElector$1.process(LeaderElector.java:125)
[junit4:junit4]   2> at org.apache.zookeeper.ClientCnxn$EventThread.processEvent(ClientCnxn.java:526)
[junit4:junit4]   2> at org.apache.zookeeper.ClientCnxn$EventThread.run(ClientCnxn.java:502)
[junit4:junit4]   2>
[junit4:junit4]   2> 93668 T5508 oascc.ZkStateReader$3.process Updating live nodes
[junit4:junit4]   2> 93668 T5508 oascc.ZkStateReader$3.process WARNING ZooKeeper watch triggered, but Solr cannot talk to ZK
[junit4:junit4]   2> 93668 T5508 oasc.LeaderElector$1.process WARNING  org.apache.zookeeper.KeeperException$SessionExpiredException: KeeperErrorCode = Session expired for /overseer_elect/election
[junit4:junit4]   2> at org.apache.zookeeper.KeeperException.create(KeeperException.java:118)
[junit4:junit4]   2> at org.apache.zookeeper.KeeperException.create(KeeperException.java:42)
[junit4:junit4]   2> at org.apache.zookeeper.ZooKeeper.getChildren(ZooKeeper.java:1249)
[junit4:junit4]   2> at org.apache.solr.common.cloud.SolrZkClient$6.execute(SolrZkClient.java:266)
[junit4:junit4]   2> at org.apache.solr.common.cloud.SolrZkClient$6.execute(SolrZkClient.java:263)
[junit4:junit4]   2> at org.apache.solr.common.cloud.ZkCmdExecutor.retryOperation(ZkCmdExecutor.java:67)
[junit4:junit4]   2> at org.apache.solr.common.cloud.SolrZkClient.getChildren(SolrZkClient.java:263)
[junit4:junit4]   2> at org.apache.solr.cloud.LeaderElector.checkIfIamLeader(LeaderElector.java:91)
[junit4:junit4]   2> at org.apache.solr.cloud.LeaderElector.access$000(LeaderElector.java:57)
[junit4:junit4]   2> at org.apache.solr.cloud.LeaderElector$1.process(LeaderElector.java:125)
[junit4:junit4]   2> at org.apache.zookeeper.ClientCnxn$EventThread.processEvent(ClientCnxn.java:526)
[junit4:junit4]   2> at org.apache.zookeeper.ClientCnxn$EventThread.run(ClientCnxn.java:502)
[junit4:junit4]   2>
[junit4:junit4]   2> 93668 T5508 oaz.ClientCnxn$EventThread.run EventThread shut down
[junit4:junit4]   2> 93769 T5500 C128 P17929 oasc.SolrException.log SEVERE shard update error StdNode: http://127.0.0.1:16267/solr/collection1/:org.apache.solr.client.solrj.SolrServerException: Server refused connection at: http://127.0.0.1:16267/solr/collection1
[junit4:junit4]   2> at org.apache.solr.client.solrj.impl.HttpSolrServer.request(HttpSolrServer.java:407)
[junit4:junit4]   2> at org.apache.solr.client.solrj.impl.HttpSolrServer.request(HttpSolrServer.java:182)
[junit4:junit4]   2> at org.apache.solr.update.SolrCmdDistributor$1.call(SolrCmdDistributor.java:336)
[junit4:junit4]   2> at org.apache.solr.update.SolrCmdDistributor$1.call(SolrCmdDistributor.java:317)
[junit4:junit4]   2> at java.util.concurrent.FutureTask$Sync.innerRun(FutureTask.java:334)
[junit4:junit4]   2> at java.util.concurrent.FutureTask.run(FutureTask.java:166)
[junit4:junit4]   2> at java.util.concurrent.Executors$RunnableAdapter.call(Executors.java:471)
[junit4:junit4]   2> at java.util.concurrent.FutureTask$Sync.innerRun(FutureTask.java:334)
[junit4:junit4]   2> at java.util.concurrent.FutureTask.run(FutureTask.java:166)
[junit4:junit4]   2> at org.apache.solr.update.SolrCmdDistributor$BoundedExecutor$1.run(SolrCmdDistributor.java:538)
[junit4:junit4]   2> at java.util.concurrent.ThreadPoolExecutor.runWorker(ThreadPoolExecutor.java:1110)
[junit4:junit4]   2> at java.util.concurrent.ThreadPoolExecutor$Worker.run(ThreadPoolExecutor.java:603)
[junit4:junit4]   2> at java.lang.Thread.run(Thread.java:679)
[junit4:junit4]   2> Caused by: org.apache.http.conn.HttpHostConnectException: Connection to http://127.0.0.1:16267 refused
[junit4:junit4]   2> at org.apache.http.impl.conn.DefaultClientConnectionOperator.openConnection(DefaultClientConnectionOperator.java:158)
[junit4:junit4]   2> at org.apache.http.impl.conn.AbstractPoolEntry.open(AbstractPoolEntry.java:150)
[junit4:junit4]   2> at org.apache.http.impl.conn.AbstractPooledConnAdapter.open(AbstractPooledConnAdapter.java:121)
[junit4:junit4]   2> at org.apache.http.impl.client.DefaultRequestDirector.tryConnect(DefaultRequestDirector.java:575)
[junit4:junit4]   2> at org.apache.http.impl.client.DefaultRequestDirector.execute(DefaultRequestDirector.java:425)
[junit4:junit4]   2> at org.apache.http.impl.client.AbstractHttpClient.execute(AbstractHttpClient.java:820)
[junit4:junit4]   2> at org.apache.http.impl.client.AbstractHttpClient.execute(AbstractHttpClient.java:754)
[junit4:junit4]   2> at org.apache.http.impl.client.AbstractHttpClient.execute(AbstractHttpClient.java:732)
[junit4:junit4]   2> at org.apache.solr.client.solrj.impl.HttpSolrServer.request(HttpSolrServer.java:353)
[junit4:junit4]   2> ... 12 more
[junit4:junit4]   2> Caused by: java.net.ConnectException: Operation timed out
[junit4:junit4]   2> at java.net.PlainSocketImpl.socketConnect(Native Method)
[junit4:junit4]   2> at java.net.AbstractPlainSocketImpl.doConnect(AbstractPlainSocketImpl.java:327)
[junit4:junit4]   2> at java.net.AbstractPlainSocketImpl.connectToAddress(AbstractPlainSocketImpl.java:193)
[junit4:junit4]   2> at java.net.AbstractPlainSocketImpl.connect(AbstractPlainSocketImpl.java:180)
[junit4:junit4]   2> at java.net.SocksSocketImpl.connect(SocksSocketImpl.java:384)
[junit4:junit4]   2> at java.net.Socket.connect(Socket.java:546)
[junit4:junit4]   2> at org.apache.http.conn.scheme.PlainSocketFactory.connectSocket(PlainSocketFactory.java:123)
[junit4:junit4]   2> at org.apache.http.impl.conn.DefaultClientConnectionOperator.openConnection(DefaultClientConnectionOperator.java:148)
[junit4:junit4]   2> ... 20 more
[junit4:junit4]   2>
[junit4:junit4]   2> 159450 T5462 oas.SolrTestCaseJ4.endTrackingSearchers SEVERE ERROR: SolrIndexSearcher opens=24 closes=23
[junit4:junit4]   2> NOTE: test params are: codec=Asserting, sim=RandomSimilarityProvider(queryNorm=true,coord=true): {}, locale=in_ID, timezone=Asia/Calcutta
[junit4:junit4]   2> NOTE: FreeBSD 9.0-RELEASE amd64/Sun Microsystems Inc. 1.6.0_32 (64-bit)/cpus=16,threads=6,free=144660344,total=369229824
[junit4:junit4]   2> NOTE: All tests run in this JVM: [TestHTMLStripCharFilterFactory, TestFoldingMultitermQuery, EchoParamsTest, TestCharFilters, BasicFunctionalityTest, TestSearchPerf, TestJapaneseKatakanaStemFilterFactory, DateFieldTest, XmlUpdateRequestHandlerTest, SolrRequestParserTest, TestTypeTokenFilterFactory, FastVectorHighlighterTest, TestExtendedDismaxParser, TestJmxIntegration, ZkNodePropsTest, AutoCommitTest, TestRandomFaceting, TestStressVersions, TestDistributedSearch, SimpleFacetsTest, SpatialFilterTest, PreAnalyzedFieldTest, SystemInfoHandlerTest, UpdateRequestProcessorFactoryTest, TestSolrQueryParser, TestCapitalizationFilterFactory, DistributedQueryElevationComponentTest, TestSolrCoreProperties, HighlighterTest, TestNorwegianLightStemFilterFactory, TestCodecSupport, TestStandardFactories, TestRemoveDuplicatesTokenFilterFactory, TestDistributedGrouping, OutputWriterTest, SuggesterWFSTTest, TestFunctionQuery, MoreLikeThisHandlerTest, LeaderElectionIntegrationTest, TestArabicFilters, TestHyphenationCompoundWordTokenFilterFactory, ShowFileRequestHandlerTest, CommonGramsQueryFilterFactoryTest, TermsComponentTest, PluginInfoTest, LukeRequestHandlerTest, ConvertedLegacyTest, TestUpdate, TestStemmerOverrideFilterFactory, RecoveryZkTest, TestTrimFilterFactory, DirectUpdateHandlerOptimizeTest, FullSolrCloudDistribCmdsTest, TestPatternTokenizerFactory, SolrInfoMBeanTest, MinimalSchemaTest, TestIndexingPerformance, JSONWriterTest, TestFaceting, BinaryUpdateRequestHandlerTest, DOMUtilTest, TestBulgarianStemFilterFactory, DirectUpdateHandlerTest, TestHashPartitioner, TestGreekLowerCaseFilterFactory, SuggesterTest, TestCSVLoader, TestPatternReplaceCharFilterFactory, TestSwedishLightStemFilterFactory, SuggesterTSTTest, CopyFieldTest, RequestHandlersTest, CoreAdminHandlerTest, FullSolrCloudTest, StatsComponentTest, TestJoin, QueryElevationComponentTest, TestTrie, DirectSolrConnectionTest, CacheHeaderTest, TestWordDelimiterFilterFactory, PolyFieldTest, TestCSVResponseWriter, CurrencyFieldTest, TestPseudoReturnFields, DisMaxRequestHandlerTest, DistanceFunctionTest, StandardRequestHandlerTest, TestQueryTypes, TestPHPSerializedResponseWriter, FieldAnalysisRequestHandlerTest, PingRequestHandlerTest, TermVectorComponentTest, JsonLoaderTest, TestSurroundQueryParser, TestValueSourceCache, TestReversedWildcardFilterFactory, DebugComponentTest, RequiredFieldsTest, SuggesterFSTTest, TestQueryUtils, LoggingHandlerTest, SolrCmdDistributorTest, UpdateParamsTest, CSVRequestHandlerTest, NotRequiredUniqueKeyTest, BadIndexSchemaTest, SolrCoreCheckLockOnStartupTest, TestLuceneMatchVersion, TestPropInject, PrimitiveFieldTypeTest, BadComponentTest, TestBinaryField, SOLR749Test, DefaultValueUpdateProcessorTest, TestLFUCache, SolrIndexConfigTest, TestNumberUtils, TestJapaneseBaseFormFilterFactory, TestJapaneseTokenizerFactory, TestKStemFilterFactory, TestPhraseSuggestions, LegacyHTMLStripCharFilterTest, TestJapaneseReadingFormFilterFactory, TestIBSimilarityFactory, DateMathParserTest, TestThaiWordFilterFactory, TestNGramFilters, OpenExchangeRatesOrgProviderTest, TestCzechStemFilterFactory, FileUtilsTest, TestPortugueseMinimalStemFilterFactory, TestDelimitedPayloadTokenFilterFactory, CloudStateTest, TestGermanLightStemFilterFactory, TestBadConfig, TestBrazilianStemFilterFactory, TestIrishLowerCaseFilterFactory, TestCJKWidthFilterFactory, TestUtils, TestFrenchLightStemFilterFactory, TestHunspellStemFilterFactory, TestKeepFilterFactory, TestDictionaryCompoundWordTokenFilterFactory, TestSynonymFilterFactory, TestLatvianStemFilterFactory, TestDocumentBuilder, TestJapaneseIterationMarkCharFilterFactory, SyncSliceTest]
[junit4:junit4]   2> NOTE: reproduce with: ant test  -Dtestcase=SyncSliceTest -Dtests.seed=747F9BFECA4C10AD -Dtests.multiplier=3 -Dtests.slow=true -Dtests.locale=in_ID -Dtests.timezone=Asia/Calcutta -Dtests.file.encoding=ISO8859-1
[junit4:junit4]   2>
[junit4:junit4] ERROR   0.00s J0 | SyncSliceTest (suite)
[junit4:junit4]    > Throwable #1: java.lang.AssertionError: ERROR: SolrIndexSearcher opens=24 closes=23
[junit4:junit4]    > at __randomizedtesting.SeedInfo.seed([747F9BFECA4C10AD]:0)
[junit4:junit4]    > at org.junit.Assert.fail(Assert.java:93)
[junit4:junit4]    > at org.apache.solr.SolrTestCaseJ4.endTrackingSearchers(SolrTestCaseJ4.java:216)
[junit4:junit4]    > at org.apache.solr.SolrTestCaseJ4.afterClass(SolrTestCaseJ4.java:82)
[junit4:junit4]    > at sun.reflect.GeneratedMethodAccessor16.invoke(Unknown Source)
[junit4:junit4]    > at sun.reflect.DelegatingMethodAccessorImpl.invoke(DelegatingMethodAccessorImpl.java:43)
[junit4:junit4]    > at java.lang.reflect.Method.invoke(Method.java:616)
[junit4:junit4]    > at com.carrotsearch.randomizedtesting.RandomizedRunner.invoke(RandomizedRunner.java:1995)
[junit4:junit4]    > at com.carrotsearch.randomizedtesting.RandomizedRunner.access$1100(RandomizedRunner.java:132)
[junit4:junit4]    > at com.carrotsearch.randomizedtesting.RandomizedRunner$5.evaluate(RandomizedRunner.java:754)
[junit4:junit4]    > at com.carrotsearch.randomizedtesting.rules.SystemPropertiesRestoreRule$1.evaluate(SystemPropertiesRestoreRule.java:53)
[junit4:junit4]    > at org.apache.lucene.util.AbstractBeforeAfterRule$1.evaluate(AbstractBeforeAfterRule.java:45)
[junit4:junit4]    > at org.apache.lucene.util.TestRuleReportUncaughtExceptions$1.evaluate(TestRuleReportUncaughtExceptions.java:68)
[junit4:junit4]    > at org.apache.lucene.util.TestRuleStoreClassName$1.evaluate(TestRuleStoreClassName.java:38)
[junit4:junit4]    > at org.apache.lucene.util.TestRuleIcuHack$1.evaluate(TestRuleIcuHack.java:51)
[junit4:junit4]    > at com.carrotsearch.randomizedtesting.rules.SystemPropertiesInvariantRule$1.evaluate(SystemPropertiesInvariantRule.java:55)
[junit4:junit4]    > at org.apache.lucene.util.TestRuleNoInstanceHooksOverrides$1.evaluate(TestRuleNoInstanceHooksOverrides.java:53)
[junit4:junit4]    > at org.apache.lucene.util.TestRuleNoStaticHooksShadowing$1.evaluate(TestRuleNoStaticHooksShadowing.java:52)
[junit4:junit4]    > at org.apache.lucene.util.TestRuleAssertionsRequired$1.evaluate(TestRuleAssertionsRequired.java:36)
[junit4:junit4]    > at org.apache.lucene.util.TestRuleMarkFailure$1.evaluate(TestRuleMarkFailure.java:48)
[junit4:junit4]    > at org.apache.lucene.util.TestRuleIgnoreAfterMaxFailures$1.evaluate(TestRuleIgnoreAfterMaxFailures.java:70)
[junit4:junit4]    > at org.apache.lucene.util.TestRuleIgnoreTestSuites$1.evaluate(TestRuleIgnoreTestSuites.java:55)
[junit4:junit4]    > at com.carrotsearch.randomizedtesting.RandomizedRunner.runSuite(RandomizedRunner.java:605)
[junit4:junit4]    > at com.carrotsearch.randomizedtesting.RandomizedRunner.access$400(RandomizedRunner.java:132)
[junit4:junit4]    > at com.carrotsearch.randomizedtesting.RandomizedRunner$2.run(RandomizedRunner.java:551)
[junit4:junit4]    >
[junit4:junit4] Completed on J0 in 159.47s, 1 test, 1 failure <<< FAILURES!
[...truncated 30 lines...]

[...truncated 12468 lines...]

[...truncated 12468 lines...]

[...truncated 12468 lines...]

[...truncated 12468 lines...]

[...truncated 12403 lines...]
[junit4:junit4]   2> 159450 T5462 oas.SolrTestCaseJ4.endTrackingSearchers SEVERE ERROR: SolrIndexSearcher opens=24 closes=23
[junit4:junit4]   2> NOTE: test params are: codec=Asserting, sim=RandomSimilarityProvider(queryNorm=true,coord=true): {}, locale=in_ID, timezone=Asia/Calcutta
[junit4:junit4]   2> NOTE: FreeBSD 9.0-RELEASE amd64/Sun Microsystems Inc. 1.6.0_32 (64-bit)/cpus=16,threads=6,free=144660344,total=369229824
[junit4:junit4]   2> NOTE: All tests run in this JVM: [TestHTMLStripCharFilterFactory, TestFoldingMultitermQuery, EchoParamsTest, TestCharFilters, BasicFunctionalityTest, TestSearchPerf, TestJapaneseKatakanaStemFilterFactory, DateFieldTest, XmlUpdateRequestHandlerTest, SolrRequestParserTest, TestTypeTokenFilterFactory, FastVectorHighlighterTest, TestExtendedDismaxParser, TestJmxIntegration, ZkNodePropsTest, AutoCommitTest, TestRandomFaceting, TestStressVersions, TestDistributedSearch, SimpleFacetsTest, SpatialFilterTest, PreAnalyzedFieldTest, SystemInfoHandlerTest, UpdateRequestProcessorFactoryTest, TestSolrQueryParser, TestCapitalizationFilterFactory, DistributedQueryElevationComponentTest, TestSolrCoreProperties, HighlighterTest, TestNorwegianLightStemFilterFactory, TestCodecSupport, TestStandardFactories, TestRemoveDuplicatesTokenFilterFactory, TestDistributedGrouping, OutputWriterTest, SuggesterWFSTTest, TestFunctionQuery, MoreLikeThisHandlerTest, LeaderElectionIntegrationTest, TestArabicFilters, TestHyphenationCompoundWordTokenFilterFactory, ShowFileRequestHandlerTest, CommonGramsQueryFilterFactoryTest, TermsComponentTest, PluginInfoTest, LukeRequestHandlerTest, ConvertedLegacyTest, TestUpdate, TestStemmerOverrideFilterFactory, RecoveryZkTest, TestTrimFilterFactory, DirectUpdateHandlerOptimizeTest, FullSolrCloudDistribCmdsTest, TestPatternTokenizerFactory, SolrInfoMBeanTest, MinimalSchemaTest, TestIndexingPerformance, JSONWriterTest, TestFaceting, BinaryUpdateRequestHandlerTest, DOMUtilTest, TestBulgarianStemFilterFactory, DirectUpdateHandlerTest, TestHashPartitioner, TestGreekLowerCaseFilterFactory, SuggesterTest, TestCSVLoader, TestPatternReplaceCharFilterFactory, TestSwedishLightStemFilterFactory, SuggesterTSTTest, CopyFieldTest, RequestHandlersTest, CoreAdminHandlerTest, FullSolrCloudTest, StatsComponentTest, TestJoin, QueryElevationComponentTest, TestTrie, DirectSolrConnectionTest, CacheHeaderTest, TestWordDelimiterFilterFactory, PolyFieldTest, TestCSVResponseWriter, CurrencyFieldTest, TestPseudoReturnFields, DisMaxRequestHandlerTest, DistanceFunctionTest, StandardRequestHandlerTest, TestQueryTypes, TestPHPSerializedResponseWriter, FieldAnalysisRequestHandlerTest, PingRequestHandlerTest, TermVectorComponentTest, JsonLoaderTest, TestSurroundQueryParser, TestValueSourceCache, TestReversedWildcardFilterFactory, DebugComponentTest, RequiredFieldsTest, SuggesterFSTTest, TestQueryUtils, LoggingHandlerTest, SolrCmdDistributorTest, UpdateParamsTest, CSVRequestHandlerTest, NotRequiredUniqueKeyTest, BadIndexSchemaTest, SolrCoreCheckLockOnStartupTest, TestLuceneMatchVersion, TestPropInject, PrimitiveFieldTypeTest, BadComponentTest, TestBinaryField, SOLR749Test, DefaultValueUpdateProcessorTest, TestLFUCache, SolrIndexConfigTest, TestNumberUtils, TestJapaneseBaseFormFilterFactory, TestJapaneseTokenizerFactory, TestKStemFilterFactory, TestPhraseSuggestions, LegacyHTMLStripCharFilterTest, TestJapaneseReadingFormFilterFactory, TestIBSimilarityFactory, DateMathParserTest, TestThaiWordFilterFactory, TestNGramFilters, OpenExchangeRatesOrgProviderTest, TestCzechStemFilterFactory, FileUtilsTest, TestPortugueseMinimalStemFilterFactory, TestDelimitedPayloadTokenFilterFactory, CloudStateTest, TestGermanLightStemFilterFactory, TestBadConfig, TestBrazilianStemFilterFactory, TestIrishLowerCaseFilterFactory, TestCJKWidthFilterFactory, TestUtils, TestFrenchLightStemFilterFactory, TestHunspellStemFilterFactory, TestKeepFilterFactory, TestDictionaryCompoundWordTokenFilterFactory, TestSynonymFilterFactory, TestLatvianStemFilterFactory, TestDocumentBuilder, TestJapaneseIterationMarkCharFilterFactory, SyncSliceTest]
[junit4:junit4]   2> NOTE: reproduce with: ant test  -Dtestcase=SyncSliceTest -Dtests.seed=747F9BFECA4C10AD -Dtests.multiplier=3 -Dtests.slow=true -Dtests.locale=in_ID -Dtests.timezone=Asia/Calcutta -Dtests.file.encoding=ISO8859-1
[junit4:junit4]   2>
[junit4:junit4] ERROR   0.00s J0 | SyncSliceTest (suite)
[junit4:junit4]    > Throwable #1: java.lang.AssertionError: ERROR: SolrIndexSearcher opens=24 closes=23
[junit4:junit4]    > at __randomizedtesting.SeedInfo.seed([747F9BFECA4C10AD]:0)
[junit4:junit4]    > at org.junit.Assert.fail(Assert.java:93)
[junit4:junit4]    > at org.apache.solr.SolrTestCaseJ4.endTrackingSearchers(SolrTestCaseJ4.java:216)
[junit4:junit4]    > at org.apache.solr.SolrTestCaseJ4.afterClass(SolrTestCaseJ4.java:82)
[junit4:junit4]    > at sun.reflect.GeneratedMethodAccessor16.invoke(Unknown Source)
[junit4:junit4]    > at sun.reflect.DelegatingMethodAccessorImpl.invoke(DelegatingMethodAccessorImpl.java:43)
[junit4:junit4]    > at java.lang.reflect.Method.invoke(Method.java:616)
[junit4:junit4]    > at com.carrotsearch.randomizedtesting.RandomizedRunner.invoke(RandomizedRunner.java:1995)
[junit4:junit4]    > at com.carrotsearch.randomizedtesting.RandomizedRunner.access$1100(RandomizedRunner.java:132)
[junit4:junit4]    > at com.carrotsearch.randomizedtesting.RandomizedRunner$5.evaluate(RandomizedRunner.java:754)
[junit4:junit4]    > at com.carrotsearch.randomizedtesting.rules.SystemPropertiesRestoreRule$1.evaluate(SystemPropertiesRestoreRule.java:53)
[junit4:junit4]    > at org.apache.lucene.util.AbstractBeforeAfterRule$1.evaluate(AbstractBeforeAfterRule.java:45)
[junit4:junit4]    > at org.apache.lucene.util.TestRuleReportUncaughtExceptions$1.evaluate(TestRuleReportUncaughtExceptions.java:68)
[junit4:junit4]    > at org.apache.lucene.util.TestRuleStoreClassName$1.evaluate(TestRuleStoreClassName.java:38)
[junit4:junit4]    > at org.apache.lucene.util.TestRuleIcuHack$1.evaluate(TestRuleIcuHack.java:51)
[junit4:junit4]    > at com.carrotsearch.randomizedtesting.rules.SystemPropertiesInvariantRule$1.evaluate(SystemPropertiesInvariantRule.java:55)
[junit4:junit4]    > at org.apache.lucene.util.TestRuleNoInstanceHooksOverrides$1.evaluate(TestRuleNoInstanceHooksOverrides.java:53)
[junit4:junit4]    > at org.apache.lucene.util.TestRuleNoStaticHooksShadowing$1.evaluate(TestRuleNoStaticHooksShadowing.java:52)
[junit4:junit4]    > at org.apache.lucene.util.TestRuleAssertionsRequired$1.evaluate(TestRuleAssertionsRequired.java:36)
[junit4:junit4]    > at org.apache.lucene.util.TestRuleMarkFailure$1.evaluate(TestRuleMarkFailure.java:48)
[junit4:junit4]    > at org.apache.lucene.util.TestRuleIgnoreAfterMaxFailures$1.evaluate(TestRuleIgnoreAfterMaxFailures.java:70)
[junit4:junit4]    > at org.apache.lucene.util.TestRuleIgnoreTestSuites$1.evaluate(TestRuleIgnoreTestSuites.java:55)
[junit4:junit4]    > at com.carrotsearch.randomizedtesting.RandomizedRunner.runSuite(RandomizedRunner.java:605)
[junit4:junit4]    > at com.carrotsearch.randomizedtesting.RandomizedRunner.access$400(RandomizedRunner.java:132)
[junit4:junit4]    > at com.carrotsearch.randomizedtesting.RandomizedRunner$2.run(RandomizedRunner.java:551)
[junit4:junit4]    >
[junit4:junit4] Completed on J0 in 159.47s, 1 test, 1 failure <<< FAILURES!
[junit4:junit4]  
[junit4:junit4] Suite: org.apache.solr.update.processor.ScriptEngineTest
[junit4:junit4] Completed on J0 in 0.05s, 5 tests
[junit4:junit4]  
[junit4:junit4] Suite: org.apache.solr.update.processor.StatelessScriptUpdateProcessorFactoryTest
[junit4:junit4] Completed on J0 in 0.91s, 7 tests
[junit4:junit4]  
[junit4:junit4] Suite: org.apache.solr.search.TestStressRecovery
[junit4:junit4] Completed on J1 in 23.48s, 1 test
[junit4:junit4]  
[junit4:junit4] JVM J0:     0.89 ..   795.94 =   795.05s
[junit4:junit4] JVM J1:     0.89 ..   860.31 =   859.42s
[junit4:junit4] Execution time total: 14 minutes 20 seconds
[junit4:junit4] Tests summary: 297 suites, 1054 tests, 1 suite-level error, 1 failure, 5 ignored

BUILD FAILED
/usr/home/hudson/hudson-slave/workspace/Lucene-Solr-tests-only-trunk/checkout/build.xml:29: The following error occurred while executing this line:
/usr/home/hudson/hudson-slave/workspace/Lucene-Solr-tests-only-trunk/checkout/solr/build.xml:144: The following error occurred while executing this line:
/usr/home/hudson/hudson-slave/workspace/Lucene-Solr-tests-only-trunk/checkout/lucene/module-build.xml:62: The following error occurred while executing this line:
/usr/home/hudson/hudson-slave/workspace/Lucene-Solr-tests-only-trunk/checkout/lucene/common-build.xml:1094: The following error occurred while executing this line:
/usr/home/hudson/hudson-slave/workspace/Lucene-Solr-tests-only-trunk/checkout/lucene/common-build.xml:789: There were test failures: 297 suites, 1054 tests, 1 suite-level error, 1 failure, 5 ignored

Total time: 25 minutes 48 seconds
Build step 'Execute shell' marked build as failure
Archiving artifacts
Recording test results
Publishing Clover coverage report...
No Clover report will be published due to a Build Failure
Email was triggered for: Failure
Sending email for trigger: Failure




---------------------------------------------------------------------
To unsubscribe, e-mail: [hidden email]
For additional commands, e-mail: [hidden email]