[JENKINS] Lucene-Solr-tests-only-trunk - Build # 14924 - Failure

classic Classic list List threaded Threaded
2 messages Options
Reply | Threaded
Open this post in threaded view
|

[JENKINS] Lucene-Solr-tests-only-trunk - Build # 14924 - Failure

Apache Jenkins Server-2
Build: https://builds.apache.org/job/Lucene-Solr-tests-only-trunk/14924/

1 tests failed.
REGRESSION:  org.apache.solr.cloud.FullSolrCloudTest.testDistribSearch

Error Message:
Timeout occured while waiting response from server at: http://localhost:34674/solr/collection1

Stack Trace:
org.apache.solr.client.solrj.SolrServerException: Timeout occured while waiting response from server at: http://localhost:34674/solr/collection1
        at __randomizedtesting.SeedInfo.seed([D9D79AA1D983E547:583114B9AEDC857B]:0)
        at org.apache.solr.client.solrj.impl.HttpSolrServer.request(HttpSolrServer.java:410)
        at org.apache.solr.client.solrj.impl.HttpSolrServer.request(HttpSolrServer.java:182)
        at org.apache.solr.client.solrj.request.AbstractUpdateRequest.process(AbstractUpdateRequest.java:117)
        at org.apache.solr.cloud.FullSolrCloudTest.index_specific(FullSolrCloudTest.java:504)
        at org.apache.solr.cloud.FullSolrCloudTest.brindDownShardIndexSomeDocsAndRecover(FullSolrCloudTest.java:722)
        at org.apache.solr.cloud.FullSolrCloudTest.doTest(FullSolrCloudTest.java:559)
        at org.apache.solr.BaseDistributedSearchTestCase.testDistribSearch(BaseDistributedSearchTestCase.java:679)
        at sun.reflect.NativeMethodAccessorImpl.invoke0(Native Method)
        at sun.reflect.NativeMethodAccessorImpl.invoke(NativeMethodAccessorImpl.java:57)
        at sun.reflect.DelegatingMethodAccessorImpl.invoke(DelegatingMethodAccessorImpl.java:43)
        at java.lang.reflect.Method.invoke(Method.java:616)
        at com.carrotsearch.randomizedtesting.RandomizedRunner.invoke(RandomizedRunner.java:1995)
        at com.carrotsearch.randomizedtesting.RandomizedRunner.access$1100(RandomizedRunner.java:132)
        at com.carrotsearch.randomizedtesting.RandomizedRunner$6.evaluate(RandomizedRunner.java:818)
        at com.carrotsearch.randomizedtesting.RandomizedRunner$7.evaluate(RandomizedRunner.java:877)
        at com.carrotsearch.randomizedtesting.RandomizedRunner$8.evaluate(RandomizedRunner.java:891)
        at com.carrotsearch.randomizedtesting.rules.SystemPropertiesRestoreRule$1.evaluate(SystemPropertiesRestoreRule.java:53)
        at org.apache.lucene.util.TestRuleSetupTeardownChained$1.evaluate(TestRuleSetupTeardownChained.java:50)
        at org.apache.lucene.util.TestRuleFieldCacheSanity$1.evaluate(TestRuleFieldCacheSanity.java:32)
        at org.apache.lucene.util.AbstractBeforeAfterRule$1.evaluate(AbstractBeforeAfterRule.java:45)
        at com.carrotsearch.randomizedtesting.rules.SystemPropertiesInvariantRule$1.evaluate(SystemPropertiesInvariantRule.java:55)
        at org.apache.lucene.util.TestRuleReportUncaughtExceptions$1.evaluate(TestRuleReportUncaughtExceptions.java:68)
        at org.apache.lucene.util.TestRuleThreadAndTestName$1.evaluate(TestRuleThreadAndTestName.java:48)
        at org.apache.lucene.util.TestRuleIgnoreAfterMaxFailures$1.evaluate(TestRuleIgnoreAfterMaxFailures.java:70)
        at org.apache.lucene.util.TestRuleMarkFailure$1.evaluate(TestRuleMarkFailure.java:48)
        at com.carrotsearch.randomizedtesting.RandomizedRunner.runSingleTest(RandomizedRunner.java:825)
        at com.carrotsearch.randomizedtesting.RandomizedRunner.access$700(RandomizedRunner.java:132)
        at com.carrotsearch.randomizedtesting.RandomizedRunner$3$1.run(RandomizedRunner.java:671)
        at com.carrotsearch.randomizedtesting.RandomizedRunner$3.evaluate(RandomizedRunner.java:697)
        at com.carrotsearch.randomizedtesting.RandomizedRunner$4.evaluate(RandomizedRunner.java:736)
        at com.carrotsearch.randomizedtesting.RandomizedRunner$5.evaluate(RandomizedRunner.java:747)
        at com.carrotsearch.randomizedtesting.rules.SystemPropertiesRestoreRule$1.evaluate(SystemPropertiesRestoreRule.java:53)
        at org.apache.lucene.util.AbstractBeforeAfterRule$1.evaluate(AbstractBeforeAfterRule.java:45)
        at org.apache.lucene.util.TestRuleReportUncaughtExceptions$1.evaluate(TestRuleReportUncaughtExceptions.java:68)
        at org.apache.lucene.util.TestRuleStoreClassName$1.evaluate(TestRuleStoreClassName.java:38)
        at org.apache.lucene.util.TestRuleIcuHack$1.evaluate(TestRuleIcuHack.java:51)
        at com.carrotsearch.randomizedtesting.rules.SystemPropertiesInvariantRule$1.evaluate(SystemPropertiesInvariantRule.java:55)
        at org.apache.lucene.util.TestRuleNoInstanceHooksOverrides$1.evaluate(TestRuleNoInstanceHooksOverrides.java:53)
        at org.apache.lucene.util.TestRuleNoStaticHooksShadowing$1.evaluate(TestRuleNoStaticHooksShadowing.java:52)
        at org.apache.lucene.util.TestRuleAssertionsRequired$1.evaluate(TestRuleAssertionsRequired.java:36)
        at org.apache.lucene.util.TestRuleMarkFailure$1.evaluate(TestRuleMarkFailure.java:48)
        at org.apache.lucene.util.TestRuleIgnoreAfterMaxFailures$1.evaluate(TestRuleIgnoreAfterMaxFailures.java:70)
        at org.apache.lucene.util.TestRuleIgnoreTestSuites$1.evaluate(TestRuleIgnoreTestSuites.java:55)
        at com.carrotsearch.randomizedtesting.RandomizedRunner.runSuite(RandomizedRunner.java:605)
        at com.carrotsearch.randomizedtesting.RandomizedRunner.access$400(RandomizedRunner.java:132)
        at com.carrotsearch.randomizedtesting.RandomizedRunner$2.run(RandomizedRunner.java:551)
Caused by: java.net.SocketTimeoutException: Read timed out
        at java.net.SocketInputStream.socketRead0(Native Method)
        at java.net.SocketInputStream.read(SocketInputStream.java:146)
        at org.apache.http.impl.io.AbstractSessionInputBuffer.fillBuffer(AbstractSessionInputBuffer.java:149)
        at org.apache.http.impl.io.SocketInputBuffer.fillBuffer(SocketInputBuffer.java:111)
        at org.apache.http.impl.io.AbstractSessionInputBuffer.readLine(AbstractSessionInputBuffer.java:264)
        at org.apache.http.impl.conn.DefaultResponseParser.parseHead(DefaultResponseParser.java:98)
        at org.apache.http.impl.io.AbstractMessageParser.parse(AbstractMessageParser.java:252)
        at org.apache.http.impl.AbstractHttpClientConnection.receiveResponseHeader(AbstractHttpClientConnection.java:282)
        at org.apache.http.impl.conn.DefaultClientConnection.receiveResponseHeader(DefaultClientConnection.java:247)
        at org.apache.http.impl.conn.AbstractClientConnAdapter.receiveResponseHeader(AbstractClientConnAdapter.java:216)
        at org.apache.http.protocol.HttpRequestExecutor.doReceiveResponse(HttpRequestExecutor.java:298)
        at org.apache.http.protocol.HttpRequestExecutor.execute(HttpRequestExecutor.java:125)
        at org.apache.http.impl.client.DefaultRequestDirector.tryExecute(DefaultRequestDirector.java:647)
        at org.apache.http.impl.client.DefaultRequestDirector.execute(DefaultRequestDirector.java:464)
        at org.apache.http.impl.client.AbstractHttpClient.execute(AbstractHttpClient.java:820)
        at org.apache.http.impl.client.AbstractHttpClient.execute(AbstractHttpClient.java:754)
        at org.apache.http.impl.client.AbstractHttpClient.execute(AbstractHttpClient.java:732)
        at org.apache.solr.client.solrj.impl.HttpSolrServer.request(HttpSolrServer.java:353)
        ... 45 more




Build Log:
[...truncated 11792 lines...]
[junit4:junit4]   2> 140245 T1282 oasc.ChaosMonkey.monkeyLog monkey: stop shard! 34674
[junit4:junit4]   2> 140245 T1282 oasc.CoreContainer.shutdown Shutting down CoreContainer instance=488092961
[junit4:junit4]   2> 140245 T1282 oasc.RecoveryStrategy.close WARNING Stopping recovery for core collection1 zkNodeName=127.0.0.1:34674_solr_collection1
[junit4:junit4]   2> 141297 T1352 oaz.ClientCnxn$SendThread.startConnect Opening socket connection to server localhost/127.0.0.1:24004
[junit4:junit4]   2> 152292 T1353 oaz.ClientCnxn$EventThread.run EventThread shut down
[junit4:junit4]   2> 152292 T1282 oaz.ZooKeeper.close Session: 0x138b48e0a380006 closed
[junit4:junit4]   2> 152293 T1282 oejsh.ContextHandler.doStop stopped o.e.j.s.ServletContextHandler{/solr,null}
[junit4:junit4]   2>  C86_STATE=coll:collection1 core:collection1 props:{shard=shard2, roles=null, leader=true, state=active, core=collection1, collection=collection1, node_name=127.0.0.1:34674_solr, base_url=http://127.0.0.1:34674/solr}
[junit4:junit4]   2> 152344 T1351 C86 P34674 REQ /update {wt=javabin&version=2} status=503 QTime=56781
[junit4:junit4]   2> 152345 T1351 C86 P34674 oasc.SolrException.log SEVERE null:org.eclipse.jetty.io.EofException
[junit4:junit4]   2> at org.eclipse.jetty.server.HttpOutput.write(HttpOutput.java:154)
[junit4:junit4]   2> at org.eclipse.jetty.server.HttpOutput.write(HttpOutput.java:101)
[junit4:junit4]   2> at org.apache.solr.common.util.FastOutputStream.flushBuffer(FastOutputStream.java:185)
[junit4:junit4]   2> at org.apache.solr.common.util.JavaBinCodec.marshal(JavaBinCodec.java:94)
[junit4:junit4]   2> at org.apache.solr.response.BinaryResponseWriter.write(BinaryResponseWriter.java:49)
[junit4:junit4]   2> at org.apache.solr.servlet.SolrDispatchFilter.writeResponse(SolrDispatchFilter.java:403)
[junit4:junit4]   2> at org.apache.solr.servlet.SolrDispatchFilter.doFilter(SolrDispatchFilter.java:288)
[junit4:junit4]   2> at org.eclipse.jetty.servlet.ServletHandler$CachedChain.doFilter(ServletHandler.java:1337)
[junit4:junit4]   2> at org.eclipse.jetty.servlet.ServletHandler.doHandle(ServletHandler.java:484)
[junit4:junit4]   2> at org.eclipse.jetty.server.session.SessionHandler.doHandle(SessionHandler.java:231)
[junit4:junit4]   2> at org.eclipse.jetty.server.handler.ScopedHandler.handle(ScopedHandler.java:119)
[junit4:junit4]   2> at org.eclipse.jetty.server.handler.GzipHandler.handle(GzipHandler.java:267)
[junit4:junit4]   2> at org.eclipse.jetty.server.handler.ContextHandler.doHandle(ContextHandler.java:1067)
[junit4:junit4]   2> at org.eclipse.jetty.servlet.ServletHandler.doScope(ServletHandler.java:413)
[junit4:junit4]   2> at org.eclipse.jetty.server.session.SessionHandler.doScope(SessionHandler.java:192)
[junit4:junit4]   2> at org.eclipse.jetty.server.handler.ContextHandler.doScope(ContextHandler.java:999)
[junit4:junit4]   2> at org.eclipse.jetty.server.handler.ScopedHandler.handle(ScopedHandler.java:117)
[junit4:junit4]   2> at org.eclipse.jetty.server.handler.HandlerWrapper.handle(HandlerWrapper.java:111)
[junit4:junit4]   2> at org.eclipse.jetty.server.Server.handle(Server.java:351)
[junit4:junit4]   2> at org.eclipse.jetty.server.AbstractHttpConnection.handleRequest(AbstractHttpConnection.java:454)
[junit4:junit4]   2> at org.eclipse.jetty.server.BlockingHttpConnection.handleRequest(BlockingHttpConnection.java:47)
[junit4:junit4]   2> at org.eclipse.jetty.server.AbstractHttpConnection.content(AbstractHttpConnection.java:900)
[junit4:junit4]   2> at org.eclipse.jetty.server.AbstractHttpConnection$RequestHandler.content(AbstractHttpConnection.java:954)
[junit4:junit4]   2> at org.eclipse.jetty.http.HttpParser.parseNext(HttpParser.java:952)
[junit4:junit4]   2> at org.eclipse.jetty.http.HttpParser.parseAvailable(HttpParser.java:235)
[junit4:junit4]   2> at org.eclipse.jetty.server.BlockingHttpConnection.handle(BlockingHttpConnection.java:66)
[junit4:junit4]   2> at org.eclipse.jetty.server.bio.SocketConnector$ConnectorEndPoint.run(SocketConnector.java:254)
[junit4:junit4]   2> at org.eclipse.jetty.util.thread.QueuedThreadPool.runJob(QueuedThreadPool.java:599)
[junit4:junit4]   2> at org.eclipse.jetty.util.thread.QueuedThreadPool$3.run(QueuedThreadPool.java:534)
[junit4:junit4]   2> at java.lang.Thread.run(Thread.java:679)
[junit4:junit4]   2>
[junit4:junit4]   2> 152346 T1351 C86 P34674 oasc.SolrException.log SEVERE null:org.eclipse.jetty.io.EofException
[junit4:junit4]   2> at org.eclipse.jetty.server.HttpOutput.write(HttpOutput.java:154)
[junit4:junit4]   2> at org.eclipse.jetty.server.HttpOutput.write(HttpOutput.java:101)
[junit4:junit4]   2> at org.apache.solr.common.util.FastOutputStream.flushBuffer(FastOutputStream.java:185)
[junit4:junit4]   2> at org.apache.solr.common.util.JavaBinCodec.marshal(JavaBinCodec.java:94)
[junit4:junit4]   2> at org.apache.solr.response.BinaryResponseWriter.write(BinaryResponseWriter.java:49)
[junit4:junit4]   2> at org.apache.solr.servlet.SolrDispatchFilter.writeResponse(SolrDispatchFilter.java:403)
[junit4:junit4]   2> at org.apache.solr.servlet.SolrDispatchFilter.doFilter(SolrDispatchFilter.java:288)
[junit4:junit4]   2> at org.eclipse.jetty.servlet.ServletHandler$CachedChain.doFilter(ServletHandler.java:1337)
[junit4:junit4]   2> at org.eclipse.jetty.servlet.ServletHandler.doHandle(ServletHandler.java:484)
[junit4:junit4]   2> at org.eclipse.jetty.server.session.SessionHandler.doHandle(SessionHandler.java:231)
[junit4:junit4]   2> at org.eclipse.jetty.server.handler.ScopedHandler.handle(ScopedHandler.java:119)
[junit4:junit4]   2> at org.eclipse.jetty.server.handler.GzipHandler.handle(GzipHandler.java:267)
[junit4:junit4]   2> at org.eclipse.jetty.server.handler.ContextHandler.doHandle(ContextHandler.java:1067)
[junit4:junit4]   2> at org.eclipse.jetty.servlet.ServletHandler.doScope(ServletHandler.java:413)
[junit4:junit4]   2> at org.eclipse.jetty.server.session.SessionHandler.doScope(SessionHandler.java:192)
[junit4:junit4]   2> at org.eclipse.jetty.server.handler.ContextHandler.doScope(ContextHandler.java:999)
[junit4:junit4]   2> at org.eclipse.jetty.server.handler.ScopedHandler.handle(ScopedHandler.java:117)
[junit4:junit4]   2> at org.eclipse.jetty.server.handler.HandlerWrapper.handle(HandlerWrapper.java:111)
[junit4:junit4]   2> at org.eclipse.jetty.server.Server.handle(Server.java:351)
[junit4:junit4]   2> at org.eclipse.jetty.server.AbstractHttpConnection.handleRequest(AbstractHttpConnection.java:454)
[junit4:junit4]   2> at org.eclipse.jetty.server.BlockingHttpConnection.handleRequest(BlockingHttpConnection.java:47)
[junit4:junit4]   2> at org.eclipse.jetty.server.AbstractHttpConnection.content(AbstractHttpConnection.java:900)
[junit4:junit4]   2> at org.eclipse.jetty.server.AbstractHttpConnection$RequestHandler.content(AbstractHttpConnection.java:954)
[junit4:junit4]   2> at org.eclipse.jetty.http.HttpParser.parseNext(HttpParser.java:952)
[junit4:junit4]   2> at org.eclipse.jetty.http.HttpParser.parseAvailable(HttpParser.java:235)
[junit4:junit4]   2> at org.eclipse.jetty.server.BlockingHttpConnection.handle(BlockingHttpConnection.java:66)
[junit4:junit4]   2> at org.eclipse.jetty.server.bio.SocketConnector$ConnectorEndPoint.run(SocketConnector.java:254)
[junit4:junit4]   2> at org.eclipse.jetty.util.thread.QueuedThreadPool.runJob(QueuedThreadPool.java:599)
[junit4:junit4]   2> at org.eclipse.jetty.util.thread.QueuedThreadPool$3.run(QueuedThreadPool.java:534)
[junit4:junit4]   2> at java.lang.Thread.run(Thread.java:679)
[junit4:junit4]   2>
[junit4:junit4]   2> 152351 T1351 C86 P34674 oasc.SolrCore.close [collection1]  CLOSING SolrCore org.apache.solr.core.SolrCore@6e99fc76
[junit4:junit4]   2> 152355 T1351 C86 P34674 oasc.SolrCore.closeSearcher [collection1] Closing main searcher on request.
[junit4:junit4]   2> 152355 T1351 C86 P34674 oasu.DirectUpdateHandler2.close closing DirectUpdateHandler2{commits=6,autocommits=0,soft autocommits=0,optimizes=0,rollbacks=0,expungeDeletes=0,docsPending=0,adds=0,deletesById=0,deletesByQuery=0,errors=0,cumulative_adds=36,cumulative_deletesById=0,cumulative_deletesByQuery=0,cumulative_errors=0}
[junit4:junit4]   2> 152356 T1351 C86 P34674 oasc.RecoveryStrategy.close WARNING Stopping recovery for core collection1 zkNodeName=127.0.0.1:34674_solr_collection1
[junit4:junit4]   2> 152398 T1282 oas.SolrTestCaseJ4.tearDown ###Ending testDistribSearch
[junit4:junit4]   1>      /solr/collections/control_collection/leader_elect/control_shard (1)
[junit4:junit4]   1>       /solr/collections/control_collection/leader_elect/control_shard/election (1)
[junit4:junit4]   1>        /solr/collections/control_collection/leader_elect/control_shard/election/88018714883522562-127.0.0.1:60446_solr_collection1-n_0000000000 (0)
[junit4:junit4]   1>     /solr/collections/control_collection/leaders (1)
[junit4:junit4]   1>      /solr/collections/control_collection/leaders/control_shard (0)
[junit4:junit4]   1>      DATA:
[junit4:junit4]   1>          {
[junit4:junit4]   1>            "core":"collection1",
[junit4:junit4]   1>            "node_name":"127.0.0.1:60446_solr",
[junit4:junit4]   1>            "base_url":"http://127.0.0.1:60446/solr"}
[junit4:junit4]   1>   /solr/clusterstate.json (0)
[junit4:junit4]   1>   DATA:
[junit4:junit4]   1>       {
[junit4:junit4]   1>         "collection1":{
[junit4:junit4]   1>           "shard1":{
[junit4:junit4]   1>             "127.0.0.1:34645_solr_collection1":{
[junit4:junit4]   1>               "shard":"shard1",
[junit4:junit4]   1>               "leader":"true",
[junit4:junit4]   1>               "roles":null,
[junit4:junit4]   1>               "state":"active",
[junit4:junit4]   1>               "core":"collection1",
[junit4:junit4]   1>               "collection":"collection1",
[junit4:junit4]   1>               "node_name":"127.0.0.1:34645_solr",
[junit4:junit4]   1>               "base_url":"http://127.0.0.1:34645/solr"},
[junit4:junit4]   1>             "127.0.0.1:34671_solr_collection1":{
[junit4:junit4]   1>               "shard":"shard1",
[junit4:junit4]   1>               "roles":null,
[junit4:junit4]   1>               "state":"active",
[junit4:junit4]   1>               "core":"collection1",
[junit4:junit4]   1>               "collection":"collection1",
[junit4:junit4]   1>               "node_name":"127.0.0.1:34671_solr",
[junit4:junit4]   1>               "base_url":"http://127.0.0.1:34671/solr"}},
[junit4:junit4]   1>           "shard2":{
[junit4:junit4]   1>             "127.0.0.1:34669_solr_collection1":{
[junit4:junit4]   1>               "shard":"shard2",
[junit4:junit4]   1>               "roles":null,
[junit4:junit4]   1>               "state":"active",
[junit4:junit4]   1>               "core":"collection1",
[junit4:junit4]   1>               "collection":"collection1",
[junit4:junit4]   1>               "node_name":"127.0.0.1:34669_solr",
[junit4:junit4]   1>               "base_url":"http://127.0.0.1:34669/solr"},
[junit4:junit4]   1>             "127.0.0.1:34674_solr_collection1":{
[junit4:junit4]   1>               "shard":"shard2",
[junit4:junit4]   1>               "leader":"true",
[junit4:junit4]   1>               "roles":null,
[junit4:junit4]   1>               "state":"active",
[junit4:junit4]   1>               "core":"collection1",
[junit4:junit4]   1>               "collection":"collection1",
[junit4:junit4]   1>               "node_name":"127.0.0.1:34674_solr",
[junit4:junit4]   1>               "base_url":"http://127.0.0.1:34674/solr"}}},
[junit4:junit4]   1>         "control_collection":{"control_shard":{"127.0.0.1:60446_solr_collection1":{
[junit4:junit4]   1>               "shard":"control_shard",
[junit4:junit4]   1>               "leader":"true",
[junit4:junit4]   1>               "roles":null,
[junit4:junit4]   1>               "state":"active",
[junit4:junit4]   1>               "core":"collection1",
[junit4:junit4]   1>               "collection":"control_collection",
[junit4:junit4]   1>               "node_name":"127.0.0.1:60446_solr",
[junit4:junit4]   1>               "base_url":"http://127.0.0.1:60446/solr"}}}}
[junit4:junit4]   1>  /zookeeper (1)
[junit4:junit4]   1>  DATA:
[junit4:junit4]   1>      
[junit4:junit4]   1>
[junit4:junit4]   2> NOTE: reproduce with: ant test  -Dtestcase=FullSolrCloudTest -Dtests.method=testDistribSearch -Dtests.seed=D9D79AA1D983E547 -Dtests.multiplier=3 -Dtests.slow=true -Dtests.locale=ar_JO -Dtests.timezone=Etc/GMT+5 -Dtests.file.encoding=ISO8859-1
[junit4:junit4]   1>
[junit4:junit4]   2>
[junit4:junit4]    > (@AfterClass output)
[junit4:junit4]   2> 152476 T1282 oas.SolrTestCaseJ4.deleteCore ###deleteCore
[junit4:junit4]   2> NOTE: test params are: codec=Asserting, sim=RandomSimilarityProvider(queryNorm=true,coord=true): {}, locale=ar_JO, timezone=Etc/GMT+5
[junit4:junit4]   2> NOTE: FreeBSD 9.0-RELEASE amd64/Sun Microsystems Inc. 1.6.0_32 (64-bit)/cpus=16,threads=2,free=91031992,total=252968960
[junit4:junit4]   2> NOTE: All tests run in this JVM: [PolyFieldTest, TestSort, PeerSyncTest, UpdateParamsTest, URLClassifyProcessorTest, TestSystemIdResolver, SpellCheckComponentTest, TestNorwegianMinimalStemFilterFactory, SpellingQueryConverterTest, TestEnglishMinimalStemFilterFactory, TestBinaryResponseWriter, IndexSchemaRuntimeFieldTest, SolrCoreTest, FieldAnalysisRequestHandlerTest, CloudStateUpdateTest, TestKeywordMarkerFilterFactory, TestReload, TestHunspellStemFilterFactory, PrimUtilsTest, TestNGramFilters, SortByFunctionTest, TestArbitraryIndexDir, TestHindiFilters, TestBeiderMorseFilterFactory, TestGroupingSearch, FileBasedSpellCheckerTest, TestJmxMonitoredMap, TestMultiCoreConfBootstrap, TestSuggestSpellingConverter, TestSolrDeletionPolicy2, TestTurkishLowerCaseFilterFactory, ZkCLITest, TestElisionFilterFactory, TestIBSimilarityFactory, TestLMJelinekMercerSimilarityFactory, JsonLoaderTest, SuggesterFSTTest, CSVRequestHandlerTest, TestReplicationHandler, SearchHandlerTest, WordBreakSolrSpellCheckerTest, IndexReaderFactoryTest, TimeZoneUtilsTest, RAMDirectoryFactoryTest, HighlighterConfigTest, ReturnFieldsTest, UUIDFieldTest, TestCzechStemFilterFactory, TestGreekStemFilterFactory, TestStressLucene, LengthFilterTest, TestValueSourceCache, TestRangeQuery, TestRealTimeGet, ScriptEngineTest, OverseerTest, StandardRequestHandlerTest, TestUAX29URLEmailTokenizerFactory, ResourceLoaderTest, TestSolrDeletionPolicy1, TestGermanNormalizationFilterFactory, CircularListTest, TestJapaneseReadingFormFilterFactory, DocumentBuilderTest, TestRecovery, TestStressReorder, TestDefaultSimilarityFactory, TestRemoteStreaming, SolrPluginUtilsTest, TestHungarianLightStemFilterFactory, TestPortugueseLightStemFilterFactory, FullSolrCloudTest]
[junit4:junit4]   2>
[junit4:junit4] Completed on J1 in 152.51s, 1 test, 1 error <<< FAILURES!
[...truncated 496 lines...]

[...truncated 12439 lines...]

[...truncated 12439 lines...]

[...truncated 12439 lines...]

[...truncated 12439 lines...]

[...truncated 12424 lines...]
BUILD FAILED
/usr/home/hudson/hudson-slave/workspace/Lucene-Solr-tests-only-trunk/checkout/build.xml:29: The following error occurred while executing this line:
/usr/home/hudson/hudson-slave/workspace/Lucene-Solr-tests-only-trunk/checkout/solr/build.xml:144: The following error occurred while executing this line:
/usr/home/hudson/hudson-slave/workspace/Lucene-Solr-tests-only-trunk/checkout/lucene/module-build.xml:62: The following error occurred while executing this line:
/usr/home/hudson/hudson-slave/workspace/Lucene-Solr-tests-only-trunk/checkout/lucene/common-build.xml:1094: The following error occurred while executing this line:
/usr/home/hudson/hudson-slave/workspace/Lucene-Solr-tests-only-trunk/checkout/lucene/common-build.xml:789: There were test failures: 297 suites, 1054 tests, 1 error, 5 ignored

Total time: 25 minutes 20 seconds
Build step 'Execute shell' marked build as failure
Archiving artifacts
Recording test results
Publishing Clover coverage report...
No Clover report will be published due to a Build Failure
Email was triggered for: Failure
Sending email for trigger: Failure




---------------------------------------------------------------------
To unsubscribe, e-mail: [hidden email]
For additional commands, e-mail: [hidden email]
Reply | Threaded
Open this post in threaded view
|

[JENKINS] Lucene-Solr-tests-only-trunk - Build # 14925 - Still Failing

Apache Jenkins Server-2
Build: https://builds.apache.org/job/Lucene-Solr-tests-only-trunk/14925/

1 tests failed.
FAILED:  org.apache.solr.cloud.FullSolrCloudTest.testDistribSearch

Error Message:
Timeout occured while waiting response from server at: http://localhost:45023/solr/collection1

Stack Trace:
org.apache.solr.client.solrj.SolrServerException: Timeout occured while waiting response from server at: http://localhost:45023/solr/collection1
        at __randomizedtesting.SeedInfo.seed([FE23AEC7802DFB36:7FC520DFF7729B0A]:0)
        at org.apache.solr.client.solrj.impl.HttpSolrServer.request(HttpSolrServer.java:410)
        at org.apache.solr.client.solrj.impl.HttpSolrServer.request(HttpSolrServer.java:182)
        at org.apache.solr.client.solrj.request.AbstractUpdateRequest.process(AbstractUpdateRequest.java:117)
        at org.apache.solr.cloud.FullSolrCloudTest.index_specific(FullSolrCloudTest.java:504)
        at org.apache.solr.cloud.FullSolrCloudTest.brindDownShardIndexSomeDocsAndRecover(FullSolrCloudTest.java:722)
        at org.apache.solr.cloud.FullSolrCloudTest.doTest(FullSolrCloudTest.java:559)
        at org.apache.solr.BaseDistributedSearchTestCase.testDistribSearch(BaseDistributedSearchTestCase.java:679)
        at sun.reflect.NativeMethodAccessorImpl.invoke0(Native Method)
        at sun.reflect.NativeMethodAccessorImpl.invoke(NativeMethodAccessorImpl.java:57)
        at sun.reflect.DelegatingMethodAccessorImpl.invoke(DelegatingMethodAccessorImpl.java:43)
        at java.lang.reflect.Method.invoke(Method.java:616)
        at com.carrotsearch.randomizedtesting.RandomizedRunner.invoke(RandomizedRunner.java:1995)
        at com.carrotsearch.randomizedtesting.RandomizedRunner.access$1100(RandomizedRunner.java:132)
        at com.carrotsearch.randomizedtesting.RandomizedRunner$6.evaluate(RandomizedRunner.java:818)
        at com.carrotsearch.randomizedtesting.RandomizedRunner$7.evaluate(RandomizedRunner.java:877)
        at com.carrotsearch.randomizedtesting.RandomizedRunner$8.evaluate(RandomizedRunner.java:891)
        at com.carrotsearch.randomizedtesting.rules.SystemPropertiesRestoreRule$1.evaluate(SystemPropertiesRestoreRule.java:53)
        at org.apache.lucene.util.TestRuleSetupTeardownChained$1.evaluate(TestRuleSetupTeardownChained.java:50)
        at org.apache.lucene.util.TestRuleFieldCacheSanity$1.evaluate(TestRuleFieldCacheSanity.java:32)
        at org.apache.lucene.util.AbstractBeforeAfterRule$1.evaluate(AbstractBeforeAfterRule.java:45)
        at com.carrotsearch.randomizedtesting.rules.SystemPropertiesInvariantRule$1.evaluate(SystemPropertiesInvariantRule.java:55)
        at org.apache.lucene.util.TestRuleReportUncaughtExceptions$1.evaluate(TestRuleReportUncaughtExceptions.java:68)
        at org.apache.lucene.util.TestRuleThreadAndTestName$1.evaluate(TestRuleThreadAndTestName.java:48)
        at org.apache.lucene.util.TestRuleIgnoreAfterMaxFailures$1.evaluate(TestRuleIgnoreAfterMaxFailures.java:70)
        at org.apache.lucene.util.TestRuleMarkFailure$1.evaluate(TestRuleMarkFailure.java:48)
        at com.carrotsearch.randomizedtesting.RandomizedRunner.runSingleTest(RandomizedRunner.java:825)
        at com.carrotsearch.randomizedtesting.RandomizedRunner.access$700(RandomizedRunner.java:132)
        at com.carrotsearch.randomizedtesting.RandomizedRunner$3$1.run(RandomizedRunner.java:671)
        at com.carrotsearch.randomizedtesting.RandomizedRunner$3.evaluate(RandomizedRunner.java:697)
        at com.carrotsearch.randomizedtesting.RandomizedRunner$4.evaluate(RandomizedRunner.java:736)
        at com.carrotsearch.randomizedtesting.RandomizedRunner$5.evaluate(RandomizedRunner.java:747)
        at com.carrotsearch.randomizedtesting.rules.SystemPropertiesRestoreRule$1.evaluate(SystemPropertiesRestoreRule.java:53)
        at org.apache.lucene.util.AbstractBeforeAfterRule$1.evaluate(AbstractBeforeAfterRule.java:45)
        at org.apache.lucene.util.TestRuleReportUncaughtExceptions$1.evaluate(TestRuleReportUncaughtExceptions.java:68)
        at org.apache.lucene.util.TestRuleStoreClassName$1.evaluate(TestRuleStoreClassName.java:38)
        at org.apache.lucene.util.TestRuleIcuHack$1.evaluate(TestRuleIcuHack.java:51)
        at com.carrotsearch.randomizedtesting.rules.SystemPropertiesInvariantRule$1.evaluate(SystemPropertiesInvariantRule.java:55)
        at org.apache.lucene.util.TestRuleNoInstanceHooksOverrides$1.evaluate(TestRuleNoInstanceHooksOverrides.java:53)
        at org.apache.lucene.util.TestRuleNoStaticHooksShadowing$1.evaluate(TestRuleNoStaticHooksShadowing.java:52)
        at org.apache.lucene.util.TestRuleAssertionsRequired$1.evaluate(TestRuleAssertionsRequired.java:36)
        at org.apache.lucene.util.TestRuleMarkFailure$1.evaluate(TestRuleMarkFailure.java:48)
        at org.apache.lucene.util.TestRuleIgnoreAfterMaxFailures$1.evaluate(TestRuleIgnoreAfterMaxFailures.java:70)
        at org.apache.lucene.util.TestRuleIgnoreTestSuites$1.evaluate(TestRuleIgnoreTestSuites.java:55)
        at com.carrotsearch.randomizedtesting.RandomizedRunner.runSuite(RandomizedRunner.java:605)
        at com.carrotsearch.randomizedtesting.RandomizedRunner.access$400(RandomizedRunner.java:132)
        at com.carrotsearch.randomizedtesting.RandomizedRunner$2.run(RandomizedRunner.java:551)
Caused by: java.net.SocketTimeoutException: Read timed out
        at java.net.SocketInputStream.socketRead0(Native Method)
        at java.net.SocketInputStream.read(SocketInputStream.java:146)
        at org.apache.http.impl.io.AbstractSessionInputBuffer.fillBuffer(AbstractSessionInputBuffer.java:149)
        at org.apache.http.impl.io.SocketInputBuffer.fillBuffer(SocketInputBuffer.java:111)
        at org.apache.http.impl.io.AbstractSessionInputBuffer.readLine(AbstractSessionInputBuffer.java:264)
        at org.apache.http.impl.conn.DefaultResponseParser.parseHead(DefaultResponseParser.java:98)
        at org.apache.http.impl.io.AbstractMessageParser.parse(AbstractMessageParser.java:252)
        at org.apache.http.impl.AbstractHttpClientConnection.receiveResponseHeader(AbstractHttpClientConnection.java:282)
        at org.apache.http.impl.conn.DefaultClientConnection.receiveResponseHeader(DefaultClientConnection.java:247)
        at org.apache.http.impl.conn.AbstractClientConnAdapter.receiveResponseHeader(AbstractClientConnAdapter.java:216)
        at org.apache.http.protocol.HttpRequestExecutor.doReceiveResponse(HttpRequestExecutor.java:298)
        at org.apache.http.protocol.HttpRequestExecutor.execute(HttpRequestExecutor.java:125)
        at org.apache.http.impl.client.DefaultRequestDirector.tryExecute(DefaultRequestDirector.java:647)
        at org.apache.http.impl.client.DefaultRequestDirector.execute(DefaultRequestDirector.java:464)
        at org.apache.http.impl.client.AbstractHttpClient.execute(AbstractHttpClient.java:820)
        at org.apache.http.impl.client.AbstractHttpClient.execute(AbstractHttpClient.java:754)
        at org.apache.http.impl.client.AbstractHttpClient.execute(AbstractHttpClient.java:732)
        at org.apache.solr.client.solrj.impl.HttpSolrServer.request(HttpSolrServer.java:353)
        ... 45 more




Build Log:
[...truncated 11868 lines...]
[junit4:junit4]   2> 139444 T2180 oejsh.ContextHandler.doStop stopped o.e.j.s.ServletContextHandler{/solr,null}
[junit4:junit4]   2> 139496 T2180 oasc.ChaosMonkey.monkeyLog monkey: stop shard! 45023
[junit4:junit4]   2> 139496 T2180 oasc.CoreContainer.shutdown Shutting down CoreContainer instance=1929322870
[junit4:junit4]   2> 139496 T2180 oasc.RecoveryStrategy.close WARNING Stopping recovery for core collection1 zkNodeName=127.0.0.1:45023_solr_collection1
[junit4:junit4]   2> 140941 T2250 oaz.ClientCnxn$SendThread.startConnect Opening socket connection to server localhost/127.0.0.1:45388
[junit4:junit4]   2> 151545 T2251 oaz.ClientCnxn$EventThread.run EventThread shut down
[junit4:junit4]   2> 151545 T2180 oaz.ZooKeeper.close Session: 0x138b4f118a60006 closed
[junit4:junit4]   2> 151546 T2180 oejsh.ContextHandler.doStop stopped o.e.j.s.ServletContextHandler{/solr,null}
[junit4:junit4]   2> 151596 T2249 C99 P45023 REQ /update {wt=javabin&version=2} status=503 QTime=56616
[junit4:junit4]   2> 151597 T2249 C99 P45023 oasc.SolrException.log SEVERE null:org.eclipse.jetty.io.EofException
[junit4:junit4]   2> at org.eclipse.jetty.server.HttpOutput.write(HttpOutput.java:154)
[junit4:junit4]   2> at org.eclipse.jetty.server.HttpOutput.write(HttpOutput.java:101)
[junit4:junit4]   2> at org.apache.solr.common.util.FastOutputStream.flushBuffer(FastOutputStream.java:185)
[junit4:junit4]   2> at org.apache.solr.common.util.JavaBinCodec.marshal(JavaBinCodec.java:94)
[junit4:junit4]   2> at org.apache.solr.response.BinaryResponseWriter.write(BinaryResponseWriter.java:49)
[junit4:junit4]   2> at org.apache.solr.servlet.SolrDispatchFilter.writeResponse(SolrDispatchFilter.java:403)
[junit4:junit4]   2> at org.apache.solr.servlet.SolrDispatchFilter.doFilter(SolrDispatchFilter.java:288)
[junit4:junit4]   2> at org.eclipse.jetty.servlet.ServletHandler$CachedChain.doFilter(ServletHandler.java:1337)
[junit4:junit4]   2> at org.eclipse.jetty.servlet.ServletHandler.doHandle(ServletHandler.java:484)
[junit4:junit4]   2> at org.eclipse.jetty.server.session.SessionHandler.doHandle(SessionHandler.java:231)
[junit4:junit4]   2> at org.eclipse.jetty.server.handler.ScopedHandler.handle(ScopedHandler.java:119)
[junit4:junit4]   2> at org.eclipse.jetty.server.handler.GzipHandler.handle(GzipHandler.java:267)
[junit4:junit4]   2> at org.eclipse.jetty.server.handler.ContextHandler.doHandle(ContextHandler.java:1067)
[junit4:junit4]   2> at org.eclipse.jetty.servlet.ServletHandler.doScope(ServletHandler.java:413)
[junit4:junit4]   2> at org.eclipse.jetty.server.session.SessionHandler.doScope(SessionHandler.java:192)
[junit4:junit4]   2> at org.eclipse.jetty.server.handler.ContextHandler.doScope(ContextHandler.java:999)
[junit4:junit4]   2> at org.eclipse.jetty.server.handler.ScopedHandler.handle(ScopedHandler.java:117)
[junit4:junit4]   2> at org.eclipse.jetty.server.handler.HandlerWrapper.handle(HandlerWrapper.java:111)
[junit4:junit4]   2> at org.eclipse.jetty.server.Server.handle(Server.java:351)
[junit4:junit4]   2> at org.eclipse.jetty.server.AbstractHttpConnection.handleRequest(AbstractHttpConnection.java:454)
[junit4:junit4]   2> at org.eclipse.jetty.server.BlockingHttpConnection.handleRequest(BlockingHttpConnection.java:47)
[junit4:junit4]   2> at org.eclipse.jetty.server.AbstractHttpConnection.content(AbstractHttpConnection.java:900)
[junit4:junit4]   2> at org.eclipse.jetty.server.AbstractHttpConnection$RequestHandler.content(AbstractHttpConnection.java:954)
[junit4:junit4]   2> at org.eclipse.jetty.http.HttpParser.parseNext(HttpParser.java:952)
[junit4:junit4]   2> at org.eclipse.jetty.http.HttpParser.parseAvailable(HttpParser.java:235)
[junit4:junit4]   2> at org.eclipse.jetty.server.BlockingHttpConnection.handle(BlockingHttpConnection.java:66)
[junit4:junit4]   2> at org.eclipse.jetty.server.bio.SocketConnector$ConnectorEndPoint.run(SocketConnector.java:254)
[junit4:junit4]   2> at org.eclipse.jetty.util.thread.QueuedThreadPool.runJob(QueuedThreadPool.java:599)
[junit4:junit4]   2> at org.eclipse.jetty.util.thread.QueuedThreadPool$3.run(QueuedThreadPool.java:534)
[junit4:junit4]   2> at java.lang.Thread.run(Thread.java:679)
[junit4:junit4]   2>
[junit4:junit4]   2> 151599 T2249 C99 P45023 oasc.SolrException.log SEVERE null:org.eclipse.jetty.io.EofException
[junit4:junit4]   2> at org.eclipse.jetty.server.HttpOutput.write(HttpOutput.java:154)
[junit4:junit4]   2> at org.eclipse.jetty.server.HttpOutput.write(HttpOutput.java:101)
[junit4:junit4]   2> at org.apache.solr.common.util.FastOutputStream.flushBuffer(FastOutputStream.java:185)
[junit4:junit4]   2> at org.apache.solr.common.util.JavaBinCodec.marshal(JavaBinCodec.java:94)
[junit4:junit4]   2> at org.apache.solr.response.BinaryResponseWriter.write(BinaryResponseWriter.java:49)
[junit4:junit4]   2> at org.apache.solr.servlet.SolrDispatchFilter.writeResponse(SolrDispatchFilter.java:403)
[junit4:junit4]   2> at org.apache.solr.servlet.SolrDispatchFilter.doFilter(SolrDispatchFilter.java:288)
[junit4:junit4]   2> at org.eclipse.jetty.servlet.ServletHandler$CachedChain.doFilter(ServletHandler.java:1337)
[junit4:junit4]   2> at org.eclipse.jetty.servlet.ServletHandler.doHandle(ServletHandler.java:484)
[junit4:junit4]   2> at org.eclipse.jetty.server.session.SessionHandler.doHandle(SessionHandler.java:231)
[junit4:junit4]   2> at org.eclipse.jetty.server.handler.ScopedHandler.handle(ScopedHandler.java:119)
[junit4:junit4]   2> at org.eclipse.jetty.server.handler.GzipHandler.handle(GzipHandler.java:267)
[junit4:junit4]   2> at org.eclipse.jetty.server.handler.ContextHandler.doHandle(ContextHandler.java:1067)
[junit4:junit4]   2> at org.eclipse.jetty.servlet.ServletHandler.doScope(ServletHandler.java:413)
[junit4:junit4]   2> at org.eclipse.jetty.server.session.SessionHandler.doScope(SessionHandler.java:192)
[junit4:junit4]   2> at org.eclipse.jetty.server.handler.ContextHandler.doScope(ContextHandler.java:999)
[junit4:junit4]   2> at org.eclipse.jetty.server.handler.ScopedHandler.handle(ScopedHandler.java:117)
[junit4:junit4]   2> at org.eclipse.jetty.server.handler.HandlerWrapper.handle(HandlerWrapper.java:111)
[junit4:junit4]   2> at org.eclipse.jetty.server.Server.handle(Server.java:351)
[junit4:junit4]   2> at org.eclipse.jetty.server.AbstractHttpConnection.handleRequest(AbstractHttpConnection.java:454)
[junit4:junit4]   2> at org.eclipse.jetty.server.BlockingHttpConnection.handleRequest(BlockingHttpConnection.java:47)
[junit4:junit4]   2> at org.eclipse.jetty.server.AbstractHttpConnection.content(AbstractHttpConnection.java:900)
[junit4:junit4]   2> at org.eclipse.jetty.server.AbstractHttpConnection$RequestHandler.content(AbstractHttpConnection.java:954)
[junit4:junit4]   2> at org.eclipse.jetty.http.HttpParser.parseNext(HttpParser.java:952)
[junit4:junit4]   2> at org.eclipse.jetty.http.HttpParser.parseAvailable(HttpParser.java:235)
[junit4:junit4]   2> at org.eclipse.jetty.server.BlockingHttpConnection.handle(BlockingHttpConnection.java:66)
[junit4:junit4]   2> at org.eclipse.jetty.server.bio.SocketConnector$ConnectorEndPoint.run(SocketConnector.java:254)
[junit4:junit4]   2> at org.eclipse.jetty.util.thread.QueuedThreadPool.runJob(QueuedThreadPool.java:599)
[junit4:junit4]   2> at org.eclipse.jetty.util.thread.QueuedThreadPool$3.run(QueuedThreadPool.java:534)
[junit4:junit4]   2> at java.lang.Thread.run(Thread.java:679)
[junit4:junit4]   2>
[junit4:junit4]   2> 151604 T2249 C99 P45023 oasc.SolrCore.close [collection1]  CLOSING SolrCore org.apache.solr.core.SolrCore@5cf90b4a
[junit4:junit4]   2> 151606 T2249 C99 P45023 oasc.SolrCore.closeSearcher [collection1] Closing main searcher on request.
[junit4:junit4]   2> 151607 T2249 C99 P45023 oasu.DirectUpdateHandler2.close closing DirectUpdateHandler2{commits=7,autocommits=0,soft autocommits=0,optimizes=0,rollbacks=0,expungeDeletes=0,docsPending=0,adds=0,deletesById=0,deletesByQuery=0,errors=0,cumulative_adds=36,cumulative_deletesById=0,cumulative_deletesByQuery=0,cumulative_errors=0}
[junit4:junit4]   2> 151608 T2249 C99 P45023 oasc.RecoveryStrategy.close WARNING Stopping recovery for core collection1 zkNodeName=127.0.0.1:45023_solr_collection1
[junit4:junit4]   2> 151643 T2180 oas.SolrTestCaseJ4.tearDown ###Ending testDistribSearch
[junit4:junit4]   1>      /solr/collections/control_collection/leader_elect/control_shard (1)
[junit4:junit4]   1>       /solr/collections/control_collection/leader_elect/control_shard/election (1)
[junit4:junit4]   1>        /solr/collections/control_collection/leader_elect/control_shard/election/88019140327374850-127.0.0.1:35650_solr_collection1-n_0000000000 (0)
[junit4:junit4]   1>     /solr/collections/control_collection/leaders (1)
[junit4:junit4]   1>      /solr/collections/control_collection/leaders/control_shard (0)
[junit4:junit4]   1>      DATA:
[junit4:junit4]   1>          {
[junit4:junit4]   1>            "core":"collection1",
[junit4:junit4]   1>            "node_name":"127.0.0.1:35650_solr",
[junit4:junit4]   1>            "base_url":"http://127.0.0.1:35650/solr"}
[junit4:junit4]   1>   /solr/clusterstate.json (0)
[junit4:junit4]   1>   DATA:
[junit4:junit4]   1>       {
[junit4:junit4]   1>         "collection1":{
[junit4:junit4]   1>           "shard1":{
[junit4:junit4]   1>             "127.0.0.1:50312_solr_collection1":{
[junit4:junit4]   1>               "shard":"shard1",
[junit4:junit4]   1>               "leader":"true",
[junit4:junit4]   1>               "roles":null,
[junit4:junit4]   1>               "state":"active",
[junit4:junit4]   1>               "core":"collection1",
[junit4:junit4]   1>               "collection":"collection1",
[junit4:junit4]   1>               "node_name":"127.0.0.1:50312_solr",
[junit4:junit4]   1>               "base_url":"http://127.0.0.1:50312/solr"},
[junit4:junit4]   1>             "127.0.0.1:57810_solr_collection1":{
[junit4:junit4]   1>               "shard":"shard1",
[junit4:junit4]   1>               "roles":null,
[junit4:junit4]   1>               "state":"active",
[junit4:junit4]   1>               "core":"collection1",
[junit4:junit4]   1>               "collection":"collection1",
[junit4:junit4]   1>               "node_name":"127.0.0.1:57810_solr",
[junit4:junit4]   1>               "base_url":"http://127.0.0.1:57810/solr"}},
[junit4:junit4]   1>           "shard2":{
[junit4:junit4]   1>             "127.0.0.1:44290_solr_collection1":{
[junit4:junit4]   1>               "shard":"shard2",
[junit4:junit4]   1>               "roles":null,
[junit4:junit4]   1>               "state":"active",
[junit4:junit4]   1>               "core":"collection1",
[junit4:junit4]   1>               "collection":"collection1",
[junit4:junit4]   1>               "node_name":"127.0.0.1:44290_solr",
[junit4:junit4]   1>               "base_url":"http://127.0.0.1:44290/solr"},
[junit4:junit4]   1>             "127.0.0.1:45023_solr_collection1":{
[junit4:junit4]   1>               "shard":"shard2",
[junit4:junit4]   1>               "leader":"true",
[junit4:junit4]   1>               "roles":null,
[junit4:junit4]   1>               "state":"active",
[junit4:junit4]   1>               "core":"collection1",
[junit4:junit4]   1>               "collection":"collection1",
[junit4:junit4]   1>               "node_name":"127.0.0.1:45023_solr",
[junit4:junit4]   1>               "base_url":"http://127.0.0.1:45023/solr"}}},
[junit4:junit4]   1>         "control_collection":{"control_shard":{"127.0.0.1:35650_solr_collection1":{
[junit4:junit4]   1>               "shard":"control_shard",
[junit4:junit4]   1>               "leader":"true",
[junit4:junit4]   1>               "roles":null,
[junit4:junit4]   1>               "state":"active",
[junit4:junit4]   1>               "core":"collection1",
[junit4:junit4]   1>               "collection":"control_collection",
[junit4:junit4]   1>               "node_name":"127.0.0.1:35650_solr",
[junit4:junit4]   1>               "base_url":"http://127.0.0.1:35650/solr"}}}}
[junit4:junit4]   1>  /zookeeper (1)
[junit4:junit4]   1>  DATA:
[junit4:junit4]   1>      
[junit4:junit4]   1>
[junit4:junit4]   2> NOTE: reproduce with: ant test  -Dtestcase=FullSolrCloudTest -Dtests.method=testDistribSearch -Dtests.seed=FE23AEC7802DFB36 -Dtests.multiplier=3 -Dtests.slow=true -Dtests.locale=pl -Dtests.timezone=America/Vancouver -Dtests.file.encoding=UTF-8
[junit4:junit4]   1>
[junit4:junit4]   2>
[junit4:junit4]    > (@AfterClass output)
[junit4:junit4]   2> 151672 T2180 oas.SolrTestCaseJ4.deleteCore ###deleteCore
[junit4:junit4]   2> NOTE: test params are: codec=SimpleText, sim=DefaultSimilarity, locale=pl, timezone=America/Vancouver
[junit4:junit4]   2> NOTE: FreeBSD 9.0-RELEASE amd64/Sun Microsystems Inc. 1.6.0_32 (64-bit)/cpus=16,threads=3,free=30473128,total=305987584
[junit4:junit4]   2> NOTE: All tests run in this JVM: [TestTrie, BasicZkTest, PeerSyncTest, TestGreekStemFilterFactory, TestGermanMinimalStemFilterFactory, DebugComponentTest, DistributedTermsComponentTest, SortByFunctionTest, TestStressReorder, IndexSchemaRuntimeFieldTest, TestPluginEnable, NotRequiredUniqueKeyTest, TestMultiWordSynonyms, TestTurkishLowerCaseFilterFactory, ZkSolrClientTest, PolyFieldTest, TestGermanNormalizationFilterFactory, TestSolrDeletionPolicy1, TestJapaneseReadingFormFilterFactory, TestSolrXMLSerializer, TestNGramFilters, OverseerTest, SpellCheckCollatorTest, DirectSolrConnectionTest, TestLRUCache, TestBeiderMorseFilterFactory, DocumentAnalysisRequestHandlerTest, TestRussianLightStemFilterFactory, PrimUtilsTest, LengthFilterTest, AlternateDirectoryTest, UpdateParamsTest, TestStopFilterFactory, SpellingQueryConverterTest, TermVectorComponentTest, TestPatternReplaceFilterFactory, SampleTest, TestQuerySenderNoQuery, TestGroupingSearch, SpellCheckComponentTest, IndexSchemaTest, TestStressLucene, ReturnFieldsTest, TestHunspellStemFilterFactory, TestEnglishMinimalStemFilterFactory, TestGalicianMinimalStemFilterFactory, CommonGramsFilterFactoryTest, FileBasedSpellCheckerTest, TestRemoteStreaming, JsonLoaderTest, TestSort, TestXIncludeConfig, RAMDirectoryFactoryTest, ZkControllerTest, CSVRequestHandlerTest, SolrCoreTest, QueryEqualityTest, TestElisionFilterFactory, TestLuceneMatchVersion, TestPortugueseLightStemFilterFactory, ResourceLoaderTest, URLClassifyProcessorTest, TestIndexSearcher, CircularListTest, TestIndonesianStemFilterFactory, TimeZoneUtilsTest, IndexReaderFactoryTest, TestValueSourceCache, ZkCLITest, BasicDistributedZkTest, FullSolrCloudTest]
[junit4:junit4]   2>
[junit4:junit4] Completed on J1 in 151.68s, 1 test, 1 error <<< FAILURES!
[...truncated 542 lines...]

[...truncated 12561 lines...]

[...truncated 12561 lines...]

[...truncated 12561 lines...]

[...truncated 12561 lines...]

[...truncated 12546 lines...]
BUILD FAILED
/usr/home/hudson/hudson-slave/workspace/Lucene-Solr-tests-only-trunk/checkout/build.xml:29: The following error occurred while executing this line:
/usr/home/hudson/hudson-slave/workspace/Lucene-Solr-tests-only-trunk/checkout/solr/build.xml:144: The following error occurred while executing this line:
/usr/home/hudson/hudson-slave/workspace/Lucene-Solr-tests-only-trunk/checkout/lucene/module-build.xml:62: The following error occurred while executing this line:
/usr/home/hudson/hudson-slave/workspace/Lucene-Solr-tests-only-trunk/checkout/lucene/common-build.xml:1094: The following error occurred while executing this line:
/usr/home/hudson/hudson-slave/workspace/Lucene-Solr-tests-only-trunk/checkout/lucene/common-build.xml:789: There were test failures: 297 suites, 1054 tests, 1 error, 5 ignored

Total time: 29 minutes 58 seconds
Build step 'Execute shell' marked build as failure
Archiving artifacts
Recording test results
Publishing Clover coverage report...
No Clover report will be published due to a Build Failure
Email was triggered for: Failure
Sending email for trigger: Failure




---------------------------------------------------------------------
To unsubscribe, e-mail: [hidden email]
For additional commands, e-mail: [hidden email]