[JENKINS] Lucene-Solr-tests-only-trunk - Build # 14927 - Failure

classic Classic list List threaded Threaded
4 messages Options
Reply | Threaded
Open this post in threaded view
|

[JENKINS] Lucene-Solr-tests-only-trunk - Build # 14927 - Failure

Apache Jenkins Server-2
Build: https://builds.apache.org/job/Lucene-Solr-tests-only-trunk/14927/

1 tests failed.
FAILED:  junit.framework.TestSuite.org.apache.solr.cloud.SyncSliceTest

Error Message:
ERROR: SolrIndexSearcher opens=24 closes=23

Stack Trace:
java.lang.AssertionError: ERROR: SolrIndexSearcher opens=24 closes=23
        at __randomizedtesting.SeedInfo.seed([D62EF941F53AC21B]:0)
        at org.junit.Assert.fail(Assert.java:93)
        at org.apache.solr.SolrTestCaseJ4.endTrackingSearchers(SolrTestCaseJ4.java:216)
        at org.apache.solr.SolrTestCaseJ4.afterClass(SolrTestCaseJ4.java:82)
        at sun.reflect.GeneratedMethodAccessor13.invoke(Unknown Source)
        at sun.reflect.DelegatingMethodAccessorImpl.invoke(DelegatingMethodAccessorImpl.java:43)
        at java.lang.reflect.Method.invoke(Method.java:616)
        at com.carrotsearch.randomizedtesting.RandomizedRunner.invoke(RandomizedRunner.java:1995)
        at com.carrotsearch.randomizedtesting.RandomizedRunner.access$1100(RandomizedRunner.java:132)
        at com.carrotsearch.randomizedtesting.RandomizedRunner$5.evaluate(RandomizedRunner.java:754)
        at com.carrotsearch.randomizedtesting.rules.SystemPropertiesRestoreRule$1.evaluate(SystemPropertiesRestoreRule.java:53)
        at org.apache.lucene.util.AbstractBeforeAfterRule$1.evaluate(AbstractBeforeAfterRule.java:45)
        at org.apache.lucene.util.TestRuleReportUncaughtExceptions$1.evaluate(TestRuleReportUncaughtExceptions.java:68)
        at org.apache.lucene.util.TestRuleStoreClassName$1.evaluate(TestRuleStoreClassName.java:38)
        at org.apache.lucene.util.TestRuleIcuHack$1.evaluate(TestRuleIcuHack.java:51)
        at com.carrotsearch.randomizedtesting.rules.SystemPropertiesInvariantRule$1.evaluate(SystemPropertiesInvariantRule.java:55)
        at org.apache.lucene.util.TestRuleNoInstanceHooksOverrides$1.evaluate(TestRuleNoInstanceHooksOverrides.java:53)
        at org.apache.lucene.util.TestRuleNoStaticHooksShadowing$1.evaluate(TestRuleNoStaticHooksShadowing.java:52)
        at org.apache.lucene.util.TestRuleAssertionsRequired$1.evaluate(TestRuleAssertionsRequired.java:36)
        at org.apache.lucene.util.TestRuleMarkFailure$1.evaluate(TestRuleMarkFailure.java:48)
        at org.apache.lucene.util.TestRuleIgnoreAfterMaxFailures$1.evaluate(TestRuleIgnoreAfterMaxFailures.java:70)
        at org.apache.lucene.util.TestRuleIgnoreTestSuites$1.evaluate(TestRuleIgnoreTestSuites.java:55)
        at com.carrotsearch.randomizedtesting.RandomizedRunner.runSuite(RandomizedRunner.java:605)
        at com.carrotsearch.randomizedtesting.RandomizedRunner.access$400(RandomizedRunner.java:132)
        at com.carrotsearch.randomizedtesting.RandomizedRunner$2.run(RandomizedRunner.java:551)




Build Log:
[...truncated 9771 lines...]
[junit4:junit4]   2>
[junit4:junit4]   2> 68096 T2892 oaz.ClientCnxn$EventThread.run EventThread shut down
[junit4:junit4]   2> 72269 T1260 oaz.ClientCnxn$SendThread.run Client session timed out, have not heard from server in 12001ms for sessionid 0x138b5e1d8630010, closing socket connection and attempting reconnect
[junit4:junit4]   2> 73538 T1260 oaz.ClientCnxn$SendThread.startConnect Opening socket connection to server localhost/127.0.0.1:13326
[junit4:junit4]   2> 84371 T1260 oaz.ClientCnxn$SendThread.run Client session timed out, have not heard from server in 12001ms for sessionid 0x138b5e1d8630010, closing socket connection and attempting reconnect
[junit4:junit4]   2> 85578 T1260 oaz.ClientCnxn$SendThread.startConnect Opening socket connection to server localhost/127.0.0.1:13326
[junit4:junit4]   2> 93683 T2879 oasc.SyncStrategy.syncToMe Could not tell a replica to recover org.apache.solr.client.solrj.SolrServerException: IOException occured when talking to server at: http://127.0.0.1:26655/solr/collection1
[junit4:junit4]   2> at org.apache.solr.client.solrj.impl.HttpSolrServer.request(HttpSolrServer.java:414)
[junit4:junit4]   2> at org.apache.solr.client.solrj.impl.HttpSolrServer.request(HttpSolrServer.java:182)
[junit4:junit4]   2> at org.apache.solr.cloud.SyncStrategy.syncToMe(SyncStrategy.java:237)
[junit4:junit4]   2> at org.apache.solr.cloud.SyncStrategy.syncReplicas(SyncStrategy.java:119)
[junit4:junit4]   2> at org.apache.solr.cloud.SyncStrategy.sync(SyncStrategy.java:82)
[junit4:junit4]   2> at org.apache.solr.cloud.ShardLeaderElectionContext.runLeaderProcess(ElectionContext.java:158)
[junit4:junit4]   2> at org.apache.solr.cloud.LeaderElector.runIamLeaderProcess(LeaderElector.java:151)
[junit4:junit4]   2> at org.apache.solr.cloud.LeaderElector.checkIfIamLeader(LeaderElector.java:96)
[junit4:junit4]   2> at org.apache.solr.cloud.LeaderElector.access$000(LeaderElector.java:57)
[junit4:junit4]   2> at org.apache.solr.cloud.LeaderElector$1.process(LeaderElector.java:125)
[junit4:junit4]   2> at org.apache.zookeeper.ClientCnxn$EventThread.processEvent(ClientCnxn.java:526)
[junit4:junit4]   2> at org.apache.zookeeper.ClientCnxn$EventThread.run(ClientCnxn.java:502)
[junit4:junit4]   2> Caused by: org.apache.http.conn.ConnectTimeoutException: Connect to 127.0.0.1:26655 timed out
[junit4:junit4]   2> at org.apache.http.conn.scheme.PlainSocketFactory.connectSocket(PlainSocketFactory.java:125)
[junit4:junit4]   2> at org.apache.http.impl.conn.DefaultClientConnectionOperator.openConnection(DefaultClientConnectionOperator.java:148)
[junit4:junit4]   2> at org.apache.http.impl.conn.AbstractPoolEntry.open(AbstractPoolEntry.java:150)
[junit4:junit4]   2> at org.apache.http.impl.conn.AbstractPooledConnAdapter.open(AbstractPooledConnAdapter.java:121)
[junit4:junit4]   2> at org.apache.http.impl.client.DefaultRequestDirector.tryConnect(DefaultRequestDirector.java:575)
[junit4:junit4]   2> at org.apache.http.impl.client.DefaultRequestDirector.execute(DefaultRequestDirector.java:425)
[junit4:junit4]   2> at org.apache.http.impl.client.AbstractHttpClient.execute(AbstractHttpClient.java:820)
[junit4:junit4]   2> at org.apache.http.impl.client.AbstractHttpClient.execute(AbstractHttpClient.java:754)
[junit4:junit4]   2> at org.apache.http.impl.client.AbstractHttpClient.execute(AbstractHttpClient.java:732)
[junit4:junit4]   2> at org.apache.solr.client.solrj.impl.HttpSolrServer.request(HttpSolrServer.java:353)
[junit4:junit4]   2> ... 11 more
[junit4:junit4]   2>
[junit4:junit4]   2> 93684 T2879 oasc.RecoveryStrategy.close WARNING Stopping recovery for core collection1 zkNodeName=127.0.0.1:38735_solr_collection1
[junit4:junit4]   2> 93684 T2879 oasc.LeaderElector$1.process WARNING  org.apache.zookeeper.KeeperException$SessionExpiredException: KeeperErrorCode = Session expired for /overseer/queue/qn-
[junit4:junit4]   2> at org.apache.zookeeper.KeeperException.create(KeeperException.java:118)
[junit4:junit4]   2> at org.apache.zookeeper.KeeperException.create(KeeperException.java:42)
[junit4:junit4]   2> at org.apache.zookeeper.ZooKeeper.create(ZooKeeper.java:643)
[junit4:junit4]   2> at org.apache.solr.common.cloud.SolrZkClient$5.execute(SolrZkClient.java:244)
[junit4:junit4]   2> at org.apache.solr.common.cloud.SolrZkClient$5.execute(SolrZkClient.java:241)
[junit4:junit4]   2> at org.apache.solr.common.cloud.ZkCmdExecutor.retryOperation(ZkCmdExecutor.java:67)
[junit4:junit4]   2> at org.apache.solr.common.cloud.SolrZkClient.create(SolrZkClient.java:241)
[junit4:junit4]   2> at org.apache.solr.cloud.DistributedQueue.offer(DistributedQueue.java:236)
[junit4:junit4]   2> at org.apache.solr.cloud.ZkController.publish(ZkController.java:734)
[junit4:junit4]   2> at org.apache.solr.cloud.ShardLeaderElectionContext.runLeaderProcess(ElectionContext.java:168)
[junit4:junit4]   2> at org.apache.solr.cloud.LeaderElector.runIamLeaderProcess(LeaderElector.java:151)
[junit4:junit4]   2> at org.apache.solr.cloud.LeaderElector.checkIfIamLeader(LeaderElector.java:96)
[junit4:junit4]   2> at org.apache.solr.cloud.LeaderElector.access$000(LeaderElector.java:57)
[junit4:junit4]   2> at org.apache.solr.cloud.LeaderElector$1.process(LeaderElector.java:125)
[junit4:junit4]   2> at org.apache.zookeeper.ClientCnxn$EventThread.processEvent(ClientCnxn.java:526)
[junit4:junit4]   2> at org.apache.zookeeper.ClientCnxn$EventThread.run(ClientCnxn.java:502)
[junit4:junit4]   2>
[junit4:junit4]   2> 93685 T2879 oasc.LeaderElector$1.process WARNING  org.apache.zookeeper.KeeperException$SessionExpiredException: KeeperErrorCode = Session expired for /overseer_elect/election
[junit4:junit4]   2> at org.apache.zookeeper.KeeperException.create(KeeperException.java:118)
[junit4:junit4]   2> at org.apache.zookeeper.KeeperException.create(KeeperException.java:42)
[junit4:junit4]   2> at org.apache.zookeeper.ZooKeeper.getChildren(ZooKeeper.java:1249)
[junit4:junit4]   2> at org.apache.solr.common.cloud.SolrZkClient$6.execute(SolrZkClient.java:266)
[junit4:junit4]   2> at org.apache.solr.common.cloud.SolrZkClient$6.execute(SolrZkClient.java:263)
[junit4:junit4]   2> at org.apache.solr.common.cloud.ZkCmdExecutor.retryOperation(ZkCmdExecutor.java:67)
[junit4:junit4]   2> at org.apache.solr.common.cloud.SolrZkClient.getChildren(SolrZkClient.java:263)
[junit4:junit4]   2> at org.apache.solr.cloud.LeaderElector.checkIfIamLeader(LeaderElector.java:91)
[junit4:junit4]   2> at org.apache.solr.cloud.LeaderElector.access$000(LeaderElector.java:57)
[junit4:junit4]   2> at org.apache.solr.cloud.LeaderElector$1.process(LeaderElector.java:125)
[junit4:junit4]   2> at org.apache.zookeeper.ClientCnxn$EventThread.processEvent(ClientCnxn.java:526)
[junit4:junit4]   2> at org.apache.zookeeper.ClientCnxn$EventThread.run(ClientCnxn.java:502)
[junit4:junit4]   2>
[junit4:junit4]   2> 93685 T2879 oascc.ZkStateReader$3.process Updating live nodes
[junit4:junit4]   2> 93686 T2879 oascc.ZkStateReader$3.process WARNING ZooKeeper watch triggered, but Solr cannot talk to ZK
[junit4:junit4]   2> 93686 T2879 oaz.ClientCnxn$EventThread.run EventThread shut down
[junit4:junit4]   2> 93941 T2871 C212 P38735 oasc.SolrException.log SEVERE shard update error StdNode: http://127.0.0.1:26655/solr/collection1/:org.apache.solr.client.solrj.SolrServerException: Server refused connection at: http://127.0.0.1:26655/solr/collection1
[junit4:junit4]   2> at org.apache.solr.client.solrj.impl.HttpSolrServer.request(HttpSolrServer.java:407)
[junit4:junit4]   2> at org.apache.solr.client.solrj.impl.HttpSolrServer.request(HttpSolrServer.java:182)
[junit4:junit4]   2> at org.apache.solr.update.SolrCmdDistributor$1.call(SolrCmdDistributor.java:336)
[junit4:junit4]   2> at org.apache.solr.update.SolrCmdDistributor$1.call(SolrCmdDistributor.java:317)
[junit4:junit4]   2> at java.util.concurrent.FutureTask$Sync.innerRun(FutureTask.java:334)
[junit4:junit4]   2> at java.util.concurrent.FutureTask.run(FutureTask.java:166)
[junit4:junit4]   2> at java.util.concurrent.Executors$RunnableAdapter.call(Executors.java:471)
[junit4:junit4]   2> at java.util.concurrent.FutureTask$Sync.innerRun(FutureTask.java:334)
[junit4:junit4]   2> at java.util.concurrent.FutureTask.run(FutureTask.java:166)
[junit4:junit4]   2> at org.apache.solr.update.SolrCmdDistributor$BoundedExecutor$1.run(SolrCmdDistributor.java:538)
[junit4:junit4]   2> at java.util.concurrent.ThreadPoolExecutor.runWorker(ThreadPoolExecutor.java:1110)
[junit4:junit4]   2> at java.util.concurrent.ThreadPoolExecutor$Worker.run(ThreadPoolExecutor.java:603)
[junit4:junit4]   2> at java.lang.Thread.run(Thread.java:679)
[junit4:junit4]   2> Caused by: org.apache.http.conn.HttpHostConnectException: Connection to http://127.0.0.1:26655 refused
[junit4:junit4]   2> at org.apache.http.impl.conn.DefaultClientConnectionOperator.openConnection(DefaultClientConnectionOperator.java:158)
[junit4:junit4]   2> at org.apache.http.impl.conn.AbstractPoolEntry.open(AbstractPoolEntry.java:150)
[junit4:junit4]   2> at org.apache.http.impl.conn.AbstractPooledConnAdapter.open(AbstractPooledConnAdapter.java:121)
[junit4:junit4]   2> at org.apache.http.impl.client.DefaultRequestDirector.tryConnect(DefaultRequestDirector.java:575)
[junit4:junit4]   2> at org.apache.http.impl.client.DefaultRequestDirector.execute(DefaultRequestDirector.java:425)
[junit4:junit4]   2> at org.apache.http.impl.client.AbstractHttpClient.execute(AbstractHttpClient.java:820)
[junit4:junit4]   2> at org.apache.http.impl.client.AbstractHttpClient.execute(AbstractHttpClient.java:754)
[junit4:junit4]   2> at org.apache.http.impl.client.AbstractHttpClient.execute(AbstractHttpClient.java:732)
[junit4:junit4]   2> at org.apache.solr.client.solrj.impl.HttpSolrServer.request(HttpSolrServer.java:353)
[junit4:junit4]   2> ... 12 more
[junit4:junit4]   2> Caused by: java.net.ConnectException: Operation timed out
[junit4:junit4]   2> at java.net.PlainSocketImpl.socketConnect(Native Method)
[junit4:junit4]   2> at java.net.AbstractPlainSocketImpl.doConnect(AbstractPlainSocketImpl.java:327)
[junit4:junit4]   2> at java.net.AbstractPlainSocketImpl.connectToAddress(AbstractPlainSocketImpl.java:193)
[junit4:junit4]   2> at java.net.AbstractPlainSocketImpl.connect(AbstractPlainSocketImpl.java:180)
[junit4:junit4]   2> at java.net.SocksSocketImpl.connect(SocksSocketImpl.java:384)
[junit4:junit4]   2> at java.net.Socket.connect(Socket.java:546)
[junit4:junit4]   2> at org.apache.http.conn.scheme.PlainSocketFactory.connectSocket(PlainSocketFactory.java:123)
[junit4:junit4]   2> at org.apache.http.impl.conn.DefaultClientConnectionOperator.openConnection(DefaultClientConnectionOperator.java:148)
[junit4:junit4]   2> ... 20 more
[junit4:junit4]   2>
[junit4:junit4]   2> 96473 T1260 oaz.ClientCnxn$SendThread.run Client session timed out, have not heard from server in 12001ms for sessionid 0x138b5e1d8630010, closing socket connection and attempting reconnect
[junit4:junit4]   2> 98331 T1260 oaz.ClientCnxn$SendThread.startConnect Opening socket connection to server localhost/127.0.0.1:13326
[junit4:junit4]   2> 108575 T1260 oaz.ClientCnxn$SendThread.run Client session timed out, have not heard from server in 12001ms for sessionid 0x138b5e1d8630010, closing socket connection and attempting reconnect
[junit4:junit4]   2> 110224 T1260 oaz.ClientCnxn$SendThread.startConnect Opening socket connection to server localhost/127.0.0.1:13326
[junit4:junit4]   2> 120677 T1260 oaz.ClientCnxn$SendThread.run Client session timed out, have not heard from server in 12001ms for sessionid 0x138b5e1d8630010, closing socket connection and attempting reconnect
[junit4:junit4]   2> 122217 T1260 oaz.ClientCnxn$SendThread.startConnect Opening socket connection to server localhost/127.0.0.1:13326
[junit4:junit4]   2> 132779 T1260 oaz.ClientCnxn$SendThread.run Client session timed out, have not heard from server in 12001ms for sessionid 0x138b5e1d8630010, closing socket connection and attempting reconnect
[junit4:junit4]   2> 134647 T1260 oaz.ClientCnxn$SendThread.startConnect Opening socket connection to server localhost/127.0.0.1:13326
[junit4:junit4]   2> 144881 T1260 oaz.ClientCnxn$SendThread.run Client session timed out, have not heard from server in 12001ms for sessionid 0x138b5e1d8630010, closing socket connection and attempting reconnect
[junit4:junit4]   2> 146370 T1260 oaz.ClientCnxn$SendThread.startConnect Opening socket connection to server localhost/127.0.0.1:13326
[junit4:junit4]   2> 156983 T1260 oaz.ClientCnxn$SendThread.run Client session timed out, have not heard from server in 12001ms for sessionid 0x138b5e1d8630010, closing socket connection and attempting reconnect
[junit4:junit4]   2> 159083 T1260 oaz.ClientCnxn$SendThread.startConnect Opening socket connection to server localhost/127.0.0.1:13326
[junit4:junit4]   2> 159670 T2833 oas.SolrTestCaseJ4.endTrackingSearchers SEVERE ERROR: SolrIndexSearcher opens=24 closes=23
[junit4:junit4]   2> NOTE: test params are: codec=Lucene40: {range_facet_l=PostingsFormat(name=MockSep), text=PostingsFormat(name=NestedPulsing), _version_=PostingsFormat(name=MockSep), rnd_b=Pulsing40(freqCutoff=11 minBlockSize=86 maxBlockSize=180), intDefault=PostingsFormat(name=MockSep), id=Pulsing40(freqCutoff=11 minBlockSize=86 maxBlockSize=180), timestamp=PostingsFormat(name=MockSep), a_t=PostingsFormat(name=MockSep), range_facet_sl=PostingsFormat(name=NestedPulsing), range_facet_si=MockVariableIntBlock(baseBlockSize=63), other_tl1=PostingsFormat(name=MockSep), multiDefault=MockVariableIntBlock(baseBlockSize=63), a_si=MockVariableIntBlock(baseBlockSize=63)}, sim=DefaultSimilarity, locale=ar_SA, timezone=Australia/Brisbane
[junit4:junit4]   2> NOTE: FreeBSD 9.0-RELEASE amd64/Sun Microsystems Inc. 1.6.0_32 (64-bit)/cpus=16,threads=6,free=48397856,total=309002240
[junit4:junit4]   2> NOTE: All tests run in this JVM: [SpellCheckComponentTest, TestJmxMonitoredMap, TestCSVResponseWriter, DocumentAnalysisRequestHandlerTest, UUIDFieldTest, ZkSolrClientTest, TestGroupingSearch, TestArbitraryIndexDir, TestRangeQuery, TestSuggestSpellingConverter, TestReload, TestKeepFilterFactory, BadIndexSchemaTest, TestXIncludeConfig, TestOmitPositions, TestConfig, TestTurkishLowerCaseFilterFactory, SolrCoreTest, TestSystemIdResolver, TestHunspellStemFilterFactory, DocumentBuilderTest, LoggingHandlerTest, TestQuerySenderNoQuery, XsltUpdateRequestHandlerTest, TestGermanMinimalStemFilterFactory, ReturnFieldsTest, PeerSyncTest, RAMDirectoryFactoryTest, TestRealTimeGet, TestMultiWordSynonyms, TestLMJelinekMercerSimilarityFactory, TestSort, FieldMutatingUpdateProcessorTest, TestCzechStemFilterFactory, TestReplicationHandler, TestWriterPerf, TestPortugueseLightStemFilterFactory, ScriptEngineTest, TestSolrDeletionPolicy1, TestReverseStringFilterFactory, TimeZoneUtilsTest, TestQueryTypes, SpellPossibilityIteratorTest, TestDocSet, FileBasedSpellCheckerTest, MBeansHandlerTest, TestUtils, UpdateParamsTest, NoCacheHeaderTest, IndexReaderFactoryTest, TermVectorComponentTest, TestTrie, DistanceFunctionTest, URLClassifyProcessorTest, TestIndexSearcher, TestBinaryResponseWriter, TestIBSimilarityFactory, TestStopFilterFactory, SpellingQueryConverterTest, FullSolrCloudTest, TestCoreContainer, TestEnglishMinimalStemFilterFactory, TestDefaultSimilarityFactory, SearchHandlerTest, TestGalicianMinimalStemFilterFactory, TestStressReorder, TestNumberUtils, TestNGramFilters, TestRecovery, TestPorterStemFilterFactory, HighlighterConfigTest, OverseerTest, LeaderElectionTest, ZkControllerTest, TestDistributedGrouping, CloudStateUpdateTest, TestDistributedSearch, SpellCheckCollatorTest, TestExtendedDismaxParser, SoftAutoCommitTest, AutoCommitTest, BasicZkTest, WordBreakSolrSpellCheckerTest, DistributedTermsComponentTest, StatsComponentTest, TestMultiCoreConfBootstrap, SimpleFacetsTest, LukeRequestHandlerTest, DirectSolrSpellCheckerTest, ConvertedLegacyTest, QueryElevationComponentTest, SortByFunctionTest, BasicFunctionalityTest, SignatureUpdateProcessorFactoryTest, TestJmxIntegration, SampleTest, TestFunctionQuery, SolrRequestParserTest, DirectSolrConnectionTest, TestRemoteStreaming, CacheHeaderTest, QueryEqualityTest, PolyFieldTest, DistributedQueryElevationComponentTest, TestPseudoReturnFields, DisMaxRequestHandlerTest, IndexSchemaTest, QueryParsingTest, TermsComponentTest, MinimalSchemaTest, StandardRequestHandlerTest, TestPHPSerializedResponseWriter, XmlUpdateRequestHandlerTest, FieldAnalysisRequestHandlerTest, PingRequestHandlerTest, JsonLoaderTest, TestSurroundQueryParser, IndexSchemaRuntimeFieldTest, SolrPluginUtilsTest, TestValueSourceCache, TestReversedWildcardFilterFactory, DebugComponentTest, RequestHandlersTest, SuggesterFSTTest, SuggesterTSTTest, UniqFieldsUpdateProcessorFactoryTest, SuggesterTest, CSVRequestHandlerTest, TestSearchPerf, NotRequiredUniqueKeyTest, TestFoldingMultitermQuery, SolrCoreCheckLockOnStartupTest, TestLuceneMatchVersion, TestPropInject, PrimitiveFieldTypeTest, AlternateDirectoryTest, BadComponentTest, TestSolrDeletionPolicy2, SOLR749Test, TestPropInjectDefaults, DefaultValueUpdateProcessorTest, TestQuerySenderListener, TestCollationField, SolrIndexConfigTest, TestBeiderMorseFilterFactory, MultiTermTest, EchoParamsTest, TestJapaneseTokenizerFactory, TestPhraseSuggestions, TestLMDirichletSimilarityFactory, TestPluginEnable, TestHyphenationCompoundWordTokenFilterFactory, TestJapaneseReadingFormFilterFactory, TestDFRSimilarityFactory, TestCodecSupport, TestHTMLStripCharFilterFactory, TestFastLRUCache, TestThaiWordFilterFactory, PluginInfoTest, TestShingleFilterFactory, PrimUtilsTest, TestGreekLowerCaseFilterFactory, DoubleMetaphoneFilterFactoryTest, OpenExchangeRatesOrgProviderTest, TestUAX29URLEmailTokenizerFactory, ResourceLoaderTest, FileUtilsTest, TestSolrXMLSerializer, TestDelimitedPayloadTokenFilterFactory, CloudStateTest, TestGermanLightStemFilterFactory, TestPersianNormalizationFilterFactory, TestBadConfig, TestJapanesePartOfSpeechStopFilterFactory, CommonGramsFilterFactoryTest, TestElisionFilterFactory, TestIndonesianStemFilterFactory, TestSwedishLightStemFilterFactory, TestHindiFilters, TestTypeTokenFilterFactory, TestHungarianLightStemFilterFactory, TestLRUCache, LengthFilterTest, TestIrishLowerCaseFilterFactory, TestKeywordMarkerFilterFactory, TestPatternTokenizerFactory, CommonGramsQueryFilterFactoryTest, TestCJKWidthFilterFactory, TestGreekStemFilterFactory, TestFrenchLightStemFilterFactory, TestGermanNormalizationFilterFactory, TestGermanStemFilterFactory, TestNorwegianLightStemFilterFactory, TestWikipediaTokenizerFactory, TestArabicFilters, TestCJKBigramFilterFactory, PreAnalyzedFieldTest, ZkNodePropsTest, TestNorwegianMinimalStemFilterFactory, TestPatternReplaceFilterFactory, TestSynonymFilterFactory, CircularListTest, TestRussianLightStemFilterFactory, AnalysisAfterCoreReloadTest, TestDocumentBuilder, TestCharFilters, TestJapaneseIterationMarkCharFilterFactory, SyncSliceTest]
[junit4:junit4]   2> NOTE: reproduce with: ant test  -Dtestcase=SyncSliceTest -Dtests.seed=D62EF941F53AC21B -Dtests.multiplier=3 -Dtests.slow=true -Dtests.locale=ar_SA -Dtests.timezone=Australia/Brisbane -Dtests.file.encoding=UTF-8
[junit4:junit4]   2>
[junit4:junit4] ERROR   0.00s J1 | SyncSliceTest (suite)
[junit4:junit4]    > Throwable #1: java.lang.AssertionError: ERROR: SolrIndexSearcher opens=24 closes=23
[junit4:junit4]    > at __randomizedtesting.SeedInfo.seed([D62EF941F53AC21B]:0)
[junit4:junit4]    > at org.junit.Assert.fail(Assert.java:93)
[junit4:junit4]    > at org.apache.solr.SolrTestCaseJ4.endTrackingSearchers(SolrTestCaseJ4.java:216)
[junit4:junit4]    > at org.apache.solr.SolrTestCaseJ4.afterClass(SolrTestCaseJ4.java:82)
[junit4:junit4]    > at sun.reflect.GeneratedMethodAccessor13.invoke(Unknown Source)
[junit4:junit4]    > at sun.reflect.DelegatingMethodAccessorImpl.invoke(DelegatingMethodAccessorImpl.java:43)
[junit4:junit4]    > at java.lang.reflect.Method.invoke(Method.java:616)
[junit4:junit4]    > at com.carrotsearch.randomizedtesting.RandomizedRunner.invoke(RandomizedRunner.java:1995)
[junit4:junit4]    > at com.carrotsearch.randomizedtesting.RandomizedRunner.access$1100(RandomizedRunner.java:132)
[junit4:junit4]    > at com.carrotsearch.randomizedtesting.RandomizedRunner$5.evaluate(RandomizedRunner.java:754)
[junit4:junit4]    > at com.carrotsearch.randomizedtesting.rules.SystemPropertiesRestoreRule$1.evaluate(SystemPropertiesRestoreRule.java:53)
[junit4:junit4]    > at org.apache.lucene.util.AbstractBeforeAfterRule$1.evaluate(AbstractBeforeAfterRule.java:45)
[junit4:junit4]    > at org.apache.lucene.util.TestRuleReportUncaughtExceptions$1.evaluate(TestRuleReportUncaughtExceptions.java:68)
[junit4:junit4]    > at org.apache.lucene.util.TestRuleStoreClassName$1.evaluate(TestRuleStoreClassName.java:38)
[junit4:junit4]    > at org.apache.lucene.util.TestRuleIcuHack$1.evaluate(TestRuleIcuHack.java:51)
[junit4:junit4]    > at com.carrotsearch.randomizedtesting.rules.SystemPropertiesInvariantRule$1.evaluate(SystemPropertiesInvariantRule.java:55)
[junit4:junit4]    > at org.apache.lucene.util.TestRuleNoInstanceHooksOverrides$1.evaluate(TestRuleNoInstanceHooksOverrides.java:53)
[junit4:junit4]    > at org.apache.lucene.util.TestRuleNoStaticHooksShadowing$1.evaluate(TestRuleNoStaticHooksShadowing.java:52)
[junit4:junit4]    > at org.apache.lucene.util.TestRuleAssertionsRequired$1.evaluate(TestRuleAssertionsRequired.java:36)
[junit4:junit4]    > at org.apache.lucene.util.TestRuleMarkFailure$1.evaluate(TestRuleMarkFailure.java:48)
[junit4:junit4]    > at org.apache.lucene.util.TestRuleIgnoreAfterMaxFailures$1.evaluate(TestRuleIgnoreAfterMaxFailures.java:70)
[junit4:junit4]    > at org.apache.lucene.util.TestRuleIgnoreTestSuites$1.evaluate(TestRuleIgnoreTestSuites.java:55)
[junit4:junit4]    > at com.carrotsearch.randomizedtesting.RandomizedRunner.runSuite(RandomizedRunner.java:605)
[junit4:junit4]    > at com.carrotsearch.randomizedtesting.RandomizedRunner.access$400(RandomizedRunner.java:132)
[junit4:junit4]    > at com.carrotsearch.randomizedtesting.RandomizedRunner$2.run(RandomizedRunner.java:551)
[junit4:junit4]    >
[junit4:junit4] Completed on J1 in 159.70s, 1 test, 1 failure <<< FAILURES!
[...truncated 80 lines...]

[...truncated 10002 lines...]

[...truncated 10002 lines...]

[...truncated 10002 lines...]

[...truncated 10002 lines...]

[...truncated 9887 lines...]
[junit4:junit4]   2> 159670 T2833 oas.SolrTestCaseJ4.endTrackingSearchers SEVERE ERROR: SolrIndexSearcher opens=24 closes=23
[junit4:junit4]   2> NOTE: test params are: codec=Lucene40: {range_facet_l=PostingsFormat(name=MockSep), text=PostingsFormat(name=NestedPulsing), _version_=PostingsFormat(name=MockSep), rnd_b=Pulsing40(freqCutoff=11 minBlockSize=86 maxBlockSize=180), intDefault=PostingsFormat(name=MockSep), id=Pulsing40(freqCutoff=11 minBlockSize=86 maxBlockSize=180), timestamp=PostingsFormat(name=MockSep), a_t=PostingsFormat(name=MockSep), range_facet_sl=PostingsFormat(name=NestedPulsing), range_facet_si=MockVariableIntBlock(baseBlockSize=63), other_tl1=PostingsFormat(name=MockSep), multiDefault=MockVariableIntBlock(baseBlockSize=63), a_si=MockVariableIntBlock(baseBlockSize=63)}, sim=DefaultSimilarity, locale=ar_SA, timezone=Australia/Brisbane
[junit4:junit4]   2> NOTE: FreeBSD 9.0-RELEASE amd64/Sun Microsystems Inc. 1.6.0_32 (64-bit)/cpus=16,threads=6,free=48397856,total=309002240
[junit4:junit4]   2> NOTE: All tests run in this JVM: [SpellCheckComponentTest, TestJmxMonitoredMap, TestCSVResponseWriter, DocumentAnalysisRequestHandlerTest, UUIDFieldTest, ZkSolrClientTest, TestGroupingSearch, TestArbitraryIndexDir, TestRangeQuery, TestSuggestSpellingConverter, TestReload, TestKeepFilterFactory, BadIndexSchemaTest, TestXIncludeConfig, TestOmitPositions, TestConfig, TestTurkishLowerCaseFilterFactory, SolrCoreTest, TestSystemIdResolver, TestHunspellStemFilterFactory, DocumentBuilderTest, LoggingHandlerTest, TestQuerySenderNoQuery, XsltUpdateRequestHandlerTest, TestGermanMinimalStemFilterFactory, ReturnFieldsTest, PeerSyncTest, RAMDirectoryFactoryTest, TestRealTimeGet, TestMultiWordSynonyms, TestLMJelinekMercerSimilarityFactory, TestSort, FieldMutatingUpdateProcessorTest, TestCzechStemFilterFactory, TestReplicationHandler, TestWriterPerf, TestPortugueseLightStemFilterFactory, ScriptEngineTest, TestSolrDeletionPolicy1, TestReverseStringFilterFactory, TimeZoneUtilsTest, TestQueryTypes, SpellPossibilityIteratorTest, TestDocSet, FileBasedSpellCheckerTest, MBeansHandlerTest, TestUtils, UpdateParamsTest, NoCacheHeaderTest, IndexReaderFactoryTest, TermVectorComponentTest, TestTrie, DistanceFunctionTest, URLClassifyProcessorTest, TestIndexSearcher, TestBinaryResponseWriter, TestIBSimilarityFactory, TestStopFilterFactory, SpellingQueryConverterTest, FullSolrCloudTest, TestCoreContainer, TestEnglishMinimalStemFilterFactory, TestDefaultSimilarityFactory, SearchHandlerTest, TestGalicianMinimalStemFilterFactory, TestStressReorder, TestNumberUtils, TestNGramFilters, TestRecovery, TestPorterStemFilterFactory, HighlighterConfigTest, OverseerTest, LeaderElectionTest, ZkControllerTest, TestDistributedGrouping, CloudStateUpdateTest, TestDistributedSearch, SpellCheckCollatorTest, TestExtendedDismaxParser, SoftAutoCommitTest, AutoCommitTest, BasicZkTest, WordBreakSolrSpellCheckerTest, DistributedTermsComponentTest, StatsComponentTest, TestMultiCoreConfBootstrap, SimpleFacetsTest, LukeRequestHandlerTest, DirectSolrSpellCheckerTest, ConvertedLegacyTest, QueryElevationComponentTest, SortByFunctionTest, BasicFunctionalityTest, SignatureUpdateProcessorFactoryTest, TestJmxIntegration, SampleTest, TestFunctionQuery, SolrRequestParserTest, DirectSolrConnectionTest, TestRemoteStreaming, CacheHeaderTest, QueryEqualityTest, PolyFieldTest, DistributedQueryElevationComponentTest, TestPseudoReturnFields, DisMaxRequestHandlerTest, IndexSchemaTest, QueryParsingTest, TermsComponentTest, MinimalSchemaTest, StandardRequestHandlerTest, TestPHPSerializedResponseWriter, XmlUpdateRequestHandlerTest, FieldAnalysisRequestHandlerTest, PingRequestHandlerTest, JsonLoaderTest, TestSurroundQueryParser, IndexSchemaRuntimeFieldTest, SolrPluginUtilsTest, TestValueSourceCache, TestReversedWildcardFilterFactory, DebugComponentTest, RequestHandlersTest, SuggesterFSTTest, SuggesterTSTTest, UniqFieldsUpdateProcessorFactoryTest, SuggesterTest, CSVRequestHandlerTest, TestSearchPerf, NotRequiredUniqueKeyTest, TestFoldingMultitermQuery, SolrCoreCheckLockOnStartupTest, TestLuceneMatchVersion, TestPropInject, PrimitiveFieldTypeTest, AlternateDirectoryTest, BadComponentTest, TestSolrDeletionPolicy2, SOLR749Test, TestPropInjectDefaults, DefaultValueUpdateProcessorTest, TestQuerySenderListener, TestCollationField, SolrIndexConfigTest, TestBeiderMorseFilterFactory, MultiTermTest, EchoParamsTest, TestJapaneseTokenizerFactory, TestPhraseSuggestions, TestLMDirichletSimilarityFactory, TestPluginEnable, TestHyphenationCompoundWordTokenFilterFactory, TestJapaneseReadingFormFilterFactory, TestDFRSimilarityFactory, TestCodecSupport, TestHTMLStripCharFilterFactory, TestFastLRUCache, TestThaiWordFilterFactory, PluginInfoTest, TestShingleFilterFactory, PrimUtilsTest, TestGreekLowerCaseFilterFactory, DoubleMetaphoneFilterFactoryTest, OpenExchangeRatesOrgProviderTest, TestUAX29URLEmailTokenizerFactory, ResourceLoaderTest, FileUtilsTest, TestSolrXMLSerializer, TestDelimitedPayloadTokenFilterFactory, CloudStateTest, TestGermanLightStemFilterFactory, TestPersianNormalizationFilterFactory, TestBadConfig, TestJapanesePartOfSpeechStopFilterFactory, CommonGramsFilterFactoryTest, TestElisionFilterFactory, TestIndonesianStemFilterFactory, TestSwedishLightStemFilterFactory, TestHindiFilters, TestTypeTokenFilterFactory, TestHungarianLightStemFilterFactory, TestLRUCache, LengthFilterTest, TestIrishLowerCaseFilterFactory, TestKeywordMarkerFilterFactory, TestPatternTokenizerFactory, CommonGramsQueryFilterFactoryTest, TestCJKWidthFilterFactory, TestGreekStemFilterFactory, TestFrenchLightStemFilterFactory, TestGermanNormalizationFilterFactory, TestGermanStemFilterFactory, TestNorwegianLightStemFilterFactory, TestWikipediaTokenizerFactory, TestArabicFilters, TestCJKBigramFilterFactory, PreAnalyzedFieldTest, ZkNodePropsTest, TestNorwegianMinimalStemFilterFactory, TestPatternReplaceFilterFactory, TestSynonymFilterFactory, CircularListTest, TestRussianLightStemFilterFactory, AnalysisAfterCoreReloadTest, TestDocumentBuilder, TestCharFilters, TestJapaneseIterationMarkCharFilterFactory, SyncSliceTest]
[junit4:junit4]   2> NOTE: reproduce with: ant test  -Dtestcase=SyncSliceTest -Dtests.seed=D62EF941F53AC21B -Dtests.multiplier=3 -Dtests.slow=true -Dtests.locale=ar_SA -Dtests.timezone=Australia/Brisbane -Dtests.file.encoding=UTF-8
[junit4:junit4]   2>
[junit4:junit4] ERROR   0.00s J1 | SyncSliceTest (suite)
[junit4:junit4]    > Throwable #1: java.lang.AssertionError: ERROR: SolrIndexSearcher opens=24 closes=23
[junit4:junit4]    > at __randomizedtesting.SeedInfo.seed([D62EF941F53AC21B]:0)
[junit4:junit4]    > at org.junit.Assert.fail(Assert.java:93)
[junit4:junit4]    > at org.apache.solr.SolrTestCaseJ4.endTrackingSearchers(SolrTestCaseJ4.java:216)
[junit4:junit4]    > at org.apache.solr.SolrTestCaseJ4.afterClass(SolrTestCaseJ4.java:82)
[junit4:junit4]    > at sun.reflect.GeneratedMethodAccessor13.invoke(Unknown Source)
[junit4:junit4]    > at sun.reflect.DelegatingMethodAccessorImpl.invoke(DelegatingMethodAccessorImpl.java:43)
[junit4:junit4]    > at java.lang.reflect.Method.invoke(Method.java:616)
[junit4:junit4]    > at com.carrotsearch.randomizedtesting.RandomizedRunner.invoke(RandomizedRunner.java:1995)
[junit4:junit4]    > at com.carrotsearch.randomizedtesting.RandomizedRunner.access$1100(RandomizedRunner.java:132)
[junit4:junit4]    > at com.carrotsearch.randomizedtesting.RandomizedRunner$5.evaluate(RandomizedRunner.java:754)
[junit4:junit4]    > at com.carrotsearch.randomizedtesting.rules.SystemPropertiesRestoreRule$1.evaluate(SystemPropertiesRestoreRule.java:53)
[junit4:junit4]    > at org.apache.lucene.util.AbstractBeforeAfterRule$1.evaluate(AbstractBeforeAfterRule.java:45)
[junit4:junit4]    > at org.apache.lucene.util.TestRuleReportUncaughtExceptions$1.evaluate(TestRuleReportUncaughtExceptions.java:68)
[junit4:junit4]    > at org.apache.lucene.util.TestRuleStoreClassName$1.evaluate(TestRuleStoreClassName.java:38)
[junit4:junit4]    > at org.apache.lucene.util.TestRuleIcuHack$1.evaluate(TestRuleIcuHack.java:51)
[junit4:junit4]    > at com.carrotsearch.randomizedtesting.rules.SystemPropertiesInvariantRule$1.evaluate(SystemPropertiesInvariantRule.java:55)
[junit4:junit4]    > at org.apache.lucene.util.TestRuleNoInstanceHooksOverrides$1.evaluate(TestRuleNoInstanceHooksOverrides.java:53)
[junit4:junit4]    > at org.apache.lucene.util.TestRuleNoStaticHooksShadowing$1.evaluate(TestRuleNoStaticHooksShadowing.java:52)
[junit4:junit4]    > at org.apache.lucene.util.TestRuleAssertionsRequired$1.evaluate(TestRuleAssertionsRequired.java:36)
[junit4:junit4]    > at org.apache.lucene.util.TestRuleMarkFailure$1.evaluate(TestRuleMarkFailure.java:48)
[junit4:junit4]    > at org.apache.lucene.util.TestRuleIgnoreAfterMaxFailures$1.evaluate(TestRuleIgnoreAfterMaxFailures.java:70)
[junit4:junit4]    > at org.apache.lucene.util.TestRuleIgnoreTestSuites$1.evaluate(TestRuleIgnoreTestSuites.java:55)
[junit4:junit4]    > at com.carrotsearch.randomizedtesting.RandomizedRunner.runSuite(RandomizedRunner.java:605)
[junit4:junit4]    > at com.carrotsearch.randomizedtesting.RandomizedRunner.access$400(RandomizedRunner.java:132)
[junit4:junit4]    > at com.carrotsearch.randomizedtesting.RandomizedRunner$2.run(RandomizedRunner.java:551)
[junit4:junit4]    >
[junit4:junit4] Completed on J1 in 159.70s, 1 test, 1 failure <<< FAILURES!
[junit4:junit4]  
[junit4:junit4] Suite: org.apache.solr.analysis.LegacyHTMLStripCharFilterTest
[junit4:junit4] IGNORED 0.00s J0 | LegacyHTMLStripCharFilterTest.testRandom
[junit4:junit4]    > Cause: Annotated @Ignore(broken offsets: see LUCENE-2208)
[junit4:junit4] Completed on J0 in 0.23s, 13 tests, 1 skipped
[junit4:junit4]  
[junit4:junit4] Suite: org.apache.solr.analysis.TestItalianLightStemFilterFactory
[junit4:junit4] Completed on J0 in 0.01s, 1 test
[junit4:junit4]  
[junit4:junit4] Suite: org.apache.solr.analysis.TestFrenchMinimalStemFilterFactory
[junit4:junit4] Completed on J0 in 0.01s, 1 test
[junit4:junit4]  
[junit4:junit4] Suite: org.apache.solr.search.TestQueryUtils
[junit4:junit4] Completed on J0 in 0.87s, 1 test
[junit4:junit4]  
[junit4:junit4] Suite: org.apache.solr.TestSolrCoreProperties
[junit4:junit4] Completed on J0 in 0.24s, 1 test
[junit4:junit4]  
[junit4:junit4] Suite: org.apache.solr.handler.TestCSVLoader
[junit4:junit4] Completed on J0 in 0.96s, 5 tests
[junit4:junit4]  
[junit4:junit4] Suite: org.apache.solr.update.SolrCmdDistributorTest
[junit4:junit4] Completed on J0 in 1.15s, 1 test
[junit4:junit4]  
[junit4:junit4] Suite: org.apache.solr.spelling.IndexBasedSpellCheckerTest
[junit4:junit4] Completed on J0 in 0.76s, 5 tests
[junit4:junit4]  
[junit4:junit4] Suite: org.apache.solr.analysis.TestRemoveDuplicatesTokenFilterFactory
[junit4:junit4] Completed on J0 in 0.01s, 1 test
[junit4:junit4]  
[junit4:junit4] Suite: org.apache.solr.search.TestSolrJ
[junit4:junit4] Completed on J0 in 0.01s, 1 test
[junit4:junit4]  
[junit4:junit4] Suite: org.apache.solr.update.TestUpdate
[junit4:junit4] Completed on J0 in 0.52s, 1 test
[junit4:junit4]  
[junit4:junit4] Suite: org.apache.solr.core.TestMergePolicyConfig
[junit4:junit4] Completed on J0 in 0.42s, 1 test
[junit4:junit4]  
[junit4:junit4] Suite: org.apache.solr.OutputWriterTest
[junit4:junit4] Completed on J0 in 0.25s, 5 tests
[junit4:junit4]  
[junit4:junit4] Suite: org.apache.solr.util.DOMUtilTest
[junit4:junit4] Completed on J0 in 0.02s, 1 test
[junit4:junit4]  
[junit4:junit4] Suite: org.apache.solr.search.TestLFUCache
[junit4:junit4] Completed on J0 in 0.52s, 5 tests
[junit4:junit4]  
[junit4:junit4] Suite: org.apache.solr.search.TestRTGBase
[junit4:junit4] Completed on J0 in 0.00s, 0 tests
[junit4:junit4]  
[junit4:junit4] Suite: org.apache.solr.cloud.ZkCLITest
[junit4:junit4] Completed on J1 in 2.24s, 3 tests
[junit4:junit4]  
[junit4:junit4] Suite: org.apache.solr.search.TestStressLucene
[junit4:junit4] Completed on J0 in 0.44s, 1 test
[junit4:junit4]  
[junit4:junit4] Suite: org.apache.solr.search.TestStressVersions
[junit4:junit4] Completed on J1 in 8.35s, 1 test
[junit4:junit4]  
[junit4:junit4] JVM J0:     0.88 ..   837.32 =   836.44s
[junit4:junit4] JVM J1:     0.88 ..   896.28 =   895.40s
[junit4:junit4] Execution time total: 14 minutes 56 seconds
[junit4:junit4] Tests summary: 297 suites, 1054 tests, 1 suite-level error, 5 ignored

BUILD FAILED
/usr/home/hudson/hudson-slave/workspace/Lucene-Solr-tests-only-trunk/checkout/build.xml:29: The following error occurred while executing this line:
/usr/home/hudson/hudson-slave/workspace/Lucene-Solr-tests-only-trunk/checkout/solr/build.xml:144: The following error occurred while executing this line:
/usr/home/hudson/hudson-slave/workspace/Lucene-Solr-tests-only-trunk/checkout/lucene/module-build.xml:62: The following error occurred while executing this line:
/usr/home/hudson/hudson-slave/workspace/Lucene-Solr-tests-only-trunk/checkout/lucene/common-build.xml:1094: The following error occurred while executing this line:
/usr/home/hudson/hudson-slave/workspace/Lucene-Solr-tests-only-trunk/checkout/lucene/common-build.xml:789: There were test failures: 297 suites, 1054 tests, 1 suite-level error, 5 ignored

Total time: 26 minutes 23 seconds
Build step 'Execute shell' marked build as failure
Archiving artifacts
Recording test results
Publishing Clover coverage report...
No Clover report will be published due to a Build Failure
Email was triggered for: Failure
Sending email for trigger: Failure




---------------------------------------------------------------------
To unsubscribe, e-mail: [hidden email]
For additional commands, e-mail: [hidden email]
Reply | Threaded
Open this post in threaded view
|

Re: [JENKINS] Lucene-Solr-tests-only-trunk - Build # 14927 - Failure

Mark Miller-3
I'm going to commit an attempted fix for this one once I do a bit more testing on freebsd.

If you ever happen to try and search a machine thats down, you are screwed.

Drives me crazy. This happens in the real world but I cannot do it in unit tests :*(

I'm considering making distrib search have a timeout just for tests - but even that is somewhat annoying because it's still going to take 15-30 seconds or whatever to timeout - it can't be too low or it will fail on slow/busy build machines.

On Jul 23, 2012, at 6:20 PM, Apache Jenkins Server wrote:

> Build: https://builds.apache.org/job/Lucene-Solr-tests-only-trunk/14927/
>
> 1 tests failed.
> FAILED:  junit.framework.TestSuite.org.apache.solr.cloud.SyncSliceTest
>
> Error Message:
> ERROR: SolrIndexSearcher opens=24 closes=23
>
> Stack Trace:
> java.lang.AssertionError: ERROR: SolrIndexSearcher opens=24 closes=23
> at __randomizedtesting.SeedInfo.seed([D62EF941F53AC21B]:0)
> at org.junit.Assert.fail(Assert.java:93)
> at org.apache.solr.SolrTestCaseJ4.endTrackingSearchers(SolrTestCaseJ4.java:216)
> at org.apache.solr.SolrTestCaseJ4.afterClass(SolrTestCaseJ4.java:82)
> at sun.reflect.GeneratedMethodAccessor13.invoke(Unknown Source)
> at sun.reflect.DelegatingMethodAccessorImpl.invoke(DelegatingMethodAccessorImpl.java:43)
> at java.lang.reflect.Method.invoke(Method.java:616)
> at com.carrotsearch.randomizedtesting.RandomizedRunner.invoke(RandomizedRunner.java:1995)
> at com.carrotsearch.randomizedtesting.RandomizedRunner.access$1100(RandomizedRunner.java:132)
> at com.carrotsearch.randomizedtesting.RandomizedRunner$5.evaluate(RandomizedRunner.java:754)
> at com.carrotsearch.randomizedtesting.rules.SystemPropertiesRestoreRule$1.evaluate(SystemPropertiesRestoreRule.java:53)
> at org.apache.lucene.util.AbstractBeforeAfterRule$1.evaluate(AbstractBeforeAfterRule.java:45)
> at org.apache.lucene.util.TestRuleReportUncaughtExceptions$1.evaluate(TestRuleReportUncaughtExceptions.java:68)
> at org.apache.lucene.util.TestRuleStoreClassName$1.evaluate(TestRuleStoreClassName.java:38)
> at org.apache.lucene.util.TestRuleIcuHack$1.evaluate(TestRuleIcuHack.java:51)
> at com.carrotsearch.randomizedtesting.rules.SystemPropertiesInvariantRule$1.evaluate(SystemPropertiesInvariantRule.java:55)
> at org.apache.lucene.util.TestRuleNoInstanceHooksOverrides$1.evaluate(TestRuleNoInstanceHooksOverrides.java:53)
> at org.apache.lucene.util.TestRuleNoStaticHooksShadowing$1.evaluate(TestRuleNoStaticHooksShadowing.java:52)
> at org.apache.lucene.util.TestRuleAssertionsRequired$1.evaluate(TestRuleAssertionsRequired.java:36)
> at org.apache.lucene.util.TestRuleMarkFailure$1.evaluate(TestRuleMarkFailure.java:48)
> at org.apache.lucene.util.TestRuleIgnoreAfterMaxFailures$1.evaluate(TestRuleIgnoreAfterMaxFailures.java:70)
> at org.apache.lucene.util.TestRuleIgnoreTestSuites$1.evaluate(TestRuleIgnoreTestSuites.java:55)
> at com.carrotsearch.randomizedtesting.RandomizedRunner.runSuite(RandomizedRunner.java:605)
> at com.carrotsearch.randomizedtesting.RandomizedRunner.access$400(RandomizedRunner.java:132)
> at com.carrotsearch.randomizedtesting.RandomizedRunner$2.run(RandomizedRunner.java:551)
>
>
>
>
> Build Log:
> [...truncated 9771 lines...]
> [junit4:junit4]   2>
> [junit4:junit4]   2> 68096 T2892 oaz.ClientCnxn$EventThread.run EventThread shut down
> [junit4:junit4]   2> 72269 T1260 oaz.ClientCnxn$SendThread.run Client session timed out, have not heard from server in 12001ms for sessionid 0x138b5e1d8630010, closing socket connection and attempting reconnect
> [junit4:junit4]   2> 73538 T1260 oaz.ClientCnxn$SendThread.startConnect Opening socket connection to server localhost/127.0.0.1:13326
> [junit4:junit4]   2> 84371 T1260 oaz.ClientCnxn$SendThread.run Client session timed out, have not heard from server in 12001ms for sessionid 0x138b5e1d8630010, closing socket connection and attempting reconnect
> [junit4:junit4]   2> 85578 T1260 oaz.ClientCnxn$SendThread.startConnect Opening socket connection to server localhost/127.0.0.1:13326
> [junit4:junit4]   2> 93683 T2879 oasc.SyncStrategy.syncToMe Could not tell a replica to recover org.apache.solr.client.solrj.SolrServerException: IOException occured when talking to server at: http://127.0.0.1:26655/solr/collection1
> [junit4:junit4]   2> at org.apache.solr.client.solrj.impl.HttpSolrServer.request(HttpSolrServer.java:414)
> [junit4:junit4]   2> at org.apache.solr.client.solrj.impl.HttpSolrServer.request(HttpSolrServer.java:182)
> [junit4:junit4]   2> at org.apache.solr.cloud.SyncStrategy.syncToMe(SyncStrategy.java:237)
> [junit4:junit4]   2> at org.apache.solr.cloud.SyncStrategy.syncReplicas(SyncStrategy.java:119)
> [junit4:junit4]   2> at org.apache.solr.cloud.SyncStrategy.sync(SyncStrategy.java:82)
> [junit4:junit4]   2> at org.apache.solr.cloud.ShardLeaderElectionContext.runLeaderProcess(ElectionContext.java:158)
> [junit4:junit4]   2> at org.apache.solr.cloud.LeaderElector.runIamLeaderProcess(LeaderElector.java:151)
> [junit4:junit4]   2> at org.apache.solr.cloud.LeaderElector.checkIfIamLeader(LeaderElector.java:96)
> [junit4:junit4]   2> at org.apache.solr.cloud.LeaderElector.access$000(LeaderElector.java:57)
> [junit4:junit4]   2> at org.apache.solr.cloud.LeaderElector$1.process(LeaderElector.java:125)
> [junit4:junit4]   2> at org.apache.zookeeper.ClientCnxn$EventThread.processEvent(ClientCnxn.java:526)
> [junit4:junit4]   2> at org.apache.zookeeper.ClientCnxn$EventThread.run(ClientCnxn.java:502)
> [junit4:junit4]   2> Caused by: org.apache.http.conn.ConnectTimeoutException: Connect to 127.0.0.1:26655 timed out
> [junit4:junit4]   2> at org.apache.http.conn.scheme.PlainSocketFactory.connectSocket(PlainSocketFactory.java:125)
> [junit4:junit4]   2> at org.apache.http.impl.conn.DefaultClientConnectionOperator.openConnection(DefaultClientConnectionOperator.java:148)
> [junit4:junit4]   2> at org.apache.http.impl.conn.AbstractPoolEntry.open(AbstractPoolEntry.java:150)
> [junit4:junit4]   2> at org.apache.http.impl.conn.AbstractPooledConnAdapter.open(AbstractPooledConnAdapter.java:121)
> [junit4:junit4]   2> at org.apache.http.impl.client.DefaultRequestDirector.tryConnect(DefaultRequestDirector.java:575)
> [junit4:junit4]   2> at org.apache.http.impl.client.DefaultRequestDirector.execute(DefaultRequestDirector.java:425)
> [junit4:junit4]   2> at org.apache.http.impl.client.AbstractHttpClient.execute(AbstractHttpClient.java:820)
> [junit4:junit4]   2> at org.apache.http.impl.client.AbstractHttpClient.execute(AbstractHttpClient.java:754)
> [junit4:junit4]   2> at org.apache.http.impl.client.AbstractHttpClient.execute(AbstractHttpClient.java:732)
> [junit4:junit4]   2> at org.apache.solr.client.solrj.impl.HttpSolrServer.request(HttpSolrServer.java:353)
> [junit4:junit4]   2> ... 11 more
> [junit4:junit4]   2>
> [junit4:junit4]   2> 93684 T2879 oasc.RecoveryStrategy.close WARNING Stopping recovery for core collection1 zkNodeName=127.0.0.1:38735_solr_collection1
> [junit4:junit4]   2> 93684 T2879 oasc.LeaderElector$1.process WARNING  org.apache.zookeeper.KeeperException$SessionExpiredException: KeeperErrorCode = Session expired for /overseer/queue/qn-
> [junit4:junit4]   2> at org.apache.zookeeper.KeeperException.create(KeeperException.java:118)
> [junit4:junit4]   2> at org.apache.zookeeper.KeeperException.create(KeeperException.java:42)
> [junit4:junit4]   2> at org.apache.zookeeper.ZooKeeper.create(ZooKeeper.java:643)
> [junit4:junit4]   2> at org.apache.solr.common.cloud.SolrZkClient$5.execute(SolrZkClient.java:244)
> [junit4:junit4]   2> at org.apache.solr.common.cloud.SolrZkClient$5.execute(SolrZkClient.java:241)
> [junit4:junit4]   2> at org.apache.solr.common.cloud.ZkCmdExecutor.retryOperation(ZkCmdExecutor.java:67)
> [junit4:junit4]   2> at org.apache.solr.common.cloud.SolrZkClient.create(SolrZkClient.java:241)
> [junit4:junit4]   2> at org.apache.solr.cloud.DistributedQueue.offer(DistributedQueue.java:236)
> [junit4:junit4]   2> at org.apache.solr.cloud.ZkController.publish(ZkController.java:734)
> [junit4:junit4]   2> at org.apache.solr.cloud.ShardLeaderElectionContext.runLeaderProcess(ElectionContext.java:168)
> [junit4:junit4]   2> at org.apache.solr.cloud.LeaderElector.runIamLeaderProcess(LeaderElector.java:151)
> [junit4:junit4]   2> at org.apache.solr.cloud.LeaderElector.checkIfIamLeader(LeaderElector.java:96)
> [junit4:junit4]   2> at org.apache.solr.cloud.LeaderElector.access$000(LeaderElector.java:57)
> [junit4:junit4]   2> at org.apache.solr.cloud.LeaderElector$1.process(LeaderElector.java:125)
> [junit4:junit4]   2> at org.apache.zookeeper.ClientCnxn$EventThread.processEvent(ClientCnxn.java:526)
> [junit4:junit4]   2> at org.apache.zookeeper.ClientCnxn$EventThread.run(ClientCnxn.java:502)
> [junit4:junit4]   2>
> [junit4:junit4]   2> 93685 T2879 oasc.LeaderElector$1.process WARNING  org.apache.zookeeper.KeeperException$SessionExpiredException: KeeperErrorCode = Session expired for /overseer_elect/election
> [junit4:junit4]   2> at org.apache.zookeeper.KeeperException.create(KeeperException.java:118)
> [junit4:junit4]   2> at org.apache.zookeeper.KeeperException.create(KeeperException.java:42)
> [junit4:junit4]   2> at org.apache.zookeeper.ZooKeeper.getChildren(ZooKeeper.java:1249)
> [junit4:junit4]   2> at org.apache.solr.common.cloud.SolrZkClient$6.execute(SolrZkClient.java:266)
> [junit4:junit4]   2> at org.apache.solr.common.cloud.SolrZkClient$6.execute(SolrZkClient.java:263)
> [junit4:junit4]   2> at org.apache.solr.common.cloud.ZkCmdExecutor.retryOperation(ZkCmdExecutor.java:67)
> [junit4:junit4]   2> at org.apache.solr.common.cloud.SolrZkClient.getChildren(SolrZkClient.java:263)
> [junit4:junit4]   2> at org.apache.solr.cloud.LeaderElector.checkIfIamLeader(LeaderElector.java:91)
> [junit4:junit4]   2> at org.apache.solr.cloud.LeaderElector.access$000(LeaderElector.java:57)
> [junit4:junit4]   2> at org.apache.solr.cloud.LeaderElector$1.process(LeaderElector.java:125)
> [junit4:junit4]   2> at org.apache.zookeeper.ClientCnxn$EventThread.processEvent(ClientCnxn.java:526)
> [junit4:junit4]   2> at org.apache.zookeeper.ClientCnxn$EventThread.run(ClientCnxn.java:502)
> [junit4:junit4]   2>
> [junit4:junit4]   2> 93685 T2879 oascc.ZkStateReader$3.process Updating live nodes
> [junit4:junit4]   2> 93686 T2879 oascc.ZkStateReader$3.process WARNING ZooKeeper watch triggered, but Solr cannot talk to ZK
> [junit4:junit4]   2> 93686 T2879 oaz.ClientCnxn$EventThread.run EventThread shut down
> [junit4:junit4]   2> 93941 T2871 C212 P38735 oasc.SolrException.log SEVERE shard update error StdNode: http://127.0.0.1:26655/solr/collection1/:org.apache.solr.client.solrj.SolrServerException: Server refused connection at: http://127.0.0.1:26655/solr/collection1
> [junit4:junit4]   2> at org.apache.solr.client.solrj.impl.HttpSolrServer.request(HttpSolrServer.java:407)
> [junit4:junit4]   2> at org.apache.solr.client.solrj.impl.HttpSolrServer.request(HttpSolrServer.java:182)
> [junit4:junit4]   2> at org.apache.solr.update.SolrCmdDistributor$1.call(SolrCmdDistributor.java:336)
> [junit4:junit4]   2> at org.apache.solr.update.SolrCmdDistributor$1.call(SolrCmdDistributor.java:317)
> [junit4:junit4]   2> at java.util.concurrent.FutureTask$Sync.innerRun(FutureTask.java:334)
> [junit4:junit4]   2> at java.util.concurrent.FutureTask.run(FutureTask.java:166)
> [junit4:junit4]   2> at java.util.concurrent.Executors$RunnableAdapter.call(Executors.java:471)
> [junit4:junit4]   2> at java.util.concurrent.FutureTask$Sync.innerRun(FutureTask.java:334)
> [junit4:junit4]   2> at java.util.concurrent.FutureTask.run(FutureTask.java:166)
> [junit4:junit4]   2> at org.apache.solr.update.SolrCmdDistributor$BoundedExecutor$1.run(SolrCmdDistributor.java:538)
> [junit4:junit4]   2> at java.util.concurrent.ThreadPoolExecutor.runWorker(ThreadPoolExecutor.java:1110)
> [junit4:junit4]   2> at java.util.concurrent.ThreadPoolExecutor$Worker.run(ThreadPoolExecutor.java:603)
> [junit4:junit4]   2> at java.lang.Thread.run(Thread.java:679)
> [junit4:junit4]   2> Caused by: org.apache.http.conn.HttpHostConnectException: Connection to http://127.0.0.1:26655 refused
> [junit4:junit4]   2> at org.apache.http.impl.conn.DefaultClientConnectionOperator.openConnection(DefaultClientConnectionOperator.java:158)
> [junit4:junit4]   2> at org.apache.http.impl.conn.AbstractPoolEntry.open(AbstractPoolEntry.java:150)
> [junit4:junit4]   2> at org.apache.http.impl.conn.AbstractPooledConnAdapter.open(AbstractPooledConnAdapter.java:121)
> [junit4:junit4]   2> at org.apache.http.impl.client.DefaultRequestDirector.tryConnect(DefaultRequestDirector.java:575)
> [junit4:junit4]   2> at org.apache.http.impl.client.DefaultRequestDirector.execute(DefaultRequestDirector.java:425)
> [junit4:junit4]   2> at org.apache.http.impl.client.AbstractHttpClient.execute(AbstractHttpClient.java:820)
> [junit4:junit4]   2> at org.apache.http.impl.client.AbstractHttpClient.execute(AbstractHttpClient.java:754)
> [junit4:junit4]   2> at org.apache.http.impl.client.AbstractHttpClient.execute(AbstractHttpClient.java:732)
> [junit4:junit4]   2> at org.apache.solr.client.solrj.impl.HttpSolrServer.request(HttpSolrServer.java:353)
> [junit4:junit4]   2> ... 12 more
> [junit4:junit4]   2> Caused by: java.net.ConnectException: Operation timed out
> [junit4:junit4]   2> at java.net.PlainSocketImpl.socketConnect(Native Method)
> [junit4:junit4]   2> at java.net.AbstractPlainSocketImpl.doConnect(AbstractPlainSocketImpl.java:327)
> [junit4:junit4]   2> at java.net.AbstractPlainSocketImpl.connectToAddress(AbstractPlainSocketImpl.java:193)
> [junit4:junit4]   2> at java.net.AbstractPlainSocketImpl.connect(AbstractPlainSocketImpl.java:180)
> [junit4:junit4]   2> at java.net.SocksSocketImpl.connect(SocksSocketImpl.java:384)
> [junit4:junit4]   2> at java.net.Socket.connect(Socket.java:546)
> [junit4:junit4]   2> at org.apache.http.conn.scheme.PlainSocketFactory.connectSocket(PlainSocketFactory.java:123)
> [junit4:junit4]   2> at org.apache.http.impl.conn.DefaultClientConnectionOperator.openConnection(DefaultClientConnectionOperator.java:148)
> [junit4:junit4]   2> ... 20 more
> [junit4:junit4]   2>
> [junit4:junit4]   2> 96473 T1260 oaz.ClientCnxn$SendThread.run Client session timed out, have not heard from server in 12001ms for sessionid 0x138b5e1d8630010, closing socket connection and attempting reconnect
> [junit4:junit4]   2> 98331 T1260 oaz.ClientCnxn$SendThread.startConnect Opening socket connection to server localhost/127.0.0.1:13326
> [junit4:junit4]   2> 108575 T1260 oaz.ClientCnxn$SendThread.run Client session timed out, have not heard from server in 12001ms for sessionid 0x138b5e1d8630010, closing socket connection and attempting reconnect
> [junit4:junit4]   2> 110224 T1260 oaz.ClientCnxn$SendThread.startConnect Opening socket connection to server localhost/127.0.0.1:13326
> [junit4:junit4]   2> 120677 T1260 oaz.ClientCnxn$SendThread.run Client session timed out, have not heard from server in 12001ms for sessionid 0x138b5e1d8630010, closing socket connection and attempting reconnect
> [junit4:junit4]   2> 122217 T1260 oaz.ClientCnxn$SendThread.startConnect Opening socket connection to server localhost/127.0.0.1:13326
> [junit4:junit4]   2> 132779 T1260 oaz.ClientCnxn$SendThread.run Client session timed out, have not heard from server in 12001ms for sessionid 0x138b5e1d8630010, closing socket connection and attempting reconnect
> [junit4:junit4]   2> 134647 T1260 oaz.ClientCnxn$SendThread.startConnect Opening socket connection to server localhost/127.0.0.1:13326
> [junit4:junit4]   2> 144881 T1260 oaz.ClientCnxn$SendThread.run Client session timed out, have not heard from server in 12001ms for sessionid 0x138b5e1d8630010, closing socket connection and attempting reconnect
> [junit4:junit4]   2> 146370 T1260 oaz.ClientCnxn$SendThread.startConnect Opening socket connection to server localhost/127.0.0.1:13326
> [junit4:junit4]   2> 156983 T1260 oaz.ClientCnxn$SendThread.run Client session timed out, have not heard from server in 12001ms for sessionid 0x138b5e1d8630010, closing socket connection and attempting reconnect
> [junit4:junit4]   2> 159083 T1260 oaz.ClientCnxn$SendThread.startConnect Opening socket connection to server localhost/127.0.0.1:13326
> [junit4:junit4]   2> 159670 T2833 oas.SolrTestCaseJ4.endTrackingSearchers SEVERE ERROR: SolrIndexSearcher opens=24 closes=23
> [junit4:junit4]   2> NOTE: test params are: codec=Lucene40: {range_facet_l=PostingsFormat(name=MockSep), text=PostingsFormat(name=NestedPulsing), _version_=PostingsFormat(name=MockSep), rnd_b=Pulsing40(freqCutoff=11 minBlockSize=86 maxBlockSize=180), intDefault=PostingsFormat(name=MockSep), id=Pulsing40(freqCutoff=11 minBlockSize=86 maxBlockSize=180), timestamp=PostingsFormat(name=MockSep), a_t=PostingsFormat(name=MockSep), range_facet_sl=PostingsFormat(name=NestedPulsing), range_facet_si=MockVariableIntBlock(baseBlockSize=63), other_tl1=PostingsFormat(name=MockSep), multiDefault=MockVariableIntBlock(baseBlockSize=63), a_si=MockVariableIntBlock(baseBlockSize=63)}, sim=DefaultSimilarity, locale=ar_SA, timezone=Australia/Brisbane
> [junit4:junit4]   2> NOTE: FreeBSD 9.0-RELEASE amd64/Sun Microsystems Inc. 1.6.0_32 (64-bit)/cpus=16,threads=6,free=48397856,total=309002240
> [junit4:junit4]   2> NOTE: All tests run in this JVM: [SpellCheckComponentTest, TestJmxMonitoredMap, TestCSVResponseWriter, DocumentAnalysisRequestHandlerTest, UUIDFieldTest, ZkSolrClientTest, TestGroupingSearch, TestArbitraryIndexDir, TestRangeQuery, TestSuggestSpellingConverter, TestReload, TestKeepFilterFactory, BadIndexSchemaTest, TestXIncludeConfig, TestOmitPositions, TestConfig, TestTurkishLowerCaseFilterFactory, SolrCoreTest, TestSystemIdResolver, TestHunspellStemFilterFactory, DocumentBuilderTest, LoggingHandlerTest, TestQuerySenderNoQuery, XsltUpdateRequestHandlerTest, TestGermanMinimalStemFilterFactory, ReturnFieldsTest, PeerSyncTest, RAMDirectoryFactoryTest, TestRealTimeGet, TestMultiWordSynonyms, TestLMJelinekMercerSimilarityFactory, TestSort, FieldMutatingUpdateProcessorTest, TestCzechStemFilterFactory, TestReplicationHandler, TestWriterPerf, TestPortugueseLightStemFilterFactory, ScriptEngineTest, TestSolrDeletionPolicy1, TestReverseStringFilterFactory, TimeZoneUtilsTest, TestQueryTypes, SpellPossibilityIteratorTest, TestDocSet, FileBasedSpellCheckerTest, MBeansHandlerTest, TestUtils, UpdateParamsTest, NoCacheHeaderTest, IndexReaderFactoryTest, TermVectorComponentTest, TestTrie, DistanceFunctionTest, URLClassifyProcessorTest, TestIndexSearcher, TestBinaryResponseWriter, TestIBSimilarityFactory, TestStopFilterFactory, SpellingQueryConverterTest, FullSolrCloudTest, TestCoreContainer, TestEnglishMinimalStemFilterFactory, TestDefaultSimilarityFactory, SearchHandlerTest, TestGalicianMinimalStemFilterFactory, TestStressReorder, TestNumberUtils, TestNGramFilters, TestRecovery, TestPorterStemFilterFactory, HighlighterConfigTest, OverseerTest, LeaderElectionTest, ZkControllerTest, TestDistributedGrouping, CloudStateUpdateTest, TestDistributedSearch, SpellCheckCollatorTest, TestExtendedDismaxParser, SoftAutoCommitTest, AutoCommitTest, BasicZkTest, WordBreakSolrSpellCheckerTest, DistributedTermsComponentTest, StatsComponentTest, TestMultiCoreConfBootstrap, SimpleFacetsTest, LukeRequestHandlerTest, DirectSolrSpellCheckerTest, ConvertedLegacyTest, QueryElevationComponentTest, SortByFunctionTest, BasicFunctionalityTest, SignatureUpdateProcessorFactoryTest, TestJmxIntegration, SampleTest, TestFunctionQuery, SolrRequestParserTest, DirectSolrConnectionTest, TestRemoteStreaming, CacheHeaderTest, QueryEqualityTest, PolyFieldTest, DistributedQueryElevationComponentTest, TestPseudoReturnFields, DisMaxRequestHandlerTest, IndexSchemaTest, QueryParsingTest, TermsComponentTest, MinimalSchemaTest, StandardRequestHandlerTest, TestPHPSerializedResponseWriter, XmlUpdateRequestHandlerTest, FieldAnalysisRequestHandlerTest, PingRequestHandlerTest, JsonLoaderTest, TestSurroundQueryParser, IndexSchemaRuntimeFieldTest, SolrPluginUtilsTest, TestValueSourceCache, TestReversedWildcardFilterFactory, DebugComponentTest, RequestHandlersTest, SuggesterFSTTest, SuggesterTSTTest, UniqFieldsUpdateProcessorFactoryTest, SuggesterTest, CSVRequestHandlerTest, TestSearchPerf, NotRequiredUniqueKeyTest, TestFoldingMultitermQuery, SolrCoreCheckLockOnStartupTest, TestLuceneMatchVersion, TestPropInject, PrimitiveFieldTypeTest, AlternateDirectoryTest, BadComponentTest, TestSolrDeletionPolicy2, SOLR749Test, TestPropInjectDefaults, DefaultValueUpdateProcessorTest, TestQuerySenderListener, TestCollationField, SolrIndexConfigTest, TestBeiderMorseFilterFactory, MultiTermTest, EchoParamsTest, TestJapaneseTokenizerFactory, TestPhraseSuggestions, TestLMDirichletSimilarityFactory, TestPluginEnable, TestHyphenationCompoundWordTokenFilterFactory, TestJapaneseReadingFormFilterFactory, TestDFRSimilarityFactory, TestCodecSupport, TestHTMLStripCharFilterFactory, TestFastLRUCache, TestThaiWordFilterFactory, PluginInfoTest, TestShingleFilterFactory, PrimUtilsTest, TestGreekLowerCaseFilterFactory, DoubleMetaphoneFilterFactoryTest, OpenExchangeRatesOrgProviderTest, TestUAX29URLEmailTokenizerFactory, ResourceLoaderTest, FileUtilsTest, TestSolrXMLSerializer, TestDelimitedPayloadTokenFilterFactory, CloudStateTest, TestGermanLightStemFilterFactory, TestPersianNormalizationFilterFactory, TestBadConfig, TestJapanesePartOfSpeechStopFilterFactory, CommonGramsFilterFactoryTest, TestElisionFilterFactory, TestIndonesianStemFilterFactory, TestSwedishLightStemFilterFactory, TestHindiFilters, TestTypeTokenFilterFactory, TestHungarianLightStemFilterFactory, TestLRUCache, LengthFilterTest, TestIrishLowerCaseFilterFactory, TestKeywordMarkerFilterFactory, TestPatternTokenizerFactory, CommonGramsQueryFilterFactoryTest, TestCJKWidthFilterFactory, TestGreekStemFilterFactory, TestFrenchLightStemFilterFactory, TestGermanNormalizationFilterFactory, TestGermanStemFilterFactory, TestNorwegianLightStemFilterFactory, TestWikipediaTokenizerFactory, TestArabicFilters, TestCJKBigramFilterFactory, PreAnalyzedFieldTest, ZkNodePropsTest, TestNorwegianMinimalStemFilterFactory, TestPatternReplaceFilterFactory, TestSynonymFilterFactory, CircularListTest, TestRussianLightStemFilterFactory, AnalysisAfterCoreReloadTest, TestDocumentBuilder, TestCharFilters, TestJapaneseIterationMarkCharFilterFactory, SyncSliceTest]
> [junit4:junit4]   2> NOTE: reproduce with: ant test  -Dtestcase=SyncSliceTest -Dtests.seed=D62EF941F53AC21B -Dtests.multiplier=3 -Dtests.slow=true -Dtests.locale=ar_SA -Dtests.timezone=Australia/Brisbane -Dtests.file.encoding=UTF-8
> [junit4:junit4]   2>
> [junit4:junit4] ERROR   0.00s J1 | SyncSliceTest (suite)
> [junit4:junit4]    > Throwable #1: java.lang.AssertionError: ERROR: SolrIndexSearcher opens=24 closes=23
> [junit4:junit4]    > at __randomizedtesting.SeedInfo.seed([D62EF941F53AC21B]:0)
> [junit4:junit4]    > at org.junit.Assert.fail(Assert.java:93)
> [junit4:junit4]    > at org.apache.solr.SolrTestCaseJ4.endTrackingSearchers(SolrTestCaseJ4.java:216)
> [junit4:junit4]    > at org.apache.solr.SolrTestCaseJ4.afterClass(SolrTestCaseJ4.java:82)
> [junit4:junit4]    > at sun.reflect.GeneratedMethodAccessor13.invoke(Unknown Source)
> [junit4:junit4]    > at sun.reflect.DelegatingMethodAccessorImpl.invoke(DelegatingMethodAccessorImpl.java:43)
> [junit4:junit4]    > at java.lang.reflect.Method.invoke(Method.java:616)
> [junit4:junit4]    > at com.carrotsearch.randomizedtesting.RandomizedRunner.invoke(RandomizedRunner.java:1995)
> [junit4:junit4]    > at com.carrotsearch.randomizedtesting.RandomizedRunner.access$1100(RandomizedRunner.java:132)
> [junit4:junit4]    > at com.carrotsearch.randomizedtesting.RandomizedRunner$5.evaluate(RandomizedRunner.java:754)
> [junit4:junit4]    > at com.carrotsearch.randomizedtesting.rules.SystemPropertiesRestoreRule$1.evaluate(SystemPropertiesRestoreRule.java:53)
> [junit4:junit4]    > at org.apache.lucene.util.AbstractBeforeAfterRule$1.evaluate(AbstractBeforeAfterRule.java:45)
> [junit4:junit4]    > at org.apache.lucene.util.TestRuleReportUncaughtExceptions$1.evaluate(TestRuleReportUncaughtExceptions.java:68)
> [junit4:junit4]    > at org.apache.lucene.util.TestRuleStoreClassName$1.evaluate(TestRuleStoreClassName.java:38)
> [junit4:junit4]    > at org.apache.lucene.util.TestRuleIcuHack$1.evaluate(TestRuleIcuHack.java:51)
> [junit4:junit4]    > at com.carrotsearch.randomizedtesting.rules.SystemPropertiesInvariantRule$1.evaluate(SystemPropertiesInvariantRule.java:55)
> [junit4:junit4]    > at org.apache.lucene.util.TestRuleNoInstanceHooksOverrides$1.evaluate(TestRuleNoInstanceHooksOverrides.java:53)
> [junit4:junit4]    > at org.apache.lucene.util.TestRuleNoStaticHooksShadowing$1.evaluate(TestRuleNoStaticHooksShadowing.java:52)
> [junit4:junit4]    > at org.apache.lucene.util.TestRuleAssertionsRequired$1.evaluate(TestRuleAssertionsRequired.java:36)
> [junit4:junit4]    > at org.apache.lucene.util.TestRuleMarkFailure$1.evaluate(TestRuleMarkFailure.java:48)
> [junit4:junit4]    > at org.apache.lucene.util.TestRuleIgnoreAfterMaxFailures$1.evaluate(TestRuleIgnoreAfterMaxFailures.java:70)
> [junit4:junit4]    > at org.apache.lucene.util.TestRuleIgnoreTestSuites$1.evaluate(TestRuleIgnoreTestSuites.java:55)
> [junit4:junit4]    > at com.carrotsearch.randomizedtesting.RandomizedRunner.runSuite(RandomizedRunner.java:605)
> [junit4:junit4]    > at com.carrotsearch.randomizedtesting.RandomizedRunner.access$400(RandomizedRunner.java:132)
> [junit4:junit4]    > at com.carrotsearch.randomizedtesting.RandomizedRunner$2.run(RandomizedRunner.java:551)
> [junit4:junit4]    >
> [junit4:junit4] Completed on J1 in 159.70s, 1 test, 1 failure <<< FAILURES!
> [...truncated 80 lines...]
>
> [...truncated 10002 lines...]
>
> [...truncated 10002 lines...]
>
> [...truncated 10002 lines...]
>
> [...truncated 10002 lines...]
>
> [...truncated 9887 lines...]
> [junit4:junit4]   2> 159670 T2833 oas.SolrTestCaseJ4.endTrackingSearchers SEVERE ERROR: SolrIndexSearcher opens=24 closes=23
> [junit4:junit4]   2> NOTE: test params are: codec=Lucene40: {range_facet_l=PostingsFormat(name=MockSep), text=PostingsFormat(name=NestedPulsing), _version_=PostingsFormat(name=MockSep), rnd_b=Pulsing40(freqCutoff=11 minBlockSize=86 maxBlockSize=180), intDefault=PostingsFormat(name=MockSep), id=Pulsing40(freqCutoff=11 minBlockSize=86 maxBlockSize=180), timestamp=PostingsFormat(name=MockSep), a_t=PostingsFormat(name=MockSep), range_facet_sl=PostingsFormat(name=NestedPulsing), range_facet_si=MockVariableIntBlock(baseBlockSize=63), other_tl1=PostingsFormat(name=MockSep), multiDefault=MockVariableIntBlock(baseBlockSize=63), a_si=MockVariableIntBlock(baseBlockSize=63)}, sim=DefaultSimilarity, locale=ar_SA, timezone=Australia/Brisbane
> [junit4:junit4]   2> NOTE: FreeBSD 9.0-RELEASE amd64/Sun Microsystems Inc. 1.6.0_32 (64-bit)/cpus=16,threads=6,free=48397856,total=309002240
> [junit4:junit4]   2> NOTE: All tests run in this JVM: [SpellCheckComponentTest, TestJmxMonitoredMap, TestCSVResponseWriter, DocumentAnalysisRequestHandlerTest, UUIDFieldTest, ZkSolrClientTest, TestGroupingSearch, TestArbitraryIndexDir, TestRangeQuery, TestSuggestSpellingConverter, TestReload, TestKeepFilterFactory, BadIndexSchemaTest, TestXIncludeConfig, TestOmitPositions, TestConfig, TestTurkishLowerCaseFilterFactory, SolrCoreTest, TestSystemIdResolver, TestHunspellStemFilterFactory, DocumentBuilderTest, LoggingHandlerTest, TestQuerySenderNoQuery, XsltUpdateRequestHandlerTest, TestGermanMinimalStemFilterFactory, ReturnFieldsTest, PeerSyncTest, RAMDirectoryFactoryTest, TestRealTimeGet, TestMultiWordSynonyms, TestLMJelinekMercerSimilarityFactory, TestSort, FieldMutatingUpdateProcessorTest, TestCzechStemFilterFactory, TestReplicationHandler, TestWriterPerf, TestPortugueseLightStemFilterFactory, ScriptEngineTest, TestSolrDeletionPolicy1, TestReverseStringFilterFactory, TimeZoneUtilsTest, TestQueryTypes, SpellPossibilityIteratorTest, TestDocSet, FileBasedSpellCheckerTest, MBeansHandlerTest, TestUtils, UpdateParamsTest, NoCacheHeaderTest, IndexReaderFactoryTest, TermVectorComponentTest, TestTrie, DistanceFunctionTest, URLClassifyProcessorTest, TestIndexSearcher, TestBinaryResponseWriter, TestIBSimilarityFactory, TestStopFilterFactory, SpellingQueryConverterTest, FullSolrCloudTest, TestCoreContainer, TestEnglishMinimalStemFilterFactory, TestDefaultSimilarityFactory, SearchHandlerTest, TestGalicianMinimalStemFilterFactory, TestStressReorder, TestNumberUtils, TestNGramFilters, TestRecovery, TestPorterStemFilterFactory, HighlighterConfigTest, OverseerTest, LeaderElectionTest, ZkControllerTest, TestDistributedGrouping, CloudStateUpdateTest, TestDistributedSearch, SpellCheckCollatorTest, TestExtendedDismaxParser, SoftAutoCommitTest, AutoCommitTest, BasicZkTest, WordBreakSolrSpellCheckerTest, DistributedTermsComponentTest, StatsComponentTest, TestMultiCoreConfBootstrap, SimpleFacetsTest, LukeRequestHandlerTest, DirectSolrSpellCheckerTest, ConvertedLegacyTest, QueryElevationComponentTest, SortByFunctionTest, BasicFunctionalityTest, SignatureUpdateProcessorFactoryTest, TestJmxIntegration, SampleTest, TestFunctionQuery, SolrRequestParserTest, DirectSolrConnectionTest, TestRemoteStreaming, CacheHeaderTest, QueryEqualityTest, PolyFieldTest, DistributedQueryElevationComponentTest, TestPseudoReturnFields, DisMaxRequestHandlerTest, IndexSchemaTest, QueryParsingTest, TermsComponentTest, MinimalSchemaTest, StandardRequestHandlerTest, TestPHPSerializedResponseWriter, XmlUpdateRequestHandlerTest, FieldAnalysisRequestHandlerTest, PingRequestHandlerTest, JsonLoaderTest, TestSurroundQueryParser, IndexSchemaRuntimeFieldTest, SolrPluginUtilsTest, TestValueSourceCache, TestReversedWildcardFilterFactory, DebugComponentTest, RequestHandlersTest, SuggesterFSTTest, SuggesterTSTTest, UniqFieldsUpdateProcessorFactoryTest, SuggesterTest, CSVRequestHandlerTest, TestSearchPerf, NotRequiredUniqueKeyTest, TestFoldingMultitermQuery, SolrCoreCheckLockOnStartupTest, TestLuceneMatchVersion, TestPropInject, PrimitiveFieldTypeTest, AlternateDirectoryTest, BadComponentTest, TestSolrDeletionPolicy2, SOLR749Test, TestPropInjectDefaults, DefaultValueUpdateProcessorTest, TestQuerySenderListener, TestCollationField, SolrIndexConfigTest, TestBeiderMorseFilterFactory, MultiTermTest, EchoParamsTest, TestJapaneseTokenizerFactory, TestPhraseSuggestions, TestLMDirichletSimilarityFactory, TestPluginEnable, TestHyphenationCompoundWordTokenFilterFactory, TestJapaneseReadingFormFilterFactory, TestDFRSimilarityFactory, TestCodecSupport, TestHTMLStripCharFilterFactory, TestFastLRUCache, TestThaiWordFilterFactory, PluginInfoTest, TestShingleFilterFactory, PrimUtilsTest, TestGreekLowerCaseFilterFactory, DoubleMetaphoneFilterFactoryTest, OpenExchangeRatesOrgProviderTest, TestUAX29URLEmailTokenizerFactory, ResourceLoaderTest, FileUtilsTest, TestSolrXMLSerializer, TestDelimitedPayloadTokenFilterFactory, CloudStateTest, TestGermanLightStemFilterFactory, TestPersianNormalizationFilterFactory, TestBadConfig, TestJapanesePartOfSpeechStopFilterFactory, CommonGramsFilterFactoryTest, TestElisionFilterFactory, TestIndonesianStemFilterFactory, TestSwedishLightStemFilterFactory, TestHindiFilters, TestTypeTokenFilterFactory, TestHungarianLightStemFilterFactory, TestLRUCache, LengthFilterTest, TestIrishLowerCaseFilterFactory, TestKeywordMarkerFilterFactory, TestPatternTokenizerFactory, CommonGramsQueryFilterFactoryTest, TestCJKWidthFilterFactory, TestGreekStemFilterFactory, TestFrenchLightStemFilterFactory, TestGermanNormalizationFilterFactory, TestGermanStemFilterFactory, TestNorwegianLightStemFilterFactory, TestWikipediaTokenizerFactory, TestArabicFilters, TestCJKBigramFilterFactory, PreAnalyzedFieldTest, ZkNodePropsTest, TestNorwegianMinimalStemFilterFactory, TestPatternReplaceFilterFactory, TestSynonymFilterFactory, CircularListTest, TestRussianLightStemFilterFactory, AnalysisAfterCoreReloadTest, TestDocumentBuilder, TestCharFilters, TestJapaneseIterationMarkCharFilterFactory, SyncSliceTest]
> [junit4:junit4]   2> NOTE: reproduce with: ant test  -Dtestcase=SyncSliceTest -Dtests.seed=D62EF941F53AC21B -Dtests.multiplier=3 -Dtests.slow=true -Dtests.locale=ar_SA -Dtests.timezone=Australia/Brisbane -Dtests.file.encoding=UTF-8
> [junit4:junit4]   2>
> [junit4:junit4] ERROR   0.00s J1 | SyncSliceTest (suite)
> [junit4:junit4]    > Throwable #1: java.lang.AssertionError: ERROR: SolrIndexSearcher opens=24 closes=23
> [junit4:junit4]    > at __randomizedtesting.SeedInfo.seed([D62EF941F53AC21B]:0)
> [junit4:junit4]    > at org.junit.Assert.fail(Assert.java:93)
> [junit4:junit4]    > at org.apache.solr.SolrTestCaseJ4.endTrackingSearchers(SolrTestCaseJ4.java:216)
> [junit4:junit4]    > at org.apache.solr.SolrTestCaseJ4.afterClass(SolrTestCaseJ4.java:82)
> [junit4:junit4]    > at sun.reflect.GeneratedMethodAccessor13.invoke(Unknown Source)
> [junit4:junit4]    > at sun.reflect.DelegatingMethodAccessorImpl.invoke(DelegatingMethodAccessorImpl.java:43)
> [junit4:junit4]    > at java.lang.reflect.Method.invoke(Method.java:616)
> [junit4:junit4]    > at com.carrotsearch.randomizedtesting.RandomizedRunner.invoke(RandomizedRunner.java:1995)
> [junit4:junit4]    > at com.carrotsearch.randomizedtesting.RandomizedRunner.access$1100(RandomizedRunner.java:132)
> [junit4:junit4]    > at com.carrotsearch.randomizedtesting.RandomizedRunner$5.evaluate(RandomizedRunner.java:754)
> [junit4:junit4]    > at com.carrotsearch.randomizedtesting.rules.SystemPropertiesRestoreRule$1.evaluate(SystemPropertiesRestoreRule.java:53)
> [junit4:junit4]    > at org.apache.lucene.util.AbstractBeforeAfterRule$1.evaluate(AbstractBeforeAfterRule.java:45)
> [junit4:junit4]    > at org.apache.lucene.util.TestRuleReportUncaughtExceptions$1.evaluate(TestRuleReportUncaughtExceptions.java:68)
> [junit4:junit4]    > at org.apache.lucene.util.TestRuleStoreClassName$1.evaluate(TestRuleStoreClassName.java:38)
> [junit4:junit4]    > at org.apache.lucene.util.TestRuleIcuHack$1.evaluate(TestRuleIcuHack.java:51)
> [junit4:junit4]    > at com.carrotsearch.randomizedtesting.rules.SystemPropertiesInvariantRule$1.evaluate(SystemPropertiesInvariantRule.java:55)
> [junit4:junit4]    > at org.apache.lucene.util.TestRuleNoInstanceHooksOverrides$1.evaluate(TestRuleNoInstanceHooksOverrides.java:53)
> [junit4:junit4]    > at org.apache.lucene.util.TestRuleNoStaticHooksShadowing$1.evaluate(TestRuleNoStaticHooksShadowing.java:52)
> [junit4:junit4]    > at org.apache.lucene.util.TestRuleAssertionsRequired$1.evaluate(TestRuleAssertionsRequired.java:36)
> [junit4:junit4]    > at org.apache.lucene.util.TestRuleMarkFailure$1.evaluate(TestRuleMarkFailure.java:48)
> [junit4:junit4]    > at org.apache.lucene.util.TestRuleIgnoreAfterMaxFailures$1.evaluate(TestRuleIgnoreAfterMaxFailures.java:70)
> [junit4:junit4]    > at org.apache.lucene.util.TestRuleIgnoreTestSuites$1.evaluate(TestRuleIgnoreTestSuites.java:55)
> [junit4:junit4]    > at com.carrotsearch.randomizedtesting.RandomizedRunner.runSuite(RandomizedRunner.java:605)
> [junit4:junit4]    > at com.carrotsearch.randomizedtesting.RandomizedRunner.access$400(RandomizedRunner.java:132)
> [junit4:junit4]    > at com.carrotsearch.randomizedtesting.RandomizedRunner$2.run(RandomizedRunner.java:551)
> [junit4:junit4]    >
> [junit4:junit4] Completed on J1 in 159.70s, 1 test, 1 failure <<< FAILURES!
> [junit4:junit4]  
> [junit4:junit4] Suite: org.apache.solr.analysis.LegacyHTMLStripCharFilterTest
> [junit4:junit4] IGNORED 0.00s J0 | LegacyHTMLStripCharFilterTest.testRandom
> [junit4:junit4]    > Cause: Annotated @Ignore(broken offsets: see LUCENE-2208)
> [junit4:junit4] Completed on J0 in 0.23s, 13 tests, 1 skipped
> [junit4:junit4]  
> [junit4:junit4] Suite: org.apache.solr.analysis.TestItalianLightStemFilterFactory
> [junit4:junit4] Completed on J0 in 0.01s, 1 test
> [junit4:junit4]  
> [junit4:junit4] Suite: org.apache.solr.analysis.TestFrenchMinimalStemFilterFactory
> [junit4:junit4] Completed on J0 in 0.01s, 1 test
> [junit4:junit4]  
> [junit4:junit4] Suite: org.apache.solr.search.TestQueryUtils
> [junit4:junit4] Completed on J0 in 0.87s, 1 test
> [junit4:junit4]  
> [junit4:junit4] Suite: org.apache.solr.TestSolrCoreProperties
> [junit4:junit4] Completed on J0 in 0.24s, 1 test
> [junit4:junit4]  
> [junit4:junit4] Suite: org.apache.solr.handler.TestCSVLoader
> [junit4:junit4] Completed on J0 in 0.96s, 5 tests
> [junit4:junit4]  
> [junit4:junit4] Suite: org.apache.solr.update.SolrCmdDistributorTest
> [junit4:junit4] Completed on J0 in 1.15s, 1 test
> [junit4:junit4]  
> [junit4:junit4] Suite: org.apache.solr.spelling.IndexBasedSpellCheckerTest
> [junit4:junit4] Completed on J0 in 0.76s, 5 tests
> [junit4:junit4]  
> [junit4:junit4] Suite: org.apache.solr.analysis.TestRemoveDuplicatesTokenFilterFactory
> [junit4:junit4] Completed on J0 in 0.01s, 1 test
> [junit4:junit4]  
> [junit4:junit4] Suite: org.apache.solr.search.TestSolrJ
> [junit4:junit4] Completed on J0 in 0.01s, 1 test
> [junit4:junit4]  
> [junit4:junit4] Suite: org.apache.solr.update.TestUpdate
> [junit4:junit4] Completed on J0 in 0.52s, 1 test
> [junit4:junit4]  
> [junit4:junit4] Suite: org.apache.solr.core.TestMergePolicyConfig
> [junit4:junit4] Completed on J0 in 0.42s, 1 test
> [junit4:junit4]  
> [junit4:junit4] Suite: org.apache.solr.OutputWriterTest
> [junit4:junit4] Completed on J0 in 0.25s, 5 tests
> [junit4:junit4]  
> [junit4:junit4] Suite: org.apache.solr.util.DOMUtilTest
> [junit4:junit4] Completed on J0 in 0.02s, 1 test
> [junit4:junit4]  
> [junit4:junit4] Suite: org.apache.solr.search.TestLFUCache
> [junit4:junit4] Completed on J0 in 0.52s, 5 tests
> [junit4:junit4]  
> [junit4:junit4] Suite: org.apache.solr.search.TestRTGBase
> [junit4:junit4] Completed on J0 in 0.00s, 0 tests
> [junit4:junit4]  
> [junit4:junit4] Suite: org.apache.solr.cloud.ZkCLITest
> [junit4:junit4] Completed on J1 in 2.24s, 3 tests
> [junit4:junit4]  
> [junit4:junit4] Suite: org.apache.solr.search.TestStressLucene
> [junit4:junit4] Completed on J0 in 0.44s, 1 test
> [junit4:junit4]  
> [junit4:junit4] Suite: org.apache.solr.search.TestStressVersions
> [junit4:junit4] Completed on J1 in 8.35s, 1 test
> [junit4:junit4]  
> [junit4:junit4] JVM J0:     0.88 ..   837.32 =   836.44s
> [junit4:junit4] JVM J1:     0.88 ..   896.28 =   895.40s
> [junit4:junit4] Execution time total: 14 minutes 56 seconds
> [junit4:junit4] Tests summary: 297 suites, 1054 tests, 1 suite-level error, 5 ignored
>
> BUILD FAILED
> /usr/home/hudson/hudson-slave/workspace/Lucene-Solr-tests-only-trunk/checkout/build.xml:29: The following error occurred while executing this line:
> /usr/home/hudson/hudson-slave/workspace/Lucene-Solr-tests-only-trunk/checkout/solr/build.xml:144: The following error occurred while executing this line:
> /usr/home/hudson/hudson-slave/workspace/Lucene-Solr-tests-only-trunk/checkout/lucene/module-build.xml:62: The following error occurred while executing this line:
> /usr/home/hudson/hudson-slave/workspace/Lucene-Solr-tests-only-trunk/checkout/lucene/common-build.xml:1094: The following error occurred while executing this line:
> /usr/home/hudson/hudson-slave/workspace/Lucene-Solr-tests-only-trunk/checkout/lucene/common-build.xml:789: There were test failures: 297 suites, 1054 tests, 1 suite-level error, 5 ignored
>
> Total time: 26 minutes 23 seconds
> Build step 'Execute shell' marked build as failure
> Archiving artifacts
> Recording test results
> Publishing Clover coverage report...
> No Clover report will be published due to a Build Failure
> Email was triggered for: Failure
> Sending email for trigger: Failure
>
>
>
> ---------------------------------------------------------------------
> To unsubscribe, e-mail: [hidden email]
> For additional commands, e-mail: [hidden email]

- Mark Miller
lucidimagination.com












---------------------------------------------------------------------
To unsubscribe, e-mail: [hidden email]
For additional commands, e-mail: [hidden email]

Reply | Threaded
Open this post in threaded view
|

[JENKINS] Lucene-Solr-tests-only-trunk - Build # 14928 - Still Failing

Apache Jenkins Server-2
In reply to this post by Apache Jenkins Server-2
Build: https://builds.apache.org/job/Lucene-Solr-tests-only-trunk/14928/

1 tests failed.
REGRESSION:  org.apache.lucene.index.TestPostingsFormat.test

Error Message:
GC overhead limit exceeded

Stack Trace:
java.lang.OutOfMemoryError: GC overhead limit exceeded
        at __randomizedtesting.SeedInfo.seed([6CE91EC09338D64D:E4BD211A3DC4BBB5]:0)
        at java.lang.Integer.toString(Integer.java:331)
        at org.apache.lucene.codecs.simpletext.SimpleTextFieldsWriter$SimpleTextPostingsWriter.addPosition(SimpleTextFieldsWriter.java:149)
        at org.apache.lucene.index.TestPostingsFormat.buildIndex(TestPostingsFormat.java:421)
        at org.apache.lucene.index.TestPostingsFormat.test(TestPostingsFormat.java:867)
        at sun.reflect.NativeMethodAccessorImpl.invoke0(Native Method)
        at sun.reflect.NativeMethodAccessorImpl.invoke(NativeMethodAccessorImpl.java:57)
        at sun.reflect.DelegatingMethodAccessorImpl.invoke(DelegatingMethodAccessorImpl.java:43)
        at java.lang.reflect.Method.invoke(Method.java:616)
        at com.carrotsearch.randomizedtesting.RandomizedRunner.invoke(RandomizedRunner.java:1995)
        at com.carrotsearch.randomizedtesting.RandomizedRunner.access$1100(RandomizedRunner.java:132)
        at com.carrotsearch.randomizedtesting.RandomizedRunner$6.evaluate(RandomizedRunner.java:818)
        at com.carrotsearch.randomizedtesting.RandomizedRunner$7.evaluate(RandomizedRunner.java:877)
        at com.carrotsearch.randomizedtesting.RandomizedRunner$8.evaluate(RandomizedRunner.java:891)
        at org.apache.lucene.util.TestRuleSetupTeardownChained$1.evaluate(TestRuleSetupTeardownChained.java:50)
        at org.apache.lucene.util.TestRuleFieldCacheSanity$1.evaluate(TestRuleFieldCacheSanity.java:32)
        at org.apache.lucene.util.AbstractBeforeAfterRule$1.evaluate(AbstractBeforeAfterRule.java:45)
        at com.carrotsearch.randomizedtesting.rules.SystemPropertiesInvariantRule$1.evaluate(SystemPropertiesInvariantRule.java:55)
        at org.apache.lucene.util.TestRuleReportUncaughtExceptions$1.evaluate(TestRuleReportUncaughtExceptions.java:68)
        at org.apache.lucene.util.TestRuleThreadAndTestName$1.evaluate(TestRuleThreadAndTestName.java:48)
        at org.apache.lucene.util.TestRuleIgnoreAfterMaxFailures$1.evaluate(TestRuleIgnoreAfterMaxFailures.java:70)
        at org.apache.lucene.util.TestRuleMarkFailure$1.evaluate(TestRuleMarkFailure.java:48)
        at com.carrotsearch.randomizedtesting.RandomizedRunner.runSingleTest(RandomizedRunner.java:825)
        at com.carrotsearch.randomizedtesting.RandomizedRunner.access$700(RandomizedRunner.java:132)
        at com.carrotsearch.randomizedtesting.RandomizedRunner$3$1.run(RandomizedRunner.java:671)
        at com.carrotsearch.randomizedtesting.RandomizedRunner$3.evaluate(RandomizedRunner.java:697)
        at com.carrotsearch.randomizedtesting.RandomizedRunner$4.evaluate(RandomizedRunner.java:736)
        at com.carrotsearch.randomizedtesting.RandomizedRunner$5.evaluate(RandomizedRunner.java:747)
        at org.apache.lucene.util.AbstractBeforeAfterRule$1.evaluate(AbstractBeforeAfterRule.java:45)
        at org.apache.lucene.util.TestRuleReportUncaughtExceptions$1.evaluate(TestRuleReportUncaughtExceptions.java:68)
        at org.apache.lucene.util.TestRuleStoreClassName$1.evaluate(TestRuleStoreClassName.java:38)
        at org.apache.lucene.util.TestRuleIcuHack$1.evaluate(TestRuleIcuHack.java:51)
        at com.carrotsearch.randomizedtesting.rules.SystemPropertiesInvariantRule$1.evaluate(SystemPropertiesInvariantRule.java:55)




Build Log:
[...truncated 1051 lines...]
[junit4:junit4] Suite: org.apache.lucene.store.TestDirectory
[junit4:junit4] IGNOR/A 0.01s J0 | TestDirectory.testThreadSafety
[junit4:junit4]    > Assumption #1: 'nightly' test group is disabled (@Nightly)
[junit4:junit4] Completed on J0 in 0.09s, 8 tests, 1 skipped
[junit4:junit4]  
[junit4:junit4] Suite: org.apache.lucene.util.TestCharsRef
[junit4:junit4] Completed on J1 in 0.10s, 8 tests
[junit4:junit4]  
[junit4:junit4] Suite: org.apache.lucene.index.TestParallelTermEnum
[junit4:junit4] Completed on J0 in 0.01s, 1 test
[junit4:junit4]  
[junit4:junit4] Suite: org.apache.lucene.index.TestReaderClosed
[junit4:junit4] Completed on J1 in 0.03s, 2 tests
[junit4:junit4]  
[junit4:junit4] Suite: org.apache.lucene.search.TestElevationComparator
[junit4:junit4] Completed on J0 in 0.01s, 1 test
[junit4:junit4]  
[junit4:junit4] Suite: org.apache.lucene.search.TestFieldCacheTermsFilter
[junit4:junit4] Completed on J1 in 0.01s, 1 test
[junit4:junit4]  
[junit4:junit4] Suite: org.apache.lucene.search.TestMatchAllDocsQuery
[junit4:junit4] Completed on J0 in 0.01s, 2 tests
[junit4:junit4]  
[junit4:junit4] Suite: org.apache.lucene.index.TestIndexWriterOnJRECrash
[junit4:junit4] IGNOR/A 0.00s J1 | TestIndexWriterOnJRECrash.testNRTThreads
[junit4:junit4]    > Assumption #1: 'nightly' test group is disabled (@Nightly)
[junit4:junit4] Completed on J1 in 0.02s, 1 test, 1 skipped
[junit4:junit4]  
[junit4:junit4] Suite: org.apache.lucene.search.TestCachingCollector
[junit4:junit4] Completed on J0 in 0.03s, 5 tests
[junit4:junit4]  
[junit4:junit4] Suite: org.apache.lucene.TestDemo
[junit4:junit4] Completed on J1 in 0.01s, 1 test
[junit4:junit4]  
[junit4:junit4] Suite: org.apache.lucene.search.TestPrefixQuery
[junit4:junit4] Completed on J0 in 0.01s, 1 test
[junit4:junit4]  
[junit4:junit4] Suite: org.apache.lucene.search.spans.TestSpanFirstQuery
[junit4:junit4] Completed on J1 in 0.03s, 1 test
[junit4:junit4]  
[junit4:junit4] Suite: org.apache.lucene.store.TestLock
[junit4:junit4] Completed on J0 in 0.02s, 1 test
[junit4:junit4]  
[junit4:junit4] Suite: org.apache.lucene.util.TestBytesRef
[junit4:junit4] Completed on J1 in 0.02s, 5 tests
[junit4:junit4]  
[junit4:junit4] Suite: org.apache.lucene.util.TestVirtualMethod
[junit4:junit4] Completed on J0 in 0.04s, 2 tests
[junit4:junit4]  
[junit4:junit4] Suite: org.apache.lucene.index.TestNoMergePolicy
[junit4:junit4] Completed on J1 in 0.16s, 4 tests
[junit4:junit4]  
[junit4:junit4] Suite: org.apache.lucene.search.TestNGramPhraseQuery
[junit4:junit4] Completed on J0 in 0.01s, 1 test
[junit4:junit4]  
[junit4:junit4] Suite: org.apache.lucene.codecs.intblock.TestIntBlockCodec
[junit4:junit4] Completed on J1 in 0.01s, 2 tests
[junit4:junit4]  
[junit4:junit4] Suite: org.apache.lucene.index.TestRollback
[junit4:junit4] Completed on J0 in 0.01s, 1 test
[junit4:junit4]  
[junit4:junit4] Suite: org.apache.lucene.util.TestVersion
[junit4:junit4] Completed on J1 in 0.01s, 2 tests
[junit4:junit4]  
[junit4:junit4] Suite: org.apache.lucene.analysis.TestNumericTokenStream
[junit4:junit4] Completed on J0 in 0.02s, 4 tests
[junit4:junit4]  
[junit4:junit4] Suite: org.apache.lucene.index.TestIndexWriterLockRelease
[junit4:junit4] Completed on J1 in 0.01s, 1 test
[junit4:junit4]  
[junit4:junit4] Suite: org.apache.lucene.index.TestNewestSegment
[junit4:junit4] Completed on J0 in 0.01s, 1 test
[junit4:junit4]  
[junit4:junit4] Suite: org.apache.lucene.index.TestNoMergeScheduler
[junit4:junit4] Completed on J1 in 0.01s, 3 tests
[junit4:junit4]  
[junit4:junit4] Suite: org.apache.lucene.util.TestByteBlockPool
[junit4:junit4] Completed on J0 in 0.03s, 1 test
[junit4:junit4]  
[junit4:junit4] Suite: org.apache.lucene.analysis.TestCachingTokenFilter
[junit4:junit4] Completed on J1 in 0.03s, 1 test
[junit4:junit4]  
[junit4:junit4] Suite: org.apache.lucene.index.TestIndexCommit
[junit4:junit4] Completed on J0 in 0.01s, 1 test
[junit4:junit4]  
[junit4:junit4] Suite: org.apache.lucene.TestAssertions
[junit4:junit4] Completed on J1 in 0.01s, 1 test
[junit4:junit4]  
[junit4:junit4] Suite: org.apache.lucene.analysis.tokenattributes.TestSimpleAttributeImpl
[junit4:junit4] Completed on J0 in 0.01s, 1 test
[junit4:junit4]  
[junit4:junit4] Suite: org.apache.lucene.index.TestTerm
[junit4:junit4] Completed on J1 in 0.01s, 1 test
[junit4:junit4]  
[junit4:junit4] Suite: org.apache.lucene.analysis.TestCharFilter
[junit4:junit4] Completed on J0 in 0.01s, 4 tests
[junit4:junit4]  
[junit4:junit4] Suite: org.apache.lucene.search.TestBooleanQueryVisitSubscorers
[junit4:junit4] Completed on J0 in 0.02s, 3 tests
[junit4:junit4]  
[junit4:junit4] Suite: org.apache.lucene.search.TestConjunctions
[junit4:junit4] Completed on J0 in 0.01s, 1 test
[junit4:junit4]  
[junit4:junit4] Suite: org.apache.lucene.util.TestMaxFailuresRule
[junit4:junit4] Completed on J0 in 0.10s, 1 test
[junit4:junit4]  
[junit4:junit4] Suite: org.apache.lucene.index.TestPostingsFormat
[junit4:junit4] ERROR   50.9s J1 | TestPostingsFormat.test
[junit4:junit4]    > Throwable #1: java.lang.OutOfMemoryError: GC overhead limit exceeded
[junit4:junit4]    > at __randomizedtesting.SeedInfo.seed([6CE91EC09338D64D:E4BD211A3DC4BBB5]:0)
[junit4:junit4]    > at java.lang.Integer.toString(Integer.java:331)
[junit4:junit4]    > at org.apache.lucene.codecs.simpletext.SimpleTextFieldsWriter$SimpleTextPostingsWriter.addPosition(SimpleTextFieldsWriter.java:149)
[junit4:junit4]    > at org.apache.lucene.index.TestPostingsFormat.buildIndex(TestPostingsFormat.java:421)
[junit4:junit4]    > at org.apache.lucene.index.TestPostingsFormat.test(TestPostingsFormat.java:867)
[junit4:junit4]    > at sun.reflect.NativeMethodAccessorImpl.invoke0(Native Method)
[junit4:junit4]    > at sun.reflect.NativeMethodAccessorImpl.invoke(NativeMethodAccessorImpl.java:57)
[junit4:junit4]    > at sun.reflect.DelegatingMethodAccessorImpl.invoke(DelegatingMethodAccessorImpl.java:43)
[junit4:junit4]    > at java.lang.reflect.Method.invoke(Method.java:616)
[junit4:junit4]    > at com.carrotsearch.randomizedtesting.RandomizedRunner.invoke(RandomizedRunner.java:1995)
[junit4:junit4]    > at com.carrotsearch.randomizedtesting.RandomizedRunner.access$1100(RandomizedRunner.java:132)
[junit4:junit4]    > at com.carrotsearch.randomizedtesting.RandomizedRunner$6.evaluate(RandomizedRunner.java:818)
[junit4:junit4]    > at com.carrotsearch.randomizedtesting.RandomizedRunner$7.evaluate(RandomizedRunner.java:877)
[junit4:junit4]    > at com.carrotsearch.randomizedtesting.RandomizedRunner$8.evaluate(RandomizedRunner.java:891)
[junit4:junit4]    > at org.apache.lucene.util.TestRuleSetupTeardownChained$1.evaluate(TestRuleSetupTeardownChained.java:50)
[junit4:junit4]    > at org.apache.lucene.util.TestRuleFieldCacheSanity$1.evaluate(TestRuleFieldCacheSanity.java:32)
[junit4:junit4]    > at org.apache.lucene.util.AbstractBeforeAfterRule$1.evaluate(AbstractBeforeAfterRule.java:45)
[junit4:junit4]    > at com.carrotsearch.randomizedtesting.rules.SystemPropertiesInvariantRule$1.evaluate(SystemPropertiesInvariantRule.java:55)
[junit4:junit4]    > at org.apache.lucene.util.TestRuleReportUncaughtExceptions$1.evaluate(TestRuleReportUncaughtExceptions.java:68)
[junit4:junit4]    > at org.apache.lucene.util.TestRuleThreadAndTestName$1.evaluate(TestRuleThreadAndTestName.java:48)
[junit4:junit4]    > at org.apache.lucene.util.TestRuleIgnoreAfterMaxFailures$1.evaluate(TestRuleIgnoreAfterMaxFailures.java:70)
[junit4:junit4]    > at org.apache.lucene.util.TestRuleMarkFailure$1.evaluate(TestRuleMarkFailure.java:48)
[junit4:junit4]    > at com.carrotsearch.randomizedtesting.RandomizedRunner.runSingleTest(RandomizedRunner.java:825)
[junit4:junit4]    > at com.carrotsearch.randomizedtesting.RandomizedRunner.access$700(RandomizedRunner.java:132)
[junit4:junit4]    > at com.carrotsearch.randomizedtesting.RandomizedRunner$3$1.run(RandomizedRunner.java:671)
[junit4:junit4]    > at com.carrotsearch.randomizedtesting.RandomizedRunner$3.evaluate(RandomizedRunner.java:697)
[junit4:junit4]    > at com.carrotsearch.randomizedtesting.RandomizedRunner$4.evaluate(RandomizedRunner.java:736)
[junit4:junit4]    > at com.carrotsearch.randomizedtesting.RandomizedRunner$5.evaluate(RandomizedRunner.java:747)
[junit4:junit4]    > at org.apache.lucene.util.AbstractBeforeAfterRule$1.evaluate(AbstractBeforeAfterRule.java:45)
[junit4:junit4]    > at org.apache.lucene.util.TestRuleReportUncaughtExceptions$1.evaluate(TestRuleReportUncaughtExceptions.java:68)
[junit4:junit4]    > at org.apache.lucene.util.TestRuleStoreClassName$1.evaluate(TestRuleStoreClassName.java:38)
[junit4:junit4]    > at org.apache.lucene.util.TestRuleIcuHack$1.evaluate(TestRuleIcuHack.java:51)
[junit4:junit4]    > at com.carrotsearch.randomizedtesting.rules.SystemPropertiesInvariantRule$1.evaluate(SystemPropertiesInvariantRule.java:55)
[junit4:junit4]    >
[junit4:junit4]   2> NOTE: reproduce with: ant test  -Dtestcase=TestPostingsFormat -Dtests.method=test -Dtests.seed=6CE91EC09338D64D -Dtests.multiplier=3 -Dtests.slow=true -Dtests.locale=cs -Dtests.timezone=America/Maceio -Dtests.file.encoding=ISO8859-1
[junit4:junit4]   2>
[junit4:junit4]    > (@AfterClass output)
[junit4:junit4]   2> NOTE: test params are: codec=SimpleText, sim=RandomSimilarityProvider(queryNorm=true,coord=true): {}, locale=cs, timezone=America/Maceio
[junit4:junit4]   2> NOTE: FreeBSD 9.0-RELEASE amd64/Sun Microsystems Inc. 1.6.0_32 (64-bit)/cpus=16,threads=1,free=59754240,total=477233152
[junit4:junit4]   2> NOTE: All tests run in this JVM: [TestPayloads, Nested1, TestUniqueTermCount, TestDocTermOrds, TestBytesRefHash, TestSubScorerFreqs, TestSimpleExplanations, TestCloseableThreadLocal, TestBinaryTerms, TestAutomatonQueryUnicode, MultiCollectorTest, TestConcurrentMergeScheduler, TestFieldMaskingSpanQuery, TestToken, TestIOUtils, TestCollectionUtil, TestCodecs, TestIntsRef, TestIndexInput, TestPrefixRandom, TestPersistentSnapshotDeletionPolicy, TestAutomatonQuery, TestBooleanOr, TestAttributeSource, TestPerFieldPostingsFormat, TestThreadedForceMerge, TestIndexWriterOnDiskFull, TestCachingWrapperFilter, TestBasics, TestSentinelIntSet, TestFieldCacheSanityChecker, TestRamUsageEstimator, TestBinaryDocument, Test10KPulsings, TestPerSegmentDeletes, TestExplanations, TestReuseDocsEnum, TestForTooMuchCloning, TestIsCurrent, TestWildcard, TestSegmentMerger, TestDateTools, TestRollingBuffer, TestPrefixFilter, Nested1, Nested2, Nested3, TestDoc, TestNumericRangeQuery32, TestTopDocsMerge, TestQueryWrapperFilter, TestTopScoreDocCollector, TestDocValuesScoring, TestCompiledAutomaton, TestLookaheadTokenFilter, TestSegmentTermDocs, TestDocValuesTypeCompatibility, TestTermVectorsWriter, TestDocCount, TestPhrasePrefixQuery, TestForceMergeForever, Before3, Before3, TestSameTokenSamePosition, TestNamedSPILoader, TestNumericRangeQuery64, TestIndexWriterMergePolicy, TestConsistentFieldNumbers, TestRamUsageEstimatorOnWildAnimals, TestBitUtil, TestMinimize, TestSimilarity, TestDocIdSet, TestHugeRamFile, TestRAMDirectory, TestSimpleSearchEquivalence, TestDirectoryReader, TestSpanMultiTermQueryWrapper, TestCrash, TestIndexWriterWithThreads, TestByteSlices, TestDeletionPolicy, TestAtomicUpdate, TestIndexWriterMerging, TestLucene40PostingsReader, TestOpenBitSet, TestTimeLimitingCollector, TestSearchAfter, TestIndexWriterUnicode, TestIndexWriterDelete, TestBufferedIndexInput, TestPagedBytes, TestWeakIdentityMap, TestTypePromotion, TestSnapshotDeletionPolicy, TestMockAnalyzer, TestDeterminizeLexicon, TestRollingCharBuffer, TestNRTReaderWithThreads, TestStressNRT, TestLockFactory, TestComplexExplanations, TestNumericUtils, TestLevenshteinAutomata, TestMultiValuedNumericRangeQuery, TestDeterminism, TestCharTermAttributeImpl, TestFieldsReader, TestRollingUpdates, TestTransactions, TestFieldCache, TestSpanSearchEquivalence, TestMultiThreadTermVectors, TestSimilarityBase, TestPayloadTermQuery, TestMergeSchedulerExternal, TestPayloadNearQuery, TestPayloadExplanations, TestPrefixCodedTerms, TestDocsAndPositions, TestUnicodeUtil, TestAllFilesHaveCodecHeader, TestParallelAtomicReader, TestBooleanQuery, TestFuzzyQuery, InBeforeClass, InAfterClass, InTestMethod, NonStringProperties, TestIdentityHashSet, TestSpanExplanationsOfNonMatches, TestCheckIndex, TestNearSpansOrdered, TestParallelReaderEmptyIndex, TestDocument, TestFilteredSearch, NestedSetupChain, NestedTeardownChain, Test2BPostings, TestFilterAtomicReader, TestDateFilter, TestSegmentTermEnum, TestBooleanScorer, TestRecyclingByteBlockAllocator, TestCharsRef, TestReaderClosed, TestFieldCacheTermsFilter, TestIndexWriterOnJRECrash, TestDemo, TestSpanFirstQuery, TestBytesRef, TestNoMergePolicy, TestIntBlockCodec, TestVersion, TestIndexWriterLockRelease, TestNoMergeScheduler, TestCachingTokenFilter, TestAssertions, TestTerm, TestPostingsFormat]
[junit4:junit4]   2>
[junit4:junit4] Completed on J1 in 59.71s, 1 test, 1 error <<< FAILURES!
[...truncated 20 lines...]

[...truncated 1222 lines...]

[...truncated 1222 lines...]

[...truncated 1222 lines...]

[...truncated 1222 lines...]

[...truncated 1208 lines...]
BUILD FAILED
/usr/home/hudson/hudson-slave/workspace/Lucene-Solr-tests-only-trunk/checkout/build.xml:29: The following error occurred while executing this line:
/usr/home/hudson/hudson-slave/workspace/Lucene-Solr-tests-only-trunk/checkout/lucene/build.xml:50: The following error occurred while executing this line:
/usr/home/hudson/hudson-slave/workspace/Lucene-Solr-tests-only-trunk/checkout/lucene/common-build.xml:1094: The following error occurred while executing this line:
/usr/home/hudson/hudson-slave/workspace/Lucene-Solr-tests-only-trunk/checkout/lucene/common-build.xml:789: There were test failures: 305 suites, 1721 tests, 1 error, 13 ignored (11 assumptions)

Total time: 7 minutes 21 seconds
Build step 'Execute shell' marked build as failure
Archiving artifacts
Recording test results
Publishing Clover coverage report...
No Clover report will be published due to a Build Failure
Email was triggered for: Failure
Sending email for trigger: Failure




---------------------------------------------------------------------
To unsubscribe, e-mail: [hidden email]
For additional commands, e-mail: [hidden email]
Reply | Threaded
Open this post in threaded view
|

Re: [JENKINS] Lucene-Solr-tests-only-trunk - Build # 14928 - Still Failing

Robert Muir
I figured something like this would happen... this test itself
probably requires lots of ram and is driven over the edge by
multiplier + simpletext.

I think we should tone down the multiplier, rather than disabling SimpleText.

On Mon, Jul 23, 2012 at 8:07 PM, Apache Jenkins Server
<[hidden email]> wrote:

> Build: https://builds.apache.org/job/Lucene-Solr-tests-only-trunk/14928/
>
> 1 tests failed.
> REGRESSION:  org.apache.lucene.index.TestPostingsFormat.test
>
> Error Message:
> GC overhead limit exceeded
>
> Stack Trace:
> java.lang.OutOfMemoryError: GC overhead limit exceeded
>         at __randomizedtesting.SeedInfo.seed([6CE91EC09338D64D:E4BD211A3DC4BBB5]:0)
>         at java.lang.Integer.toString(Integer.java:331)
>         at org.apache.lucene.codecs.simpletext.SimpleTextFieldsWriter$SimpleTextPostingsWriter.addPosition(SimpleTextFieldsWriter.java:149)
>         at org.apache.lucene.index.TestPostingsFormat.buildIndex(TestPostingsFormat.java:421)
>         at org.apache.lucene.index.TestPostingsFormat.test(TestPostingsFormat.java:867)
>         at sun.reflect.NativeMethodAccessorImpl.invoke0(Native Method)
>         at sun.reflect.NativeMethodAccessorImpl.invoke(NativeMethodAccessorImpl.java:57)
>         at sun.reflect.DelegatingMethodAccessorImpl.invoke(DelegatingMethodAccessorImpl.java:43)
>         at java.lang.reflect.Method.invoke(Method.java:616)
>         at com.carrotsearch.randomizedtesting.RandomizedRunner.invoke(RandomizedRunner.java:1995)
>         at com.carrotsearch.randomizedtesting.RandomizedRunner.access$1100(RandomizedRunner.java:132)
>         at com.carrotsearch.randomizedtesting.RandomizedRunner$6.evaluate(RandomizedRunner.java:818)
>         at com.carrotsearch.randomizedtesting.RandomizedRunner$7.evaluate(RandomizedRunner.java:877)
>         at com.carrotsearch.randomizedtesting.RandomizedRunner$8.evaluate(RandomizedRunner.java:891)
>         at org.apache.lucene.util.TestRuleSetupTeardownChained$1.evaluate(TestRuleSetupTeardownChained.java:50)
>         at org.apache.lucene.util.TestRuleFieldCacheSanity$1.evaluate(TestRuleFieldCacheSanity.java:32)
>         at org.apache.lucene.util.AbstractBeforeAfterRule$1.evaluate(AbstractBeforeAfterRule.java:45)
>         at com.carrotsearch.randomizedtesting.rules.SystemPropertiesInvariantRule$1.evaluate(SystemPropertiesInvariantRule.java:55)
>         at org.apache.lucene.util.TestRuleReportUncaughtExceptions$1.evaluate(TestRuleReportUncaughtExceptions.java:68)
>         at org.apache.lucene.util.TestRuleThreadAndTestName$1.evaluate(TestRuleThreadAndTestName.java:48)
>         at org.apache.lucene.util.TestRuleIgnoreAfterMaxFailures$1.evaluate(TestRuleIgnoreAfterMaxFailures.java:70)
>         at org.apache.lucene.util.TestRuleMarkFailure$1.evaluate(TestRuleMarkFailure.java:48)
>         at com.carrotsearch.randomizedtesting.RandomizedRunner.runSingleTest(RandomizedRunner.java:825)
>         at com.carrotsearch.randomizedtesting.RandomizedRunner.access$700(RandomizedRunner.java:132)
>         at com.carrotsearch.randomizedtesting.RandomizedRunner$3$1.run(RandomizedRunner.java:671)
>         at com.carrotsearch.randomizedtesting.RandomizedRunner$3.evaluate(RandomizedRunner.java:697)
>         at com.carrotsearch.randomizedtesting.RandomizedRunner$4.evaluate(RandomizedRunner.java:736)
>         at com.carrotsearch.randomizedtesting.RandomizedRunner$5.evaluate(RandomizedRunner.java:747)
>         at org.apache.lucene.util.AbstractBeforeAfterRule$1.evaluate(AbstractBeforeAfterRule.java:45)
>         at org.apache.lucene.util.TestRuleReportUncaughtExceptions$1.evaluate(TestRuleReportUncaughtExceptions.java:68)
>         at org.apache.lucene.util.TestRuleStoreClassName$1.evaluate(TestRuleStoreClassName.java:38)
>         at org.apache.lucene.util.TestRuleIcuHack$1.evaluate(TestRuleIcuHack.java:51)
>         at com.carrotsearch.randomizedtesting.rules.SystemPropertiesInvariantRule$1.evaluate(SystemPropertiesInvariantRule.java:55)
>
>
>
>
> Build Log:
> [...truncated 1051 lines...]
> [junit4:junit4] Suite: org.apache.lucene.store.TestDirectory
> [junit4:junit4] IGNOR/A 0.01s J0 | TestDirectory.testThreadSafety
> [junit4:junit4]    > Assumption #1: 'nightly' test group is disabled (@Nightly)
> [junit4:junit4] Completed on J0 in 0.09s, 8 tests, 1 skipped
> [junit4:junit4]
> [junit4:junit4] Suite: org.apache.lucene.util.TestCharsRef
> [junit4:junit4] Completed on J1 in 0.10s, 8 tests
> [junit4:junit4]
> [junit4:junit4] Suite: org.apache.lucene.index.TestParallelTermEnum
> [junit4:junit4] Completed on J0 in 0.01s, 1 test
> [junit4:junit4]
> [junit4:junit4] Suite: org.apache.lucene.index.TestReaderClosed
> [junit4:junit4] Completed on J1 in 0.03s, 2 tests
> [junit4:junit4]
> [junit4:junit4] Suite: org.apache.lucene.search.TestElevationComparator
> [junit4:junit4] Completed on J0 in 0.01s, 1 test
> [junit4:junit4]
> [junit4:junit4] Suite: org.apache.lucene.search.TestFieldCacheTermsFilter
> [junit4:junit4] Completed on J1 in 0.01s, 1 test
> [junit4:junit4]
> [junit4:junit4] Suite: org.apache.lucene.search.TestMatchAllDocsQuery
> [junit4:junit4] Completed on J0 in 0.01s, 2 tests
> [junit4:junit4]
> [junit4:junit4] Suite: org.apache.lucene.index.TestIndexWriterOnJRECrash
> [junit4:junit4] IGNOR/A 0.00s J1 | TestIndexWriterOnJRECrash.testNRTThreads
> [junit4:junit4]    > Assumption #1: 'nightly' test group is disabled (@Nightly)
> [junit4:junit4] Completed on J1 in 0.02s, 1 test, 1 skipped
> [junit4:junit4]
> [junit4:junit4] Suite: org.apache.lucene.search.TestCachingCollector
> [junit4:junit4] Completed on J0 in 0.03s, 5 tests
> [junit4:junit4]
> [junit4:junit4] Suite: org.apache.lucene.TestDemo
> [junit4:junit4] Completed on J1 in 0.01s, 1 test
> [junit4:junit4]
> [junit4:junit4] Suite: org.apache.lucene.search.TestPrefixQuery
> [junit4:junit4] Completed on J0 in 0.01s, 1 test
> [junit4:junit4]
> [junit4:junit4] Suite: org.apache.lucene.search.spans.TestSpanFirstQuery
> [junit4:junit4] Completed on J1 in 0.03s, 1 test
> [junit4:junit4]
> [junit4:junit4] Suite: org.apache.lucene.store.TestLock
> [junit4:junit4] Completed on J0 in 0.02s, 1 test
> [junit4:junit4]
> [junit4:junit4] Suite: org.apache.lucene.util.TestBytesRef
> [junit4:junit4] Completed on J1 in 0.02s, 5 tests
> [junit4:junit4]
> [junit4:junit4] Suite: org.apache.lucene.util.TestVirtualMethod
> [junit4:junit4] Completed on J0 in 0.04s, 2 tests
> [junit4:junit4]
> [junit4:junit4] Suite: org.apache.lucene.index.TestNoMergePolicy
> [junit4:junit4] Completed on J1 in 0.16s, 4 tests
> [junit4:junit4]
> [junit4:junit4] Suite: org.apache.lucene.search.TestNGramPhraseQuery
> [junit4:junit4] Completed on J0 in 0.01s, 1 test
> [junit4:junit4]
> [junit4:junit4] Suite: org.apache.lucene.codecs.intblock.TestIntBlockCodec
> [junit4:junit4] Completed on J1 in 0.01s, 2 tests
> [junit4:junit4]
> [junit4:junit4] Suite: org.apache.lucene.index.TestRollback
> [junit4:junit4] Completed on J0 in 0.01s, 1 test
> [junit4:junit4]
> [junit4:junit4] Suite: org.apache.lucene.util.TestVersion
> [junit4:junit4] Completed on J1 in 0.01s, 2 tests
> [junit4:junit4]
> [junit4:junit4] Suite: org.apache.lucene.analysis.TestNumericTokenStream
> [junit4:junit4] Completed on J0 in 0.02s, 4 tests
> [junit4:junit4]
> [junit4:junit4] Suite: org.apache.lucene.index.TestIndexWriterLockRelease
> [junit4:junit4] Completed on J1 in 0.01s, 1 test
> [junit4:junit4]
> [junit4:junit4] Suite: org.apache.lucene.index.TestNewestSegment
> [junit4:junit4] Completed on J0 in 0.01s, 1 test
> [junit4:junit4]
> [junit4:junit4] Suite: org.apache.lucene.index.TestNoMergeScheduler
> [junit4:junit4] Completed on J1 in 0.01s, 3 tests
> [junit4:junit4]
> [junit4:junit4] Suite: org.apache.lucene.util.TestByteBlockPool
> [junit4:junit4] Completed on J0 in 0.03s, 1 test
> [junit4:junit4]
> [junit4:junit4] Suite: org.apache.lucene.analysis.TestCachingTokenFilter
> [junit4:junit4] Completed on J1 in 0.03s, 1 test
> [junit4:junit4]
> [junit4:junit4] Suite: org.apache.lucene.index.TestIndexCommit
> [junit4:junit4] Completed on J0 in 0.01s, 1 test
> [junit4:junit4]
> [junit4:junit4] Suite: org.apache.lucene.TestAssertions
> [junit4:junit4] Completed on J1 in 0.01s, 1 test
> [junit4:junit4]
> [junit4:junit4] Suite: org.apache.lucene.analysis.tokenattributes.TestSimpleAttributeImpl
> [junit4:junit4] Completed on J0 in 0.01s, 1 test
> [junit4:junit4]
> [junit4:junit4] Suite: org.apache.lucene.index.TestTerm
> [junit4:junit4] Completed on J1 in 0.01s, 1 test
> [junit4:junit4]
> [junit4:junit4] Suite: org.apache.lucene.analysis.TestCharFilter
> [junit4:junit4] Completed on J0 in 0.01s, 4 tests
> [junit4:junit4]
> [junit4:junit4] Suite: org.apache.lucene.search.TestBooleanQueryVisitSubscorers
> [junit4:junit4] Completed on J0 in 0.02s, 3 tests
> [junit4:junit4]
> [junit4:junit4] Suite: org.apache.lucene.search.TestConjunctions
> [junit4:junit4] Completed on J0 in 0.01s, 1 test
> [junit4:junit4]
> [junit4:junit4] Suite: org.apache.lucene.util.TestMaxFailuresRule
> [junit4:junit4] Completed on J0 in 0.10s, 1 test
> [junit4:junit4]
> [junit4:junit4] Suite: org.apache.lucene.index.TestPostingsFormat
> [junit4:junit4] ERROR   50.9s J1 | TestPostingsFormat.test
> [junit4:junit4]    > Throwable #1: java.lang.OutOfMemoryError: GC overhead limit exceeded
> [junit4:junit4]    >    at __randomizedtesting.SeedInfo.seed([6CE91EC09338D64D:E4BD211A3DC4BBB5]:0)
> [junit4:junit4]    >    at java.lang.Integer.toString(Integer.java:331)
> [junit4:junit4]    >    at org.apache.lucene.codecs.simpletext.SimpleTextFieldsWriter$SimpleTextPostingsWriter.addPosition(SimpleTextFieldsWriter.java:149)
> [junit4:junit4]    >    at org.apache.lucene.index.TestPostingsFormat.buildIndex(TestPostingsFormat.java:421)
> [junit4:junit4]    >    at org.apache.lucene.index.TestPostingsFormat.test(TestPostingsFormat.java:867)
> [junit4:junit4]    >    at sun.reflect.NativeMethodAccessorImpl.invoke0(Native Method)
> [junit4:junit4]    >    at sun.reflect.NativeMethodAccessorImpl.invoke(NativeMethodAccessorImpl.java:57)
> [junit4:junit4]    >    at sun.reflect.DelegatingMethodAccessorImpl.invoke(DelegatingMethodAccessorImpl.java:43)
> [junit4:junit4]    >    at java.lang.reflect.Method.invoke(Method.java:616)
> [junit4:junit4]    >    at com.carrotsearch.randomizedtesting.RandomizedRunner.invoke(RandomizedRunner.java:1995)
> [junit4:junit4]    >    at com.carrotsearch.randomizedtesting.RandomizedRunner.access$1100(RandomizedRunner.java:132)
> [junit4:junit4]    >    at com.carrotsearch.randomizedtesting.RandomizedRunner$6.evaluate(RandomizedRunner.java:818)
> [junit4:junit4]    >    at com.carrotsearch.randomizedtesting.RandomizedRunner$7.evaluate(RandomizedRunner.java:877)
> [junit4:junit4]    >    at com.carrotsearch.randomizedtesting.RandomizedRunner$8.evaluate(RandomizedRunner.java:891)
> [junit4:junit4]    >    at org.apache.lucene.util.TestRuleSetupTeardownChained$1.evaluate(TestRuleSetupTeardownChained.java:50)
> [junit4:junit4]    >    at org.apache.lucene.util.TestRuleFieldCacheSanity$1.evaluate(TestRuleFieldCacheSanity.java:32)
> [junit4:junit4]    >    at org.apache.lucene.util.AbstractBeforeAfterRule$1.evaluate(AbstractBeforeAfterRule.java:45)
> [junit4:junit4]    >    at com.carrotsearch.randomizedtesting.rules.SystemPropertiesInvariantRule$1.evaluate(SystemPropertiesInvariantRule.java:55)
> [junit4:junit4]    >    at org.apache.lucene.util.TestRuleReportUncaughtExceptions$1.evaluate(TestRuleReportUncaughtExceptions.java:68)
> [junit4:junit4]    >    at org.apache.lucene.util.TestRuleThreadAndTestName$1.evaluate(TestRuleThreadAndTestName.java:48)
> [junit4:junit4]    >    at org.apache.lucene.util.TestRuleIgnoreAfterMaxFailures$1.evaluate(TestRuleIgnoreAfterMaxFailures.java:70)
> [junit4:junit4]    >    at org.apache.lucene.util.TestRuleMarkFailure$1.evaluate(TestRuleMarkFailure.java:48)
> [junit4:junit4]    >    at com.carrotsearch.randomizedtesting.RandomizedRunner.runSingleTest(RandomizedRunner.java:825)
> [junit4:junit4]    >    at com.carrotsearch.randomizedtesting.RandomizedRunner.access$700(RandomizedRunner.java:132)
> [junit4:junit4]    >    at com.carrotsearch.randomizedtesting.RandomizedRunner$3$1.run(RandomizedRunner.java:671)
> [junit4:junit4]    >    at com.carrotsearch.randomizedtesting.RandomizedRunner$3.evaluate(RandomizedRunner.java:697)
> [junit4:junit4]    >    at com.carrotsearch.randomizedtesting.RandomizedRunner$4.evaluate(RandomizedRunner.java:736)
> [junit4:junit4]    >    at com.carrotsearch.randomizedtesting.RandomizedRunner$5.evaluate(RandomizedRunner.java:747)
> [junit4:junit4]    >    at org.apache.lucene.util.AbstractBeforeAfterRule$1.evaluate(AbstractBeforeAfterRule.java:45)
> [junit4:junit4]    >    at org.apache.lucene.util.TestRuleReportUncaughtExceptions$1.evaluate(TestRuleReportUncaughtExceptions.java:68)
> [junit4:junit4]    >    at org.apache.lucene.util.TestRuleStoreClassName$1.evaluate(TestRuleStoreClassName.java:38)
> [junit4:junit4]    >    at org.apache.lucene.util.TestRuleIcuHack$1.evaluate(TestRuleIcuHack.java:51)
> [junit4:junit4]    >    at com.carrotsearch.randomizedtesting.rules.SystemPropertiesInvariantRule$1.evaluate(SystemPropertiesInvariantRule.java:55)
> [junit4:junit4]    >
> [junit4:junit4]   2> NOTE: reproduce with: ant test  -Dtestcase=TestPostingsFormat -Dtests.method=test -Dtests.seed=6CE91EC09338D64D -Dtests.multiplier=3 -Dtests.slow=true -Dtests.locale=cs -Dtests.timezone=America/Maceio -Dtests.file.encoding=ISO8859-1
> [junit4:junit4]   2>
> [junit4:junit4]    > (@AfterClass output)
> [junit4:junit4]   2> NOTE: test params are: codec=SimpleText, sim=RandomSimilarityProvider(queryNorm=true,coord=true): {}, locale=cs, timezone=America/Maceio
> [junit4:junit4]   2> NOTE: FreeBSD 9.0-RELEASE amd64/Sun Microsystems Inc. 1.6.0_32 (64-bit)/cpus=16,threads=1,free=59754240,total=477233152
> [junit4:junit4]   2> NOTE: All tests run in this JVM: [TestPayloads, Nested1, TestUniqueTermCount, TestDocTermOrds, TestBytesRefHash, TestSubScorerFreqs, TestSimpleExplanations, TestCloseableThreadLocal, TestBinaryTerms, TestAutomatonQueryUnicode, MultiCollectorTest, TestConcurrentMergeScheduler, TestFieldMaskingSpanQuery, TestToken, TestIOUtils, TestCollectionUtil, TestCodecs, TestIntsRef, TestIndexInput, TestPrefixRandom, TestPersistentSnapshotDeletionPolicy, TestAutomatonQuery, TestBooleanOr, TestAttributeSource, TestPerFieldPostingsFormat, TestThreadedForceMerge, TestIndexWriterOnDiskFull, TestCachingWrapperFilter, TestBasics, TestSentinelIntSet, TestFieldCacheSanityChecker, TestRamUsageEstimator, TestBinaryDocument, Test10KPulsings, TestPerSegmentDeletes, TestExplanations, TestReuseDocsEnum, TestForTooMuchCloning, TestIsCurrent, TestWildcard, TestSegmentMerger, TestDateTools, TestRollingBuffer, TestPrefixFilter, Nested1, Nested2, Nested3, TestDoc, TestNumericRangeQuery32, TestTopDocsMerge, TestQueryWrapperFilter, TestTopScoreDocCollector, TestDocValuesScoring, TestCompiledAutomaton, TestLookaheadTokenFilter, TestSegmentTermDocs, TestDocValuesTypeCompatibility, TestTermVectorsWriter, TestDocCount, TestPhrasePrefixQuery, TestForceMergeForever, Before3, Before3, TestSameTokenSamePosition, TestNamedSPILoader, TestNumericRangeQuery64, TestIndexWriterMergePolicy, TestConsistentFieldNumbers, TestRamUsageEstimatorOnWildAnimals, TestBitUtil, TestMinimize, TestSimilarity, TestDocIdSet, TestHugeRamFile, TestRAMDirectory, TestSimpleSearchEquivalence, TestDirectoryReader, TestSpanMultiTermQueryWrapper, TestCrash, TestIndexWriterWithThreads, TestByteSlices, TestDeletionPolicy, TestAtomicUpdate, TestIndexWriterMerging, TestLucene40PostingsReader, TestOpenBitSet, TestTimeLimitingCollector, TestSearchAfter, TestIndexWriterUnicode, TestIndexWriterDelete, TestBufferedIndexInput, TestPagedBytes, TestWeakIdentityMap, TestTypePromotion, TestSnapshotDeletionPolicy, TestMockAnalyzer, TestDeterminizeLexicon, TestRollingCharBuffer, TestNRTReaderWithThreads, TestStressNRT, TestLockFactory, TestComplexExplanations, TestNumericUtils, TestLevenshteinAutomata, TestMultiValuedNumericRangeQuery, TestDeterminism, TestCharTermAttributeImpl, TestFieldsReader, TestRollingUpdates, TestTransactions, TestFieldCache, TestSpanSearchEquivalence, TestMultiThreadTermVectors, TestSimilarityBase, TestPayloadTermQuery, TestMergeSchedulerExternal, TestPayloadNearQuery, TestPayloadExplanations, TestPrefixCodedTerms, TestDocsAndPositions, TestUnicodeUtil, TestAllFilesHaveCodecHeader, TestParallelAtomicReader, TestBooleanQuery, TestFuzzyQuery, InBeforeClass, InAfterClass, InTestMethod, NonStringProperties, TestIdentityHashSet, TestSpanExplanationsOfNonMatches, TestCheckIndex, TestNearSpansOrdered, TestParallelReaderEmptyIndex, TestDocument, TestFilteredSearch, NestedSetupChain, NestedTeardownChain, Test2BPostings, TestFilterAtomicReader, TestDateFilter, TestSegmentTermEnum, TestBooleanScorer, TestRecyclingByteBlockAllocator, TestCharsRef, TestReaderClosed, TestFieldCacheTermsFilter, TestIndexWriterOnJRECrash, TestDemo, TestSpanFirstQuery, TestBytesRef, TestNoMergePolicy, TestIntBlockCodec, TestVersion, TestIndexWriterLockRelease, TestNoMergeScheduler, TestCachingTokenFilter, TestAssertions, TestTerm, TestPostingsFormat]
> [junit4:junit4]   2>
> [junit4:junit4] Completed on J1 in 59.71s, 1 test, 1 error <<< FAILURES!
> [...truncated 20 lines...]
>
> [...truncated 1222 lines...]
>
> [...truncated 1222 lines...]
>
> [...truncated 1222 lines...]
>
> [...truncated 1222 lines...]
>
> [...truncated 1208 lines...]
> BUILD FAILED
> /usr/home/hudson/hudson-slave/workspace/Lucene-Solr-tests-only-trunk/checkout/build.xml:29: The following error occurred while executing this line:
> /usr/home/hudson/hudson-slave/workspace/Lucene-Solr-tests-only-trunk/checkout/lucene/build.xml:50: The following error occurred while executing this line:
> /usr/home/hudson/hudson-slave/workspace/Lucene-Solr-tests-only-trunk/checkout/lucene/common-build.xml:1094: The following error occurred while executing this line:
> /usr/home/hudson/hudson-slave/workspace/Lucene-Solr-tests-only-trunk/checkout/lucene/common-build.xml:789: There were test failures: 305 suites, 1721 tests, 1 error, 13 ignored (11 assumptions)
>
> Total time: 7 minutes 21 seconds
> Build step 'Execute shell' marked build as failure
> Archiving artifacts
> Recording test results
> Publishing Clover coverage report...
> No Clover report will be published due to a Build Failure
> Email was triggered for: Failure
> Sending email for trigger: Failure
>
>
>
>
> ---------------------------------------------------------------------
> To unsubscribe, e-mail: [hidden email]
> For additional commands, e-mail: [hidden email]



--
lucidimagination.com

---------------------------------------------------------------------
To unsubscribe, e-mail: [hidden email]
For additional commands, e-mail: [hidden email]