[JENKINS] Lucene-Solr-tests-only-trunk-java7 - Build # 1443 - Failure

classic Classic list List threaded Threaded
2 messages Options
Reply | Threaded
Open this post in threaded view
|

[JENKINS] Lucene-Solr-tests-only-trunk-java7 - Build # 1443 - Failure

Apache Jenkins Server-2
Build: https://builds.apache.org/job/Lucene-Solr-tests-only-trunk-java7/1443/

2 tests failed.
REGRESSION:  org.apache.solr.cloud.BasicDistributedZkTest.testDistribSearch

Error Message:
Could not connect to ZooKeeper 127.0.0.1:32919 within 30000 ms

Stack Trace:
java.util.concurrent.TimeoutException: Could not connect to ZooKeeper 127.0.0.1:32919 within 30000 ms
        at org.apache.solr.common.cloud.ConnectionManager.waitForConnected(ConnectionManager.java:124)
        at org.apache.solr.common.cloud.SolrZkClient.<init>(SolrZkClient.java:121)
        at org.apache.solr.common.cloud.SolrZkClient.<init>(SolrZkClient.java:84)
        at org.apache.solr.common.cloud.SolrZkClient.<init>(SolrZkClient.java:65)
        at org.apache.solr.cloud.AbstractZkTestCase.buildZooKeeper(AbstractZkTestCase.java:71)
        at org.apache.solr.cloud.AbstractDistributedZkTestCase.setUp(AbstractDistributedZkTestCase.java:47)
        at org.apache.lucene.util.LuceneTestCaseRunner.runChild(LuceneTestCaseRunner.java:165)
        at org.apache.lucene.util.LuceneTestCaseRunner.runChild(LuceneTestCaseRunner.java:57)


FAILED:  junit.framework.TestSuite.org.apache.solr.cloud.BasicDistributedZkTest

Error Message:
java.lang.AssertionError: ensure your setUp() calls super.setUp() and your tearDown() calls super.tearDown()!!!

Stack Trace:
java.lang.RuntimeException: java.lang.AssertionError: ensure your setUp() calls super.setUp() and your tearDown() calls super.tearDown()!!!
        at org.apache.lucene.util.LuceneTestCase.afterClassLuceneTestCaseJ4(LuceneTestCase.java:405)
        at org.apache.lucene.util.LuceneTestCase.afterClassLuceneTestCaseJ4(LuceneTestCase.java:347)




Build Log (for compile errors):
[...truncated 11465 lines...]



---------------------------------------------------------------------
To unsubscribe, e-mail: [hidden email]
For additional commands, e-mail: [hidden email]

Reply | Threaded
Open this post in threaded view
|

[JENKINS] Lucene-Solr-tests-only-trunk-java7 - Build # 1444 - Still Failing

Apache Jenkins Server-2
Build: https://builds.apache.org/job/Lucene-Solr-tests-only-trunk-java7/1444/

1 tests failed.
FAILED:  org.apache.solr.client.solrj.embedded.LargeVolumeBinaryJettyTest.testMultiThreaded

Error Message:
java.lang.AssertionError: Some threads threw uncaught exceptions!

Stack Trace:
java.lang.RuntimeException: java.lang.AssertionError: Some threads threw uncaught exceptions!
        at org.apache.lucene.util.LuceneTestCase.tearDown(LuceneTestCase.java:657)
        at org.apache.solr.SolrTestCaseJ4.tearDown(SolrTestCaseJ4.java:86)
        at org.apache.lucene.util.LuceneTestCaseRunner.runChild(LuceneTestCaseRunner.java:165)
        at org.apache.lucene.util.LuceneTestCaseRunner.runChild(LuceneTestCaseRunner.java:57)
        at org.apache.lucene.util.LuceneTestCase.checkUncaughtExceptionsAfter(LuceneTestCase.java:685)
        at org.apache.lucene.util.LuceneTestCase.tearDown(LuceneTestCase.java:629)




Build Log (for compile errors):
[...truncated 12599 lines...]



---------------------------------------------------------------------
To unsubscribe, e-mail: [hidden email]
For additional commands, e-mail: [hidden email]