[JENKINS] Lucene-Solr-tests-only-trunk-java7 - Build # 2035 - Failure

classic Classic list List threaded Threaded
4 messages Options
Reply | Threaded
Open this post in threaded view
|

[JENKINS] Lucene-Solr-tests-only-trunk-java7 - Build # 2035 - Failure

Apache Jenkins Server-2
Build: https://builds.apache.org/job/Lucene-Solr-tests-only-trunk-java7/2035/

1 tests failed.
REGRESSION:  org.apache.lucene.analysis.util.TestCharTokenizers.testCrossPlaneNormalization

Error Message:
Uncaught exception by thread: Thread[Thread-642,5,]

Stack Trace:
org.apache.lucene.util.UncaughtExceptionsRule$UncaughtExceptionsInBackgroundThread: Uncaught exception by thread: Thread[Thread-642,5,]
        at org.apache.lucene.util.UncaughtExceptionsRule$1.evaluate(UncaughtExceptionsRule.java:60)
        at org.apache.lucene.util.LuceneTestCase$RememberThreadRule$1.evaluate(LuceneTestCase.java:618)
        at org.junit.rules.RunRules.evaluate(RunRules.java:18)
        at org.junit.runners.ParentRunner.runLeaf(ParentRunner.java:263)
        at org.junit.runners.BlockJUnit4ClassRunner.runChild(BlockJUnit4ClassRunner.java:68)
        at org.apache.lucene.util.LuceneTestCaseRunner.runChild(LuceneTestCaseRunner.java:164)
        at org.apache.lucene.util.LuceneTestCaseRunner.runChild(LuceneTestCaseRunner.java:57)
        at org.junit.runners.ParentRunner$3.run(ParentRunner.java:231)
        at org.junit.runners.ParentRunner$1.schedule(ParentRunner.java:60)
        at org.junit.runners.ParentRunner.runChildren(ParentRunner.java:229)
        at org.junit.runners.ParentRunner.access$000(ParentRunner.java:50)
        at org.junit.runners.ParentRunner$2.evaluate(ParentRunner.java:222)
        at org.junit.internal.runners.statements.RunBefores.evaluate(RunBefores.java:28)
        at org.junit.internal.runners.statements.RunAfters.evaluate(RunAfters.java:30)
        at org.apache.lucene.util.UncaughtExceptionsRule$1.evaluate(UncaughtExceptionsRule.java:51)
        at org.apache.lucene.util.StoreClassNameRule$1.evaluate(StoreClassNameRule.java:21)
        at org.apache.lucene.util.SystemPropertiesInvariantRule$1.evaluate(SystemPropertiesInvariantRule.java:22)
        at org.junit.rules.RunRules.evaluate(RunRules.java:18)
        at org.junit.runners.ParentRunner.run(ParentRunner.java:300)
        at junit.framework.JUnit4TestAdapter.run(JUnit4TestAdapter.java:39)
        at org.apache.tools.ant.taskdefs.optional.junit.JUnitTestRunner.run(JUnitTestRunner.java:420)
        at org.apache.tools.ant.taskdefs.optional.junit.JUnitTestRunner.launch(JUnitTestRunner.java:911)
        at org.apache.tools.ant.taskdefs.optional.junit.JUnitTestRunner.main(JUnitTestRunner.java:743)
Caused by: org.junit.ComparisonFailure: term 0 expected:<δ[δδδδδδδδδδδδδδδ]> but was:<δ[]>
        at org.junit.Assert.assertEquals(Assert.java:125)
        at org.apache.lucene.analysis.BaseTokenStreamTestCase.assertTokenStreamContents(BaseTokenStreamTestCase.java:144)
        at org.apache.lucene.analysis.BaseTokenStreamTestCase.checkRandomData(BaseTokenStreamTestCase.java:551)
        at org.apache.lucene.analysis.BaseTokenStreamTestCase.access$000(BaseTokenStreamTestCase.java:49)
        at org.apache.lucene.analysis.BaseTokenStreamTestCase$AnalysisThread.run(BaseTokenStreamTestCase.java:334)




Build Log (for compile errors):
[...truncated 3769 lines...]




---------------------------------------------------------------------
To unsubscribe, e-mail: [hidden email]
For additional commands, e-mail: [hidden email]
Reply | Threaded
Open this post in threaded view
|

[JENKINS] Lucene-Solr-tests-only-trunk-java7 - Build # 2036 - Still Failing

Apache Jenkins Server-2
Build: https://builds.apache.org/job/Lucene-Solr-tests-only-trunk-java7/2036/

1 tests failed.
FAILED:  org.apache.lucene.analysis.icu.TestICUFoldingFilter.testRandomStrings

Error Message:
Uncaught exception by thread: Thread[Thread-1,5,]

Stack Trace:
org.apache.lucene.util.UncaughtExceptionsRule$UncaughtExceptionsInBackgroundThread: Uncaught exception by thread: Thread[Thread-1,5,]
        at org.apache.lucene.util.UncaughtExceptionsRule$1.evaluate(UncaughtExceptionsRule.java:60)
        at org.apache.lucene.util.LuceneTestCase$RememberThreadRule$1.evaluate(LuceneTestCase.java:618)
        at org.junit.rules.RunRules.evaluate(RunRules.java:18)
        at org.junit.runners.ParentRunner.runLeaf(ParentRunner.java:263)
        at org.junit.runners.BlockJUnit4ClassRunner.runChild(BlockJUnit4ClassRunner.java:68)
        at org.apache.lucene.util.LuceneTestCaseRunner.runChild(LuceneTestCaseRunner.java:164)
        at org.apache.lucene.util.LuceneTestCaseRunner.runChild(LuceneTestCaseRunner.java:57)
        at org.junit.runners.ParentRunner$3.run(ParentRunner.java:231)
        at org.junit.runners.ParentRunner$1.schedule(ParentRunner.java:60)
        at org.junit.runners.ParentRunner.runChildren(ParentRunner.java:229)
        at org.junit.runners.ParentRunner.access$000(ParentRunner.java:50)
        at org.junit.runners.ParentRunner$2.evaluate(ParentRunner.java:222)
        at org.junit.internal.runners.statements.RunBefores.evaluate(RunBefores.java:28)
        at org.junit.internal.runners.statements.RunAfters.evaluate(RunAfters.java:30)
        at org.apache.lucene.util.UncaughtExceptionsRule$1.evaluate(UncaughtExceptionsRule.java:51)
        at org.apache.lucene.util.StoreClassNameRule$1.evaluate(StoreClassNameRule.java:21)
        at org.apache.lucene.util.SystemPropertiesInvariantRule$1.evaluate(SystemPropertiesInvariantRule.java:22)
        at org.junit.rules.RunRules.evaluate(RunRules.java:18)
        at org.junit.runners.ParentRunner.run(ParentRunner.java:300)
        at junit.framework.JUnit4TestAdapter.run(JUnit4TestAdapter.java:39)
        at org.apache.tools.ant.taskdefs.optional.junit.JUnitTestRunner.run(JUnitTestRunner.java:420)
        at org.apache.tools.ant.taskdefs.optional.junit.JUnitTestRunner.launch(JUnitTestRunner.java:911)
        at org.apache.tools.ant.taskdefs.optional.junit.JUnitTestRunner.main(JUnitTestRunner.java:743)
Caused by: org.junit.ComparisonFailure: term 0 expected:<[]k> but was:<[]k>
        at org.junit.Assert.assertEquals(Assert.java:125)
        at org.apache.lucene.analysis.BaseTokenStreamTestCase.assertTokenStreamContents(BaseTokenStreamTestCase.java:144)
        at org.apache.lucene.analysis.BaseTokenStreamTestCase.checkRandomData(BaseTokenStreamTestCase.java:551)
        at org.apache.lucene.analysis.BaseTokenStreamTestCase.access$000(BaseTokenStreamTestCase.java:49)
        at org.apache.lucene.analysis.BaseTokenStreamTestCase$AnalysisThread.run(BaseTokenStreamTestCase.java:334)




Build Log (for compile errors):
[...truncated 3950 lines...]




---------------------------------------------------------------------
To unsubscribe, e-mail: [hidden email]
For additional commands, e-mail: [hidden email]
Reply | Threaded
Open this post in threaded view
|

[JENKINS] Lucene-Solr-tests-only-trunk-java7 - Build # 2037 - Still Failing

Apache Jenkins Server-2
Build: https://builds.apache.org/job/Lucene-Solr-tests-only-trunk-java7/2037/

1 tests failed.
FAILED:  org.apache.lucene.analysis.icu.TestICUFoldingFilter.testRandomStrings

Error Message:
Uncaught exception by thread: Thread[Thread-1,5,]

Stack Trace:
org.apache.lucene.util.UncaughtExceptionsRule$UncaughtExceptionsInBackgroundThread: Uncaught exception by thread: Thread[Thread-1,5,]
        at org.apache.lucene.util.UncaughtExceptionsRule$1.evaluate(UncaughtExceptionsRule.java:60)
        at org.apache.lucene.util.LuceneTestCase$RememberThreadRule$1.evaluate(LuceneTestCase.java:618)
        at org.junit.rules.RunRules.evaluate(RunRules.java:18)
        at org.junit.runners.ParentRunner.runLeaf(ParentRunner.java:263)
        at org.junit.runners.BlockJUnit4ClassRunner.runChild(BlockJUnit4ClassRunner.java:68)
        at org.apache.lucene.util.LuceneTestCaseRunner.runChild(LuceneTestCaseRunner.java:164)
        at org.apache.lucene.util.LuceneTestCaseRunner.runChild(LuceneTestCaseRunner.java:57)
        at org.junit.runners.ParentRunner$3.run(ParentRunner.java:231)
        at org.junit.runners.ParentRunner$1.schedule(ParentRunner.java:60)
        at org.junit.runners.ParentRunner.runChildren(ParentRunner.java:229)
        at org.junit.runners.ParentRunner.access$000(ParentRunner.java:50)
        at org.junit.runners.ParentRunner$2.evaluate(ParentRunner.java:222)
        at org.junit.internal.runners.statements.RunBefores.evaluate(RunBefores.java:28)
        at org.junit.internal.runners.statements.RunAfters.evaluate(RunAfters.java:30)
        at org.apache.lucene.util.UncaughtExceptionsRule$1.evaluate(UncaughtExceptionsRule.java:51)
        at org.apache.lucene.util.StoreClassNameRule$1.evaluate(StoreClassNameRule.java:21)
        at org.apache.lucene.util.SystemPropertiesInvariantRule$1.evaluate(SystemPropertiesInvariantRule.java:22)
        at org.junit.rules.RunRules.evaluate(RunRules.java:18)
        at org.junit.runners.ParentRunner.run(ParentRunner.java:300)
        at junit.framework.JUnit4TestAdapter.run(JUnit4TestAdapter.java:39)
        at org.apache.tools.ant.taskdefs.optional.junit.JUnitTestRunner.run(JUnitTestRunner.java:420)
        at org.apache.tools.ant.taskdefs.optional.junit.JUnitTestRunner.launch(JUnitTestRunner.java:911)
        at org.apache.tools.ant.taskdefs.optional.junit.JUnitTestRunner.main(JUnitTestRunner.java:743)
Caused by: org.junit.ComparisonFailure: term 0 expected:<[]vл䡭ꮄa桸t> but was:<[]vл䡭ꮄa桸t>
        at org.junit.Assert.assertEquals(Assert.java:125)
        at org.apache.lucene.analysis.BaseTokenStreamTestCase.assertTokenStreamContents(BaseTokenStreamTestCase.java:144)
        at org.apache.lucene.analysis.BaseTokenStreamTestCase.checkRandomData(BaseTokenStreamTestCase.java:551)
        at org.apache.lucene.analysis.BaseTokenStreamTestCase.access$000(BaseTokenStreamTestCase.java:49)
        at org.apache.lucene.analysis.BaseTokenStreamTestCase$AnalysisThread.run(BaseTokenStreamTestCase.java:334)




Build Log (for compile errors):
[...truncated 3895 lines...]




---------------------------------------------------------------------
To unsubscribe, e-mail: [hidden email]
For additional commands, e-mail: [hidden email]
Reply | Threaded
Open this post in threaded view
|

Re: [JENKINS] Lucene-Solr-tests-only-trunk-java7 - Build # 2037 - Still Failing

Robert Muir
This is LUCENE-3896. The test should be using MockTokenizer instead of
Whitespace anyway. I'll switch it over.

On Wed, Mar 21, 2012 at 7:29 AM, Apache Jenkins Server
<[hidden email]> wrote:

> Build: https://builds.apache.org/job/Lucene-Solr-tests-only-trunk-java7/2037/
>
> 1 tests failed.
> FAILED:  org.apache.lucene.analysis.icu.TestICUFoldingFilter.testRandomStrings
>
> Error Message:
> Uncaught exception by thread: Thread[Thread-1,5,]
>
> Stack Trace:
> org.apache.lucene.util.UncaughtExceptionsRule$UncaughtExceptionsInBackgroundThread: Uncaught exception by thread: Thread[Thread-1,5,]
>        at org.apache.lucene.util.UncaughtExceptionsRule$1.evaluate(UncaughtExceptionsRule.java:60)
>        at org.apache.lucene.util.LuceneTestCase$RememberThreadRule$1.evaluate(LuceneTestCase.java:618)
>        at org.junit.rules.RunRules.evaluate(RunRules.java:18)
>        at org.junit.runners.ParentRunner.runLeaf(ParentRunner.java:263)
>        at org.junit.runners.BlockJUnit4ClassRunner.runChild(BlockJUnit4ClassRunner.java:68)
>        at org.apache.lucene.util.LuceneTestCaseRunner.runChild(LuceneTestCaseRunner.java:164)
>        at org.apache.lucene.util.LuceneTestCaseRunner.runChild(LuceneTestCaseRunner.java:57)
>        at org.junit.runners.ParentRunner$3.run(ParentRunner.java:231)
>        at org.junit.runners.ParentRunner$1.schedule(ParentRunner.java:60)
>        at org.junit.runners.ParentRunner.runChildren(ParentRunner.java:229)
>        at org.junit.runners.ParentRunner.access$000(ParentRunner.java:50)
>        at org.junit.runners.ParentRunner$2.evaluate(ParentRunner.java:222)
>        at org.junit.internal.runners.statements.RunBefores.evaluate(RunBefores.java:28)
>        at org.junit.internal.runners.statements.RunAfters.evaluate(RunAfters.java:30)
>        at org.apache.lucene.util.UncaughtExceptionsRule$1.evaluate(UncaughtExceptionsRule.java:51)
>        at org.apache.lucene.util.StoreClassNameRule$1.evaluate(StoreClassNameRule.java:21)
>        at org.apache.lucene.util.SystemPropertiesInvariantRule$1.evaluate(SystemPropertiesInvariantRule.java:22)
>        at org.junit.rules.RunRules.evaluate(RunRules.java:18)
>        at org.junit.runners.ParentRunner.run(ParentRunner.java:300)
>        at junit.framework.JUnit4TestAdapter.run(JUnit4TestAdapter.java:39)
>        at org.apache.tools.ant.taskdefs.optional.junit.JUnitTestRunner.run(JUnitTestRunner.java:420)
>        at org.apache.tools.ant.taskdefs.optional.junit.JUnitTestRunner.launch(JUnitTestRunner.java:911)
>        at org.apache.tools.ant.taskdefs.optional.junit.JUnitTestRunner.main(JUnitTestRunner.java:743)
> Caused by: org.junit.ComparisonFailure: term 0 expected:<[]vл䡭ꮄa桸t> but was:<[]vл䡭ꮄa桸t>
>        at org.junit.Assert.assertEquals(Assert.java:125)
>        at org.apache.lucene.analysis.BaseTokenStreamTestCase.assertTokenStreamContents(BaseTokenStreamTestCase.java:144)
>        at org.apache.lucene.analysis.BaseTokenStreamTestCase.checkRandomData(BaseTokenStreamTestCase.java:551)
>        at org.apache.lucene.analysis.BaseTokenStreamTestCase.access$000(BaseTokenStreamTestCase.java:49)
>        at org.apache.lucene.analysis.BaseTokenStreamTestCase$AnalysisThread.run(BaseTokenStreamTestCase.java:334)
>
>
>
>
> Build Log (for compile errors):
> [...truncated 3895 lines...]
>
>
>
>
> ---------------------------------------------------------------------
> To unsubscribe, e-mail: [hidden email]
> For additional commands, e-mail: [hidden email]



--
lucidimagination.com

---------------------------------------------------------------------
To unsubscribe, e-mail: [hidden email]
For additional commands, e-mail: [hidden email]