[JENKINS] Lucene-trunk-Linux-Java7-64-test-only - Build # 51118 - Failure!

classic Classic list List threaded Threaded
3 messages Options
Reply | Threaded
Open this post in threaded view
|

[JENKINS] Lucene-trunk-Linux-Java7-64-test-only - Build # 51118 - Failure!

builder
Build: builds.flonkings.com/job/Lucene-trunk-Linux-Java7-64-test-only/51118/

3 tests failed.
FAILED:  junit.framework.TestSuite.org.apache.lucene.search.TestMultiTermConstantScore

Error Message:
count should be <= maxMergeCount (= 1)

Stack Trace:
java.lang.IllegalArgumentException: count should be <= maxMergeCount (= 1)
        at __randomizedtesting.SeedInfo.seed([491FB3F847D4B1F7]:0)
        at org.apache.lucene.index.ConcurrentMergeScheduler.setMaxThreadCount(ConcurrentMergeScheduler.java:91)
        at org.apache.lucene.util._TestUtil.reduceOpenFiles(_TestUtil.java:773)
        at org.apache.lucene.search.BaseTestRangeFilter.build(BaseTestRangeFilter.java:140)
        at org.apache.lucene.search.BaseTestRangeFilter.beforeClassBaseTestRangeFilter(BaseTestRangeFilter.java:102)
        at sun.reflect.NativeMethodAccessorImpl.invoke0(Native Method)
        at sun.reflect.NativeMethodAccessorImpl.invoke(NativeMethodAccessorImpl.java:57)
        at sun.reflect.DelegatingMethodAccessorImpl.invoke(DelegatingMethodAccessorImpl.java:43)
        at java.lang.reflect.Method.invoke(Method.java:601)
        at com.carrotsearch.randomizedtesting.RandomizedRunner.invoke(RandomizedRunner.java:1559)
        at com.carrotsearch.randomizedtesting.RandomizedRunner.access$600(RandomizedRunner.java:79)
        at com.carrotsearch.randomizedtesting.RandomizedRunner$4.evaluate(RandomizedRunner.java:677)
        at com.carrotsearch.randomizedtesting.RandomizedRunner$5.evaluate(RandomizedRunner.java:693)
        at org.apache.lucene.util.AbstractBeforeAfterRule$1.evaluate(AbstractBeforeAfterRule.java:46)
        at org.apache.lucene.util.TestRuleStoreClassName$1.evaluate(TestRuleStoreClassName.java:42)
        at com.carrotsearch.randomizedtesting.rules.SystemPropertiesInvariantRule$1.evaluate(SystemPropertiesInvariantRule.java:55)
        at com.carrotsearch.randomizedtesting.rules.NoShadowingOrOverridesOnMethodsRule$1.evaluate(NoShadowingOrOverridesOnMethodsRule.java:39)
        at com.carrotsearch.randomizedtesting.rules.NoShadowingOrOverridesOnMethodsRule$1.evaluate(NoShadowingOrOverridesOnMethodsRule.java:39)
        at com.carrotsearch.randomizedtesting.rules.StatementAdapter.evaluate(StatementAdapter.java:36)
        at org.apache.lucene.util.TestRuleAssertionsRequired$1.evaluate(TestRuleAssertionsRequired.java:43)
        at org.apache.lucene.util.TestRuleMarkFailure$1.evaluate(TestRuleMarkFailure.java:48)
        at org.apache.lucene.util.TestRuleIgnoreAfterMaxFailures$1.evaluate(TestRuleIgnoreAfterMaxFailures.java:70)
        at org.apache.lucene.util.TestRuleIgnoreTestSuites$1.evaluate(TestRuleIgnoreTestSuites.java:55)
        at com.carrotsearch.randomizedtesting.rules.StatementAdapter.evaluate(StatementAdapter.java:36)
        at com.carrotsearch.randomizedtesting.ThreadLeakControl$StatementRunner.run(ThreadLeakControl.java:358)
        at java.lang.Thread.run(Thread.java:722)


FAILED:  junit.framework.TestSuite.org.apache.lucene.search.TestMultiTermConstantScore

Error Message:


Stack Trace:
java.lang.NullPointerException
        at __randomizedtesting.SeedInfo.seed([491FB3F847D4B1F7]:0)
        at org.apache.lucene.search.TestMultiTermConstantScore.afterClass(TestMultiTermConstantScore.java:81)
        at sun.reflect.NativeMethodAccessorImpl.invoke0(Native Method)
        at sun.reflect.NativeMethodAccessorImpl.invoke(NativeMethodAccessorImpl.java:57)
        at sun.reflect.DelegatingMethodAccessorImpl.invoke(DelegatingMethodAccessorImpl.java:43)
        at java.lang.reflect.Method.invoke(Method.java:601)
        at com.carrotsearch.randomizedtesting.RandomizedRunner.invoke(RandomizedRunner.java:1559)
        at com.carrotsearch.randomizedtesting.RandomizedRunner.access$600(RandomizedRunner.java:79)
        at com.carrotsearch.randomizedtesting.RandomizedRunner$5.evaluate(RandomizedRunner.java:700)
        at org.apache.lucene.util.AbstractBeforeAfterRule$1.evaluate(AbstractBeforeAfterRule.java:46)
        at org.apache.lucene.util.TestRuleStoreClassName$1.evaluate(TestRuleStoreClassName.java:42)
        at com.carrotsearch.randomizedtesting.rules.SystemPropertiesInvariantRule$1.evaluate(SystemPropertiesInvariantRule.java:55)
        at com.carrotsearch.randomizedtesting.rules.NoShadowingOrOverridesOnMethodsRule$1.evaluate(NoShadowingOrOverridesOnMethodsRule.java:39)
        at com.carrotsearch.randomizedtesting.rules.NoShadowingOrOverridesOnMethodsRule$1.evaluate(NoShadowingOrOverridesOnMethodsRule.java:39)
        at com.carrotsearch.randomizedtesting.rules.StatementAdapter.evaluate(StatementAdapter.java:36)
        at org.apache.lucene.util.TestRuleAssertionsRequired$1.evaluate(TestRuleAssertionsRequired.java:43)
        at org.apache.lucene.util.TestRuleMarkFailure$1.evaluate(TestRuleMarkFailure.java:48)
        at org.apache.lucene.util.TestRuleIgnoreAfterMaxFailures$1.evaluate(TestRuleIgnoreAfterMaxFailures.java:70)
        at org.apache.lucene.util.TestRuleIgnoreTestSuites$1.evaluate(TestRuleIgnoreTestSuites.java:55)
        at com.carrotsearch.randomizedtesting.rules.StatementAdapter.evaluate(StatementAdapter.java:36)
        at com.carrotsearch.randomizedtesting.ThreadLeakControl$StatementRunner.run(ThreadLeakControl.java:358)
        at java.lang.Thread.run(Thread.java:722)


FAILED:  junit.framework.TestSuite.org.apache.lucene.search.TestMultiTermConstantScore

Error Message:


Stack Trace:
java.lang.NullPointerException
        at __randomizedtesting.SeedInfo.seed([491FB3F847D4B1F7]:0)
        at org.apache.lucene.search.BaseTestRangeFilter.afterClassBaseTestRangeFilter(BaseTestRangeFilter.java:108)
        at sun.reflect.NativeMethodAccessorImpl.invoke0(Native Method)
        at sun.reflect.NativeMethodAccessorImpl.invoke(NativeMethodAccessorImpl.java:57)
        at sun.reflect.DelegatingMethodAccessorImpl.invoke(DelegatingMethodAccessorImpl.java:43)
        at java.lang.reflect.Method.invoke(Method.java:601)
        at com.carrotsearch.randomizedtesting.RandomizedRunner.invoke(RandomizedRunner.java:1559)
        at com.carrotsearch.randomizedtesting.RandomizedRunner.access$600(RandomizedRunner.java:79)
        at com.carrotsearch.randomizedtesting.RandomizedRunner$5.evaluate(RandomizedRunner.java:700)
        at org.apache.lucene.util.AbstractBeforeAfterRule$1.evaluate(AbstractBeforeAfterRule.java:46)
        at org.apache.lucene.util.TestRuleStoreClassName$1.evaluate(TestRuleStoreClassName.java:42)
        at com.carrotsearch.randomizedtesting.rules.SystemPropertiesInvariantRule$1.evaluate(SystemPropertiesInvariantRule.java:55)
        at com.carrotsearch.randomizedtesting.rules.NoShadowingOrOverridesOnMethodsRule$1.evaluate(NoShadowingOrOverridesOnMethodsRule.java:39)
        at com.carrotsearch.randomizedtesting.rules.NoShadowingOrOverridesOnMethodsRule$1.evaluate(NoShadowingOrOverridesOnMethodsRule.java:39)
        at com.carrotsearch.randomizedtesting.rules.StatementAdapter.evaluate(StatementAdapter.java:36)
        at org.apache.lucene.util.TestRuleAssertionsRequired$1.evaluate(TestRuleAssertionsRequired.java:43)
        at org.apache.lucene.util.TestRuleMarkFailure$1.evaluate(TestRuleMarkFailure.java:48)
        at org.apache.lucene.util.TestRuleIgnoreAfterMaxFailures$1.evaluate(TestRuleIgnoreAfterMaxFailures.java:70)
        at org.apache.lucene.util.TestRuleIgnoreTestSuites$1.evaluate(TestRuleIgnoreTestSuites.java:55)
        at com.carrotsearch.randomizedtesting.rules.StatementAdapter.evaluate(StatementAdapter.java:36)
        at com.carrotsearch.randomizedtesting.ThreadLeakControl$StatementRunner.run(ThreadLeakControl.java:358)
        at java.lang.Thread.run(Thread.java:722)




Build Log:
[...truncated 948 lines...]
[junit4:junit4] Suite: org.apache.lucene.search.TestMultiTermConstantScore
[junit4:junit4]   2> NOTE: test params are: codec=FastDecompressionCompressingStoredFields(storedFieldsFormat=CompressingStoredFieldsFormat(compressionMode=FAST_DECOMPRESSION, chunkSize=325), termVectorsFormat=CompressingTermVectorsFormat(compressionMode=FAST_DECOMPRESSION, chunkSize=325)), sim=DefaultSimilarity, locale=fr_CH, timezone=America/Nipigon
[junit4:junit4]   2> NOTE: Linux 3.2.0-26-generic amd64/Oracle Corporation 1.7.0_05 (64-bit)/cpus=8,threads=1,free=104154400,total=264503296
[junit4:junit4]   2> NOTE: All tests run in this JVM: [TestOmitNorms, Test2BDocs, TestLucene41StoredFieldsFormat, TestTopDocsMerge, TestDocValuesWithThreads, TestPackedInts, TestSegmentMerger, TestBitVector, TestDocTermOrdsRewriteMethod, TestTermVectorsFormat, TestCodecHoldsOpenFiles, TestCheckIndex, TestVirtualMethod, TestInPlaceMergeSorter, TestByteBlockPool, TestBooleanQuery, TestSpanExplanationsOfNonMatches, TestStressNRT, TestMixedCodecs, Nested, TestExternalCodecs, TestIOUtils, TestSloppyPhraseQuery, TestOpenBitSet, TestConsistentFieldNumbers, TestMockAnalyzer, TestToken, TestRAMDirectory, TestCharTermAttributeImpl, TestMultiTermConstantScore]
[junit4:junit4]   2> NOTE: reproduce with: ant test  -Dtestcase=TestMultiTermConstantScore -Dtests.seed=491FB3F847D4B1F7 -Dtests.slow=true -Dtests.locale=fr_CH -Dtests.timezone=America/Nipigon -Dtests.file.encoding=UTF-8
[junit4:junit4] ERROR   0.00s J4 | TestMultiTermConstantScore (suite) <<<
[junit4:junit4]    > Throwable #1: java.lang.IllegalArgumentException: count should be <= maxMergeCount (= 1)
[junit4:junit4]    > at __randomizedtesting.SeedInfo.seed([491FB3F847D4B1F7]:0)
[junit4:junit4]    > at org.apache.lucene.index.ConcurrentMergeScheduler.setMaxThreadCount(ConcurrentMergeScheduler.java:91)
[junit4:junit4]    > at org.apache.lucene.util._TestUtil.reduceOpenFiles(_TestUtil.java:773)
[junit4:junit4]    > at org.apache.lucene.search.BaseTestRangeFilter.build(BaseTestRangeFilter.java:140)
[junit4:junit4]    > at org.apache.lucene.search.BaseTestRangeFilter.beforeClassBaseTestRangeFilter(BaseTestRangeFilter.java:102)
[junit4:junit4]    > at java.lang.Thread.run(Thread.java:722)Throwable #2: java.lang.NullPointerException
[junit4:junit4]    > at __randomizedtesting.SeedInfo.seed([491FB3F847D4B1F7]:0)
[junit4:junit4]    > at org.apache.lucene.search.TestMultiTermConstantScore.afterClass(TestMultiTermConstantScore.java:81)
[junit4:junit4]    > at java.lang.Thread.run(Thread.java:722)Throwable #3: java.lang.NullPointerException
[junit4:junit4]    > at __randomizedtesting.SeedInfo.seed([491FB3F847D4B1F7]:0)
[junit4:junit4]    > at org.apache.lucene.search.BaseTestRangeFilter.afterClassBaseTestRangeFilter(BaseTestRangeFilter.java:108)
[junit4:junit4]    > at java.lang.Thread.run(Thread.java:722)
[junit4:junit4] Completed on J4 in 0.27s, 0 tests, 3 errors <<< FAILURES!

[...truncated 313 lines...]
BUILD FAILED
/var/lib/jenkins/workspace/Lucene-trunk-Linux-Java7-64-test-only/checkout/lucene/build.xml:49: The following error occurred while executing this line:
/var/lib/jenkins/workspace/Lucene-trunk-Linux-Java7-64-test-only/checkout/lucene/common-build.xml:1245: The following error occurred while executing this line:
/var/lib/jenkins/workspace/Lucene-trunk-Linux-Java7-64-test-only/checkout/lucene/common-build.xml:889: There were test failures: 356 suites, 2243 tests, 3 suite-level errors, 45 ignored (32 assumptions)

Total time: 4 minutes 2 seconds
Build step 'Invoke Ant' marked build as failure
Archiving artifacts
Recording test results
Email was triggered for: Failure
Sending email for trigger: Failure





---------------------------------------------------------------------
To unsubscribe, e-mail: [hidden email]
For additional commands, e-mail: [hidden email]
Reply | Threaded
Open this post in threaded view
|

Re: [JENKINS] Lucene-trunk-Linux-Java7-64-test-only - Build # 51118 - Failure!

Robert Muir
ill look into this... its https://issues.apache.org/jira/browse/LUCENE-5080 :)

On Fri, Jun 28, 2013 at 4:01 PM, <[hidden email]> wrote:
Build: builds.flonkings.com/job/Lucene-trunk-Linux-Java7-64-test-only/51118/

3 tests failed.
FAILED:  junit.framework.TestSuite.org.apache.lucene.search.TestMultiTermConstantScore

Error Message:
count should be <= maxMergeCount (= 1)

Stack Trace:
java.lang.IllegalArgumentException: count should be <= maxMergeCount (= 1)
        at __randomizedtesting.SeedInfo.seed([491FB3F847D4B1F7]:0)
        at org.apache.lucene.index.ConcurrentMergeScheduler.setMaxThreadCount(ConcurrentMergeScheduler.java:91)
        at org.apache.lucene.util._TestUtil.reduceOpenFiles(_TestUtil.java:773)
        at org.apache.lucene.search.BaseTestRangeFilter.build(BaseTestRangeFilter.java:140)
        at org.apache.lucene.search.BaseTestRangeFilter.beforeClassBaseTestRangeFilter(BaseTestRangeFilter.java:102)
        at sun.reflect.NativeMethodAccessorImpl.invoke0(Native Method)
        at sun.reflect.NativeMethodAccessorImpl.invoke(NativeMethodAccessorImpl.java:57)
        at sun.reflect.DelegatingMethodAccessorImpl.invoke(DelegatingMethodAccessorImpl.java:43)
        at java.lang.reflect.Method.invoke(Method.java:601)
        at com.carrotsearch.randomizedtesting.RandomizedRunner.invoke(RandomizedRunner.java:1559)
        at com.carrotsearch.randomizedtesting.RandomizedRunner.access$600(RandomizedRunner.java:79)
        at com.carrotsearch.randomizedtesting.RandomizedRunner$4.evaluate(RandomizedRunner.java:677)
        at com.carrotsearch.randomizedtesting.RandomizedRunner$5.evaluate(RandomizedRunner.java:693)
        at org.apache.lucene.util.AbstractBeforeAfterRule$1.evaluate(AbstractBeforeAfterRule.java:46)
        at org.apache.lucene.util.TestRuleStoreClassName$1.evaluate(TestRuleStoreClassName.java:42)
        at com.carrotsearch.randomizedtesting.rules.SystemPropertiesInvariantRule$1.evaluate(SystemPropertiesInvariantRule.java:55)
        at com.carrotsearch.randomizedtesting.rules.NoShadowingOrOverridesOnMethodsRule$1.evaluate(NoShadowingOrOverridesOnMethodsRule.java:39)
        at com.carrotsearch.randomizedtesting.rules.NoShadowingOrOverridesOnMethodsRule$1.evaluate(NoShadowingOrOverridesOnMethodsRule.java:39)
        at com.carrotsearch.randomizedtesting.rules.StatementAdapter.evaluate(StatementAdapter.java:36)
        at org.apache.lucene.util.TestRuleAssertionsRequired$1.evaluate(TestRuleAssertionsRequired.java:43)
        at org.apache.lucene.util.TestRuleMarkFailure$1.evaluate(TestRuleMarkFailure.java:48)
        at org.apache.lucene.util.TestRuleIgnoreAfterMaxFailures$1.evaluate(TestRuleIgnoreAfterMaxFailures.java:70)
        at org.apache.lucene.util.TestRuleIgnoreTestSuites$1.evaluate(TestRuleIgnoreTestSuites.java:55)
        at com.carrotsearch.randomizedtesting.rules.StatementAdapter.evaluate(StatementAdapter.java:36)
        at com.carrotsearch.randomizedtesting.ThreadLeakControl$StatementRunner.run(ThreadLeakControl.java:358)
        at java.lang.Thread.run(Thread.java:722)


FAILED:  junit.framework.TestSuite.org.apache.lucene.search.TestMultiTermConstantScore

Error Message:


Stack Trace:
java.lang.NullPointerException
        at __randomizedtesting.SeedInfo.seed([491FB3F847D4B1F7]:0)
        at org.apache.lucene.search.TestMultiTermConstantScore.afterClass(TestMultiTermConstantScore.java:81)
        at sun.reflect.NativeMethodAccessorImpl.invoke0(Native Method)
        at sun.reflect.NativeMethodAccessorImpl.invoke(NativeMethodAccessorImpl.java:57)
        at sun.reflect.DelegatingMethodAccessorImpl.invoke(DelegatingMethodAccessorImpl.java:43)
        at java.lang.reflect.Method.invoke(Method.java:601)
        at com.carrotsearch.randomizedtesting.RandomizedRunner.invoke(RandomizedRunner.java:1559)
        at com.carrotsearch.randomizedtesting.RandomizedRunner.access$600(RandomizedRunner.java:79)
        at com.carrotsearch.randomizedtesting.RandomizedRunner$5.evaluate(RandomizedRunner.java:700)
        at org.apache.lucene.util.AbstractBeforeAfterRule$1.evaluate(AbstractBeforeAfterRule.java:46)
        at org.apache.lucene.util.TestRuleStoreClassName$1.evaluate(TestRuleStoreClassName.java:42)
        at com.carrotsearch.randomizedtesting.rules.SystemPropertiesInvariantRule$1.evaluate(SystemPropertiesInvariantRule.java:55)
        at com.carrotsearch.randomizedtesting.rules.NoShadowingOrOverridesOnMethodsRule$1.evaluate(NoShadowingOrOverridesOnMethodsRule.java:39)
        at com.carrotsearch.randomizedtesting.rules.NoShadowingOrOverridesOnMethodsRule$1.evaluate(NoShadowingOrOverridesOnMethodsRule.java:39)
        at com.carrotsearch.randomizedtesting.rules.StatementAdapter.evaluate(StatementAdapter.java:36)
        at org.apache.lucene.util.TestRuleAssertionsRequired$1.evaluate(TestRuleAssertionsRequired.java:43)
        at org.apache.lucene.util.TestRuleMarkFailure$1.evaluate(TestRuleMarkFailure.java:48)
        at org.apache.lucene.util.TestRuleIgnoreAfterMaxFailures$1.evaluate(TestRuleIgnoreAfterMaxFailures.java:70)
        at org.apache.lucene.util.TestRuleIgnoreTestSuites$1.evaluate(TestRuleIgnoreTestSuites.java:55)
        at com.carrotsearch.randomizedtesting.rules.StatementAdapter.evaluate(StatementAdapter.java:36)
        at com.carrotsearch.randomizedtesting.ThreadLeakControl$StatementRunner.run(ThreadLeakControl.java:358)
        at java.lang.Thread.run(Thread.java:722)


FAILED:  junit.framework.TestSuite.org.apache.lucene.search.TestMultiTermConstantScore

Error Message:


Stack Trace:
java.lang.NullPointerException
        at __randomizedtesting.SeedInfo.seed([491FB3F847D4B1F7]:0)
        at org.apache.lucene.search.BaseTestRangeFilter.afterClassBaseTestRangeFilter(BaseTestRangeFilter.java:108)
        at sun.reflect.NativeMethodAccessorImpl.invoke0(Native Method)
        at sun.reflect.NativeMethodAccessorImpl.invoke(NativeMethodAccessorImpl.java:57)
        at sun.reflect.DelegatingMethodAccessorImpl.invoke(DelegatingMethodAccessorImpl.java:43)
        at java.lang.reflect.Method.invoke(Method.java:601)
        at com.carrotsearch.randomizedtesting.RandomizedRunner.invoke(RandomizedRunner.java:1559)
        at com.carrotsearch.randomizedtesting.RandomizedRunner.access$600(RandomizedRunner.java:79)
        at com.carrotsearch.randomizedtesting.RandomizedRunner$5.evaluate(RandomizedRunner.java:700)
        at org.apache.lucene.util.AbstractBeforeAfterRule$1.evaluate(AbstractBeforeAfterRule.java:46)
        at org.apache.lucene.util.TestRuleStoreClassName$1.evaluate(TestRuleStoreClassName.java:42)
        at com.carrotsearch.randomizedtesting.rules.SystemPropertiesInvariantRule$1.evaluate(SystemPropertiesInvariantRule.java:55)
        at com.carrotsearch.randomizedtesting.rules.NoShadowingOrOverridesOnMethodsRule$1.evaluate(NoShadowingOrOverridesOnMethodsRule.java:39)
        at com.carrotsearch.randomizedtesting.rules.NoShadowingOrOverridesOnMethodsRule$1.evaluate(NoShadowingOrOverridesOnMethodsRule.java:39)
        at com.carrotsearch.randomizedtesting.rules.StatementAdapter.evaluate(StatementAdapter.java:36)
        at org.apache.lucene.util.TestRuleAssertionsRequired$1.evaluate(TestRuleAssertionsRequired.java:43)
        at org.apache.lucene.util.TestRuleMarkFailure$1.evaluate(TestRuleMarkFailure.java:48)
        at org.apache.lucene.util.TestRuleIgnoreAfterMaxFailures$1.evaluate(TestRuleIgnoreAfterMaxFailures.java:70)
        at org.apache.lucene.util.TestRuleIgnoreTestSuites$1.evaluate(TestRuleIgnoreTestSuites.java:55)
        at com.carrotsearch.randomizedtesting.rules.StatementAdapter.evaluate(StatementAdapter.java:36)
        at com.carrotsearch.randomizedtesting.ThreadLeakControl$StatementRunner.run(ThreadLeakControl.java:358)
        at java.lang.Thread.run(Thread.java:722)




Build Log:
[...truncated 948 lines...]
[junit4:junit4] Suite: org.apache.lucene.search.TestMultiTermConstantScore
[junit4:junit4]   2> NOTE: test params are: codec=FastDecompressionCompressingStoredFields(storedFieldsFormat=CompressingStoredFieldsFormat(compressionMode=FAST_DECOMPRESSION, chunkSize=325), termVectorsFormat=CompressingTermVectorsFormat(compressionMode=FAST_DECOMPRESSION, chunkSize=325)), sim=DefaultSimilarity, locale=fr_CH, timezone=America/Nipigon
[junit4:junit4]   2> NOTE: Linux 3.2.0-26-generic amd64/Oracle Corporation 1.7.0_05 (64-bit)/cpus=8,threads=1,free=104154400,total=264503296
[junit4:junit4]   2> NOTE: All tests run in this JVM: [TestOmitNorms, Test2BDocs, TestLucene41StoredFieldsFormat, TestTopDocsMerge, TestDocValuesWithThreads, TestPackedInts, TestSegmentMerger, TestBitVector, TestDocTermOrdsRewriteMethod, TestTermVectorsFormat, TestCodecHoldsOpenFiles, TestCheckIndex, TestVirtualMethod, TestInPlaceMergeSorter, TestByteBlockPool, TestBooleanQuery, TestSpanExplanationsOfNonMatches, TestStressNRT, TestMixedCodecs, Nested, TestExternalCodecs, TestIOUtils, TestSloppyPhraseQuery, TestOpenBitSet, TestConsistentFieldNumbers, TestMockAnalyzer, TestToken, TestRAMDirectory, TestCharTermAttributeImpl, TestMultiTermConstantScore]
[junit4:junit4]   2> NOTE: reproduce with: ant test  -Dtestcase=TestMultiTermConstantScore -Dtests.seed=491FB3F847D4B1F7 -Dtests.slow=true -Dtests.locale=fr_CH -Dtests.timezone=America/Nipigon -Dtests.file.encoding=UTF-8
[junit4:junit4] ERROR   0.00s J4 | TestMultiTermConstantScore (suite) <<<
[junit4:junit4]    > Throwable #1: java.lang.IllegalArgumentException: count should be <= maxMergeCount (= 1)
[junit4:junit4]    >    at __randomizedtesting.SeedInfo.seed([491FB3F847D4B1F7]:0)
[junit4:junit4]    >    at org.apache.lucene.index.ConcurrentMergeScheduler.setMaxThreadCount(ConcurrentMergeScheduler.java:91)
[junit4:junit4]    >    at org.apache.lucene.util._TestUtil.reduceOpenFiles(_TestUtil.java:773)
[junit4:junit4]    >    at org.apache.lucene.search.BaseTestRangeFilter.build(BaseTestRangeFilter.java:140)
[junit4:junit4]    >    at org.apache.lucene.search.BaseTestRangeFilter.beforeClassBaseTestRangeFilter(BaseTestRangeFilter.java:102)
[junit4:junit4]    >    at java.lang.Thread.run(Thread.java:722)Throwable #2: java.lang.NullPointerException
[junit4:junit4]    >    at __randomizedtesting.SeedInfo.seed([491FB3F847D4B1F7]:0)
[junit4:junit4]    >    at org.apache.lucene.search.TestMultiTermConstantScore.afterClass(TestMultiTermConstantScore.java:81)
[junit4:junit4]    >    at java.lang.Thread.run(Thread.java:722)Throwable #3: java.lang.NullPointerException
[junit4:junit4]    >    at __randomizedtesting.SeedInfo.seed([491FB3F847D4B1F7]:0)
[junit4:junit4]    >    at org.apache.lucene.search.BaseTestRangeFilter.afterClassBaseTestRangeFilter(BaseTestRangeFilter.java:108)
[junit4:junit4]    >    at java.lang.Thread.run(Thread.java:722)
[junit4:junit4] Completed on J4 in 0.27s, 0 tests, 3 errors <<< FAILURES!

[...truncated 313 lines...]
BUILD FAILED
/var/lib/jenkins/workspace/Lucene-trunk-Linux-Java7-64-test-only/checkout/lucene/build.xml:49: The following error occurred while executing this line:
/var/lib/jenkins/workspace/Lucene-trunk-Linux-Java7-64-test-only/checkout/lucene/common-build.xml:1245: The following error occurred while executing this line:
/var/lib/jenkins/workspace/Lucene-trunk-Linux-Java7-64-test-only/checkout/lucene/common-build.xml:889: There were test failures: 356 suites, 2243 tests, 3 suite-level errors, 45 ignored (32 assumptions)

Total time: 4 minutes 2 seconds
Build step 'Invoke Ant' marked build as failure
Archiving artifacts
Recording test results
Email was triggered for: Failure
Sending email for trigger: Failure





---------------------------------------------------------------------
To unsubscribe, e-mail: [hidden email]
For additional commands, e-mail: [hidden email]

Reply | Threaded
Open this post in threaded view
|

Re: [JENKINS] Lucene-trunk-Linux-Java7-64-test-only - Build # 51118 - Failure!

Robert Muir
I committed a fix

On Fri, Jun 28, 2013 at 4:08 PM, Robert Muir <[hidden email]> wrote:
ill look into this... its https://issues.apache.org/jira/browse/LUCENE-5080 :)

On Fri, Jun 28, 2013 at 4:01 PM, <[hidden email]> wrote:
Build: builds.flonkings.com/job/Lucene-trunk-Linux-Java7-64-test-only/51118/

3 tests failed.
FAILED:  junit.framework.TestSuite.org.apache.lucene.search.TestMultiTermConstantScore

Error Message:
count should be <= maxMergeCount (= 1)

Stack Trace:
java.lang.IllegalArgumentException: count should be <= maxMergeCount (= 1)
        at __randomizedtesting.SeedInfo.seed([491FB3F847D4B1F7]:0)
        at org.apache.lucene.index.ConcurrentMergeScheduler.setMaxThreadCount(ConcurrentMergeScheduler.java:91)
        at org.apache.lucene.util._TestUtil.reduceOpenFiles(_TestUtil.java:773)
        at org.apache.lucene.search.BaseTestRangeFilter.build(BaseTestRangeFilter.java:140)
        at org.apache.lucene.search.BaseTestRangeFilter.beforeClassBaseTestRangeFilter(BaseTestRangeFilter.java:102)
        at sun.reflect.NativeMethodAccessorImpl.invoke0(Native Method)
        at sun.reflect.NativeMethodAccessorImpl.invoke(NativeMethodAccessorImpl.java:57)
        at sun.reflect.DelegatingMethodAccessorImpl.invoke(DelegatingMethodAccessorImpl.java:43)
        at java.lang.reflect.Method.invoke(Method.java:601)
        at com.carrotsearch.randomizedtesting.RandomizedRunner.invoke(RandomizedRunner.java:1559)
        at com.carrotsearch.randomizedtesting.RandomizedRunner.access$600(RandomizedRunner.java:79)
        at com.carrotsearch.randomizedtesting.RandomizedRunner$4.evaluate(RandomizedRunner.java:677)
        at com.carrotsearch.randomizedtesting.RandomizedRunner$5.evaluate(RandomizedRunner.java:693)
        at org.apache.lucene.util.AbstractBeforeAfterRule$1.evaluate(AbstractBeforeAfterRule.java:46)
        at org.apache.lucene.util.TestRuleStoreClassName$1.evaluate(TestRuleStoreClassName.java:42)
        at com.carrotsearch.randomizedtesting.rules.SystemPropertiesInvariantRule$1.evaluate(SystemPropertiesInvariantRule.java:55)
        at com.carrotsearch.randomizedtesting.rules.NoShadowingOrOverridesOnMethodsRule$1.evaluate(NoShadowingOrOverridesOnMethodsRule.java:39)
        at com.carrotsearch.randomizedtesting.rules.NoShadowingOrOverridesOnMethodsRule$1.evaluate(NoShadowingOrOverridesOnMethodsRule.java:39)
        at com.carrotsearch.randomizedtesting.rules.StatementAdapter.evaluate(StatementAdapter.java:36)
        at org.apache.lucene.util.TestRuleAssertionsRequired$1.evaluate(TestRuleAssertionsRequired.java:43)
        at org.apache.lucene.util.TestRuleMarkFailure$1.evaluate(TestRuleMarkFailure.java:48)
        at org.apache.lucene.util.TestRuleIgnoreAfterMaxFailures$1.evaluate(TestRuleIgnoreAfterMaxFailures.java:70)
        at org.apache.lucene.util.TestRuleIgnoreTestSuites$1.evaluate(TestRuleIgnoreTestSuites.java:55)
        at com.carrotsearch.randomizedtesting.rules.StatementAdapter.evaluate(StatementAdapter.java:36)
        at com.carrotsearch.randomizedtesting.ThreadLeakControl$StatementRunner.run(ThreadLeakControl.java:358)
        at java.lang.Thread.run(Thread.java:722)


FAILED:  junit.framework.TestSuite.org.apache.lucene.search.TestMultiTermConstantScore

Error Message:


Stack Trace:
java.lang.NullPointerException
        at __randomizedtesting.SeedInfo.seed([491FB3F847D4B1F7]:0)
        at org.apache.lucene.search.TestMultiTermConstantScore.afterClass(TestMultiTermConstantScore.java:81)
        at sun.reflect.NativeMethodAccessorImpl.invoke0(Native Method)
        at sun.reflect.NativeMethodAccessorImpl.invoke(NativeMethodAccessorImpl.java:57)
        at sun.reflect.DelegatingMethodAccessorImpl.invoke(DelegatingMethodAccessorImpl.java:43)
        at java.lang.reflect.Method.invoke(Method.java:601)
        at com.carrotsearch.randomizedtesting.RandomizedRunner.invoke(RandomizedRunner.java:1559)
        at com.carrotsearch.randomizedtesting.RandomizedRunner.access$600(RandomizedRunner.java:79)
        at com.carrotsearch.randomizedtesting.RandomizedRunner$5.evaluate(RandomizedRunner.java:700)
        at org.apache.lucene.util.AbstractBeforeAfterRule$1.evaluate(AbstractBeforeAfterRule.java:46)
        at org.apache.lucene.util.TestRuleStoreClassName$1.evaluate(TestRuleStoreClassName.java:42)
        at com.carrotsearch.randomizedtesting.rules.SystemPropertiesInvariantRule$1.evaluate(SystemPropertiesInvariantRule.java:55)
        at com.carrotsearch.randomizedtesting.rules.NoShadowingOrOverridesOnMethodsRule$1.evaluate(NoShadowingOrOverridesOnMethodsRule.java:39)
        at com.carrotsearch.randomizedtesting.rules.NoShadowingOrOverridesOnMethodsRule$1.evaluate(NoShadowingOrOverridesOnMethodsRule.java:39)
        at com.carrotsearch.randomizedtesting.rules.StatementAdapter.evaluate(StatementAdapter.java:36)
        at org.apache.lucene.util.TestRuleAssertionsRequired$1.evaluate(TestRuleAssertionsRequired.java:43)
        at org.apache.lucene.util.TestRuleMarkFailure$1.evaluate(TestRuleMarkFailure.java:48)
        at org.apache.lucene.util.TestRuleIgnoreAfterMaxFailures$1.evaluate(TestRuleIgnoreAfterMaxFailures.java:70)
        at org.apache.lucene.util.TestRuleIgnoreTestSuites$1.evaluate(TestRuleIgnoreTestSuites.java:55)
        at com.carrotsearch.randomizedtesting.rules.StatementAdapter.evaluate(StatementAdapter.java:36)
        at com.carrotsearch.randomizedtesting.ThreadLeakControl$StatementRunner.run(ThreadLeakControl.java:358)
        at java.lang.Thread.run(Thread.java:722)


FAILED:  junit.framework.TestSuite.org.apache.lucene.search.TestMultiTermConstantScore

Error Message:


Stack Trace:
java.lang.NullPointerException
        at __randomizedtesting.SeedInfo.seed([491FB3F847D4B1F7]:0)
        at org.apache.lucene.search.BaseTestRangeFilter.afterClassBaseTestRangeFilter(BaseTestRangeFilter.java:108)
        at sun.reflect.NativeMethodAccessorImpl.invoke0(Native Method)
        at sun.reflect.NativeMethodAccessorImpl.invoke(NativeMethodAccessorImpl.java:57)
        at sun.reflect.DelegatingMethodAccessorImpl.invoke(DelegatingMethodAccessorImpl.java:43)
        at java.lang.reflect.Method.invoke(Method.java:601)
        at com.carrotsearch.randomizedtesting.RandomizedRunner.invoke(RandomizedRunner.java:1559)
        at com.carrotsearch.randomizedtesting.RandomizedRunner.access$600(RandomizedRunner.java:79)
        at com.carrotsearch.randomizedtesting.RandomizedRunner$5.evaluate(RandomizedRunner.java:700)
        at org.apache.lucene.util.AbstractBeforeAfterRule$1.evaluate(AbstractBeforeAfterRule.java:46)
        at org.apache.lucene.util.TestRuleStoreClassName$1.evaluate(TestRuleStoreClassName.java:42)
        at com.carrotsearch.randomizedtesting.rules.SystemPropertiesInvariantRule$1.evaluate(SystemPropertiesInvariantRule.java:55)
        at com.carrotsearch.randomizedtesting.rules.NoShadowingOrOverridesOnMethodsRule$1.evaluate(NoShadowingOrOverridesOnMethodsRule.java:39)
        at com.carrotsearch.randomizedtesting.rules.NoShadowingOrOverridesOnMethodsRule$1.evaluate(NoShadowingOrOverridesOnMethodsRule.java:39)
        at com.carrotsearch.randomizedtesting.rules.StatementAdapter.evaluate(StatementAdapter.java:36)
        at org.apache.lucene.util.TestRuleAssertionsRequired$1.evaluate(TestRuleAssertionsRequired.java:43)
        at org.apache.lucene.util.TestRuleMarkFailure$1.evaluate(TestRuleMarkFailure.java:48)
        at org.apache.lucene.util.TestRuleIgnoreAfterMaxFailures$1.evaluate(TestRuleIgnoreAfterMaxFailures.java:70)
        at org.apache.lucene.util.TestRuleIgnoreTestSuites$1.evaluate(TestRuleIgnoreTestSuites.java:55)
        at com.carrotsearch.randomizedtesting.rules.StatementAdapter.evaluate(StatementAdapter.java:36)
        at com.carrotsearch.randomizedtesting.ThreadLeakControl$StatementRunner.run(ThreadLeakControl.java:358)
        at java.lang.Thread.run(Thread.java:722)




Build Log:
[...truncated 948 lines...]
[junit4:junit4] Suite: org.apache.lucene.search.TestMultiTermConstantScore
[junit4:junit4]   2> NOTE: test params are: codec=FastDecompressionCompressingStoredFields(storedFieldsFormat=CompressingStoredFieldsFormat(compressionMode=FAST_DECOMPRESSION, chunkSize=325), termVectorsFormat=CompressingTermVectorsFormat(compressionMode=FAST_DECOMPRESSION, chunkSize=325)), sim=DefaultSimilarity, locale=fr_CH, timezone=America/Nipigon
[junit4:junit4]   2> NOTE: Linux 3.2.0-26-generic amd64/Oracle Corporation 1.7.0_05 (64-bit)/cpus=8,threads=1,free=104154400,total=264503296
[junit4:junit4]   2> NOTE: All tests run in this JVM: [TestOmitNorms, Test2BDocs, TestLucene41StoredFieldsFormat, TestTopDocsMerge, TestDocValuesWithThreads, TestPackedInts, TestSegmentMerger, TestBitVector, TestDocTermOrdsRewriteMethod, TestTermVectorsFormat, TestCodecHoldsOpenFiles, TestCheckIndex, TestVirtualMethod, TestInPlaceMergeSorter, TestByteBlockPool, TestBooleanQuery, TestSpanExplanationsOfNonMatches, TestStressNRT, TestMixedCodecs, Nested, TestExternalCodecs, TestIOUtils, TestSloppyPhraseQuery, TestOpenBitSet, TestConsistentFieldNumbers, TestMockAnalyzer, TestToken, TestRAMDirectory, TestCharTermAttributeImpl, TestMultiTermConstantScore]
[junit4:junit4]   2> NOTE: reproduce with: ant test  -Dtestcase=TestMultiTermConstantScore -Dtests.seed=491FB3F847D4B1F7 -Dtests.slow=true -Dtests.locale=fr_CH -Dtests.timezone=America/Nipigon -Dtests.file.encoding=UTF-8
[junit4:junit4] ERROR   0.00s J4 | TestMultiTermConstantScore (suite) <<<
[junit4:junit4]    > Throwable #1: java.lang.IllegalArgumentException: count should be <= maxMergeCount (= 1)
[junit4:junit4]    >    at __randomizedtesting.SeedInfo.seed([491FB3F847D4B1F7]:0)
[junit4:junit4]    >    at org.apache.lucene.index.ConcurrentMergeScheduler.setMaxThreadCount(ConcurrentMergeScheduler.java:91)
[junit4:junit4]    >    at org.apache.lucene.util._TestUtil.reduceOpenFiles(_TestUtil.java:773)
[junit4:junit4]    >    at org.apache.lucene.search.BaseTestRangeFilter.build(BaseTestRangeFilter.java:140)
[junit4:junit4]    >    at org.apache.lucene.search.BaseTestRangeFilter.beforeClassBaseTestRangeFilter(BaseTestRangeFilter.java:102)
[junit4:junit4]    >    at java.lang.Thread.run(Thread.java:722)Throwable #2: java.lang.NullPointerException
[junit4:junit4]    >    at __randomizedtesting.SeedInfo.seed([491FB3F847D4B1F7]:0)
[junit4:junit4]    >    at org.apache.lucene.search.TestMultiTermConstantScore.afterClass(TestMultiTermConstantScore.java:81)
[junit4:junit4]    >    at java.lang.Thread.run(Thread.java:722)Throwable #3: java.lang.NullPointerException
[junit4:junit4]    >    at __randomizedtesting.SeedInfo.seed([491FB3F847D4B1F7]:0)
[junit4:junit4]    >    at org.apache.lucene.search.BaseTestRangeFilter.afterClassBaseTestRangeFilter(BaseTestRangeFilter.java:108)
[junit4:junit4]    >    at java.lang.Thread.run(Thread.java:722)
[junit4:junit4] Completed on J4 in 0.27s, 0 tests, 3 errors <<< FAILURES!

[...truncated 313 lines...]
BUILD FAILED
/var/lib/jenkins/workspace/Lucene-trunk-Linux-Java7-64-test-only/checkout/lucene/build.xml:49: The following error occurred while executing this line:
/var/lib/jenkins/workspace/Lucene-trunk-Linux-Java7-64-test-only/checkout/lucene/common-build.xml:1245: The following error occurred while executing this line:
/var/lib/jenkins/workspace/Lucene-trunk-Linux-Java7-64-test-only/checkout/lucene/common-build.xml:889: There were test failures: 356 suites, 2243 tests, 3 suite-level errors, 45 ignored (32 assumptions)

Total time: 4 minutes 2 seconds
Build step 'Invoke Ant' marked build as failure
Archiving artifacts
Recording test results
Email was triggered for: Failure
Sending email for trigger: Failure





---------------------------------------------------------------------
To unsubscribe, e-mail: [hidden email]
For additional commands, e-mail: [hidden email]