[JENKINS-MAVEN] Lucene-Solr-Maven-7.7 #8: POMs out of sync

classic Classic list List threaded Threaded
5 messages Options
Reply | Threaded
Open this post in threaded view
|

[JENKINS-MAVEN] Lucene-Solr-Maven-7.7 #8: POMs out of sync

Apache Jenkins Server-2
Build: https://builds.apache.org/job/Lucene-Solr-Maven-7.7/8/

No tests ran.

Build Log:
[...truncated 19170 lines...]
BUILD FAILED
/x1/jenkins/jenkins-slave/workspace/Lucene-Solr-Maven-7.7/build.xml:672: The following error occurred while executing this line:
/x1/jenkins/jenkins-slave/workspace/Lucene-Solr-Maven-7.7/build.xml:209: The following error occurred while executing this line:
/x1/jenkins/jenkins-slave/workspace/Lucene-Solr-Maven-7.7/lucene/build.xml:411: The following error occurred while executing this line:
/x1/jenkins/jenkins-slave/workspace/Lucene-Solr-Maven-7.7/lucene/common-build.xml:2268: The following error occurred while executing this line:
/x1/jenkins/jenkins-slave/workspace/Lucene-Solr-Maven-7.7/lucene/common-build.xml:1726: The following error occurred while executing this line:
/x1/jenkins/jenkins-slave/workspace/Lucene-Solr-Maven-7.7/lucene/common-build.xml:657: Error deploying artifact 'org.apache.lucene:lucene-demo:jar': Error installing artifact's metadata: Error while deploying metadata: Error transferring file

Total time: 8 minutes 37 seconds
Build step 'Invoke Ant' marked build as failure
Email was triggered for: Failure - Any
Sending email for trigger: Failure - Any


---------------------------------------------------------------------
To unsubscribe, e-mail: [hidden email]
For additional commands, e-mail: [hidden email]
Reply | Threaded
Open this post in threaded view
|

[JENKINS-MAVEN] Lucene-Solr-Maven-7.7 #9: POMs out of sync

Apache Jenkins Server-2
Build: https://builds.apache.org/job/Lucene-Solr-Maven-7.7/9/

No tests ran.

Build Log:
[...truncated 19725 lines...]
BUILD FAILED
/x1/jenkins/jenkins-slave/workspace/Lucene-Solr-Maven-7.7/build.xml:672: The following error occurred while executing this line:
/x1/jenkins/jenkins-slave/workspace/Lucene-Solr-Maven-7.7/build.xml:209: The following error occurred while executing this line:
/x1/jenkins/jenkins-slave/workspace/Lucene-Solr-Maven-7.7/lucene/build.xml:411: The following error occurred while executing this line:
/x1/jenkins/jenkins-slave/workspace/Lucene-Solr-Maven-7.7/lucene/common-build.xml:2268: The following error occurred while executing this line:
/x1/jenkins/jenkins-slave/workspace/Lucene-Solr-Maven-7.7/lucene/common-build.xml:1726: The following error occurred while executing this line:
/x1/jenkins/jenkins-slave/workspace/Lucene-Solr-Maven-7.7/lucene/common-build.xml:657: Error deploying artifact 'org.apache.lucene:lucene-queries:jar': Error deploying artifact: Error transferring file

Total time: 9 minutes 7 seconds
Build step 'Invoke Ant' marked build as failure
Email was triggered for: Failure - Any
Sending email for trigger: Failure - Any


---------------------------------------------------------------------
To unsubscribe, e-mail: [hidden email]
For additional commands, e-mail: [hidden email]
Reply | Threaded
Open this post in threaded view
|

[JENKINS-MAVEN] Lucene-Solr-Maven-7.7 #10: POMs out of sync

Apache Jenkins Server-2
Build: https://builds.apache.org/job/Lucene-Solr-Maven-7.7/10/

No tests ran.

Build Log:
[...truncated 18753 lines...]
BUILD FAILED
/x1/jenkins/jenkins-slave/workspace/Lucene-Solr-Maven-7.7/build.xml:672: The following error occurred while executing this line:
/x1/jenkins/jenkins-slave/workspace/Lucene-Solr-Maven-7.7/build.xml:209: The following error occurred while executing this line:
/x1/jenkins/jenkins-slave/workspace/Lucene-Solr-Maven-7.7/lucene/build.xml:411: The following error occurred while executing this line:
/x1/jenkins/jenkins-slave/workspace/Lucene-Solr-Maven-7.7/lucene/common-build.xml:2268: The following error occurred while executing this line:
/x1/jenkins/jenkins-slave/workspace/Lucene-Solr-Maven-7.7/lucene/analysis/build.xml:129: The following error occurred while executing this line:
/x1/jenkins/jenkins-slave/workspace/Lucene-Solr-Maven-7.7/lucene/analysis/build.xml:38: The following error occurred while executing this line:
/x1/jenkins/jenkins-slave/workspace/Lucene-Solr-Maven-7.7/lucene/common-build.xml:1726: The following error occurred while executing this line:
/x1/jenkins/jenkins-slave/workspace/Lucene-Solr-Maven-7.7/lucene/common-build.xml:657: Error deploying artifact 'org.apache.lucene:lucene-analyzers-stempel:jar': Error installing artifact's metadata: Error while deploying metadata: Error transferring file

Total time: 7 minutes 52 seconds
Build step 'Invoke Ant' marked build as failure
Email was triggered for: Failure - Any
Sending email for trigger: Failure - Any


---------------------------------------------------------------------
To unsubscribe, e-mail: [hidden email]
For additional commands, e-mail: [hidden email]
Reply | Threaded
Open this post in threaded view
|

[JENKINS-MAVEN] Lucene-Solr-Maven-7.7 #11: POMs out of sync

Apache Jenkins Server-2
Build: https://builds.apache.org/job/Lucene-Solr-Maven-7.7/11/

No tests ran.

Build Log:
[...truncated 19890 lines...]
BUILD FAILED
/x1/jenkins/jenkins-slave/workspace/Lucene-Solr-Maven-7.7/build.xml:672: The following error occurred while executing this line:
/x1/jenkins/jenkins-slave/workspace/Lucene-Solr-Maven-7.7/build.xml:209: The following error occurred while executing this line:
/x1/jenkins/jenkins-slave/workspace/Lucene-Solr-Maven-7.7/lucene/build.xml:411: The following error occurred while executing this line:
/x1/jenkins/jenkins-slave/workspace/Lucene-Solr-Maven-7.7/lucene/common-build.xml:2268: The following error occurred while executing this line:
/x1/jenkins/jenkins-slave/workspace/Lucene-Solr-Maven-7.7/lucene/common-build.xml:1726: The following error occurred while executing this line:
/x1/jenkins/jenkins-slave/workspace/Lucene-Solr-Maven-7.7/lucene/common-build.xml:657: Error deploying artifact 'org.apache.lucene:lucene-replicator:jar': Error deploying artifact: Error transferring file

Total time: 9 minutes 47 seconds
Build step 'Invoke Ant' marked build as failure
Email was triggered for: Failure - Any
Sending email for trigger: Failure - Any


---------------------------------------------------------------------
To unsubscribe, e-mail: [hidden email]
For additional commands, e-mail: [hidden email]
Reply | Threaded
Open this post in threaded view
|

[JENKINS-MAVEN] Lucene-Solr-Maven-7.7 #12: POMs out of sync

Apache Jenkins Server-2
Build: https://builds.apache.org/job/Lucene-Solr-Maven-7.7/12/

No tests ran.

Build Log:
[...truncated 20268 lines...]
BUILD FAILED
/x1/jenkins/jenkins-slave/workspace/Lucene-Solr-Maven-7.7/build.xml:672: The following error occurred while executing this line:
/x1/jenkins/jenkins-slave/workspace/Lucene-Solr-Maven-7.7/build.xml:209: The following error occurred while executing this line:
/x1/jenkins/jenkins-slave/workspace/Lucene-Solr-Maven-7.7/solr/build.xml:692: The following error occurred while executing this line:
/x1/jenkins/jenkins-slave/workspace/Lucene-Solr-Maven-7.7/lucene/common-build.xml:657: Error deploying artifact 'org.apache.solr:solr-parent:pom': Error installing artifact's metadata: Error while deploying metadata: Error transferring file

Total time: 10 minutes 30 seconds
Build step 'Invoke Ant' marked build as failure
Email was triggered for: Failure - Any
Sending email for trigger: Failure - Any


---------------------------------------------------------------------
To unsubscribe, e-mail: [hidden email]
For additional commands, e-mail: [hidden email]