[JENKINS-MAVEN] Lucene-Solr-Maven-7.x #323: POMs out of sync

classic Classic list List threaded Threaded
8 messages Options
Reply | Threaded
Open this post in threaded view
|

[JENKINS-MAVEN] Lucene-Solr-Maven-7.x #323: POMs out of sync

Apache Jenkins Server-2
Build: https://builds.apache.org/job/Lucene-Solr-Maven-7.x/323/

No tests ran.

Build Log:
[...truncated 17822 lines...]
BUILD FAILED
/home/jenkins/jenkins-slave/workspace/Lucene-Solr-Maven-7.x/build.xml:672: The following error occurred while executing this line:
/home/jenkins/jenkins-slave/workspace/Lucene-Solr-Maven-7.x/build.xml:209: The following error occurred while executing this line:
/home/jenkins/jenkins-slave/workspace/Lucene-Solr-Maven-7.x/lucene/build.xml:404: The following error occurred while executing this line:
/home/jenkins/jenkins-slave/workspace/Lucene-Solr-Maven-7.x/lucene/common-build.xml:650: Error deploying artifact 'org.apache.lucene:lucene-solr-grandparent:pom': Error deploying artifact: Failed to transfer file: https://repository.apache.org/content/repositories/snapshots/org/apache/lucene/lucene-solr-grandparent/7.6.0-SNAPSHOT/lucene-solr-grandparent-7.6.0-20181006.140105-20.pom. Return code is: 401

Total time: 11 minutes 27 seconds
Build step 'Invoke Ant' marked build as failure
Email was triggered for: Failure - Any
Sending email for trigger: Failure - Any


---------------------------------------------------------------------
To unsubscribe, e-mail: [hidden email]
For additional commands, e-mail: [hidden email]
Reply | Threaded
Open this post in threaded view
|

[JENKINS-MAVEN] Lucene-Solr-Maven-7.x #324: POMs out of sync

Apache Jenkins Server-2
Build: https://builds.apache.org/job/Lucene-Solr-Maven-7.x/324/

No tests ran.

Build Log:
[...truncated 17822 lines...]
BUILD FAILED
/x1/jenkins/jenkins-slave/workspace/Lucene-Solr-Maven-7.x/build.xml:672: The following error occurred while executing this line:
/x1/jenkins/jenkins-slave/workspace/Lucene-Solr-Maven-7.x/build.xml:209: The following error occurred while executing this line:
/x1/jenkins/jenkins-slave/workspace/Lucene-Solr-Maven-7.x/lucene/build.xml:404: The following error occurred while executing this line:
/x1/jenkins/jenkins-slave/workspace/Lucene-Solr-Maven-7.x/lucene/common-build.xml:650: Error deploying artifact 'org.apache.lucene:lucene-solr-grandparent:pom': Error deploying artifact: Failed to transfer file: https://repository.apache.org/content/repositories/snapshots/org/apache/lucene/lucene-solr-grandparent/7.6.0-SNAPSHOT/lucene-solr-grandparent-7.6.0-20181007.120749-20.pom. Return code is: 401

Total time: 7 minutes 30 seconds
Build step 'Invoke Ant' marked build as failure
Email was triggered for: Failure - Any
Sending email for trigger: Failure - Any


---------------------------------------------------------------------
To unsubscribe, e-mail: [hidden email]
For additional commands, e-mail: [hidden email]
Reply | Threaded
Open this post in threaded view
|

[JENKINS-MAVEN] Lucene-Solr-Maven-7.x #325: POMs out of sync

Apache Jenkins Server-2
Build: https://builds.apache.org/job/Lucene-Solr-Maven-7.x/325/

No tests ran.

Build Log:
[...truncated 17822 lines...]
BUILD FAILED
/home/jenkins/jenkins-slave/workspace/Lucene-Solr-Maven-7.x/build.xml:672: The following error occurred while executing this line:
/home/jenkins/jenkins-slave/workspace/Lucene-Solr-Maven-7.x/build.xml:209: The following error occurred while executing this line:
/home/jenkins/jenkins-slave/workspace/Lucene-Solr-Maven-7.x/lucene/build.xml:404: The following error occurred while executing this line:
/home/jenkins/jenkins-slave/workspace/Lucene-Solr-Maven-7.x/lucene/common-build.xml:650: Error deploying artifact 'org.apache.lucene:lucene-solr-grandparent:pom': Error deploying artifact: Failed to transfer file: https://repository.apache.org/content/repositories/snapshots/org/apache/lucene/lucene-solr-grandparent/7.6.0-SNAPSHOT/lucene-solr-grandparent-7.6.0-20181008.110208-20.pom. Return code is: 401

Total time: 13 minutes 41 seconds
Build step 'Invoke Ant' marked build as failure
Email was triggered for: Failure - Any
Sending email for trigger: Failure - Any


---------------------------------------------------------------------
To unsubscribe, e-mail: [hidden email]
For additional commands, e-mail: [hidden email]
Reply | Threaded
Open this post in threaded view
|

[JENKINS-MAVEN] Lucene-Solr-Maven-7.x #326: POMs out of sync

Apache Jenkins Server-2
Build: https://builds.apache.org/job/Lucene-Solr-Maven-7.x/326/

No tests ran.

Build Log:
[...truncated 17822 lines...]
BUILD FAILED
/home/jenkins/jenkins-slave/workspace/Lucene-Solr-Maven-7.x/build.xml:672: The following error occurred while executing this line:
/home/jenkins/jenkins-slave/workspace/Lucene-Solr-Maven-7.x/build.xml:209: The following error occurred while executing this line:
/home/jenkins/jenkins-slave/workspace/Lucene-Solr-Maven-7.x/lucene/build.xml:404: The following error occurred while executing this line:
/home/jenkins/jenkins-slave/workspace/Lucene-Solr-Maven-7.x/lucene/common-build.xml:650: Error deploying artifact 'org.apache.lucene:lucene-solr-grandparent:pom': Error deploying artifact: Failed to transfer file: https://repository.apache.org/content/repositories/snapshots/org/apache/lucene/lucene-solr-grandparent/7.6.0-SNAPSHOT/lucene-solr-grandparent-7.6.0-20181009.144244-20.pom. Return code is: 401

Total time: 15 minutes 4 seconds
Build step 'Invoke Ant' marked build as failure
Email was triggered for: Failure - Any
Sending email for trigger: Failure - Any


---------------------------------------------------------------------
To unsubscribe, e-mail: [hidden email]
For additional commands, e-mail: [hidden email]
Reply | Threaded
Open this post in threaded view
|

[JENKINS-MAVEN] Lucene-Solr-Maven-7.x #327: POMs out of sync

Apache Jenkins Server-2
Build: https://builds.apache.org/job/Lucene-Solr-Maven-7.x/327/

No tests ran.

Build Log:
[...truncated 17822 lines...]
BUILD FAILED
/x1/jenkins/jenkins-slave/workspace/Lucene-Solr-Maven-7.x/build.xml:672: The following error occurred while executing this line:
/x1/jenkins/jenkins-slave/workspace/Lucene-Solr-Maven-7.x/build.xml:209: The following error occurred while executing this line:
/x1/jenkins/jenkins-slave/workspace/Lucene-Solr-Maven-7.x/lucene/build.xml:404: The following error occurred while executing this line:
/x1/jenkins/jenkins-slave/workspace/Lucene-Solr-Maven-7.x/lucene/common-build.xml:650: Error deploying artifact 'org.apache.lucene:lucene-solr-grandparent:pom': Error deploying artifact: Failed to transfer file: https://repository.apache.org/content/repositories/snapshots/org/apache/lucene/lucene-solr-grandparent/7.6.0-SNAPSHOT/lucene-solr-grandparent-7.6.0-20181010.134519-20.pom. Return code is: 401

Total time: 7 minutes 24 seconds
Build step 'Invoke Ant' marked build as failure
Email was triggered for: Failure - Any
Sending email for trigger: Failure - Any


---------------------------------------------------------------------
To unsubscribe, e-mail: [hidden email]
For additional commands, e-mail: [hidden email]
Reply | Threaded
Open this post in threaded view
|

[JENKINS-MAVEN] Lucene-Solr-Maven-7.x #328: POMs out of sync

Apache Jenkins Server-2
Build: https://builds.apache.org/job/Lucene-Solr-Maven-7.x/328/

No tests ran.

Build Log:
[...truncated 17822 lines...]
BUILD FAILED
/x1/jenkins/jenkins-slave/workspace/Lucene-Solr-Maven-7.x/build.xml:672: The following error occurred while executing this line:
/x1/jenkins/jenkins-slave/workspace/Lucene-Solr-Maven-7.x/build.xml:209: The following error occurred while executing this line:
/x1/jenkins/jenkins-slave/workspace/Lucene-Solr-Maven-7.x/lucene/build.xml:404: The following error occurred while executing this line:
/x1/jenkins/jenkins-slave/workspace/Lucene-Solr-Maven-7.x/lucene/common-build.xml:650: Error deploying artifact 'org.apache.lucene:lucene-solr-grandparent:pom': Error deploying artifact: Failed to transfer file: https://repository.apache.org/content/repositories/snapshots/org/apache/lucene/lucene-solr-grandparent/7.6.0-SNAPSHOT/lucene-solr-grandparent-7.6.0-20181011.123346-20.pom. Return code is: 401

Total time: 7 minutes 0 seconds
Build step 'Invoke Ant' marked build as failure
Email was triggered for: Failure - Any
Sending email for trigger: Failure - Any


---------------------------------------------------------------------
To unsubscribe, e-mail: [hidden email]
For additional commands, e-mail: [hidden email]
Reply | Threaded
Open this post in threaded view
|

[JENKINS-MAVEN] Lucene-Solr-Maven-7.x #329: POMs out of sync

Apache Jenkins Server-2
Build: https://builds.apache.org/job/Lucene-Solr-Maven-7.x/329/

No tests ran.

Build Log:
[...truncated 17822 lines...]
BUILD FAILED
/x1/jenkins/jenkins-slave/workspace/Lucene-Solr-Maven-7.x/build.xml:672: The following error occurred while executing this line:
/x1/jenkins/jenkins-slave/workspace/Lucene-Solr-Maven-7.x/build.xml:209: The following error occurred while executing this line:
/x1/jenkins/jenkins-slave/workspace/Lucene-Solr-Maven-7.x/lucene/build.xml:404: The following error occurred while executing this line:
/x1/jenkins/jenkins-slave/workspace/Lucene-Solr-Maven-7.x/lucene/common-build.xml:650: Error deploying artifact 'org.apache.lucene:lucene-solr-grandparent:pom': Error deploying artifact: Failed to transfer file: https://repository.apache.org/content/repositories/snapshots/org/apache/lucene/lucene-solr-grandparent/7.6.0-SNAPSHOT/lucene-solr-grandparent-7.6.0-20181012.115302-20.pom. Return code is: 401

Total time: 7 minutes 5 seconds
Build step 'Invoke Ant' marked build as failure
Email was triggered for: Failure - Any
Sending email for trigger: Failure - Any


---------------------------------------------------------------------
To unsubscribe, e-mail: [hidden email]
For additional commands, e-mail: [hidden email]
Reply | Threaded
Open this post in threaded view
|

Re: [JENKINS-MAVEN] Lucene-Solr-Maven-7.x #329: POMs out of sync

sarowe
The Maven snapshot upload jobs (this one and the one for the master branch) last succeeded on October 5th, and have failed every day since.

I reported the problem on Infra Hipchat, and Chris Thistlethwaite worked on and eventually fixed the problem: the appropriate Nexus credentials had changed, but puppet automation to propogate the creds to the two Lucene-dedicated Jenkins VMs was not updated at the same time.  See https://github.com/apache/infrastructure-puppet/pull/1204 for the puppet changes.

After the above pull request was merged and puppet updated, which Chris T. said happens every 30 minutes, I verified that the creds were updated (they're located in the apache.snapshots.https server stanza in /home/jenkins/.m2/settings.xml on the two VMs).  Then I killed the job running on the lucene1 VM, which allowed https://builds.apache.org/job/Lucene-Solr-Maven-master/2380 to run, since it happened to be next on the queue.  It succeeded, so I think we're all set now.

--
Steve
www.lucidworks.com

> On Oct 12, 2018, at 7:53 AM, Apache Jenkins Server <[hidden email]> wrote:
>
> Build: https://builds.apache.org/job/Lucene-Solr-Maven-7.x/329/
>
> No tests ran.
>
> Build Log:
> [...truncated 17822 lines...]
> BUILD FAILED
> /x1/jenkins/jenkins-slave/workspace/Lucene-Solr-Maven-7.x/build.xml:672: The following error occurred while executing this line:
> /x1/jenkins/jenkins-slave/workspace/Lucene-Solr-Maven-7.x/build.xml:209: The following error occurred while executing this line:
> /x1/jenkins/jenkins-slave/workspace/Lucene-Solr-Maven-7.x/lucene/build.xml:404: The following error occurred while executing this line:
> /x1/jenkins/jenkins-slave/workspace/Lucene-Solr-Maven-7.x/lucene/common-build.xml:650: Error deploying artifact 'org.apache.lucene:lucene-solr-grandparent:pom': Error deploying artifact: Failed to transfer file: https://repository.apache.org/content/repositories/snapshots/org/apache/lucene/lucene-solr-grandparent/7.6.0-SNAPSHOT/lucene-solr-grandparent-7.6.0-20181012.115302-20.pom. Return code is: 401
>
> Total time: 7 minutes 5 seconds
> Build step 'Invoke Ant' marked build as failure
> Email was triggered for: Failure - Any
> Sending email for trigger: Failure - Any
>
> ---------------------------------------------------------------------
> To unsubscribe, e-mail: [hidden email]
> For additional commands, e-mail: [hidden email]


---------------------------------------------------------------------
To unsubscribe, e-mail: [hidden email]
For additional commands, e-mail: [hidden email]