[JENKINS-MAVEN] Lucene-Solr-Maven-master #2374: POMs out of sync

classic Classic list List threaded Threaded
6 messages Options
Reply | Threaded
Open this post in threaded view
|

[JENKINS-MAVEN] Lucene-Solr-Maven-master #2374: POMs out of sync

Apache Jenkins Server-2
Build: https://builds.apache.org/job/Lucene-Solr-Maven-master/2374/

No tests ran.

Build Log:
[...truncated 17795 lines...]
BUILD FAILED
/home/jenkins/jenkins-slave/workspace/Lucene-Solr-Maven-master/build.xml:672: The following error occurred while executing this line:
/home/jenkins/jenkins-slave/workspace/Lucene-Solr-Maven-master/build.xml:209: The following error occurred while executing this line:
/home/jenkins/jenkins-slave/workspace/Lucene-Solr-Maven-master/lucene/build.xml:404: The following error occurred while executing this line:
/home/jenkins/jenkins-slave/workspace/Lucene-Solr-Maven-master/lucene/common-build.xml:650: Error deploying artifact 'org.apache.lucene:lucene-solr-grandparent:pom': Error deploying artifact: Failed to transfer file: https://repository.apache.org/content/repositories/snapshots/org/apache/lucene/lucene-solr-grandparent/8.0.0-SNAPSHOT/lucene-solr-grandparent-8.0.0-20181006.142005-239.pom. Return code is: 401

Total time: 14 minutes 10 seconds
Build step 'Invoke Ant' marked build as failure
Email was triggered for: Failure - Any
Sending email for trigger: Failure - Any


---------------------------------------------------------------------
To unsubscribe, e-mail: [hidden email]
For additional commands, e-mail: [hidden email]
Reply | Threaded
Open this post in threaded view
|

[JENKINS-MAVEN] Lucene-Solr-Maven-master #2375: POMs out of sync

Apache Jenkins Server-2
Build: https://builds.apache.org/job/Lucene-Solr-Maven-master/2375/

No tests ran.

Build Log:
[...truncated 17795 lines...]
BUILD FAILED
/x1/jenkins/jenkins-slave/workspace/Lucene-Solr-Maven-master/build.xml:672: The following error occurred while executing this line:
/x1/jenkins/jenkins-slave/workspace/Lucene-Solr-Maven-master/build.xml:209: The following error occurred while executing this line:
/x1/jenkins/jenkins-slave/workspace/Lucene-Solr-Maven-master/lucene/build.xml:404: The following error occurred while executing this line:
/x1/jenkins/jenkins-slave/workspace/Lucene-Solr-Maven-master/lucene/common-build.xml:650: Error deploying artifact 'org.apache.lucene:lucene-solr-grandparent:pom': Error deploying artifact: Failed to transfer file: https://repository.apache.org/content/repositories/snapshots/org/apache/lucene/lucene-solr-grandparent/8.0.0-SNAPSHOT/lucene-solr-grandparent-8.0.0-20181007.121529-239.pom. Return code is: 401

Total time: 7 minutes 20 seconds
Build step 'Invoke Ant' marked build as failure
Email was triggered for: Failure - Any
Sending email for trigger: Failure - Any


---------------------------------------------------------------------
To unsubscribe, e-mail: [hidden email]
For additional commands, e-mail: [hidden email]
Reply | Threaded
Open this post in threaded view
|

[JENKINS-MAVEN] Lucene-Solr-Maven-master #2376: POMs out of sync

Apache Jenkins Server-2
Build: https://builds.apache.org/job/Lucene-Solr-Maven-master/2376/

No tests ran.

Build Log:
[...truncated 17795 lines...]
BUILD FAILED
/x1/jenkins/jenkins-slave/workspace/Lucene-Solr-Maven-master/build.xml:672: The following error occurred while executing this line:
/x1/jenkins/jenkins-slave/workspace/Lucene-Solr-Maven-master/build.xml:209: The following error occurred while executing this line:
/x1/jenkins/jenkins-slave/workspace/Lucene-Solr-Maven-master/lucene/build.xml:404: The following error occurred while executing this line:
/x1/jenkins/jenkins-slave/workspace/Lucene-Solr-Maven-master/lucene/common-build.xml:650: Error deploying artifact 'org.apache.lucene:lucene-solr-grandparent:pom': Error deploying artifact: Failed to transfer file: https://repository.apache.org/content/repositories/snapshots/org/apache/lucene/lucene-solr-grandparent/8.0.0-SNAPSHOT/lucene-solr-grandparent-8.0.0-20181008.123612-239.pom. Return code is: 401

Total time: 7 minutes 10 seconds
Build step 'Invoke Ant' marked build as failure
Email was triggered for: Failure - Any
Sending email for trigger: Failure - Any


---------------------------------------------------------------------
To unsubscribe, e-mail: [hidden email]
For additional commands, e-mail: [hidden email]
Reply | Threaded
Open this post in threaded view
|

[JENKINS-MAVEN] Lucene-Solr-Maven-master #2377: POMs out of sync

Apache Jenkins Server-2
Build: https://builds.apache.org/job/Lucene-Solr-Maven-master/2377/

No tests ran.

Build Log:
[...truncated 17795 lines...]
BUILD FAILED
/x1/jenkins/jenkins-slave/workspace/Lucene-Solr-Maven-master/build.xml:672: The following error occurred while executing this line:
/x1/jenkins/jenkins-slave/workspace/Lucene-Solr-Maven-master/build.xml:209: The following error occurred while executing this line:
/x1/jenkins/jenkins-slave/workspace/Lucene-Solr-Maven-master/lucene/build.xml:404: The following error occurred while executing this line:
/x1/jenkins/jenkins-slave/workspace/Lucene-Solr-Maven-master/lucene/common-build.xml:650: Error deploying artifact 'org.apache.lucene:lucene-solr-grandparent:pom': Error deploying artifact: Failed to transfer file: https://repository.apache.org/content/repositories/snapshots/org/apache/lucene/lucene-solr-grandparent/8.0.0-SNAPSHOT/lucene-solr-grandparent-8.0.0-20181009.153313-239.pom. Return code is: 401

Total time: 7 minutes 41 seconds
Build step 'Invoke Ant' marked build as failure
Email was triggered for: Failure - Any
Sending email for trigger: Failure - Any


---------------------------------------------------------------------
To unsubscribe, e-mail: [hidden email]
For additional commands, e-mail: [hidden email]
Reply | Threaded
Open this post in threaded view
|

[JENKINS-MAVEN] Lucene-Solr-Maven-master #2378: POMs out of sync

Apache Jenkins Server-2
Build: https://builds.apache.org/job/Lucene-Solr-Maven-master/2378/

No tests ran.

Build Log:
[...truncated 17795 lines...]
BUILD FAILED
/x1/jenkins/jenkins-slave/workspace/Lucene-Solr-Maven-master/build.xml:672: The following error occurred while executing this line:
/x1/jenkins/jenkins-slave/workspace/Lucene-Solr-Maven-master/build.xml:209: The following error occurred while executing this line:
/x1/jenkins/jenkins-slave/workspace/Lucene-Solr-Maven-master/lucene/build.xml:404: The following error occurred while executing this line:
/x1/jenkins/jenkins-slave/workspace/Lucene-Solr-Maven-master/lucene/common-build.xml:650: Error deploying artifact 'org.apache.lucene:lucene-solr-grandparent:pom': Error deploying artifact: Failed to transfer file: https://repository.apache.org/content/repositories/snapshots/org/apache/lucene/lucene-solr-grandparent/8.0.0-SNAPSHOT/lucene-solr-grandparent-8.0.0-20181010.135252-239.pom. Return code is: 401

Total time: 7 minutes 13 seconds
Build step 'Invoke Ant' marked build as failure
Email was triggered for: Failure - Any
Sending email for trigger: Failure - Any


---------------------------------------------------------------------
To unsubscribe, e-mail: [hidden email]
For additional commands, e-mail: [hidden email]
Reply | Threaded
Open this post in threaded view
|

[JENKINS-MAVEN] Lucene-Solr-Maven-master #2379: POMs out of sync

Apache Jenkins Server-2
Build: https://builds.apache.org/job/Lucene-Solr-Maven-master/2379/

No tests ran.

Build Log:
[...truncated 17795 lines...]
BUILD FAILED
/x1/jenkins/jenkins-slave/workspace/Lucene-Solr-Maven-master/build.xml:672: The following error occurred while executing this line:
/x1/jenkins/jenkins-slave/workspace/Lucene-Solr-Maven-master/build.xml:209: The following error occurred while executing this line:
/x1/jenkins/jenkins-slave/workspace/Lucene-Solr-Maven-master/lucene/build.xml:404: The following error occurred while executing this line:
/x1/jenkins/jenkins-slave/workspace/Lucene-Solr-Maven-master/lucene/common-build.xml:650: Error deploying artifact 'org.apache.lucene:lucene-solr-grandparent:pom': Error deploying artifact: Failed to transfer file: https://repository.apache.org/content/repositories/snapshots/org/apache/lucene/lucene-solr-grandparent/8.0.0-SNAPSHOT/lucene-solr-grandparent-8.0.0-20181011.124109-239.pom. Return code is: 401

Total time: 7 minutes 3 seconds
Build step 'Invoke Ant' marked build as failure
Email was triggered for: Failure - Any
Sending email for trigger: Failure - Any


---------------------------------------------------------------------
To unsubscribe, e-mail: [hidden email]
For additional commands, e-mail: [hidden email]