[JENKINS-MAVEN] Lucene-Solr-Maven-master #2538: POMs out of sync

classic Classic list List threaded Threaded
21 messages Options
12
Reply | Threaded
Open this post in threaded view
|

[JENKINS-MAVEN] Lucene-Solr-Maven-master #2538: POMs out of sync

Apache Jenkins Server-2
Build: https://builds.apache.org/job/Lucene-Solr-Maven-master/2538/

No tests ran.

Build Log:
[...truncated 18070 lines...]
BUILD FAILED
/x1/jenkins/jenkins-slave/workspace/Lucene-Solr-Maven-master/build.xml:672: The following error occurred while executing this line:
/x1/jenkins/jenkins-slave/workspace/Lucene-Solr-Maven-master/build.xml:209: The following error occurred while executing this line:
/x1/jenkins/jenkins-slave/workspace/Lucene-Solr-Maven-master/lucene/build.xml:408: The following error occurred while executing this line:
/x1/jenkins/jenkins-slave/workspace/Lucene-Solr-Maven-master/lucene/common-build.xml:1707: The following error occurred while executing this line:
/x1/jenkins/jenkins-slave/workspace/Lucene-Solr-Maven-master/lucene/common-build.xml:579: Error deploying artifact 'org.apache.lucene:lucene-core:jar': Error deploying artifact: Error transferring file

Total time: 9 minutes 5 seconds
Build step 'Invoke Ant' marked build as failure
Email was triggered for: Failure - Any
Sending email for trigger: Failure - Any


---------------------------------------------------------------------
To unsubscribe, e-mail: [hidden email]
For additional commands, e-mail: [hidden email]
Reply | Threaded
Open this post in threaded view
|

[JENKINS-MAVEN] Lucene-Solr-Maven-master #2539: POMs out of sync

Apache Jenkins Server-2
Build: https://builds.apache.org/job/Lucene-Solr-Maven-master/2539/

No tests ran.

Build Log:
[...truncated 18055 lines...]
BUILD FAILED
/x1/jenkins/jenkins-slave/workspace/Lucene-Solr-Maven-master/build.xml:672: The following error occurred while executing this line:
/x1/jenkins/jenkins-slave/workspace/Lucene-Solr-Maven-master/build.xml:209: The following error occurred while executing this line:
/x1/jenkins/jenkins-slave/workspace/Lucene-Solr-Maven-master/lucene/build.xml:408: The following error occurred while executing this line:
/x1/jenkins/jenkins-slave/workspace/Lucene-Solr-Maven-master/lucene/common-build.xml:1707: The following error occurred while executing this line:
/x1/jenkins/jenkins-slave/workspace/Lucene-Solr-Maven-master/lucene/common-build.xml:579: Error deploying artifact 'org.apache.lucene:lucene-core:jar': Error installing artifact's metadata: repository metadata for: 'artifact org.apache.lucene:lucene-core' could not be retrieved from repository: apache.snapshots.https due to an error: Error transferring file: Connection refused (Connection refused)

Total time: 8 minutes 57 seconds
Build step 'Invoke Ant' marked build as failure
Email was triggered for: Failure - Any
Sending email for trigger: Failure - Any


---------------------------------------------------------------------
To unsubscribe, e-mail: [hidden email]
For additional commands, e-mail: [hidden email]
Reply | Threaded
Open this post in threaded view
|

[JENKINS-MAVEN] Lucene-Solr-Maven-master #2540: POMs out of sync

Apache Jenkins Server-2
Build: https://builds.apache.org/job/Lucene-Solr-Maven-master/2540/

No tests ran.

Build Log:
[...truncated 18200 lines...]
BUILD FAILED
/home/jenkins/jenkins-slave/workspace/Lucene-Solr-Maven-master/build.xml:673: The following error occurred while executing this line:
/home/jenkins/jenkins-slave/workspace/Lucene-Solr-Maven-master/build.xml:209: The following error occurred while executing this line:
/home/jenkins/jenkins-slave/workspace/Lucene-Solr-Maven-master/lucene/build.xml:408: The following error occurred while executing this line:
/home/jenkins/jenkins-slave/workspace/Lucene-Solr-Maven-master/lucene/common-build.xml:1648: The following error occurred while executing this line:
/home/jenkins/jenkins-slave/workspace/Lucene-Solr-Maven-master/lucene/common-build.xml:581: Error deploying artifact 'org.apache.lucene:lucene-test-framework:jar': Error installing artifact's metadata: repository metadata for: 'artifact org.apache.lucene:lucene-test-framework' could not be retrieved from repository: apache.snapshots.https due to an error: Error transferring file: Connection refused (Connection refused)

Total time: 17 minutes 38 seconds
Build step 'Invoke Ant' marked build as failure
Email was triggered for: Failure - Any
Sending email for trigger: Failure - Any


---------------------------------------------------------------------
To unsubscribe, e-mail: [hidden email]
For additional commands, e-mail: [hidden email]
Reply | Threaded
Open this post in threaded view
|

[JENKINS-MAVEN] Lucene-Solr-Maven-master #2541: POMs out of sync

Apache Jenkins Server-2
Build: https://builds.apache.org/job/Lucene-Solr-Maven-master/2541/

No tests ran.

Build Log:
[...truncated 18054 lines...]
BUILD FAILED
/home/jenkins/jenkins-slave/workspace/Lucene-Solr-Maven-master/build.xml:673: The following error occurred while executing this line:
/home/jenkins/jenkins-slave/workspace/Lucene-Solr-Maven-master/build.xml:209: The following error occurred while executing this line:
/home/jenkins/jenkins-slave/workspace/Lucene-Solr-Maven-master/lucene/build.xml:408: The following error occurred while executing this line:
/home/jenkins/jenkins-slave/workspace/Lucene-Solr-Maven-master/lucene/common-build.xml:1709: The following error occurred while executing this line:
/home/jenkins/jenkins-slave/workspace/Lucene-Solr-Maven-master/lucene/common-build.xml:581: Error deploying artifact 'org.apache.lucene:lucene-core:jar': Error deploying artifact: Error transferring file

Total time: 15 minutes 14 seconds
Build step 'Invoke Ant' marked build as failure
Email was triggered for: Failure - Any
Sending email for trigger: Failure - Any


---------------------------------------------------------------------
To unsubscribe, e-mail: [hidden email]
For additional commands, e-mail: [hidden email]
Reply | Threaded
Open this post in threaded view
|

[JENKINS-MAVEN] Lucene-Solr-Maven-master #2542: POMs out of sync

Apache Jenkins Server-2
Build: https://builds.apache.org/job/Lucene-Solr-Maven-master/2542/

No tests ran.

Build Log:
[...truncated 18063 lines...]
BUILD FAILED
/x1/jenkins/jenkins-slave/workspace/Lucene-Solr-Maven-master/build.xml:673: The following error occurred while executing this line:
/x1/jenkins/jenkins-slave/workspace/Lucene-Solr-Maven-master/build.xml:209: The following error occurred while executing this line:
/x1/jenkins/jenkins-slave/workspace/Lucene-Solr-Maven-master/lucene/build.xml:408: The following error occurred while executing this line:
/x1/jenkins/jenkins-slave/workspace/Lucene-Solr-Maven-master/lucene/common-build.xml:1709: The following error occurred while executing this line:
/x1/jenkins/jenkins-slave/workspace/Lucene-Solr-Maven-master/lucene/common-build.xml:581: Error deploying artifact 'org.apache.lucene:lucene-core:jar': Error deploying artifact: Error transferring file

Total time: 8 minutes 28 seconds
Build step 'Invoke Ant' marked build as failure
Email was triggered for: Failure - Any
Sending email for trigger: Failure - Any


---------------------------------------------------------------------
To unsubscribe, e-mail: [hidden email]
For additional commands, e-mail: [hidden email]
Reply | Threaded
Open this post in threaded view
|

[JENKINS-MAVEN] Lucene-Solr-Maven-master #2543: POMs out of sync

Apache Jenkins Server-2
Build: https://builds.apache.org/job/Lucene-Solr-Maven-master/2543/

No tests ran.

Build Log:
[...truncated 18055 lines...]
BUILD FAILED
/x1/jenkins/jenkins-slave/workspace/Lucene-Solr-Maven-master/build.xml:673: The following error occurred while executing this line:
/x1/jenkins/jenkins-slave/workspace/Lucene-Solr-Maven-master/build.xml:209: The following error occurred while executing this line:
/x1/jenkins/jenkins-slave/workspace/Lucene-Solr-Maven-master/lucene/build.xml:408: The following error occurred while executing this line:
/x1/jenkins/jenkins-slave/workspace/Lucene-Solr-Maven-master/lucene/common-build.xml:1709: The following error occurred while executing this line:
/x1/jenkins/jenkins-slave/workspace/Lucene-Solr-Maven-master/lucene/common-build.xml:581: Error deploying artifact 'org.apache.lucene:lucene-core:jar': Error installing artifact's metadata: Error while deploying metadata: Error transferring file

Total time: 8 minutes 42 seconds
Build step 'Invoke Ant' marked build as failure
Email was triggered for: Failure - Any
Sending email for trigger: Failure - Any


---------------------------------------------------------------------
To unsubscribe, e-mail: [hidden email]
For additional commands, e-mail: [hidden email]
Reply | Threaded
Open this post in threaded view
|

[JENKINS-MAVEN] Lucene-Solr-Maven-master #2544: POMs out of sync

Apache Jenkins Server-2
Build: https://builds.apache.org/job/Lucene-Solr-Maven-master/2544/

No tests ran.

Build Log:
[...truncated 18055 lines...]
BUILD FAILED
/x1/jenkins/jenkins-slave/workspace/Lucene-Solr-Maven-master/build.xml:673: The following error occurred while executing this line:
/x1/jenkins/jenkins-slave/workspace/Lucene-Solr-Maven-master/build.xml:209: The following error occurred while executing this line:
/x1/jenkins/jenkins-slave/workspace/Lucene-Solr-Maven-master/lucene/build.xml:408: The following error occurred while executing this line:
/x1/jenkins/jenkins-slave/workspace/Lucene-Solr-Maven-master/lucene/common-build.xml:1709: The following error occurred while executing this line:
/x1/jenkins/jenkins-slave/workspace/Lucene-Solr-Maven-master/lucene/common-build.xml:581: Error deploying artifact 'org.apache.lucene:lucene-core:jar': Error installing artifact's metadata: Error while deploying metadata: Error transferring file

Total time: 9 minutes 3 seconds
Build step 'Invoke Ant' marked build as failure
Email was triggered for: Failure - Any
Sending email for trigger: Failure - Any


---------------------------------------------------------------------
To unsubscribe, e-mail: [hidden email]
For additional commands, e-mail: [hidden email]
Reply | Threaded
Open this post in threaded view
|

[JENKINS-MAVEN] Lucene-Solr-Maven-master #2545: POMs out of sync

Apache Jenkins Server-2
Build: https://builds.apache.org/job/Lucene-Solr-Maven-master/2545/

No tests ran.

Build Log:
[...truncated 18070 lines...]
BUILD FAILED
/x1/jenkins/jenkins-slave/workspace/Lucene-Solr-Maven-master/build.xml:673: The following error occurred while executing this line:
/x1/jenkins/jenkins-slave/workspace/Lucene-Solr-Maven-master/build.xml:209: The following error occurred while executing this line:
/x1/jenkins/jenkins-slave/workspace/Lucene-Solr-Maven-master/lucene/build.xml:408: The following error occurred while executing this line:
/x1/jenkins/jenkins-slave/workspace/Lucene-Solr-Maven-master/lucene/common-build.xml:1709: The following error occurred while executing this line:
/x1/jenkins/jenkins-slave/workspace/Lucene-Solr-Maven-master/lucene/common-build.xml:581: Error deploying artifact 'org.apache.lucene:lucene-core:jar': Error deploying artifact: Error transferring file

Total time: 8 minutes 57 seconds
Build step 'Invoke Ant' marked build as failure
Email was triggered for: Failure - Any
Sending email for trigger: Failure - Any


---------------------------------------------------------------------
To unsubscribe, e-mail: [hidden email]
For additional commands, e-mail: [hidden email]
Reply | Threaded
Open this post in threaded view
|

[JENKINS-MAVEN] Lucene-Solr-Maven-master #2546: POMs out of sync

Apache Jenkins Server-2
Build: https://builds.apache.org/job/Lucene-Solr-Maven-master/2546/

No tests ran.

Build Log:
[...truncated 18054 lines...]
BUILD FAILED
/x1/jenkins/jenkins-slave/workspace/Lucene-Solr-Maven-master/build.xml:673: The following error occurred while executing this line:
/x1/jenkins/jenkins-slave/workspace/Lucene-Solr-Maven-master/build.xml:209: The following error occurred while executing this line:
/x1/jenkins/jenkins-slave/workspace/Lucene-Solr-Maven-master/lucene/build.xml:408: The following error occurred while executing this line:
/x1/jenkins/jenkins-slave/workspace/Lucene-Solr-Maven-master/lucene/common-build.xml:1709: The following error occurred while executing this line:
/x1/jenkins/jenkins-slave/workspace/Lucene-Solr-Maven-master/lucene/common-build.xml:581: Error deploying artifact 'org.apache.lucene:lucene-core:jar': Error deploying artifact: Error transferring file

Total time: 8 minutes 49 seconds
Build step 'Invoke Ant' marked build as failure
Email was triggered for: Failure - Any
Sending email for trigger: Failure - Any


---------------------------------------------------------------------
To unsubscribe, e-mail: [hidden email]
For additional commands, e-mail: [hidden email]
Reply | Threaded
Open this post in threaded view
|

[JENKINS-MAVEN] Lucene-Solr-Maven-master #2547: POMs out of sync

Apache Jenkins Server-2
Build: https://builds.apache.org/job/Lucene-Solr-Maven-master/2547/

No tests ran.

Build Log:
[...truncated 18071 lines...]
BUILD FAILED
/home/jenkins/jenkins-slave/workspace/Lucene-Solr-Maven-master/build.xml:673: The following error occurred while executing this line:
/home/jenkins/jenkins-slave/workspace/Lucene-Solr-Maven-master/build.xml:209: The following error occurred while executing this line:
/home/jenkins/jenkins-slave/workspace/Lucene-Solr-Maven-master/lucene/build.xml:408: The following error occurred while executing this line:
/home/jenkins/jenkins-slave/workspace/Lucene-Solr-Maven-master/lucene/common-build.xml:1709: The following error occurred while executing this line:
/home/jenkins/jenkins-slave/workspace/Lucene-Solr-Maven-master/lucene/common-build.xml:581: Error deploying artifact 'org.apache.lucene:lucene-core:jar': Error installing artifact's metadata: repository metadata for: 'artifact org.apache.lucene:lucene-core' could not be retrieved from repository: apache.snapshots.https due to an error: Error transferring file: Connection refused (Connection refused)

Total time: 15 minutes 48 seconds
Build step 'Invoke Ant' marked build as failure
Email was triggered for: Failure - Any
Sending email for trigger: Failure - Any


---------------------------------------------------------------------
To unsubscribe, e-mail: [hidden email]
For additional commands, e-mail: [hidden email]
Reply | Threaded
Open this post in threaded view
|

[JENKINS-MAVEN] Lucene-Solr-Maven-master #2548: POMs out of sync

Apache Jenkins Server-2
Build: https://builds.apache.org/job/Lucene-Solr-Maven-master/2548/

No tests ran.

Build Log:
[...truncated 18054 lines...]
BUILD FAILED
/home/jenkins/jenkins-slave/workspace/Lucene-Solr-Maven-master/build.xml:673: The following error occurred while executing this line:
/home/jenkins/jenkins-slave/workspace/Lucene-Solr-Maven-master/build.xml:209: The following error occurred while executing this line:
/home/jenkins/jenkins-slave/workspace/Lucene-Solr-Maven-master/lucene/build.xml:408: The following error occurred while executing this line:
/home/jenkins/jenkins-slave/workspace/Lucene-Solr-Maven-master/lucene/common-build.xml:1709: The following error occurred while executing this line:
/home/jenkins/jenkins-slave/workspace/Lucene-Solr-Maven-master/lucene/common-build.xml:581: Error deploying artifact 'org.apache.lucene:lucene-core:jar': Error deploying artifact: Error transferring file

Total time: 15 minutes 12 seconds
Build step 'Invoke Ant' marked build as failure
Email was triggered for: Failure - Any
Sending email for trigger: Failure - Any


---------------------------------------------------------------------
To unsubscribe, e-mail: [hidden email]
For additional commands, e-mail: [hidden email]
Reply | Threaded
Open this post in threaded view
|

[JENKINS-MAVEN] Lucene-Solr-Maven-master #2549: POMs out of sync

Apache Jenkins Server-2
Build: https://builds.apache.org/job/Lucene-Solr-Maven-master/2549/

No tests ran.

Build Log:
[...truncated 18103 lines...]
BUILD FAILED
/x1/jenkins/jenkins-slave/workspace/Lucene-Solr-Maven-master/build.xml:673: The following error occurred while executing this line:
/x1/jenkins/jenkins-slave/workspace/Lucene-Solr-Maven-master/build.xml:209: The following error occurred while executing this line:
/x1/jenkins/jenkins-slave/workspace/Lucene-Solr-Maven-master/lucene/build.xml:408: The following error occurred while executing this line:
/x1/jenkins/jenkins-slave/workspace/Lucene-Solr-Maven-master/lucene/common-build.xml:1648: The following error occurred while executing this line:
/x1/jenkins/jenkins-slave/workspace/Lucene-Solr-Maven-master/lucene/common-build.xml:581: Error deploying artifact 'org.apache.lucene:lucene-test-framework:jar': Error installing artifact's metadata: repository metadata for: 'artifact org.apache.lucene:lucene-test-framework' could not be retrieved from repository: apache.snapshots.https due to an error: Error transferring file: Connection refused (Connection refused)

Total time: 9 minutes 2 seconds
Build step 'Invoke Ant' marked build as failure
Email was triggered for: Failure - Any
Sending email for trigger: Failure - Any


---------------------------------------------------------------------
To unsubscribe, e-mail: [hidden email]
For additional commands, e-mail: [hidden email]
Reply | Threaded
Open this post in threaded view
|

[JENKINS-MAVEN] Lucene-Solr-Maven-master #2550: POMs out of sync

Apache Jenkins Server-2
Build: https://builds.apache.org/job/Lucene-Solr-Maven-master/2550/

No tests ran.

Build Log:
[...truncated 18175 lines...]
BUILD FAILED
/x1/jenkins/jenkins-slave/workspace/Lucene-Solr-Maven-master/build.xml:673: The following error occurred while executing this line:
/x1/jenkins/jenkins-slave/workspace/Lucene-Solr-Maven-master/build.xml:209: The following error occurred while executing this line:
/x1/jenkins/jenkins-slave/workspace/Lucene-Solr-Maven-master/lucene/build.xml:413: The following error occurred while executing this line:
/x1/jenkins/jenkins-slave/workspace/Lucene-Solr-Maven-master/lucene/common-build.xml:2180: The following error occurred while executing this line:
/x1/jenkins/jenkins-slave/workspace/Lucene-Solr-Maven-master/lucene/analysis/build.xml:129: The following error occurred while executing this line:
/x1/jenkins/jenkins-slave/workspace/Lucene-Solr-Maven-master/lucene/analysis/build.xml:38: The following error occurred while executing this line:
/x1/jenkins/jenkins-slave/workspace/Lucene-Solr-Maven-master/lucene/common-build.xml:1648: The following error occurred while executing this line:
/x1/jenkins/jenkins-slave/workspace/Lucene-Solr-Maven-master/lucene/common-build.xml:581: Error deploying artifact 'org.apache.lucene:lucene-analyzers-common:jar': Error installing artifact's metadata: Error while deploying metadata: Error transferring file

Total time: 9 minutes 4 seconds
Build step 'Invoke Ant' marked build as failure
Email was triggered for: Failure - Any
Sending email for trigger: Failure - Any


---------------------------------------------------------------------
To unsubscribe, e-mail: [hidden email]
For additional commands, e-mail: [hidden email]
Reply | Threaded
Open this post in threaded view
|

[JENKINS-MAVEN] Lucene-Solr-Maven-master #2551: POMs out of sync

Apache Jenkins Server-2
Build: https://builds.apache.org/job/Lucene-Solr-Maven-master/2551/

No tests ran.

Build Log:
[...truncated 18064 lines...]
BUILD FAILED
/home/jenkins/jenkins-slave/workspace/Lucene-Solr-Maven-master/build.xml:673: The following error occurred while executing this line:
/home/jenkins/jenkins-slave/workspace/Lucene-Solr-Maven-master/build.xml:209: The following error occurred while executing this line:
/home/jenkins/jenkins-slave/workspace/Lucene-Solr-Maven-master/lucene/build.xml:408: The following error occurred while executing this line:
/home/jenkins/jenkins-slave/workspace/Lucene-Solr-Maven-master/lucene/common-build.xml:1709: The following error occurred while executing this line:
/home/jenkins/jenkins-slave/workspace/Lucene-Solr-Maven-master/lucene/common-build.xml:581: Error deploying artifact 'org.apache.lucene:lucene-core:jar': Error retrieving previous build number for artifact 'org.apache.lucene:lucene-core:jar:javadoc': repository metadata for: 'snapshot org.apache.lucene:lucene-core:9.0.0-SNAPSHOT' could not be retrieved from repository: apache.snapshots.https due to an error: Error transferring file: Connection refused (Connection refused)

Total time: 15 minutes 21 seconds
Build step 'Invoke Ant' marked build as failure
Email was triggered for: Failure - Any
Sending email for trigger: Failure - Any


---------------------------------------------------------------------
To unsubscribe, e-mail: [hidden email]
For additional commands, e-mail: [hidden email]
Reply | Threaded
Open this post in threaded view
|

[JENKINS-MAVEN] Lucene-Solr-Maven-master #2552: POMs out of sync

Apache Jenkins Server-2
Build: https://builds.apache.org/job/Lucene-Solr-Maven-master/2552/

No tests ran.

Build Log:
[...truncated 18055 lines...]
BUILD FAILED
/x1/jenkins/jenkins-slave/workspace/Lucene-Solr-Maven-master/build.xml:673: The following error occurred while executing this line:
/x1/jenkins/jenkins-slave/workspace/Lucene-Solr-Maven-master/build.xml:209: The following error occurred while executing this line:
/x1/jenkins/jenkins-slave/workspace/Lucene-Solr-Maven-master/lucene/build.xml:408: The following error occurred while executing this line:
/x1/jenkins/jenkins-slave/workspace/Lucene-Solr-Maven-master/lucene/common-build.xml:1709: The following error occurred while executing this line:
/x1/jenkins/jenkins-slave/workspace/Lucene-Solr-Maven-master/lucene/common-build.xml:581: Error deploying artifact 'org.apache.lucene:lucene-core:jar': Error deploying artifact: Error transferring file

Total time: 8 minutes 57 seconds
Build step 'Invoke Ant' marked build as failure
Email was triggered for: Failure - Any
Sending email for trigger: Failure - Any


---------------------------------------------------------------------
To unsubscribe, e-mail: [hidden email]
For additional commands, e-mail: [hidden email]
Reply | Threaded
Open this post in threaded view
|

[JENKINS-MAVEN] Lucene-Solr-Maven-master #2553: POMs out of sync

Apache Jenkins Server-2
Build: https://builds.apache.org/job/Lucene-Solr-Maven-master/2553/

No tests ran.

Build Log:
[...truncated 18055 lines...]
BUILD FAILED
/home/jenkins/jenkins-slave/workspace/Lucene-Solr-Maven-master/build.xml:673: The following error occurred while executing this line:
/home/jenkins/jenkins-slave/workspace/Lucene-Solr-Maven-master/build.xml:209: The following error occurred while executing this line:
/home/jenkins/jenkins-slave/workspace/Lucene-Solr-Maven-master/lucene/build.xml:408: The following error occurred while executing this line:
/home/jenkins/jenkins-slave/workspace/Lucene-Solr-Maven-master/lucene/common-build.xml:1709: The following error occurred while executing this line:
/home/jenkins/jenkins-slave/workspace/Lucene-Solr-Maven-master/lucene/common-build.xml:581: Error deploying artifact 'org.apache.lucene:lucene-core:jar': Error deploying artifact: Error transferring file

Total time: 19 minutes 6 seconds
Build step 'Invoke Ant' marked build as failure
Email was triggered for: Failure - Any
Sending email for trigger: Failure - Any


---------------------------------------------------------------------
To unsubscribe, e-mail: [hidden email]
For additional commands, e-mail: [hidden email]
Reply | Threaded
Open this post in threaded view
|

[JENKINS-MAVEN] Lucene-Solr-Maven-master #2554: POMs out of sync

Apache Jenkins Server-2
Build: https://builds.apache.org/job/Lucene-Solr-Maven-master/2554/

No tests ran.

Build Log:
[...truncated 18055 lines...]
BUILD FAILED
/x1/jenkins/jenkins-slave/workspace/Lucene-Solr-Maven-master/build.xml:673: The following error occurred while executing this line:
/x1/jenkins/jenkins-slave/workspace/Lucene-Solr-Maven-master/build.xml:209: The following error occurred while executing this line:
/x1/jenkins/jenkins-slave/workspace/Lucene-Solr-Maven-master/lucene/build.xml:408: The following error occurred while executing this line:
/x1/jenkins/jenkins-slave/workspace/Lucene-Solr-Maven-master/lucene/common-build.xml:1709: The following error occurred while executing this line:
/x1/jenkins/jenkins-slave/workspace/Lucene-Solr-Maven-master/lucene/common-build.xml:581: Error deploying artifact 'org.apache.lucene:lucene-core:jar': Error deploying artifact: Error transferring file

Total time: 8 minutes 53 seconds
Build step 'Invoke Ant' marked build as failure
Email was triggered for: Failure - Any
Sending email for trigger: Failure - Any


---------------------------------------------------------------------
To unsubscribe, e-mail: [hidden email]
For additional commands, e-mail: [hidden email]
Reply | Threaded
Open this post in threaded view
|

[JENKINS-MAVEN] Lucene-Solr-Maven-master #2555: POMs out of sync

Apache Jenkins Server-2
Build: https://builds.apache.org/job/Lucene-Solr-Maven-master/2555/

No tests ran.

Build Log:
[...truncated 18056 lines...]
BUILD FAILED
/home/jenkins/jenkins-slave/workspace/Lucene-Solr-Maven-master/build.xml:673: The following error occurred while executing this line:
/home/jenkins/jenkins-slave/workspace/Lucene-Solr-Maven-master/build.xml:209: The following error occurred while executing this line:
/home/jenkins/jenkins-slave/workspace/Lucene-Solr-Maven-master/lucene/build.xml:408: The following error occurred while executing this line:
/home/jenkins/jenkins-slave/workspace/Lucene-Solr-Maven-master/lucene/common-build.xml:1709: The following error occurred while executing this line:
/home/jenkins/jenkins-slave/workspace/Lucene-Solr-Maven-master/lucene/common-build.xml:581: Error deploying artifact 'org.apache.lucene:lucene-core:jar': Error installing artifact's metadata: repository metadata for: 'artifact org.apache.lucene:lucene-core' could not be retrieved from repository: apache.snapshots.https due to an error: Error transferring file: Connection refused (Connection refused)

Total time: 15 minutes 31 seconds
Build step 'Invoke Ant' marked build as failure
Email was triggered for: Failure - Any
Sending email for trigger: Failure - Any


---------------------------------------------------------------------
To unsubscribe, e-mail: [hidden email]
For additional commands, e-mail: [hidden email]
Reply | Threaded
Open this post in threaded view
|

[JENKINS-MAVEN] Lucene-Solr-Maven-master #2556: POMs out of sync

Apache Jenkins Server-2
Build: https://builds.apache.org/job/Lucene-Solr-Maven-master/2556/

No tests ran.

Build Log:
[...truncated 18056 lines...]
BUILD FAILED
/x1/jenkins/jenkins-slave/workspace/Lucene-Solr-Maven-master/build.xml:673: The following error occurred while executing this line:
/x1/jenkins/jenkins-slave/workspace/Lucene-Solr-Maven-master/build.xml:209: The following error occurred while executing this line:
/x1/jenkins/jenkins-slave/workspace/Lucene-Solr-Maven-master/lucene/build.xml:408: The following error occurred while executing this line:
/x1/jenkins/jenkins-slave/workspace/Lucene-Solr-Maven-master/lucene/common-build.xml:1709: The following error occurred while executing this line:
/x1/jenkins/jenkins-slave/workspace/Lucene-Solr-Maven-master/lucene/common-build.xml:581: Error deploying artifact 'org.apache.lucene:lucene-core:jar': Error installing artifact's metadata: Error while deploying metadata: Error transferring file

Total time: 9 minutes 4 seconds
Build step 'Invoke Ant' marked build as failure
Email was triggered for: Failure - Any
Sending email for trigger: Failure - Any


---------------------------------------------------------------------
To unsubscribe, e-mail: [hidden email]
For additional commands, e-mail: [hidden email]
Reply | Threaded
Open this post in threaded view
|

[JENKINS-MAVEN] Lucene-Solr-Maven-master #2557: POMs out of sync

Apache Jenkins Server-2
Build: https://builds.apache.org/job/Lucene-Solr-Maven-master/2557/

No tests ran.

Build Log:
[...truncated 18104 lines...]
BUILD FAILED
/x1/jenkins/jenkins-slave/workspace/Lucene-Solr-Maven-master/build.xml:673: The following error occurred while executing this line:
/x1/jenkins/jenkins-slave/workspace/Lucene-Solr-Maven-master/build.xml:209: The following error occurred while executing this line:
/x1/jenkins/jenkins-slave/workspace/Lucene-Solr-Maven-master/lucene/build.xml:408: The following error occurred while executing this line:
/x1/jenkins/jenkins-slave/workspace/Lucene-Solr-Maven-master/lucene/common-build.xml:1648: The following error occurred while executing this line:
/x1/jenkins/jenkins-slave/workspace/Lucene-Solr-Maven-master/lucene/common-build.xml:581: Error deploying artifact 'org.apache.lucene:lucene-test-framework:jar': Error installing artifact's metadata: Error while deploying metadata: Error transferring file

Total time: 8 minutes 58 seconds
Build step 'Invoke Ant' marked build as failure
Email was triggered for: Failure - Any
Sending email for trigger: Failure - Any


---------------------------------------------------------------------
To unsubscribe, e-mail: [hidden email]
For additional commands, e-mail: [hidden email]
12