[JENKINS-MAVEN] Lucene-Solr-Maven-trunk #553: POMs out of sync

classic Classic list List threaded Threaded
3 messages Options
Reply | Threaded
Open this post in threaded view
|

[JENKINS-MAVEN] Lucene-Solr-Maven-trunk #553: POMs out of sync

Apache Jenkins Server-2
Build: https://builds.apache.org/job/Lucene-Solr-Maven-trunk/553/

5 tests failed.
FAILED:  org.apache.lucene.index.TestPostingsFormat.test

Error Message:
Thread threw an uncaught exception, thread: Thread[Thread-1101,5,]

Stack Trace:
java.lang.RuntimeException: Thread threw an uncaught exception, thread: Thread[Thread-1101,5,]
        at com.carrotsearch.randomizedtesting.RunnerThreadGroup.processUncaught(RunnerThreadGroup.java:96)
        at com.carrotsearch.randomizedtesting.RandomizedRunner.runSingleTest(RandomizedRunner.java:859)
        at com.carrotsearch.randomizedtesting.RandomizedRunner.access$700(RandomizedRunner.java:132)
        at com.carrotsearch.randomizedtesting.RandomizedRunner$3$1.run(RandomizedRunner.java:671)
        at com.carrotsearch.randomizedtesting.RandomizedRunner$3.evaluate(RandomizedRunner.java:697)
        at com.carrotsearch.randomizedtesting.RandomizedRunner$4.evaluate(RandomizedRunner.java:736)
        at com.carrotsearch.randomizedtesting.RandomizedRunner$5.evaluate(RandomizedRunner.java:747)
        at org.apache.lucene.util.AbstractBeforeAfterRule$1.evaluate(AbstractBeforeAfterRule.java:45)
        at org.apache.lucene.util.TestRuleReportUncaughtExceptions$1.evaluate(TestRuleReportUncaughtExceptions.java:68)
        at org.apache.lucene.util.TestRuleStoreClassName$1.evaluate(TestRuleStoreClassName.java:38)
        at org.apache.lucene.util.TestRuleIcuHack$1.evaluate(TestRuleIcuHack.java:51)
        at com.carrotsearch.randomizedtesting.rules.SystemPropertiesInvariantRule$1.evaluate(SystemPropertiesInvariantRule.java:55)
        at org.apache.lucene.util.TestRuleNoInstanceHooksOverrides$1.evaluate(TestRuleNoInstanceHooksOverrides.java:53)
        at org.apache.lucene.util.TestRuleNoStaticHooksShadowing$1.evaluate(TestRuleNoStaticHooksShadowing.java:52)
        at org.apache.lucene.util.TestRuleAssertionsRequired$1.evaluate(TestRuleAssertionsRequired.java:36)
        at org.apache.lucene.util.TestRuleMarkFailure$1.evaluate(TestRuleMarkFailure.java:48)
        at org.apache.lucene.util.TestRuleIgnoreAfterMaxFailures$1.evaluate(TestRuleIgnoreAfterMaxFailures.java:70)
        at org.apache.lucene.util.TestRuleIgnoreTestSuites$1.evaluate(TestRuleIgnoreTestSuites.java:55)
        at com.carrotsearch.randomizedtesting.RandomizedRunner.runSuite(RandomizedRunner.java:605)
        at com.carrotsearch.randomizedtesting.RandomizedRunner.access$400(RandomizedRunner.java:132)
        at com.carrotsearch.randomizedtesting.RandomizedRunner$2.run(RandomizedRunner.java:551)
Caused by: java.lang.RuntimeException: java.lang.AssertionError: startOffset isn't -1 expected:<-1> but was:<68>
        at __randomizedtesting.SeedInfo.seed([84B6520D8F1B01BD]:0)
        at org.apache.lucene.index.TestPostingsFormat$1.run(TestPostingsFormat.java:761)
Caused by: java.lang.AssertionError: startOffset isn't -1 expected:<-1> but was:<68>
        at org.junit.Assert.fail(Assert.java:93)
        at org.junit.Assert.failNotEquals(Assert.java:647)
        at org.junit.Assert.assertEquals(Assert.java:128)
        at org.junit.Assert.assertEquals(Assert.java:472)
        at org.apache.lucene.index.TestPostingsFormat.verifyEnum(TestPostingsFormat.java:741)
        at org.apache.lucene.index.TestPostingsFormat.testTermsOneThread(TestPostingsFormat.java:828)
        at org.apache.lucene.index.TestPostingsFormat.access$200(TestPostingsFormat.java:73)
        at org.apache.lucene.index.TestPostingsFormat$1.run(TestPostingsFormat.java:759)


FAILED:  org.apache.lucene.index.TestPostingsFormat.test

Error Message:
Thread threw an uncaught exception, thread: Thread[Thread-1104,5,]

Stack Trace:
java.lang.RuntimeException: Thread threw an uncaught exception, thread: Thread[Thread-1104,5,]
        at com.carrotsearch.randomizedtesting.RunnerThreadGroup.processUncaught(RunnerThreadGroup.java:96)
        at com.carrotsearch.randomizedtesting.RandomizedRunner.runSingleTest(RandomizedRunner.java:859)
        at com.carrotsearch.randomizedtesting.RandomizedRunner.access$700(RandomizedRunner.java:132)
        at com.carrotsearch.randomizedtesting.RandomizedRunner$3$1.run(RandomizedRunner.java:671)
        at com.carrotsearch.randomizedtesting.RandomizedRunner$3.evaluate(RandomizedRunner.java:697)
        at com.carrotsearch.randomizedtesting.RandomizedRunner$4.evaluate(RandomizedRunner.java:736)
        at com.carrotsearch.randomizedtesting.RandomizedRunner$5.evaluate(RandomizedRunner.java:747)
        at org.apache.lucene.util.AbstractBeforeAfterRule$1.evaluate(AbstractBeforeAfterRule.java:45)
        at org.apache.lucene.util.TestRuleReportUncaughtExceptions$1.evaluate(TestRuleReportUncaughtExceptions.java:68)
        at org.apache.lucene.util.TestRuleStoreClassName$1.evaluate(TestRuleStoreClassName.java:38)
        at org.apache.lucene.util.TestRuleIcuHack$1.evaluate(TestRuleIcuHack.java:51)
        at com.carrotsearch.randomizedtesting.rules.SystemPropertiesInvariantRule$1.evaluate(SystemPropertiesInvariantRule.java:55)
        at org.apache.lucene.util.TestRuleNoInstanceHooksOverrides$1.evaluate(TestRuleNoInstanceHooksOverrides.java:53)
        at org.apache.lucene.util.TestRuleNoStaticHooksShadowing$1.evaluate(TestRuleNoStaticHooksShadowing.java:52)
        at org.apache.lucene.util.TestRuleAssertionsRequired$1.evaluate(TestRuleAssertionsRequired.java:36)
        at org.apache.lucene.util.TestRuleMarkFailure$1.evaluate(TestRuleMarkFailure.java:48)
        at org.apache.lucene.util.TestRuleIgnoreAfterMaxFailures$1.evaluate(TestRuleIgnoreAfterMaxFailures.java:70)
        at org.apache.lucene.util.TestRuleIgnoreTestSuites$1.evaluate(TestRuleIgnoreTestSuites.java:55)
        at com.carrotsearch.randomizedtesting.RandomizedRunner.runSuite(RandomizedRunner.java:605)
        at com.carrotsearch.randomizedtesting.RandomizedRunner.access$400(RandomizedRunner.java:132)
        at com.carrotsearch.randomizedtesting.RandomizedRunner$2.run(RandomizedRunner.java:551)
Caused by: java.lang.RuntimeException: java.lang.AssertionError: startOffset isn't -1 expected:<-1> but was:<68>
        at __randomizedtesting.SeedInfo.seed([84B6520D8F1B01BD]:0)
        at org.apache.lucene.index.TestPostingsFormat$1.run(TestPostingsFormat.java:761)
Caused by: java.lang.AssertionError: startOffset isn't -1 expected:<-1> but was:<68>
        at org.junit.Assert.fail(Assert.java:93)
        at org.junit.Assert.failNotEquals(Assert.java:647)
        at org.junit.Assert.assertEquals(Assert.java:128)
        at org.junit.Assert.assertEquals(Assert.java:472)
        at org.apache.lucene.index.TestPostingsFormat.verifyEnum(TestPostingsFormat.java:741)
        at org.apache.lucene.index.TestPostingsFormat.testTermsOneThread(TestPostingsFormat.java:828)
        at org.apache.lucene.index.TestPostingsFormat.access$200(TestPostingsFormat.java:73)
        at org.apache.lucene.index.TestPostingsFormat$1.run(TestPostingsFormat.java:759)


FAILED:  org.apache.lucene.index.TestPostingsFormat.test

Error Message:
Thread threw an uncaught exception, thread: Thread[Thread-1102,5,]

Stack Trace:
java.lang.RuntimeException: Thread threw an uncaught exception, thread: Thread[Thread-1102,5,]
        at com.carrotsearch.randomizedtesting.RunnerThreadGroup.processUncaught(RunnerThreadGroup.java:96)
        at com.carrotsearch.randomizedtesting.RandomizedRunner.runSingleTest(RandomizedRunner.java:859)
        at com.carrotsearch.randomizedtesting.RandomizedRunner.access$700(RandomizedRunner.java:132)
        at com.carrotsearch.randomizedtesting.RandomizedRunner$3$1.run(RandomizedRunner.java:671)
        at com.carrotsearch.randomizedtesting.RandomizedRunner$3.evaluate(RandomizedRunner.java:697)
        at com.carrotsearch.randomizedtesting.RandomizedRunner$4.evaluate(RandomizedRunner.java:736)
        at com.carrotsearch.randomizedtesting.RandomizedRunner$5.evaluate(RandomizedRunner.java:747)
        at org.apache.lucene.util.AbstractBeforeAfterRule$1.evaluate(AbstractBeforeAfterRule.java:45)
        at org.apache.lucene.util.TestRuleReportUncaughtExceptions$1.evaluate(TestRuleReportUncaughtExceptions.java:68)
        at org.apache.lucene.util.TestRuleStoreClassName$1.evaluate(TestRuleStoreClassName.java:38)
        at org.apache.lucene.util.TestRuleIcuHack$1.evaluate(TestRuleIcuHack.java:51)
        at com.carrotsearch.randomizedtesting.rules.SystemPropertiesInvariantRule$1.evaluate(SystemPropertiesInvariantRule.java:55)
        at org.apache.lucene.util.TestRuleNoInstanceHooksOverrides$1.evaluate(TestRuleNoInstanceHooksOverrides.java:53)
        at org.apache.lucene.util.TestRuleNoStaticHooksShadowing$1.evaluate(TestRuleNoStaticHooksShadowing.java:52)
        at org.apache.lucene.util.TestRuleAssertionsRequired$1.evaluate(TestRuleAssertionsRequired.java:36)
        at org.apache.lucene.util.TestRuleMarkFailure$1.evaluate(TestRuleMarkFailure.java:48)
        at org.apache.lucene.util.TestRuleIgnoreAfterMaxFailures$1.evaluate(TestRuleIgnoreAfterMaxFailures.java:70)
        at org.apache.lucene.util.TestRuleIgnoreTestSuites$1.evaluate(TestRuleIgnoreTestSuites.java:55)
        at com.carrotsearch.randomizedtesting.RandomizedRunner.runSuite(RandomizedRunner.java:605)
        at com.carrotsearch.randomizedtesting.RandomizedRunner.access$400(RandomizedRunner.java:132)
        at com.carrotsearch.randomizedtesting.RandomizedRunner$2.run(RandomizedRunner.java:551)
Caused by: java.lang.RuntimeException: java.lang.AssertionError: startOffset isn't -1 expected:<-1> but was:<68>
        at __randomizedtesting.SeedInfo.seed([84B6520D8F1B01BD]:0)
        at org.apache.lucene.index.TestPostingsFormat$1.run(TestPostingsFormat.java:761)
Caused by: java.lang.AssertionError: startOffset isn't -1 expected:<-1> but was:<68>
        at org.junit.Assert.fail(Assert.java:93)
        at org.junit.Assert.failNotEquals(Assert.java:647)
        at org.junit.Assert.assertEquals(Assert.java:128)
        at org.junit.Assert.assertEquals(Assert.java:472)
        at org.apache.lucene.index.TestPostingsFormat.verifyEnum(TestPostingsFormat.java:741)
        at org.apache.lucene.index.TestPostingsFormat.testTermsOneThread(TestPostingsFormat.java:828)
        at org.apache.lucene.index.TestPostingsFormat.access$200(TestPostingsFormat.java:73)
        at org.apache.lucene.index.TestPostingsFormat$1.run(TestPostingsFormat.java:759)


FAILED:  org.apache.lucene.index.TestPostingsFormat.test

Error Message:
Thread threw an uncaught exception, thread: Thread[Thread-1103,5,]

Stack Trace:
java.lang.RuntimeException: Thread threw an uncaught exception, thread: Thread[Thread-1103,5,]
        at com.carrotsearch.randomizedtesting.RunnerThreadGroup.processUncaught(RunnerThreadGroup.java:96)
        at com.carrotsearch.randomizedtesting.RandomizedRunner.runSingleTest(RandomizedRunner.java:859)
        at com.carrotsearch.randomizedtesting.RandomizedRunner.access$700(RandomizedRunner.java:132)
        at com.carrotsearch.randomizedtesting.RandomizedRunner$3$1.run(RandomizedRunner.java:671)
        at com.carrotsearch.randomizedtesting.RandomizedRunner$3.evaluate(RandomizedRunner.java:697)
        at com.carrotsearch.randomizedtesting.RandomizedRunner$4.evaluate(RandomizedRunner.java:736)
        at com.carrotsearch.randomizedtesting.RandomizedRunner$5.evaluate(RandomizedRunner.java:747)
        at org.apache.lucene.util.AbstractBeforeAfterRule$1.evaluate(AbstractBeforeAfterRule.java:45)
        at org.apache.lucene.util.TestRuleReportUncaughtExceptions$1.evaluate(TestRuleReportUncaughtExceptions.java:68)
        at org.apache.lucene.util.TestRuleStoreClassName$1.evaluate(TestRuleStoreClassName.java:38)
        at org.apache.lucene.util.TestRuleIcuHack$1.evaluate(TestRuleIcuHack.java:51)
        at com.carrotsearch.randomizedtesting.rules.SystemPropertiesInvariantRule$1.evaluate(SystemPropertiesInvariantRule.java:55)
        at org.apache.lucene.util.TestRuleNoInstanceHooksOverrides$1.evaluate(TestRuleNoInstanceHooksOverrides.java:53)
        at org.apache.lucene.util.TestRuleNoStaticHooksShadowing$1.evaluate(TestRuleNoStaticHooksShadowing.java:52)
        at org.apache.lucene.util.TestRuleAssertionsRequired$1.evaluate(TestRuleAssertionsRequired.java:36)
        at org.apache.lucene.util.TestRuleMarkFailure$1.evaluate(TestRuleMarkFailure.java:48)
        at org.apache.lucene.util.TestRuleIgnoreAfterMaxFailures$1.evaluate(TestRuleIgnoreAfterMaxFailures.java:70)
        at org.apache.lucene.util.TestRuleIgnoreTestSuites$1.evaluate(TestRuleIgnoreTestSuites.java:55)
        at com.carrotsearch.randomizedtesting.RandomizedRunner.runSuite(RandomizedRunner.java:605)
        at com.carrotsearch.randomizedtesting.RandomizedRunner.access$400(RandomizedRunner.java:132)
        at com.carrotsearch.randomizedtesting.RandomizedRunner$2.run(RandomizedRunner.java:551)
Caused by: java.lang.RuntimeException: java.lang.AssertionError: startOffset isn't -1 expected:<-1> but was:<53>
        at __randomizedtesting.SeedInfo.seed([84B6520D8F1B01BD]:0)
        at org.apache.lucene.index.TestPostingsFormat$1.run(TestPostingsFormat.java:761)
Caused by: java.lang.AssertionError: startOffset isn't -1 expected:<-1> but was:<53>
        at org.junit.Assert.fail(Assert.java:93)
        at org.junit.Assert.failNotEquals(Assert.java:647)
        at org.junit.Assert.assertEquals(Assert.java:128)
        at org.junit.Assert.assertEquals(Assert.java:472)
        at org.apache.lucene.index.TestPostingsFormat.verifyEnum(TestPostingsFormat.java:741)
        at org.apache.lucene.index.TestPostingsFormat.testTermsOneThread(TestPostingsFormat.java:828)
        at org.apache.lucene.index.TestPostingsFormat.access$200(TestPostingsFormat.java:73)
        at org.apache.lucene.index.TestPostingsFormat$1.run(TestPostingsFormat.java:759)


FAILED:  org.apache.lucene.index.TestPostingsFormat.test

Error Message:
Thread threw an uncaught exception, thread: Thread[Thread-1100,5,]

Stack Trace:
java.lang.RuntimeException: Thread threw an uncaught exception, thread: Thread[Thread-1100,5,]
        at com.carrotsearch.randomizedtesting.RunnerThreadGroup.processUncaught(RunnerThreadGroup.java:96)
        at com.carrotsearch.randomizedtesting.RandomizedRunner.runSingleTest(RandomizedRunner.java:859)
        at com.carrotsearch.randomizedtesting.RandomizedRunner.access$700(RandomizedRunner.java:132)
        at com.carrotsearch.randomizedtesting.RandomizedRunner$3$1.run(RandomizedRunner.java:671)
        at com.carrotsearch.randomizedtesting.RandomizedRunner$3.evaluate(RandomizedRunner.java:697)
        at com.carrotsearch.randomizedtesting.RandomizedRunner$4.evaluate(RandomizedRunner.java:736)
        at com.carrotsearch.randomizedtesting.RandomizedRunner$5.evaluate(RandomizedRunner.java:747)
        at org.apache.lucene.util.AbstractBeforeAfterRule$1.evaluate(AbstractBeforeAfterRule.java:45)
        at org.apache.lucene.util.TestRuleReportUncaughtExceptions$1.evaluate(TestRuleReportUncaughtExceptions.java:68)
        at org.apache.lucene.util.TestRuleStoreClassName$1.evaluate(TestRuleStoreClassName.java:38)
        at org.apache.lucene.util.TestRuleIcuHack$1.evaluate(TestRuleIcuHack.java:51)
        at com.carrotsearch.randomizedtesting.rules.SystemPropertiesInvariantRule$1.evaluate(SystemPropertiesInvariantRule.java:55)
        at org.apache.lucene.util.TestRuleNoInstanceHooksOverrides$1.evaluate(TestRuleNoInstanceHooksOverrides.java:53)
        at org.apache.lucene.util.TestRuleNoStaticHooksShadowing$1.evaluate(TestRuleNoStaticHooksShadowing.java:52)
        at org.apache.lucene.util.TestRuleAssertionsRequired$1.evaluate(TestRuleAssertionsRequired.java:36)
        at org.apache.lucene.util.TestRuleMarkFailure$1.evaluate(TestRuleMarkFailure.java:48)
        at org.apache.lucene.util.TestRuleIgnoreAfterMaxFailures$1.evaluate(TestRuleIgnoreAfterMaxFailures.java:70)
        at org.apache.lucene.util.TestRuleIgnoreTestSuites$1.evaluate(TestRuleIgnoreTestSuites.java:55)
        at com.carrotsearch.randomizedtesting.RandomizedRunner.runSuite(RandomizedRunner.java:605)
        at com.carrotsearch.randomizedtesting.RandomizedRunner.access$400(RandomizedRunner.java:132)
        at com.carrotsearch.randomizedtesting.RandomizedRunner$2.run(RandomizedRunner.java:551)
Caused by: java.lang.RuntimeException: java.lang.AssertionError: startOffset isn't -1 expected:<-1> but was:<53>
        at __randomizedtesting.SeedInfo.seed([84B6520D8F1B01BD]:0)
        at org.apache.lucene.index.TestPostingsFormat$1.run(TestPostingsFormat.java:761)
Caused by: java.lang.AssertionError: startOffset isn't -1 expected:<-1> but was:<53>
        at org.junit.Assert.fail(Assert.java:93)
        at org.junit.Assert.failNotEquals(Assert.java:647)
        at org.junit.Assert.assertEquals(Assert.java:128)
        at org.junit.Assert.assertEquals(Assert.java:472)
        at org.apache.lucene.index.TestPostingsFormat.verifyEnum(TestPostingsFormat.java:741)
        at org.apache.lucene.index.TestPostingsFormat.testTermsOneThread(TestPostingsFormat.java:828)
        at org.apache.lucene.index.TestPostingsFormat.access$200(TestPostingsFormat.java:73)
        at org.apache.lucene.index.TestPostingsFormat$1.run(TestPostingsFormat.java:759)




Build Log:
[...truncated 8769 lines...]
Running org.apache.lucene.index.TestPostingsFormat
NOTE: reproduce with: ant test  -Dtestcase=TestPostingsFormat -Dtests.method=test -Dtests.seed=84B6520D8F1B01BD -Dtests.locale=sr -Dtests.timezone=Australia/LHI -Dtests.file.encoding=ISO8859-1
NOTE: test params are: codec=SimpleText, sim=DefaultSimilarity, locale=sr, timezone=Australia/LHI
NOTE: FreeBSD 9.0-RELEASE amd64/Sun Microsystems Inc. 1.6.0_32 (64-bit)/cpus=16,threads=1,free=186608024,total=425000960
NOTE: All tests run in this JVM: [TestOmitNorms, TestGraphTokenizers, TestFSTs, TestDeletionPolicy, Nested, TestMultiValuedNumericRangeQuery, TestOmitPositions, TestAddIndexes, TestFieldCacheRangeFilter, TestDocValuesScoring, TestTermdocPerf, TestBooleanScorer, TestConjunctions, TestRollback, TestParallelCompositeReader, TestSpanExplanations, TestSubScorerFreqs, TestComplexExplanations, TestSearchAfter, TestSearcherManager, TestUTF32ToUTF8, TestSimilarity, TestSegmentReader, TestCharFilter, TestFieldCache, TestBooleanQueryVisitSubscorers, TestBasics, TestMultiFields, TestBitVector, TestBackwardsCompatibility, TestNumericRangeQuery64, TestDocValuesTypeCompatibility, TestTimeLimitingCollector, TestIndexWriterOnDiskFull, TestHugeRamFile, TestCachingWrapperFilter, TestIndexWriterExceptions, TestCachingTokenFilter, TestFieldCacheSanityChecker, TestSpecialOperations, TestMatchAllDocsQuery, TestNumericUtils, TestTypePromotion, TestWindowsMMap, TestSloppyPhraseQuery, TestPayloadNearQuery, TestIndexInput, TestNot, TestTermsEnum2, TestMultiThreadTermVectors, TestTerm, TestTermScorer, TestSpanMultiTermQueryWrapper, TestForceMergeForever, TestSpanFirstQuery, TestRecyclingByteBlockAllocator, TestPackedInts, TestNRTCachingDirectory, TestRandomStoredFields, TestNRTReaderWithThreads, TestSimpleSearchEquivalence, TestDeterminizeLexicon, TestBooleanOr, TestPrefixQuery, TestTwoPhaseCommitTool, TestSizeBoundedForceMerge, TestSnapshotDeletionPolicy, TestCompiledAutomaton, TestDocTermOrds, TestCheckIndex, TestCopyBytes, TestPrefixInBooleanQuery, TestExternalCodecs, TestNumericTokenStream, TestSimpleExplanationsOfNonMatches, TestIsCurrent, TestIntBlockCodec, TestIndexWriterDelete, TestCachingCollector, TestPagedBytes, TestRAMDirectory, TestRollingCharBuffer, TestBooleanQuery, TestDateSort, TestDocument, TestElevationComparator, TestAtomicUpdate, TestIndexWriterCommit, TestFixedBitSet, TestPhrasePrefixQuery, TestExplanations, TestNumericRangeQuery32, Nested1, TestIndexWriterMerging, TestIndexWriterMergePolicy, TestConcurrentMergeScheduler, TestParallelAtomicReader, TestPrefixCodedTerms, TestByteSlices, TestTermVectorsWriter, TestPhraseQuery, TestComplexExplanationsOfNonMatches, TestPositionIncrement, TestIndexWriterUnicode, TestSimilarityBase, TestSameTokenSamePosition, TestStressAdvance, TestDirectory, TestBytesRef, TestByteBlockPool, MultiCollectorTest, TestSortedVIntList, TestOmitTf, TestDisjunctionMaxQuery, TestDoubleBarrelLRUCache, TestPostingsOffsets, TestSearchWithThreads, TestConsistentFieldNumbers, TestBinaryDocument, Test2BPostings, TestSpanExplanationsOfNonMatches, TestVirtualMethod, TestIndexCommit, TestIndexWriter, TestSimpleExplanations, TestTermRangeFilter, TestCharsRef, TestPerSegmentDeletes, TestVersion, TestRamUsageEstimatorOnWildAnimals, TestForTooMuchCloning, TestMockCharFilter, TestTermRangeQuery, TestSort, TestBytesRefHash, TestDateFilter, TestMultiTermQueryRewrites, TestCollectionUtil, TestMaxTermFrequency, TestWildcardRandom, TestTermVectors, TestLucene40PostingsReader, TestMockAnalyzer, TestFilteredSearch, TestBinaryTerms, TestIndexWriterReader, TestPulsingReuse, TestDocsAndPositions, Test10KPulsings, TestMinimize, TestPerFieldPostingsFormat, TestMergeSchedulerExternal, TestAutomatonQuery, TestFieldValueFilter, TestBasicOperations, TestTransactionRollback, TestDoc, TestPrefixFilter, TestNearSpansOrdered, TestCrashCausesCorruptIndex, TestOpenBitSet, TestTermsEnum, TestMixedCodecs, TestFlushByRamOrCountsPolicy, TestFileSwitchDirectory, TestNRTManager, TestBitUtil, TestBooleanMinShouldMatch, TestFieldInfos, TestDocCount, TestPayloads, TestNewestSegment, TestIndexWriterOnJRECrash, TestFuzzyQuery, TestPayloadProcessorProvider, TestDeterminism, TestRollingBuffer, TestPayloadExplanations, TestPersistentSnapshotDeletionPolicy, TestDemo, TestParallelTermEnum, TestDocIdSet, TestAllFilesHaveCodecHeader, TestConstantScoreQuery, TestBufferedIndexInput, TestTieredMergePolicy, TestIndexWriterLockRelease, TestPayloadTermQuery, TestAutomatonQueryUnicode, Nested1, Nested2, Nested3, TestSetOnce, TestSegmentTermEnum, TestMultiTermConstantScore, TestMultiMMap, TestStressIndexing, TestSloppyPhraseQuery2, TestRegexpRandom, TestPrefixRandom, TestDuelingCodecs, TestFilterAtomicReader, TestSearch, TestIdentityHashSet, TestIndexWriterConfig, TestSimpleAttributeImpl, TestIndexableField, TestReuseDocsEnum, TestSmallFloat, TestDirectoryReaderReopen, TestToken, TestQueryWrapperFilter, TestSimilarity2, TestAttributeSource, TestParallelReaderEmptyIndex, TestSpans, TestNRTThreads, TestVersionComparator, ThrowInUncaught, TestNoMergeScheduler, TestDocumentWriter, TestLongPostings, TestFieldCacheRewriteMethod, Nested, Nested, Nested, Nested, Nested, Nested, Nested, Nested, Nested, Nested, Nested, Nested, Nested, Nested, Nested, Nested, Nested, Nested, Nested, Nested, Nested, TestWildcard, TestDocumentsWriterStallControl, TestRegexpRandom2, TestDocBoost, NestedSetupChain, NestedTeardownChain, TestScorerPerf, TestCodecs, TestTopScoreDocCollector, TestDirectoryReader, TestCloseableThreadLocal, TestPriorityQueue, TestFieldsReader, TestSpanSearchEquivalence, TestCompoundFile, Nested, TestSearchForDuplicates, InBeforeClass, InAfterClass, InTestMethod, NonStringProperties, TestNGramPhraseQuery, TestUniqueTermCount, TestWeakIdentityMap, Test2BDocs, TestNoMergePolicy, TestShardSearching, TestTopDocsMerge, TestTransactions, TestDateTools, TestFlex, TestNamedSPILoader, TestCrash, TestFieldMaskingSpanQuery, TestStressIndexing2, TestRollingUpdates, TestReaderClosed, TestScoreCachingWrappingScorer, TestUnicodeUtil, TestIndexWriterNRTIsCurrent, TestSegmentMerger, TestDocumentsWriterDeleteQueue, TestIndexFileDeleter, TestCustomSearcherSort, TestIOUtils, TestPostingsFormat]
Tests run: 5, Failures: 0, Errors: 5, Skipped: 0, Time elapsed: 5.427 sec <<< FAILURE!

[...truncated 373 lines...]




---------------------------------------------------------------------
To unsubscribe, e-mail: [hidden email]
For additional commands, e-mail: [hidden email]
Reply | Threaded
Open this post in threaded view
|

Re: [JENKINS-MAVEN] Lucene-Solr-Maven-trunk #553: POMs out of sync

Robert Muir
maybe a simpletext bug... I'll look into it!

On Mon, Jul 23, 2012 at 12:53 PM, Apache Jenkins Server
<[hidden email]> wrote:

> Build: https://builds.apache.org/job/Lucene-Solr-Maven-trunk/553/
>
> 5 tests failed.
> FAILED:  org.apache.lucene.index.TestPostingsFormat.test
>
> Error Message:
> Thread threw an uncaught exception, thread: Thread[Thread-1101,5,]
>
> Stack Trace:
> java.lang.RuntimeException: Thread threw an uncaught exception, thread: Thread[Thread-1101,5,]
>         at com.carrotsearch.randomizedtesting.RunnerThreadGroup.processUncaught(RunnerThreadGroup.java:96)
>         at com.carrotsearch.randomizedtesting.RandomizedRunner.runSingleTest(RandomizedRunner.java:859)
>         at com.carrotsearch.randomizedtesting.RandomizedRunner.access$700(RandomizedRunner.java:132)
>         at com.carrotsearch.randomizedtesting.RandomizedRunner$3$1.run(RandomizedRunner.java:671)
>         at com.carrotsearch.randomizedtesting.RandomizedRunner$3.evaluate(RandomizedRunner.java:697)
>         at com.carrotsearch.randomizedtesting.RandomizedRunner$4.evaluate(RandomizedRunner.java:736)
>         at com.carrotsearch.randomizedtesting.RandomizedRunner$5.evaluate(RandomizedRunner.java:747)
>         at org.apache.lucene.util.AbstractBeforeAfterRule$1.evaluate(AbstractBeforeAfterRule.java:45)
>         at org.apache.lucene.util.TestRuleReportUncaughtExceptions$1.evaluate(TestRuleReportUncaughtExceptions.java:68)
>         at org.apache.lucene.util.TestRuleStoreClassName$1.evaluate(TestRuleStoreClassName.java:38)
>         at org.apache.lucene.util.TestRuleIcuHack$1.evaluate(TestRuleIcuHack.java:51)
>         at com.carrotsearch.randomizedtesting.rules.SystemPropertiesInvariantRule$1.evaluate(SystemPropertiesInvariantRule.java:55)
>         at org.apache.lucene.util.TestRuleNoInstanceHooksOverrides$1.evaluate(TestRuleNoInstanceHooksOverrides.java:53)
>         at org.apache.lucene.util.TestRuleNoStaticHooksShadowing$1.evaluate(TestRuleNoStaticHooksShadowing.java:52)
>         at org.apache.lucene.util.TestRuleAssertionsRequired$1.evaluate(TestRuleAssertionsRequired.java:36)
>         at org.apache.lucene.util.TestRuleMarkFailure$1.evaluate(TestRuleMarkFailure.java:48)
>         at org.apache.lucene.util.TestRuleIgnoreAfterMaxFailures$1.evaluate(TestRuleIgnoreAfterMaxFailures.java:70)
>         at org.apache.lucene.util.TestRuleIgnoreTestSuites$1.evaluate(TestRuleIgnoreTestSuites.java:55)
>         at com.carrotsearch.randomizedtesting.RandomizedRunner.runSuite(RandomizedRunner.java:605)
>         at com.carrotsearch.randomizedtesting.RandomizedRunner.access$400(RandomizedRunner.java:132)
>         at com.carrotsearch.randomizedtesting.RandomizedRunner$2.run(RandomizedRunner.java:551)
> Caused by: java.lang.RuntimeException: java.lang.AssertionError: startOffset isn't -1 expected:<-1> but was:<68>
>         at __randomizedtesting.SeedInfo.seed([84B6520D8F1B01BD]:0)
>         at org.apache.lucene.index.TestPostingsFormat$1.run(TestPostingsFormat.java:761)
> Caused by: java.lang.AssertionError: startOffset isn't -1 expected:<-1> but was:<68>
>         at org.junit.Assert.fail(Assert.java:93)
>         at org.junit.Assert.failNotEquals(Assert.java:647)
>         at org.junit.Assert.assertEquals(Assert.java:128)
>         at org.junit.Assert.assertEquals(Assert.java:472)
>         at org.apache.lucene.index.TestPostingsFormat.verifyEnum(TestPostingsFormat.java:741)
>         at org.apache.lucene.index.TestPostingsFormat.testTermsOneThread(TestPostingsFormat.java:828)
>         at org.apache.lucene.index.TestPostingsFormat.access$200(TestPostingsFormat.java:73)
>         at org.apache.lucene.index.TestPostingsFormat$1.run(TestPostingsFormat.java:759)
>
>
> FAILED:  org.apache.lucene.index.TestPostingsFormat.test
>
> Error Message:
> Thread threw an uncaught exception, thread: Thread[Thread-1104,5,]
>
> Stack Trace:
> java.lang.RuntimeException: Thread threw an uncaught exception, thread: Thread[Thread-1104,5,]
>         at com.carrotsearch.randomizedtesting.RunnerThreadGroup.processUncaught(RunnerThreadGroup.java:96)
>         at com.carrotsearch.randomizedtesting.RandomizedRunner.runSingleTest(RandomizedRunner.java:859)
>         at com.carrotsearch.randomizedtesting.RandomizedRunner.access$700(RandomizedRunner.java:132)
>         at com.carrotsearch.randomizedtesting.RandomizedRunner$3$1.run(RandomizedRunner.java:671)
>         at com.carrotsearch.randomizedtesting.RandomizedRunner$3.evaluate(RandomizedRunner.java:697)
>         at com.carrotsearch.randomizedtesting.RandomizedRunner$4.evaluate(RandomizedRunner.java:736)
>         at com.carrotsearch.randomizedtesting.RandomizedRunner$5.evaluate(RandomizedRunner.java:747)
>         at org.apache.lucene.util.AbstractBeforeAfterRule$1.evaluate(AbstractBeforeAfterRule.java:45)
>         at org.apache.lucene.util.TestRuleReportUncaughtExceptions$1.evaluate(TestRuleReportUncaughtExceptions.java:68)
>         at org.apache.lucene.util.TestRuleStoreClassName$1.evaluate(TestRuleStoreClassName.java:38)
>         at org.apache.lucene.util.TestRuleIcuHack$1.evaluate(TestRuleIcuHack.java:51)
>         at com.carrotsearch.randomizedtesting.rules.SystemPropertiesInvariantRule$1.evaluate(SystemPropertiesInvariantRule.java:55)
>         at org.apache.lucene.util.TestRuleNoInstanceHooksOverrides$1.evaluate(TestRuleNoInstanceHooksOverrides.java:53)
>         at org.apache.lucene.util.TestRuleNoStaticHooksShadowing$1.evaluate(TestRuleNoStaticHooksShadowing.java:52)
>         at org.apache.lucene.util.TestRuleAssertionsRequired$1.evaluate(TestRuleAssertionsRequired.java:36)
>         at org.apache.lucene.util.TestRuleMarkFailure$1.evaluate(TestRuleMarkFailure.java:48)
>         at org.apache.lucene.util.TestRuleIgnoreAfterMaxFailures$1.evaluate(TestRuleIgnoreAfterMaxFailures.java:70)
>         at org.apache.lucene.util.TestRuleIgnoreTestSuites$1.evaluate(TestRuleIgnoreTestSuites.java:55)
>         at com.carrotsearch.randomizedtesting.RandomizedRunner.runSuite(RandomizedRunner.java:605)
>         at com.carrotsearch.randomizedtesting.RandomizedRunner.access$400(RandomizedRunner.java:132)
>         at com.carrotsearch.randomizedtesting.RandomizedRunner$2.run(RandomizedRunner.java:551)
> Caused by: java.lang.RuntimeException: java.lang.AssertionError: startOffset isn't -1 expected:<-1> but was:<68>
>         at __randomizedtesting.SeedInfo.seed([84B6520D8F1B01BD]:0)
>         at org.apache.lucene.index.TestPostingsFormat$1.run(TestPostingsFormat.java:761)
> Caused by: java.lang.AssertionError: startOffset isn't -1 expected:<-1> but was:<68>
>         at org.junit.Assert.fail(Assert.java:93)
>         at org.junit.Assert.failNotEquals(Assert.java:647)
>         at org.junit.Assert.assertEquals(Assert.java:128)
>         at org.junit.Assert.assertEquals(Assert.java:472)
>         at org.apache.lucene.index.TestPostingsFormat.verifyEnum(TestPostingsFormat.java:741)
>         at org.apache.lucene.index.TestPostingsFormat.testTermsOneThread(TestPostingsFormat.java:828)
>         at org.apache.lucene.index.TestPostingsFormat.access$200(TestPostingsFormat.java:73)
>         at org.apache.lucene.index.TestPostingsFormat$1.run(TestPostingsFormat.java:759)
>
>
> FAILED:  org.apache.lucene.index.TestPostingsFormat.test
>
> Error Message:
> Thread threw an uncaught exception, thread: Thread[Thread-1102,5,]
>
> Stack Trace:
> java.lang.RuntimeException: Thread threw an uncaught exception, thread: Thread[Thread-1102,5,]
>         at com.carrotsearch.randomizedtesting.RunnerThreadGroup.processUncaught(RunnerThreadGroup.java:96)
>         at com.carrotsearch.randomizedtesting.RandomizedRunner.runSingleTest(RandomizedRunner.java:859)
>         at com.carrotsearch.randomizedtesting.RandomizedRunner.access$700(RandomizedRunner.java:132)
>         at com.carrotsearch.randomizedtesting.RandomizedRunner$3$1.run(RandomizedRunner.java:671)
>         at com.carrotsearch.randomizedtesting.RandomizedRunner$3.evaluate(RandomizedRunner.java:697)
>         at com.carrotsearch.randomizedtesting.RandomizedRunner$4.evaluate(RandomizedRunner.java:736)
>         at com.carrotsearch.randomizedtesting.RandomizedRunner$5.evaluate(RandomizedRunner.java:747)
>         at org.apache.lucene.util.AbstractBeforeAfterRule$1.evaluate(AbstractBeforeAfterRule.java:45)
>         at org.apache.lucene.util.TestRuleReportUncaughtExceptions$1.evaluate(TestRuleReportUncaughtExceptions.java:68)
>         at org.apache.lucene.util.TestRuleStoreClassName$1.evaluate(TestRuleStoreClassName.java:38)
>         at org.apache.lucene.util.TestRuleIcuHack$1.evaluate(TestRuleIcuHack.java:51)
>         at com.carrotsearch.randomizedtesting.rules.SystemPropertiesInvariantRule$1.evaluate(SystemPropertiesInvariantRule.java:55)
>         at org.apache.lucene.util.TestRuleNoInstanceHooksOverrides$1.evaluate(TestRuleNoInstanceHooksOverrides.java:53)
>         at org.apache.lucene.util.TestRuleNoStaticHooksShadowing$1.evaluate(TestRuleNoStaticHooksShadowing.java:52)
>         at org.apache.lucene.util.TestRuleAssertionsRequired$1.evaluate(TestRuleAssertionsRequired.java:36)
>         at org.apache.lucene.util.TestRuleMarkFailure$1.evaluate(TestRuleMarkFailure.java:48)
>         at org.apache.lucene.util.TestRuleIgnoreAfterMaxFailures$1.evaluate(TestRuleIgnoreAfterMaxFailures.java:70)
>         at org.apache.lucene.util.TestRuleIgnoreTestSuites$1.evaluate(TestRuleIgnoreTestSuites.java:55)
>         at com.carrotsearch.randomizedtesting.RandomizedRunner.runSuite(RandomizedRunner.java:605)
>         at com.carrotsearch.randomizedtesting.RandomizedRunner.access$400(RandomizedRunner.java:132)
>         at com.carrotsearch.randomizedtesting.RandomizedRunner$2.run(RandomizedRunner.java:551)
> Caused by: java.lang.RuntimeException: java.lang.AssertionError: startOffset isn't -1 expected:<-1> but was:<68>
>         at __randomizedtesting.SeedInfo.seed([84B6520D8F1B01BD]:0)
>         at org.apache.lucene.index.TestPostingsFormat$1.run(TestPostingsFormat.java:761)
> Caused by: java.lang.AssertionError: startOffset isn't -1 expected:<-1> but was:<68>
>         at org.junit.Assert.fail(Assert.java:93)
>         at org.junit.Assert.failNotEquals(Assert.java:647)
>         at org.junit.Assert.assertEquals(Assert.java:128)
>         at org.junit.Assert.assertEquals(Assert.java:472)
>         at org.apache.lucene.index.TestPostingsFormat.verifyEnum(TestPostingsFormat.java:741)
>         at org.apache.lucene.index.TestPostingsFormat.testTermsOneThread(TestPostingsFormat.java:828)
>         at org.apache.lucene.index.TestPostingsFormat.access$200(TestPostingsFormat.java:73)
>         at org.apache.lucene.index.TestPostingsFormat$1.run(TestPostingsFormat.java:759)
>
>
> FAILED:  org.apache.lucene.index.TestPostingsFormat.test
>
> Error Message:
> Thread threw an uncaught exception, thread: Thread[Thread-1103,5,]
>
> Stack Trace:
> java.lang.RuntimeException: Thread threw an uncaught exception, thread: Thread[Thread-1103,5,]
>         at com.carrotsearch.randomizedtesting.RunnerThreadGroup.processUncaught(RunnerThreadGroup.java:96)
>         at com.carrotsearch.randomizedtesting.RandomizedRunner.runSingleTest(RandomizedRunner.java:859)
>         at com.carrotsearch.randomizedtesting.RandomizedRunner.access$700(RandomizedRunner.java:132)
>         at com.carrotsearch.randomizedtesting.RandomizedRunner$3$1.run(RandomizedRunner.java:671)
>         at com.carrotsearch.randomizedtesting.RandomizedRunner$3.evaluate(RandomizedRunner.java:697)
>         at com.carrotsearch.randomizedtesting.RandomizedRunner$4.evaluate(RandomizedRunner.java:736)
>         at com.carrotsearch.randomizedtesting.RandomizedRunner$5.evaluate(RandomizedRunner.java:747)
>         at org.apache.lucene.util.AbstractBeforeAfterRule$1.evaluate(AbstractBeforeAfterRule.java:45)
>         at org.apache.lucene.util.TestRuleReportUncaughtExceptions$1.evaluate(TestRuleReportUncaughtExceptions.java:68)
>         at org.apache.lucene.util.TestRuleStoreClassName$1.evaluate(TestRuleStoreClassName.java:38)
>         at org.apache.lucene.util.TestRuleIcuHack$1.evaluate(TestRuleIcuHack.java:51)
>         at com.carrotsearch.randomizedtesting.rules.SystemPropertiesInvariantRule$1.evaluate(SystemPropertiesInvariantRule.java:55)
>         at org.apache.lucene.util.TestRuleNoInstanceHooksOverrides$1.evaluate(TestRuleNoInstanceHooksOverrides.java:53)
>         at org.apache.lucene.util.TestRuleNoStaticHooksShadowing$1.evaluate(TestRuleNoStaticHooksShadowing.java:52)
>         at org.apache.lucene.util.TestRuleAssertionsRequired$1.evaluate(TestRuleAssertionsRequired.java:36)
>         at org.apache.lucene.util.TestRuleMarkFailure$1.evaluate(TestRuleMarkFailure.java:48)
>         at org.apache.lucene.util.TestRuleIgnoreAfterMaxFailures$1.evaluate(TestRuleIgnoreAfterMaxFailures.java:70)
>         at org.apache.lucene.util.TestRuleIgnoreTestSuites$1.evaluate(TestRuleIgnoreTestSuites.java:55)
>         at com.carrotsearch.randomizedtesting.RandomizedRunner.runSuite(RandomizedRunner.java:605)
>         at com.carrotsearch.randomizedtesting.RandomizedRunner.access$400(RandomizedRunner.java:132)
>         at com.carrotsearch.randomizedtesting.RandomizedRunner$2.run(RandomizedRunner.java:551)
> Caused by: java.lang.RuntimeException: java.lang.AssertionError: startOffset isn't -1 expected:<-1> but was:<53>
>         at __randomizedtesting.SeedInfo.seed([84B6520D8F1B01BD]:0)
>         at org.apache.lucene.index.TestPostingsFormat$1.run(TestPostingsFormat.java:761)
> Caused by: java.lang.AssertionError: startOffset isn't -1 expected:<-1> but was:<53>
>         at org.junit.Assert.fail(Assert.java:93)
>         at org.junit.Assert.failNotEquals(Assert.java:647)
>         at org.junit.Assert.assertEquals(Assert.java:128)
>         at org.junit.Assert.assertEquals(Assert.java:472)
>         at org.apache.lucene.index.TestPostingsFormat.verifyEnum(TestPostingsFormat.java:741)
>         at org.apache.lucene.index.TestPostingsFormat.testTermsOneThread(TestPostingsFormat.java:828)
>         at org.apache.lucene.index.TestPostingsFormat.access$200(TestPostingsFormat.java:73)
>         at org.apache.lucene.index.TestPostingsFormat$1.run(TestPostingsFormat.java:759)
>
>
> FAILED:  org.apache.lucene.index.TestPostingsFormat.test
>
> Error Message:
> Thread threw an uncaught exception, thread: Thread[Thread-1100,5,]
>
> Stack Trace:
> java.lang.RuntimeException: Thread threw an uncaught exception, thread: Thread[Thread-1100,5,]
>         at com.carrotsearch.randomizedtesting.RunnerThreadGroup.processUncaught(RunnerThreadGroup.java:96)
>         at com.carrotsearch.randomizedtesting.RandomizedRunner.runSingleTest(RandomizedRunner.java:859)
>         at com.carrotsearch.randomizedtesting.RandomizedRunner.access$700(RandomizedRunner.java:132)
>         at com.carrotsearch.randomizedtesting.RandomizedRunner$3$1.run(RandomizedRunner.java:671)
>         at com.carrotsearch.randomizedtesting.RandomizedRunner$3.evaluate(RandomizedRunner.java:697)
>         at com.carrotsearch.randomizedtesting.RandomizedRunner$4.evaluate(RandomizedRunner.java:736)
>         at com.carrotsearch.randomizedtesting.RandomizedRunner$5.evaluate(RandomizedRunner.java:747)
>         at org.apache.lucene.util.AbstractBeforeAfterRule$1.evaluate(AbstractBeforeAfterRule.java:45)
>         at org.apache.lucene.util.TestRuleReportUncaughtExceptions$1.evaluate(TestRuleReportUncaughtExceptions.java:68)
>         at org.apache.lucene.util.TestRuleStoreClassName$1.evaluate(TestRuleStoreClassName.java:38)
>         at org.apache.lucene.util.TestRuleIcuHack$1.evaluate(TestRuleIcuHack.java:51)
>         at com.carrotsearch.randomizedtesting.rules.SystemPropertiesInvariantRule$1.evaluate(SystemPropertiesInvariantRule.java:55)
>         at org.apache.lucene.util.TestRuleNoInstanceHooksOverrides$1.evaluate(TestRuleNoInstanceHooksOverrides.java:53)
>         at org.apache.lucene.util.TestRuleNoStaticHooksShadowing$1.evaluate(TestRuleNoStaticHooksShadowing.java:52)
>         at org.apache.lucene.util.TestRuleAssertionsRequired$1.evaluate(TestRuleAssertionsRequired.java:36)
>         at org.apache.lucene.util.TestRuleMarkFailure$1.evaluate(TestRuleMarkFailure.java:48)
>         at org.apache.lucene.util.TestRuleIgnoreAfterMaxFailures$1.evaluate(TestRuleIgnoreAfterMaxFailures.java:70)
>         at org.apache.lucene.util.TestRuleIgnoreTestSuites$1.evaluate(TestRuleIgnoreTestSuites.java:55)
>         at com.carrotsearch.randomizedtesting.RandomizedRunner.runSuite(RandomizedRunner.java:605)
>         at com.carrotsearch.randomizedtesting.RandomizedRunner.access$400(RandomizedRunner.java:132)
>         at com.carrotsearch.randomizedtesting.RandomizedRunner$2.run(RandomizedRunner.java:551)
> Caused by: java.lang.RuntimeException: java.lang.AssertionError: startOffset isn't -1 expected:<-1> but was:<53>
>         at __randomizedtesting.SeedInfo.seed([84B6520D8F1B01BD]:0)
>         at org.apache.lucene.index.TestPostingsFormat$1.run(TestPostingsFormat.java:761)
> Caused by: java.lang.AssertionError: startOffset isn't -1 expected:<-1> but was:<53>
>         at org.junit.Assert.fail(Assert.java:93)
>         at org.junit.Assert.failNotEquals(Assert.java:647)
>         at org.junit.Assert.assertEquals(Assert.java:128)
>         at org.junit.Assert.assertEquals(Assert.java:472)
>         at org.apache.lucene.index.TestPostingsFormat.verifyEnum(TestPostingsFormat.java:741)
>         at org.apache.lucene.index.TestPostingsFormat.testTermsOneThread(TestPostingsFormat.java:828)
>         at org.apache.lucene.index.TestPostingsFormat.access$200(TestPostingsFormat.java:73)
>         at org.apache.lucene.index.TestPostingsFormat$1.run(TestPostingsFormat.java:759)
>
>
>
>
> Build Log:
> [...truncated 8769 lines...]
> Running org.apache.lucene.index.TestPostingsFormat
> NOTE: reproduce with: ant test  -Dtestcase=TestPostingsFormat -Dtests.method=test -Dtests.seed=84B6520D8F1B01BD -Dtests.locale=sr -Dtests.timezone=Australia/LHI -Dtests.file.encoding=ISO8859-1
> NOTE: test params are: codec=SimpleText, sim=DefaultSimilarity, locale=sr, timezone=Australia/LHI
> NOTE: FreeBSD 9.0-RELEASE amd64/Sun Microsystems Inc. 1.6.0_32 (64-bit)/cpus=16,threads=1,free=186608024,total=425000960
> NOTE: All tests run in this JVM: [TestOmitNorms, TestGraphTokenizers, TestFSTs, TestDeletionPolicy, Nested, TestMultiValuedNumericRangeQuery, TestOmitPositions, TestAddIndexes, TestFieldCacheRangeFilter, TestDocValuesScoring, TestTermdocPerf, TestBooleanScorer, TestConjunctions, TestRollback, TestParallelCompositeReader, TestSpanExplanations, TestSubScorerFreqs, TestComplexExplanations, TestSearchAfter, TestSearcherManager, TestUTF32ToUTF8, TestSimilarity, TestSegmentReader, TestCharFilter, TestFieldCache, TestBooleanQueryVisitSubscorers, TestBasics, TestMultiFields, TestBitVector, TestBackwardsCompatibility, TestNumericRangeQuery64, TestDocValuesTypeCompatibility, TestTimeLimitingCollector, TestIndexWriterOnDiskFull, TestHugeRamFile, TestCachingWrapperFilter, TestIndexWriterExceptions, TestCachingTokenFilter, TestFieldCacheSanityChecker, TestSpecialOperations, TestMatchAllDocsQuery, TestNumericUtils, TestTypePromotion, TestWindowsMMap, TestSloppyPhraseQuery, TestPayloadNearQuery, TestIndexInput, TestNot, TestTermsEnum2, TestMultiThreadTermVectors, TestTerm, TestTermScorer, TestSpanMultiTermQueryWrapper, TestForceMergeForever, TestSpanFirstQuery, TestRecyclingByteBlockAllocator, TestPackedInts, TestNRTCachingDirectory, TestRandomStoredFields, TestNRTReaderWithThreads, TestSimpleSearchEquivalence, TestDeterminizeLexicon, TestBooleanOr, TestPrefixQuery, TestTwoPhaseCommitTool, TestSizeBoundedForceMerge, TestSnapshotDeletionPolicy, TestCompiledAutomaton, TestDocTermOrds, TestCheckIndex, TestCopyBytes, TestPrefixInBooleanQuery, TestExternalCodecs, TestNumericTokenStream, TestSimpleExplanationsOfNonMatches, TestIsCurrent, TestIntBlockCodec, TestIndexWriterDelete, TestCachingCollector, TestPagedBytes, TestRAMDirectory, TestRollingCharBuffer, TestBooleanQuery, TestDateSort, TestDocument, TestElevationComparator, TestAtomicUpdate, TestIndexWriterCommit, TestFixedBitSet, TestPhrasePrefixQuery, TestExplanations, TestNumericRangeQuery32, Nested1, TestIndexWriterMerging, TestIndexWriterMergePolicy, TestConcurrentMergeScheduler, TestParallelAtomicReader, TestPrefixCodedTerms, TestByteSlices, TestTermVectorsWriter, TestPhraseQuery, TestComplexExplanationsOfNonMatches, TestPositionIncrement, TestIndexWriterUnicode, TestSimilarityBase, TestSameTokenSamePosition, TestStressAdvance, TestDirectory, TestBytesRef, TestByteBlockPool, MultiCollectorTest, TestSortedVIntList, TestOmitTf, TestDisjunctionMaxQuery, TestDoubleBarrelLRUCache, TestPostingsOffsets, TestSearchWithThreads, TestConsistentFieldNumbers, TestBinaryDocument, Test2BPostings, TestSpanExplanationsOfNonMatches, TestVirtualMethod, TestIndexCommit, TestIndexWriter, TestSimpleExplanations, TestTermRangeFilter, TestCharsRef, TestPerSegmentDeletes, TestVersion, TestRamUsageEstimatorOnWildAnimals, TestForTooMuchCloning, TestMockCharFilter, TestTermRangeQuery, TestSort, TestBytesRefHash, TestDateFilter, TestMultiTermQueryRewrites, TestCollectionUtil, TestMaxTermFrequency, TestWildcardRandom, TestTermVectors, TestLucene40PostingsReader, TestMockAnalyzer, TestFilteredSearch, TestBinaryTerms, TestIndexWriterReader, TestPulsingReuse, TestDocsAndPositions, Test10KPulsings, TestMinimize, TestPerFieldPostingsFormat, TestMergeSchedulerExternal, TestAutomatonQuery, TestFieldValueFilter, TestBasicOperations, TestTransactionRollback, TestDoc, TestPrefixFilter, TestNearSpansOrdered, TestCrashCausesCorruptIndex, TestOpenBitSet, TestTermsEnum, TestMixedCodecs, TestFlushByRamOrCountsPolicy, TestFileSwitchDirectory, TestNRTManager, TestBitUtil, TestBooleanMinShouldMatch, TestFieldInfos, TestDocCount, TestPayloads, TestNewestSegment, TestIndexWriterOnJRECrash, TestFuzzyQuery, TestPayloadProcessorProvider, TestDeterminism, TestRollingBuffer, TestPayloadExplanations, TestPersistentSnapshotDeletionPolicy, TestDemo, TestParallelTermEnum, TestDocIdSet, TestAllFilesHaveCodecHeader, TestConstantScoreQuery, TestBufferedIndexInput, TestTieredMergePolicy, TestIndexWriterLockRelease, TestPayloadTermQuery, TestAutomatonQueryUnicode, Nested1, Nested2, Nested3, TestSetOnce, TestSegmentTermEnum, TestMultiTermConstantScore, TestMultiMMap, TestStressIndexing, TestSloppyPhraseQuery2, TestRegexpRandom, TestPrefixRandom, TestDuelingCodecs, TestFilterAtomicReader, TestSearch, TestIdentityHashSet, TestIndexWriterConfig, TestSimpleAttributeImpl, TestIndexableField, TestReuseDocsEnum, TestSmallFloat, TestDirectoryReaderReopen, TestToken, TestQueryWrapperFilter, TestSimilarity2, TestAttributeSource, TestParallelReaderEmptyIndex, TestSpans, TestNRTThreads, TestVersionComparator, ThrowInUncaught, TestNoMergeScheduler, TestDocumentWriter, TestLongPostings, TestFieldCacheRewriteMethod, Nested, Nested, Nested, Nested, Nested, Nested, Nested, Nested, Nested, Nested, Nested, Nested, Nested, Nested, Nested, Nested, Nested, Nested, Nested, Nested, Nested, TestWildcard, TestDocumentsWriterStallControl, TestRegexpRandom2, TestDocBoost, NestedSetupChain, NestedTeardownChain, TestScorerPerf, TestCodecs, TestTopScoreDocCollector, TestDirectoryReader, TestCloseableThreadLocal, TestPriorityQueue, TestFieldsReader, TestSpanSearchEquivalence, TestCompoundFile, Nested, TestSearchForDuplicates, InBeforeClass, InAfterClass, InTestMethod, NonStringProperties, TestNGramPhraseQuery, TestUniqueTermCount, TestWeakIdentityMap, Test2BDocs, TestNoMergePolicy, TestShardSearching, TestTopDocsMerge, TestTransactions, TestDateTools, TestFlex, TestNamedSPILoader, TestCrash, TestFieldMaskingSpanQuery, TestStressIndexing2, TestRollingUpdates, TestReaderClosed, TestScoreCachingWrappingScorer, TestUnicodeUtil, TestIndexWriterNRTIsCurrent, TestSegmentMerger, TestDocumentsWriterDeleteQueue, TestIndexFileDeleter, TestCustomSearcherSort, TestIOUtils, TestPostingsFormat]
> Tests run: 5, Failures: 0, Errors: 5, Skipped: 0, Time elapsed: 5.427 sec <<< FAILURE!
>
> [...truncated 373 lines...]
>
>
>
>
> ---------------------------------------------------------------------
> To unsubscribe, e-mail: [hidden email]
> For additional commands, e-mail: [hidden email]



--
lucidimagination.com

---------------------------------------------------------------------
To unsubscribe, e-mail: [hidden email]
For additional commands, e-mail: [hidden email]

Reply | Threaded
Open this post in threaded view
|

Re: [JENKINS-MAVEN] Lucene-Solr-Maven-trunk #553: POMs out of sync

Robert Muir
Looks like http://svn.apache.org/viewvc?view=revision&revision=1364083

I'll merge the fix from the pfor branch.

On Mon, Jul 23, 2012 at 1:04 PM, Robert Muir <[hidden email]> wrote:

> maybe a simpletext bug... I'll look into it!
>
> On Mon, Jul 23, 2012 at 12:53 PM, Apache Jenkins Server
> <[hidden email]> wrote:
>> Build: https://builds.apache.org/job/Lucene-Solr-Maven-trunk/553/
>>
>> 5 tests failed.
>> FAILED:  org.apache.lucene.index.TestPostingsFormat.test
>>
>> Error Message:
>> Thread threw an uncaught exception, thread: Thread[Thread-1101,5,]
>>
>> Stack Trace:
>> java.lang.RuntimeException: Thread threw an uncaught exception, thread: Thread[Thread-1101,5,]
>>         at com.carrotsearch.randomizedtesting.RunnerThreadGroup.processUncaught(RunnerThreadGroup.java:96)
>>         at com.carrotsearch.randomizedtesting.RandomizedRunner.runSingleTest(RandomizedRunner.java:859)
>>         at com.carrotsearch.randomizedtesting.RandomizedRunner.access$700(RandomizedRunner.java:132)
>>         at com.carrotsearch.randomizedtesting.RandomizedRunner$3$1.run(RandomizedRunner.java:671)
>>         at com.carrotsearch.randomizedtesting.RandomizedRunner$3.evaluate(RandomizedRunner.java:697)
>>         at com.carrotsearch.randomizedtesting.RandomizedRunner$4.evaluate(RandomizedRunner.java:736)
>>         at com.carrotsearch.randomizedtesting.RandomizedRunner$5.evaluate(RandomizedRunner.java:747)
>>         at org.apache.lucene.util.AbstractBeforeAfterRule$1.evaluate(AbstractBeforeAfterRule.java:45)
>>         at org.apache.lucene.util.TestRuleReportUncaughtExceptions$1.evaluate(TestRuleReportUncaughtExceptions.java:68)
>>         at org.apache.lucene.util.TestRuleStoreClassName$1.evaluate(TestRuleStoreClassName.java:38)
>>         at org.apache.lucene.util.TestRuleIcuHack$1.evaluate(TestRuleIcuHack.java:51)
>>         at com.carrotsearch.randomizedtesting.rules.SystemPropertiesInvariantRule$1.evaluate(SystemPropertiesInvariantRule.java:55)
>>         at org.apache.lucene.util.TestRuleNoInstanceHooksOverrides$1.evaluate(TestRuleNoInstanceHooksOverrides.java:53)
>>         at org.apache.lucene.util.TestRuleNoStaticHooksShadowing$1.evaluate(TestRuleNoStaticHooksShadowing.java:52)
>>         at org.apache.lucene.util.TestRuleAssertionsRequired$1.evaluate(TestRuleAssertionsRequired.java:36)
>>         at org.apache.lucene.util.TestRuleMarkFailure$1.evaluate(TestRuleMarkFailure.java:48)
>>         at org.apache.lucene.util.TestRuleIgnoreAfterMaxFailures$1.evaluate(TestRuleIgnoreAfterMaxFailures.java:70)
>>         at org.apache.lucene.util.TestRuleIgnoreTestSuites$1.evaluate(TestRuleIgnoreTestSuites.java:55)
>>         at com.carrotsearch.randomizedtesting.RandomizedRunner.runSuite(RandomizedRunner.java:605)
>>         at com.carrotsearch.randomizedtesting.RandomizedRunner.access$400(RandomizedRunner.java:132)
>>         at com.carrotsearch.randomizedtesting.RandomizedRunner$2.run(RandomizedRunner.java:551)
>> Caused by: java.lang.RuntimeException: java.lang.AssertionError: startOffset isn't -1 expected:<-1> but was:<68>
>>         at __randomizedtesting.SeedInfo.seed([84B6520D8F1B01BD]:0)
>>         at org.apache.lucene.index.TestPostingsFormat$1.run(TestPostingsFormat.java:761)
>> Caused by: java.lang.AssertionError: startOffset isn't -1 expected:<-1> but was:<68>
>>         at org.junit.Assert.fail(Assert.java:93)
>>         at org.junit.Assert.failNotEquals(Assert.java:647)
>>         at org.junit.Assert.assertEquals(Assert.java:128)
>>         at org.junit.Assert.assertEquals(Assert.java:472)
>>         at org.apache.lucene.index.TestPostingsFormat.verifyEnum(TestPostingsFormat.java:741)
>>         at org.apache.lucene.index.TestPostingsFormat.testTermsOneThread(TestPostingsFormat.java:828)
>>         at org.apache.lucene.index.TestPostingsFormat.access$200(TestPostingsFormat.java:73)
>>         at org.apache.lucene.index.TestPostingsFormat$1.run(TestPostingsFormat.java:759)
>>
>>
>> FAILED:  org.apache.lucene.index.TestPostingsFormat.test
>>
>> Error Message:
>> Thread threw an uncaught exception, thread: Thread[Thread-1104,5,]
>>
>> Stack Trace:
>> java.lang.RuntimeException: Thread threw an uncaught exception, thread: Thread[Thread-1104,5,]
>>         at com.carrotsearch.randomizedtesting.RunnerThreadGroup.processUncaught(RunnerThreadGroup.java:96)
>>         at com.carrotsearch.randomizedtesting.RandomizedRunner.runSingleTest(RandomizedRunner.java:859)
>>         at com.carrotsearch.randomizedtesting.RandomizedRunner.access$700(RandomizedRunner.java:132)
>>         at com.carrotsearch.randomizedtesting.RandomizedRunner$3$1.run(RandomizedRunner.java:671)
>>         at com.carrotsearch.randomizedtesting.RandomizedRunner$3.evaluate(RandomizedRunner.java:697)
>>         at com.carrotsearch.randomizedtesting.RandomizedRunner$4.evaluate(RandomizedRunner.java:736)
>>         at com.carrotsearch.randomizedtesting.RandomizedRunner$5.evaluate(RandomizedRunner.java:747)
>>         at org.apache.lucene.util.AbstractBeforeAfterRule$1.evaluate(AbstractBeforeAfterRule.java:45)
>>         at org.apache.lucene.util.TestRuleReportUncaughtExceptions$1.evaluate(TestRuleReportUncaughtExceptions.java:68)
>>         at org.apache.lucene.util.TestRuleStoreClassName$1.evaluate(TestRuleStoreClassName.java:38)
>>         at org.apache.lucene.util.TestRuleIcuHack$1.evaluate(TestRuleIcuHack.java:51)
>>         at com.carrotsearch.randomizedtesting.rules.SystemPropertiesInvariantRule$1.evaluate(SystemPropertiesInvariantRule.java:55)
>>         at org.apache.lucene.util.TestRuleNoInstanceHooksOverrides$1.evaluate(TestRuleNoInstanceHooksOverrides.java:53)
>>         at org.apache.lucene.util.TestRuleNoStaticHooksShadowing$1.evaluate(TestRuleNoStaticHooksShadowing.java:52)
>>         at org.apache.lucene.util.TestRuleAssertionsRequired$1.evaluate(TestRuleAssertionsRequired.java:36)
>>         at org.apache.lucene.util.TestRuleMarkFailure$1.evaluate(TestRuleMarkFailure.java:48)
>>         at org.apache.lucene.util.TestRuleIgnoreAfterMaxFailures$1.evaluate(TestRuleIgnoreAfterMaxFailures.java:70)
>>         at org.apache.lucene.util.TestRuleIgnoreTestSuites$1.evaluate(TestRuleIgnoreTestSuites.java:55)
>>         at com.carrotsearch.randomizedtesting.RandomizedRunner.runSuite(RandomizedRunner.java:605)
>>         at com.carrotsearch.randomizedtesting.RandomizedRunner.access$400(RandomizedRunner.java:132)
>>         at com.carrotsearch.randomizedtesting.RandomizedRunner$2.run(RandomizedRunner.java:551)
>> Caused by: java.lang.RuntimeException: java.lang.AssertionError: startOffset isn't -1 expected:<-1> but was:<68>
>>         at __randomizedtesting.SeedInfo.seed([84B6520D8F1B01BD]:0)
>>         at org.apache.lucene.index.TestPostingsFormat$1.run(TestPostingsFormat.java:761)
>> Caused by: java.lang.AssertionError: startOffset isn't -1 expected:<-1> but was:<68>
>>         at org.junit.Assert.fail(Assert.java:93)
>>         at org.junit.Assert.failNotEquals(Assert.java:647)
>>         at org.junit.Assert.assertEquals(Assert.java:128)
>>         at org.junit.Assert.assertEquals(Assert.java:472)
>>         at org.apache.lucene.index.TestPostingsFormat.verifyEnum(TestPostingsFormat.java:741)
>>         at org.apache.lucene.index.TestPostingsFormat.testTermsOneThread(TestPostingsFormat.java:828)
>>         at org.apache.lucene.index.TestPostingsFormat.access$200(TestPostingsFormat.java:73)
>>         at org.apache.lucene.index.TestPostingsFormat$1.run(TestPostingsFormat.java:759)
>>
>>
>> FAILED:  org.apache.lucene.index.TestPostingsFormat.test
>>
>> Error Message:
>> Thread threw an uncaught exception, thread: Thread[Thread-1102,5,]
>>
>> Stack Trace:
>> java.lang.RuntimeException: Thread threw an uncaught exception, thread: Thread[Thread-1102,5,]
>>         at com.carrotsearch.randomizedtesting.RunnerThreadGroup.processUncaught(RunnerThreadGroup.java:96)
>>         at com.carrotsearch.randomizedtesting.RandomizedRunner.runSingleTest(RandomizedRunner.java:859)
>>         at com.carrotsearch.randomizedtesting.RandomizedRunner.access$700(RandomizedRunner.java:132)
>>         at com.carrotsearch.randomizedtesting.RandomizedRunner$3$1.run(RandomizedRunner.java:671)
>>         at com.carrotsearch.randomizedtesting.RandomizedRunner$3.evaluate(RandomizedRunner.java:697)
>>         at com.carrotsearch.randomizedtesting.RandomizedRunner$4.evaluate(RandomizedRunner.java:736)
>>         at com.carrotsearch.randomizedtesting.RandomizedRunner$5.evaluate(RandomizedRunner.java:747)
>>         at org.apache.lucene.util.AbstractBeforeAfterRule$1.evaluate(AbstractBeforeAfterRule.java:45)
>>         at org.apache.lucene.util.TestRuleReportUncaughtExceptions$1.evaluate(TestRuleReportUncaughtExceptions.java:68)
>>         at org.apache.lucene.util.TestRuleStoreClassName$1.evaluate(TestRuleStoreClassName.java:38)
>>         at org.apache.lucene.util.TestRuleIcuHack$1.evaluate(TestRuleIcuHack.java:51)
>>         at com.carrotsearch.randomizedtesting.rules.SystemPropertiesInvariantRule$1.evaluate(SystemPropertiesInvariantRule.java:55)
>>         at org.apache.lucene.util.TestRuleNoInstanceHooksOverrides$1.evaluate(TestRuleNoInstanceHooksOverrides.java:53)
>>         at org.apache.lucene.util.TestRuleNoStaticHooksShadowing$1.evaluate(TestRuleNoStaticHooksShadowing.java:52)
>>         at org.apache.lucene.util.TestRuleAssertionsRequired$1.evaluate(TestRuleAssertionsRequired.java:36)
>>         at org.apache.lucene.util.TestRuleMarkFailure$1.evaluate(TestRuleMarkFailure.java:48)
>>         at org.apache.lucene.util.TestRuleIgnoreAfterMaxFailures$1.evaluate(TestRuleIgnoreAfterMaxFailures.java:70)
>>         at org.apache.lucene.util.TestRuleIgnoreTestSuites$1.evaluate(TestRuleIgnoreTestSuites.java:55)
>>         at com.carrotsearch.randomizedtesting.RandomizedRunner.runSuite(RandomizedRunner.java:605)
>>         at com.carrotsearch.randomizedtesting.RandomizedRunner.access$400(RandomizedRunner.java:132)
>>         at com.carrotsearch.randomizedtesting.RandomizedRunner$2.run(RandomizedRunner.java:551)
>> Caused by: java.lang.RuntimeException: java.lang.AssertionError: startOffset isn't -1 expected:<-1> but was:<68>
>>         at __randomizedtesting.SeedInfo.seed([84B6520D8F1B01BD]:0)
>>         at org.apache.lucene.index.TestPostingsFormat$1.run(TestPostingsFormat.java:761)
>> Caused by: java.lang.AssertionError: startOffset isn't -1 expected:<-1> but was:<68>
>>         at org.junit.Assert.fail(Assert.java:93)
>>         at org.junit.Assert.failNotEquals(Assert.java:647)
>>         at org.junit.Assert.assertEquals(Assert.java:128)
>>         at org.junit.Assert.assertEquals(Assert.java:472)
>>         at org.apache.lucene.index.TestPostingsFormat.verifyEnum(TestPostingsFormat.java:741)
>>         at org.apache.lucene.index.TestPostingsFormat.testTermsOneThread(TestPostingsFormat.java:828)
>>         at org.apache.lucene.index.TestPostingsFormat.access$200(TestPostingsFormat.java:73)
>>         at org.apache.lucene.index.TestPostingsFormat$1.run(TestPostingsFormat.java:759)
>>
>>
>> FAILED:  org.apache.lucene.index.TestPostingsFormat.test
>>
>> Error Message:
>> Thread threw an uncaught exception, thread: Thread[Thread-1103,5,]
>>
>> Stack Trace:
>> java.lang.RuntimeException: Thread threw an uncaught exception, thread: Thread[Thread-1103,5,]
>>         at com.carrotsearch.randomizedtesting.RunnerThreadGroup.processUncaught(RunnerThreadGroup.java:96)
>>         at com.carrotsearch.randomizedtesting.RandomizedRunner.runSingleTest(RandomizedRunner.java:859)
>>         at com.carrotsearch.randomizedtesting.RandomizedRunner.access$700(RandomizedRunner.java:132)
>>         at com.carrotsearch.randomizedtesting.RandomizedRunner$3$1.run(RandomizedRunner.java:671)
>>         at com.carrotsearch.randomizedtesting.RandomizedRunner$3.evaluate(RandomizedRunner.java:697)
>>         at com.carrotsearch.randomizedtesting.RandomizedRunner$4.evaluate(RandomizedRunner.java:736)
>>         at com.carrotsearch.randomizedtesting.RandomizedRunner$5.evaluate(RandomizedRunner.java:747)
>>         at org.apache.lucene.util.AbstractBeforeAfterRule$1.evaluate(AbstractBeforeAfterRule.java:45)
>>         at org.apache.lucene.util.TestRuleReportUncaughtExceptions$1.evaluate(TestRuleReportUncaughtExceptions.java:68)
>>         at org.apache.lucene.util.TestRuleStoreClassName$1.evaluate(TestRuleStoreClassName.java:38)
>>         at org.apache.lucene.util.TestRuleIcuHack$1.evaluate(TestRuleIcuHack.java:51)
>>         at com.carrotsearch.randomizedtesting.rules.SystemPropertiesInvariantRule$1.evaluate(SystemPropertiesInvariantRule.java:55)
>>         at org.apache.lucene.util.TestRuleNoInstanceHooksOverrides$1.evaluate(TestRuleNoInstanceHooksOverrides.java:53)
>>         at org.apache.lucene.util.TestRuleNoStaticHooksShadowing$1.evaluate(TestRuleNoStaticHooksShadowing.java:52)
>>         at org.apache.lucene.util.TestRuleAssertionsRequired$1.evaluate(TestRuleAssertionsRequired.java:36)
>>         at org.apache.lucene.util.TestRuleMarkFailure$1.evaluate(TestRuleMarkFailure.java:48)
>>         at org.apache.lucene.util.TestRuleIgnoreAfterMaxFailures$1.evaluate(TestRuleIgnoreAfterMaxFailures.java:70)
>>         at org.apache.lucene.util.TestRuleIgnoreTestSuites$1.evaluate(TestRuleIgnoreTestSuites.java:55)
>>         at com.carrotsearch.randomizedtesting.RandomizedRunner.runSuite(RandomizedRunner.java:605)
>>         at com.carrotsearch.randomizedtesting.RandomizedRunner.access$400(RandomizedRunner.java:132)
>>         at com.carrotsearch.randomizedtesting.RandomizedRunner$2.run(RandomizedRunner.java:551)
>> Caused by: java.lang.RuntimeException: java.lang.AssertionError: startOffset isn't -1 expected:<-1> but was:<53>
>>         at __randomizedtesting.SeedInfo.seed([84B6520D8F1B01BD]:0)
>>         at org.apache.lucene.index.TestPostingsFormat$1.run(TestPostingsFormat.java:761)
>> Caused by: java.lang.AssertionError: startOffset isn't -1 expected:<-1> but was:<53>
>>         at org.junit.Assert.fail(Assert.java:93)
>>         at org.junit.Assert.failNotEquals(Assert.java:647)
>>         at org.junit.Assert.assertEquals(Assert.java:128)
>>         at org.junit.Assert.assertEquals(Assert.java:472)
>>         at org.apache.lucene.index.TestPostingsFormat.verifyEnum(TestPostingsFormat.java:741)
>>         at org.apache.lucene.index.TestPostingsFormat.testTermsOneThread(TestPostingsFormat.java:828)
>>         at org.apache.lucene.index.TestPostingsFormat.access$200(TestPostingsFormat.java:73)
>>         at org.apache.lucene.index.TestPostingsFormat$1.run(TestPostingsFormat.java:759)
>>
>>
>> FAILED:  org.apache.lucene.index.TestPostingsFormat.test
>>
>> Error Message:
>> Thread threw an uncaught exception, thread: Thread[Thread-1100,5,]
>>
>> Stack Trace:
>> java.lang.RuntimeException: Thread threw an uncaught exception, thread: Thread[Thread-1100,5,]
>>         at com.carrotsearch.randomizedtesting.RunnerThreadGroup.processUncaught(RunnerThreadGroup.java:96)
>>         at com.carrotsearch.randomizedtesting.RandomizedRunner.runSingleTest(RandomizedRunner.java:859)
>>         at com.carrotsearch.randomizedtesting.RandomizedRunner.access$700(RandomizedRunner.java:132)
>>         at com.carrotsearch.randomizedtesting.RandomizedRunner$3$1.run(RandomizedRunner.java:671)
>>         at com.carrotsearch.randomizedtesting.RandomizedRunner$3.evaluate(RandomizedRunner.java:697)
>>         at com.carrotsearch.randomizedtesting.RandomizedRunner$4.evaluate(RandomizedRunner.java:736)
>>         at com.carrotsearch.randomizedtesting.RandomizedRunner$5.evaluate(RandomizedRunner.java:747)
>>         at org.apache.lucene.util.AbstractBeforeAfterRule$1.evaluate(AbstractBeforeAfterRule.java:45)
>>         at org.apache.lucene.util.TestRuleReportUncaughtExceptions$1.evaluate(TestRuleReportUncaughtExceptions.java:68)
>>         at org.apache.lucene.util.TestRuleStoreClassName$1.evaluate(TestRuleStoreClassName.java:38)
>>         at org.apache.lucene.util.TestRuleIcuHack$1.evaluate(TestRuleIcuHack.java:51)
>>         at com.carrotsearch.randomizedtesting.rules.SystemPropertiesInvariantRule$1.evaluate(SystemPropertiesInvariantRule.java:55)
>>         at org.apache.lucene.util.TestRuleNoInstanceHooksOverrides$1.evaluate(TestRuleNoInstanceHooksOverrides.java:53)
>>         at org.apache.lucene.util.TestRuleNoStaticHooksShadowing$1.evaluate(TestRuleNoStaticHooksShadowing.java:52)
>>         at org.apache.lucene.util.TestRuleAssertionsRequired$1.evaluate(TestRuleAssertionsRequired.java:36)
>>         at org.apache.lucene.util.TestRuleMarkFailure$1.evaluate(TestRuleMarkFailure.java:48)
>>         at org.apache.lucene.util.TestRuleIgnoreAfterMaxFailures$1.evaluate(TestRuleIgnoreAfterMaxFailures.java:70)
>>         at org.apache.lucene.util.TestRuleIgnoreTestSuites$1.evaluate(TestRuleIgnoreTestSuites.java:55)
>>         at com.carrotsearch.randomizedtesting.RandomizedRunner.runSuite(RandomizedRunner.java:605)
>>         at com.carrotsearch.randomizedtesting.RandomizedRunner.access$400(RandomizedRunner.java:132)
>>         at com.carrotsearch.randomizedtesting.RandomizedRunner$2.run(RandomizedRunner.java:551)
>> Caused by: java.lang.RuntimeException: java.lang.AssertionError: startOffset isn't -1 expected:<-1> but was:<53>
>>         at __randomizedtesting.SeedInfo.seed([84B6520D8F1B01BD]:0)
>>         at org.apache.lucene.index.TestPostingsFormat$1.run(TestPostingsFormat.java:761)
>> Caused by: java.lang.AssertionError: startOffset isn't -1 expected:<-1> but was:<53>
>>         at org.junit.Assert.fail(Assert.java:93)
>>         at org.junit.Assert.failNotEquals(Assert.java:647)
>>         at org.junit.Assert.assertEquals(Assert.java:128)
>>         at org.junit.Assert.assertEquals(Assert.java:472)
>>         at org.apache.lucene.index.TestPostingsFormat.verifyEnum(TestPostingsFormat.java:741)
>>         at org.apache.lucene.index.TestPostingsFormat.testTermsOneThread(TestPostingsFormat.java:828)
>>         at org.apache.lucene.index.TestPostingsFormat.access$200(TestPostingsFormat.java:73)
>>         at org.apache.lucene.index.TestPostingsFormat$1.run(TestPostingsFormat.java:759)
>>
>>
>>
>>
>> Build Log:
>> [...truncated 8769 lines...]
>> Running org.apache.lucene.index.TestPostingsFormat
>> NOTE: reproduce with: ant test  -Dtestcase=TestPostingsFormat -Dtests.method=test -Dtests.seed=84B6520D8F1B01BD -Dtests.locale=sr -Dtests.timezone=Australia/LHI -Dtests.file.encoding=ISO8859-1
>> NOTE: test params are: codec=SimpleText, sim=DefaultSimilarity, locale=sr, timezone=Australia/LHI
>> NOTE: FreeBSD 9.0-RELEASE amd64/Sun Microsystems Inc. 1.6.0_32 (64-bit)/cpus=16,threads=1,free=186608024,total=425000960
>> NOTE: All tests run in this JVM: [TestOmitNorms, TestGraphTokenizers, TestFSTs, TestDeletionPolicy, Nested, TestMultiValuedNumericRangeQuery, TestOmitPositions, TestAddIndexes, TestFieldCacheRangeFilter, TestDocValuesScoring, TestTermdocPerf, TestBooleanScorer, TestConjunctions, TestRollback, TestParallelCompositeReader, TestSpanExplanations, TestSubScorerFreqs, TestComplexExplanations, TestSearchAfter, TestSearcherManager, TestUTF32ToUTF8, TestSimilarity, TestSegmentReader, TestCharFilter, TestFieldCache, TestBooleanQueryVisitSubscorers, TestBasics, TestMultiFields, TestBitVector, TestBackwardsCompatibility, TestNumericRangeQuery64, TestDocValuesTypeCompatibility, TestTimeLimitingCollector, TestIndexWriterOnDiskFull, TestHugeRamFile, TestCachingWrapperFilter, TestIndexWriterExceptions, TestCachingTokenFilter, TestFieldCacheSanityChecker, TestSpecialOperations, TestMatchAllDocsQuery, TestNumericUtils, TestTypePromotion, TestWindowsMMap, TestSloppyPhraseQuery, TestPayloadNearQuery, TestIndexInput, TestNot, TestTermsEnum2, TestMultiThreadTermVectors, TestTerm, TestTermScorer, TestSpanMultiTermQueryWrapper, TestForceMergeForever, TestSpanFirstQuery, TestRecyclingByteBlockAllocator, TestPackedInts, TestNRTCachingDirectory, TestRandomStoredFields, TestNRTReaderWithThreads, TestSimpleSearchEquivalence, TestDeterminizeLexicon, TestBooleanOr, TestPrefixQuery, TestTwoPhaseCommitTool, TestSizeBoundedForceMerge, TestSnapshotDeletionPolicy, TestCompiledAutomaton, TestDocTermOrds, TestCheckIndex, TestCopyBytes, TestPrefixInBooleanQuery, TestExternalCodecs, TestNumericTokenStream, TestSimpleExplanationsOfNonMatches, TestIsCurrent, TestIntBlockCodec, TestIndexWriterDelete, TestCachingCollector, TestPagedBytes, TestRAMDirectory, TestRollingCharBuffer, TestBooleanQuery, TestDateSort, TestDocument, TestElevationComparator, TestAtomicUpdate, TestIndexWriterCommit, TestFixedBitSet, TestPhrasePrefixQuery, TestExplanations, TestNumericRangeQuery32, Nested1, TestIndexWriterMerging, TestIndexWriterMergePolicy, TestConcurrentMergeScheduler, TestParallelAtomicReader, TestPrefixCodedTerms, TestByteSlices, TestTermVectorsWriter, TestPhraseQuery, TestComplexExplanationsOfNonMatches, TestPositionIncrement, TestIndexWriterUnicode, TestSimilarityBase, TestSameTokenSamePosition, TestStressAdvance, TestDirectory, TestBytesRef, TestByteBlockPool, MultiCollectorTest, TestSortedVIntList, TestOmitTf, TestDisjunctionMaxQuery, TestDoubleBarrelLRUCache, TestPostingsOffsets, TestSearchWithThreads, TestConsistentFieldNumbers, TestBinaryDocument, Test2BPostings, TestSpanExplanationsOfNonMatches, TestVirtualMethod, TestIndexCommit, TestIndexWriter, TestSimpleExplanations, TestTermRangeFilter, TestCharsRef, TestPerSegmentDeletes, TestVersion, TestRamUsageEstimatorOnWildAnimals, TestForTooMuchCloning, TestMockCharFilter, TestTermRangeQuery, TestSort, TestBytesRefHash, TestDateFilter, TestMultiTermQueryRewrites, TestCollectionUtil, TestMaxTermFrequency, TestWildcardRandom, TestTermVectors, TestLucene40PostingsReader, TestMockAnalyzer, TestFilteredSearch, TestBinaryTerms, TestIndexWriterReader, TestPulsingReuse, TestDocsAndPositions, Test10KPulsings, TestMinimize, TestPerFieldPostingsFormat, TestMergeSchedulerExternal, TestAutomatonQuery, TestFieldValueFilter, TestBasicOperations, TestTransactionRollback, TestDoc, TestPrefixFilter, TestNearSpansOrdered, TestCrashCausesCorruptIndex, TestOpenBitSet, TestTermsEnum, TestMixedCodecs, TestFlushByRamOrCountsPolicy, TestFileSwitchDirectory, TestNRTManager, TestBitUtil, TestBooleanMinShouldMatch, TestFieldInfos, TestDocCount, TestPayloads, TestNewestSegment, TestIndexWriterOnJRECrash, TestFuzzyQuery, TestPayloadProcessorProvider, TestDeterminism, TestRollingBuffer, TestPayloadExplanations, TestPersistentSnapshotDeletionPolicy, TestDemo, TestParallelTermEnum, TestDocIdSet, TestAllFilesHaveCodecHeader, TestConstantScoreQuery, TestBufferedIndexInput, TestTieredMergePolicy, TestIndexWriterLockRelease, TestPayloadTermQuery, TestAutomatonQueryUnicode, Nested1, Nested2, Nested3, TestSetOnce, TestSegmentTermEnum, TestMultiTermConstantScore, TestMultiMMap, TestStressIndexing, TestSloppyPhraseQuery2, TestRegexpRandom, TestPrefixRandom, TestDuelingCodecs, TestFilterAtomicReader, TestSearch, TestIdentityHashSet, TestIndexWriterConfig, TestSimpleAttributeImpl, TestIndexableField, TestReuseDocsEnum, TestSmallFloat, TestDirectoryReaderReopen, TestToken, TestQueryWrapperFilter, TestSimilarity2, TestAttributeSource, TestParallelReaderEmptyIndex, TestSpans, TestNRTThreads, TestVersionComparator, ThrowInUncaught, TestNoMergeScheduler, TestDocumentWriter, TestLongPostings, TestFieldCacheRewriteMethod, Nested, Nested, Nested, Nested, Nested, Nested, Nested, Nested, Nested, Nested, Nested, Nested, Nested, Nested, Nested, Nested, Nested, Nested, Nested, Nested, Nested, TestWildcard, TestDocumentsWriterStallControl, TestRegexpRandom2, TestDocBoost, NestedSetupChain, NestedTeardownChain, TestScorerPerf, TestCodecs, TestTopScoreDocCollector, TestDirectoryReader, TestCloseableThreadLocal, TestPriorityQueue, TestFieldsReader, TestSpanSearchEquivalence, TestCompoundFile, Nested, TestSearchForDuplicates, InBeforeClass, InAfterClass, InTestMethod, NonStringProperties, TestNGramPhraseQuery, TestUniqueTermCount, TestWeakIdentityMap, Test2BDocs, TestNoMergePolicy, TestShardSearching, TestTopDocsMerge, TestTransactions, TestDateTools, TestFlex, TestNamedSPILoader, TestCrash, TestFieldMaskingSpanQuery, TestStressIndexing2, TestRollingUpdates, TestReaderClosed, TestScoreCachingWrappingScorer, TestUnicodeUtil, TestIndexWriterNRTIsCurrent, TestSegmentMerger, TestDocumentsWriterDeleteQueue, TestIndexFileDeleter, TestCustomSearcherSort, TestIOUtils, TestPostingsFormat]
>> Tests run: 5, Failures: 0, Errors: 5, Skipped: 0, Time elapsed: 5.427 sec <<< FAILURE!
>>
>> [...truncated 373 lines...]
>>
>>
>>
>>
>> ---------------------------------------------------------------------
>> To unsubscribe, e-mail: [hidden email]
>> For additional commands, e-mail: [hidden email]
>
>
>
> --
> lucidimagination.com



--
lucidimagination.com

---------------------------------------------------------------------
To unsubscribe, e-mail: [hidden email]
For additional commands, e-mail: [hidden email]