Lucene-Solr-tests-only-3.x - Build # 511 - Failure

classic Classic list List threaded Threaded
3 messages Options
Reply | Threaded
Open this post in threaded view
|

Lucene-Solr-tests-only-3.x - Build # 511 - Failure

Apache Jenkins Server
Build: http://hudson.zones.apache.org/hudson/job/Lucene-Solr-tests-only-3.x/511/

3 tests failed.
FAILED:  junit.framework.TestSuite.org.apache.solr.highlight.HighlighterTest

Error Message:
ERROR: SolrIndexSearcher opens=46 closes=45

Stack Trace:
junit.framework.AssertionFailedError: ERROR: SolrIndexSearcher opens=46 closes=45
        at org.apache.solr.SolrTestCaseJ4.endTrackingSearchers(SolrTestCaseJ4.java:114)
        at org.apache.solr.SolrTestCaseJ4.deleteCore(SolrTestCaseJ4.java:287)
        at org.apache.solr.SolrTestCaseJ4.afterClassSolrTestCase(SolrTestCaseJ4.java:65)


FAILED:  junit.framework.TestSuite.org.apache.solr.spelling.SpellCheckCollatorTest

Error Message:
ERROR: SolrIndexSearcher opens=2 closes=1

Stack Trace:
junit.framework.AssertionFailedError: ERROR: SolrIndexSearcher opens=2 closes=1
        at org.apache.solr.SolrTestCaseJ4.endTrackingSearchers(SolrTestCaseJ4.java:114)
        at org.apache.solr.SolrTestCaseJ4.deleteCore(SolrTestCaseJ4.java:287)
        at org.apache.solr.SolrTestCaseJ4.afterClassSolrTestCase(SolrTestCaseJ4.java:65)


FAILED:  junit.framework.TestSuite.org.apache.solr.update.processor.SignatureUpdateProcessorFactoryTest

Error Message:
ERROR: SolrIndexSearcher opens=39 closes=34

Stack Trace:
junit.framework.AssertionFailedError: ERROR: SolrIndexSearcher opens=39 closes=34
        at org.apache.solr.SolrTestCaseJ4.endTrackingSearchers(SolrTestCaseJ4.java:114)
        at org.apache.solr.SolrTestCaseJ4.deleteCore(SolrTestCaseJ4.java:287)
        at org.apache.solr.SolrTestCaseJ4.afterClassSolrTestCase(SolrTestCaseJ4.java:65)




Build Log (for compile errors):
[...truncated 9848 lines...]



---------------------------------------------------------------------
To unsubscribe, e-mail: [hidden email]
For additional commands, e-mail: [hidden email]

Reply | Threaded
Open this post in threaded view
|

Lucene-Solr-tests-only-3.x - Build # 512 - Still Failing

Apache Jenkins Server
Build: http://hudson.zones.apache.org/hudson/job/Lucene-Solr-tests-only-3.x/512/

3 tests failed.
FAILED:  junit.framework.TestSuite.org.apache.solr.highlight.HighlighterTest

Error Message:
ERROR: SolrIndexSearcher opens=46 closes=45

Stack Trace:
junit.framework.AssertionFailedError: ERROR: SolrIndexSearcher opens=46 closes=45
        at org.apache.solr.SolrTestCaseJ4.endTrackingSearchers(SolrTestCaseJ4.java:114)
        at org.apache.solr.SolrTestCaseJ4.deleteCore(SolrTestCaseJ4.java:287)
        at org.apache.solr.SolrTestCaseJ4.afterClassSolrTestCase(SolrTestCaseJ4.java:65)


FAILED:  junit.framework.TestSuite.org.apache.solr.spelling.SpellCheckCollatorTest

Error Message:
ERROR: SolrIndexSearcher opens=2 closes=1

Stack Trace:
junit.framework.AssertionFailedError: ERROR: SolrIndexSearcher opens=2 closes=1
        at org.apache.solr.SolrTestCaseJ4.endTrackingSearchers(SolrTestCaseJ4.java:114)
        at org.apache.solr.SolrTestCaseJ4.deleteCore(SolrTestCaseJ4.java:287)
        at org.apache.solr.SolrTestCaseJ4.afterClassSolrTestCase(SolrTestCaseJ4.java:65)


FAILED:  junit.framework.TestSuite.org.apache.solr.update.processor.SignatureUpdateProcessorFactoryTest

Error Message:
ERROR: SolrIndexSearcher opens=39 closes=34

Stack Trace:
junit.framework.AssertionFailedError: ERROR: SolrIndexSearcher opens=39 closes=34
        at org.apache.solr.SolrTestCaseJ4.endTrackingSearchers(SolrTestCaseJ4.java:114)
        at org.apache.solr.SolrTestCaseJ4.deleteCore(SolrTestCaseJ4.java:287)
        at org.apache.solr.SolrTestCaseJ4.afterClassSolrTestCase(SolrTestCaseJ4.java:65)




Build Log (for compile errors):
[...truncated 9847 lines...]



---------------------------------------------------------------------
To unsubscribe, e-mail: [hidden email]
For additional commands, e-mail: [hidden email]

Reply | Threaded
Open this post in threaded view
|

Lucene-Solr-tests-only-3.x - Build # 513 - Still Failing

Apache Jenkins Server
Build: http://hudson.zones.apache.org/hudson/job/Lucene-Solr-tests-only-3.x/513/

3 tests failed.
FAILED:  junit.framework.TestSuite.org.apache.solr.highlight.HighlighterTest

Error Message:
ERROR: SolrIndexSearcher opens=46 closes=45

Stack Trace:
junit.framework.AssertionFailedError: ERROR: SolrIndexSearcher opens=46 closes=45
        at org.apache.solr.SolrTestCaseJ4.endTrackingSearchers(SolrTestCaseJ4.java:114)
        at org.apache.solr.SolrTestCaseJ4.deleteCore(SolrTestCaseJ4.java:287)
        at org.apache.solr.SolrTestCaseJ4.afterClassSolrTestCase(SolrTestCaseJ4.java:65)


FAILED:  junit.framework.TestSuite.org.apache.solr.spelling.SpellCheckCollatorTest

Error Message:
ERROR: SolrIndexSearcher opens=2 closes=1

Stack Trace:
junit.framework.AssertionFailedError: ERROR: SolrIndexSearcher opens=2 closes=1
        at org.apache.solr.SolrTestCaseJ4.endTrackingSearchers(SolrTestCaseJ4.java:114)
        at org.apache.solr.SolrTestCaseJ4.deleteCore(SolrTestCaseJ4.java:287)
        at org.apache.solr.SolrTestCaseJ4.afterClassSolrTestCase(SolrTestCaseJ4.java:65)


FAILED:  junit.framework.TestSuite.org.apache.solr.update.processor.SignatureUpdateProcessorFactoryTest

Error Message:
ERROR: SolrIndexSearcher opens=39 closes=34

Stack Trace:
junit.framework.AssertionFailedError: ERROR: SolrIndexSearcher opens=39 closes=34
        at org.apache.solr.SolrTestCaseJ4.endTrackingSearchers(SolrTestCaseJ4.java:114)
        at org.apache.solr.SolrTestCaseJ4.deleteCore(SolrTestCaseJ4.java:287)
        at org.apache.solr.SolrTestCaseJ4.afterClassSolrTestCase(SolrTestCaseJ4.java:65)




Build Log (for compile errors):
[...truncated 9752 lines...]



---------------------------------------------------------------------
To unsubscribe, e-mail: [hidden email]
For additional commands, e-mail: [hidden email]