Lucene-Solr-tests-only-3.x - Build # 523 - Failure

classic Classic list List threaded Threaded
2 messages Options
Reply | Threaded
Open this post in threaded view
|

Lucene-Solr-tests-only-3.x - Build # 523 - Failure

Apache Jenkins Server
Build: http://hudson.zones.apache.org/hudson/job/Lucene-Solr-tests-only-3.x/523/

2 tests failed.
FAILED:  org.apache.solr.velocity.VelocityResponseWriterTest.testFocusQueryParser

Error Message:
Forked Java VM exited abnormally. Please note the time in the report does not reflect the time until the VM exit.

Stack Trace:
junit.framework.AssertionFailedError: Forked Java VM exited abnormally. Please note the time in the report does not reflect the time until the VM exit.
        at java.lang.Thread.run(Thread.java:636)


FAILED:  TEST-org.apache.solr.search.TestExtendedDismaxParser.xml.<init>

Error Message:


Stack Trace:
Test report file /home/hudson/hudson-slave/workspace/Lucene-Solr-tests-only-3.x/checkout/solr/build/test-results/TEST-org.apache.solr.search.TestExtendedDismaxParser.xml was length 0



Build Log (for compile errors):
[...truncated 191526 lines...]



---------------------------------------------------------------------
To unsubscribe, e-mail: [hidden email]
For additional commands, e-mail: [hidden email]

Reply | Threaded
Open this post in threaded view
|

Lucene-Solr-tests-only-3.x - Build # 524 - Still Failing

Apache Jenkins Server
Build: http://hudson.zones.apache.org/hudson/job/Lucene-Solr-tests-only-3.x/524/

2 tests failed.
FAILED:  org.apache.solr.util.PrimUtilsTest.testFaceting

Error Message:
Forked Java VM exited abnormally. Please note the time in the report does not reflect the time until the VM exit.

Stack Trace:
junit.framework.AssertionFailedError: Forked Java VM exited abnormally. Please note the time in the report does not reflect the time until the VM exit.
        at java.lang.Thread.run(Thread.java:636)


FAILED:  TEST-org.apache.solr.client.solrj.embedded.SolrExampleEmbeddedTest.xml.<init>

Error Message:


Stack Trace:
Test report file /home/hudson/hudson-slave/workspace/Lucene-Solr-tests-only-3.x/checkout/solr/build/test-results/TEST-org.apache.solr.client.solrj.embedded.SolrExampleEmbeddedTest.xml was length 0



Build Log (for compile errors):
[...truncated 179694 lines...]



---------------------------------------------------------------------
To unsubscribe, e-mail: [hidden email]
For additional commands, e-mail: [hidden email]