Re: Fullmetal Jenkins: Solr - Build # 86 - Failure!

classic Classic list List threaded Threaded
5 messages Options
Reply | Threaded
Open this post in threaded view
|

Re: Fullmetal Jenkins: Solr - Build # 86 - Failure!

Mark Miller-3
This test lazy cores test also fails somewhat frequently on my primary linux box.

Usually I see:

java.lang.NullPointerException
        at __randomizedtesting.SeedInfo.seed([3127684F1AE08B61:AA78F492392B81D2]:0)
        at org.apache.solr.core.TestLazyCores.testLazyLoad(TestLazyCores.java:92)

On Nov 20, 2012, at 10:09 PM, [hidden email] wrote:

> Solr - Build # 86 - Failure:
>
> Check console output at http://fullmetaljenkins.org/job/Solr/86/ to view the results.
>
> 4 tests failed.
> FAILED:  junit.framework.TestSuite.org.apache.solr.core.TestLazyCores
>
> Error Message:
> ERROR: SolrIndexSearcher opens=19 closes=15
>
> Stack Trace:
> java.lang.AssertionError: ERROR: SolrIndexSearcher opens=19 closes=15
> at __randomizedtesting.SeedInfo.seed([3127684F1AE08B61]:0)
> at org.junit.Assert.fail(Assert.java:93)
> at org.apache.solr.SolrTestCaseJ4.endTrackingSearchers(SolrTestCaseJ4.java:243)
> at org.apache.solr.SolrTestCaseJ4.afterClass(SolrTestCaseJ4.java:97)
> at sun.reflect.GeneratedMethodAccessor19.invoke(Unknown Source)
> at sun.reflect.DelegatingMethodAccessorImpl.invoke(DelegatingMethodAccessorImpl.java:43)
> at java.lang.reflect.Method.invoke(Method.java:601)
> at com.carrotsearch.randomizedtesting.RandomizedRunner.invoke(RandomizedRunner.java:1559)
> at com.carrotsearch.randomizedtesting.RandomizedRunner.access$600(RandomizedRunner.java:79)
> at com.carrotsearch.randomizedtesting.RandomizedRunner$5.evaluate(RandomizedRunner.java:700)
> at com.carrotsearch.randomizedtesting.rules.StatementAdapter.evaluate(StatementAdapter.java:36)
> at com.carrotsearch.randomizedtesting.rules.SystemPropertiesRestoreRule$1.evaluate(SystemPropertiesRestoreRule.java:53)
> at org.apache.lucene.util.AbstractBeforeAfterRule$1.evaluate(AbstractBeforeAfterRule.java:45)
> at org.apache.lucene.util.TestRuleStoreClassName$1.evaluate(TestRuleStoreClassName.java:42)
> at com.carrotsearch.randomizedtesting.rules.SystemPropertiesInvariantRule$1.evaluate(SystemPropertiesInvariantRule.java:55)
> at com.carrotsearch.randomizedtesting.rules.NoShadowingOrOverridesOnMethodsRule$1.evaluate(NoShadowingOrOverridesOnMethodsRule.java:39)
> at com.carrotsearch.randomizedtesting.rules.NoShadowingOrOverridesOnMethodsRule$1.evaluate(NoShadowingOrOverridesOnMethodsRule.java:39)
> at com.carrotsearch.randomizedtesting.rules.StatementAdapter.evaluate(StatementAdapter.java:36)
> at org.apache.lucene.util.TestRuleAssertionsRequired$1.evaluate(TestRuleAssertionsRequired.java:43)
> at org.apache.lucene.util.TestRuleMarkFailure$1.evaluate(TestRuleMarkFailure.java:48)
> at org.apache.lucene.util.TestRuleIgnoreAfterMaxFailures$1.evaluate(TestRuleIgnoreAfterMaxFailures.java:70)
> at org.apache.lucene.util.TestRuleIgnoreTestSuites$1.evaluate(TestRuleIgnoreTestSuites.java:55)
> at com.carrotsearch.randomizedtesting.rules.StatementAdapter.evaluate(StatementAdapter.java:36)
> at com.carrotsearch.randomizedtesting.ThreadLeakControl$StatementRunner.run(ThreadLeakControl.java:358)
> at java.lang.Thread.run(Thread.java:722)
>
>
> FAILED:  junit.framework.TestSuite.org.apache.solr.core.TestLazyCores
>
> Error Message:
> 4 threads leaked from SUITE scope at org.apache.solr.core.TestLazyCores:     1) Thread[id=1094, name=searcherExecutor-575-thread-1, state=WAITING, group=TGRP-TestLazyCores]         at sun.misc.Unsafe.park(Native Method)         at java.util.concurrent.locks.LockSupport.park(LockSupport.java:186)         at java.util.concurrent.locks.AbstractQueuedSynchronizer$ConditionObject.await(AbstractQueuedSynchronizer.java:2043)         at java.util.concurrent.LinkedBlockingQueue.take(LinkedBlockingQueue.java:442)         at java.util.concurrent.ThreadPoolExecutor.getTask(ThreadPoolExecutor.java:1043)         at java.util.concurrent.ThreadPoolExecutor.runWorker(ThreadPoolExecutor.java:1103)         at java.util.concurrent.ThreadPoolExecutor$Worker.run(ThreadPoolExecutor.java:603)         at java.lang.Thread.run(Thread.java:722)    2) Thread[id=1096, name=searcherExecutor-583-thread-1, state=WAITING, group=TGRP-TestLazyCores]         at sun.misc.Unsafe.park(Native Method)         at java.util.concurrent.locks.LockSupport.park(LockSupport.java:186)         at java.util.concurrent.locks.AbstractQueuedSynchronizer$ConditionObject.await(AbstractQueuedSynchronizer.java:2043)         at java.util.concurrent.LinkedBlockingQueue.take(LinkedBlockingQueue.java:442)         at java.util.concurrent.ThreadPoolExecutor.getTask(ThreadPoolExecutor.java:1043)         at java.util.concurrent.ThreadPoolExecutor.runWorker(ThreadPoolExecutor.java:1103)         at java.util.concurrent.ThreadPoolExecutor$Worker.run(ThreadPoolExecutor.java:603)         at java.lang.Thread.run(Thread.java:722)    3) Thread[id=1098, name=searcherExecutor-589-thread-1, state=WAITING, group=TGRP-TestLazyCores]         at sun.misc.Unsafe.park(Native Method)         at java.util.concurrent.locks.LockSupport.park(LockSupport.java:186)         at java.util.concurrent.locks.AbstractQueuedSynchronizer$ConditionObject.await(AbstractQueuedSynchronizer.java:2043)         at java.util.concurrent.LinkedBlockingQueue.take(LinkedBlockingQueue.java:442)         at java.util.concurrent.ThreadPoolExecutor.getTask(ThreadPoolExecutor.java:1043)         at java.util.concurrent.ThreadPoolExecutor.runWorker(ThreadPoolExecutor.java:1103)         at java.util.concurrent.ThreadPoolExecutor$Worker.run(ThreadPoolExecutor.java:603)         at java.lang.Thread.run(Thread.java:722)    4) Thread[id=1097, name=searcherExecutor-586-thread-1, state=WAITING, group=TGRP-TestLazyCores]         at sun.misc.Unsafe.park(Native Method)         at java.util.concurrent.locks.LockSupport.park(LockSupport.java:186)         at java.util.concurrent.locks.AbstractQueuedSynchronizer$ConditionObject.await(AbstractQueuedSynchronizer.java:2043)         at java.util.concurrent.LinkedBlockingQueue.take(LinkedBlockingQueue.java:442)         at java.util.concurrent.ThreadPoolExecutor.getTask(ThreadPoolExecutor.java:1043)         at java.util.concurrent.ThreadPoolExecutor.runWorker(ThreadPoolExecutor.java:1103)         at java.util.concurrent.ThreadPoolExecutor$Worker.run(ThreadPoolExecutor.java:603)         at java.lang.Thread.run(Thread.java:722)
>
> Stack Trace:
> com.carrotsearch.randomizedtesting.ThreadLeakError: 4 threads leaked from SUITE scope at org.apache.solr.core.TestLazyCores:
>   1) Thread[id=1094, name=searcherExecutor-575-thread-1, state=WAITING, group=TGRP-TestLazyCores]
>        at sun.misc.Unsafe.park(Native Method)
>        at java.util.concurrent.locks.LockSupport.park(LockSupport.java:186)
>        at java.util.concurrent.locks.AbstractQueuedSynchronizer$ConditionObject.await(AbstractQueuedSynchronizer.java:2043)
>        at java.util.concurrent.LinkedBlockingQueue.take(LinkedBlockingQueue.java:442)
>        at java.util.concurrent.ThreadPoolExecutor.getTask(ThreadPoolExecutor.java:1043)
>        at java.util.concurrent.ThreadPoolExecutor.runWorker(ThreadPoolExecutor.java:1103)
>        at java.util.concurrent.ThreadPoolExecutor$Worker.run(ThreadPoolExecutor.java:603)
>        at java.lang.Thread.run(Thread.java:722)
>   2) Thread[id=1096, name=searcherExecutor-583-thread-1, state=WAITING, group=TGRP-TestLazyCores]
>        at sun.misc.Unsafe.park(Native Method)
>        at java.util.concurrent.locks.LockSupport.park(LockSupport.java:186)
>        at java.util.concurrent.locks.AbstractQueuedSynchronizer$ConditionObject.await(AbstractQueuedSynchronizer.java:2043)
>        at java.util.concurrent.LinkedBlockingQueue.take(LinkedBlockingQueue.java:442)
>        at java.util.concurrent.ThreadPoolExecutor.getTask(ThreadPoolExecutor.java:1043)
>        at java.util.concurrent.ThreadPoolExecutor.runWorker(ThreadPoolExecutor.java:1103)
>        at java.util.concurrent.ThreadPoolExecutor$Worker.run(ThreadPoolExecutor.java:603)
>        at java.lang.Thread.run(Thread.java:722)
>   3) Thread[id=1098, name=searcherExecutor-589-thread-1, state=WAITING, group=TGRP-TestLazyCores]
>        at sun.misc.Unsafe.park(Native Method)
>        at java.util.concurrent.locks.LockSupport.park(LockSupport.java:186)
>        at java.util.concurrent.locks.AbstractQueuedSynchronizer$ConditionObject.await(AbstractQueuedSynchronizer.java:2043)
>        at java.util.concurrent.LinkedBlockingQueue.take(LinkedBlockingQueue.java:442)
>        at java.util.concurrent.ThreadPoolExecutor.getTask(ThreadPoolExecutor.java:1043)
>        at java.util.concurrent.ThreadPoolExecutor.runWorker(ThreadPoolExecutor.java:1103)
>        at java.util.concurrent.ThreadPoolExecutor$Worker.run(ThreadPoolExecutor.java:603)
>        at java.lang.Thread.run(Thread.java:722)
>   4) Thread[id=1097, name=searcherExecutor-586-thread-1, state=WAITING, group=TGRP-TestLazyCores]
>        at sun.misc.Unsafe.park(Native Method)
>        at java.util.concurrent.locks.LockSupport.park(LockSupport.java:186)
>        at java.util.concurrent.locks.AbstractQueuedSynchronizer$ConditionObject.await(AbstractQueuedSynchronizer.java:2043)
>        at java.util.concurrent.LinkedBlockingQueue.take(LinkedBlockingQueue.java:442)
>        at java.util.concurrent.ThreadPoolExecutor.getTask(ThreadPoolExecutor.java:1043)
>        at java.util.concurrent.ThreadPoolExecutor.runWorker(ThreadPoolExecutor.java:1103)
>        at java.util.concurrent.ThreadPoolExecutor$Worker.run(ThreadPoolExecutor.java:603)
>        at java.lang.Thread.run(Thread.java:722)
> at __randomizedtesting.SeedInfo.seed([3127684F1AE08B61]:0)
>
>
> FAILED:  junit.framework.TestSuite.org.apache.solr.core.TestLazyCores
>
> Error Message:
> There are still zombie threads that couldn't be terminated:    1) Thread[id=1094, name=searcherExecutor-575-thread-1, state=WAITING, group=TGRP-TestLazyCores]         at sun.misc.Unsafe.park(Native Method)         at java.util.concurrent.locks.LockSupport.park(LockSupport.java:186)         at java.util.concurrent.locks.AbstractQueuedSynchronizer$ConditionObject.await(AbstractQueuedSynchronizer.java:2043)         at java.util.concurrent.LinkedBlockingQueue.take(LinkedBlockingQueue.java:442)         at java.util.concurrent.ThreadPoolExecutor.getTask(ThreadPoolExecutor.java:1043)         at java.util.concurrent.ThreadPoolExecutor.runWorker(ThreadPoolExecutor.java:1103)         at java.util.concurrent.ThreadPoolExecutor$Worker.run(ThreadPoolExecutor.java:603)         at java.lang.Thread.run(Thread.java:722)    2) Thread[id=1096, name=searcherExecutor-583-thread-1, state=WAITING, group=TGRP-TestLazyCores]         at sun.misc.Unsafe.park(Native Method)         at java.util.concurrent.locks.LockSupport.park(LockSupport.java:186)         at java.util.concurrent.locks.AbstractQueuedSynchronizer$ConditionObject.await(AbstractQueuedSynchronizer.java:2043)         at java.util.concurrent.LinkedBlockingQueue.take(LinkedBlockingQueue.java:442)         at java.util.concurrent.ThreadPoolExecutor.getTask(ThreadPoolExecutor.java:1043)         at java.util.concurrent.ThreadPoolExecutor.runWorker(ThreadPoolExecutor.java:1103)         at java.util.concurrent.ThreadPoolExecutor$Worker.run(ThreadPoolExecutor.java:603)         at java.lang.Thread.run(Thread.java:722)    3) Thread[id=1098, name=searcherExecutor-589-thread-1, state=WAITING, group=TGRP-TestLazyCores]         at sun.misc.Unsafe.park(Native Method)         at java.util.concurrent.locks.LockSupport.park(LockSupport.java:186)         at java.util.concurrent.locks.AbstractQueuedSynchronizer$ConditionObject.await(AbstractQueuedSynchronizer.java:2043)         at java.util.concurrent.LinkedBlockingQueue.take(LinkedBlockingQueue.java:442)         at java.util.concurrent.ThreadPoolExecutor.getTask(ThreadPoolExecutor.java:1043)         at java.util.concurrent.ThreadPoolExecutor.runWorker(ThreadPoolExecutor.java:1103)         at java.util.concurrent.ThreadPoolExecutor$Worker.run(ThreadPoolExecutor.java:603)         at java.lang.Thread.run(Thread.java:722)    4) Thread[id=1097, name=searcherExecutor-586-thread-1, state=WAITING, group=TGRP-TestLazyCores]         at sun.misc.Unsafe.park(Native Method)         at java.util.concurrent.locks.LockSupport.park(LockSupport.java:186)         at java.util.concurrent.locks.AbstractQueuedSynchronizer$ConditionObject.await(AbstractQueuedSynchronizer.java:2043)         at java.util.concurrent.LinkedBlockingQueue.take(LinkedBlockingQueue.java:442)         at java.util.concurrent.ThreadPoolExecutor.getTask(ThreadPoolExecutor.java:1043)         at java.util.concurrent.ThreadPoolExecutor.runWorker(ThreadPoolExecutor.java:1103)         at java.util.concurrent.ThreadPoolExecutor$Worker.run(ThreadPoolExecutor.java:603)         at java.lang.Thread.run(Thread.java:722)
>
> Stack Trace:
> com.carrotsearch.randomizedtesting.ThreadLeakError: There are still zombie threads that couldn't be terminated:
>   1) Thread[id=1094, name=searcherExecutor-575-thread-1, state=WAITING, group=TGRP-TestLazyCores]
>        at sun.misc.Unsafe.park(Native Method)
>        at java.util.concurrent.locks.LockSupport.park(LockSupport.java:186)
>        at java.util.concurrent.locks.AbstractQueuedSynchronizer$ConditionObject.await(AbstractQueuedSynchronizer.java:2043)
>        at java.util.concurrent.LinkedBlockingQueue.take(LinkedBlockingQueue.java:442)
>        at java.util.concurrent.ThreadPoolExecutor.getTask(ThreadPoolExecutor.java:1043)
>        at java.util.concurrent.ThreadPoolExecutor.runWorker(ThreadPoolExecutor.java:1103)
>        at java.util.concurrent.ThreadPoolExecutor$Worker.run(ThreadPoolExecutor.java:603)
>        at java.lang.Thread.run(Thread.java:722)
>   2) Thread[id=1096, name=searcherExecutor-583-thread-1, state=WAITING, group=TGRP-TestLazyCores]
>        at sun.misc.Unsafe.park(Native Method)
>        at java.util.concurrent.locks.LockSupport.park(LockSupport.java:186)
>        at java.util.concurrent.locks.AbstractQueuedSynchronizer$ConditionObject.await(AbstractQueuedSynchronizer.java:2043)
>        at java.util.concurrent.LinkedBlockingQueue.take(LinkedBlockingQueue.java:442)
>        at java.util.concurrent.ThreadPoolExecutor.getTask(ThreadPoolExecutor.java:1043)
>        at java.util.concurrent.ThreadPoolExecutor.runWorker(ThreadPoolExecutor.java:1103)
>        at java.util.concurrent.ThreadPoolExecutor$Worker.run(ThreadPoolExecutor.java:603)
>        at java.lang.Thread.run(Thread.java:722)
>   3) Thread[id=1098, name=searcherExecutor-589-thread-1, state=WAITING, group=TGRP-TestLazyCores]
>        at sun.misc.Unsafe.park(Native Method)
>        at java.util.concurrent.locks.LockSupport.park(LockSupport.java:186)
>        at java.util.concurrent.locks.AbstractQueuedSynchronizer$ConditionObject.await(AbstractQueuedSynchronizer.java:2043)
>        at java.util.concurrent.LinkedBlockingQueue.take(LinkedBlockingQueue.java:442)
>        at java.util.concurrent.ThreadPoolExecutor.getTask(ThreadPoolExecutor.java:1043)
>        at java.util.concurrent.ThreadPoolExecutor.runWorker(ThreadPoolExecutor.java:1103)
>        at java.util.concurrent.ThreadPoolExecutor$Worker.run(ThreadPoolExecutor.java:603)
>        at java.lang.Thread.run(Thread.java:722)
>   4) Thread[id=1097, name=searcherExecutor-586-thread-1, state=WAITING, group=TGRP-TestLazyCores]
>        at sun.misc.Unsafe.park(Native Method)
>        at java.util.concurrent.locks.LockSupport.park(LockSupport.java:186)
>        at java.util.concurrent.locks.AbstractQueuedSynchronizer$ConditionObject.await(AbstractQueuedSynchronizer.java:2043)
>        at java.util.concurrent.LinkedBlockingQueue.take(LinkedBlockingQueue.java:442)
>        at java.util.concurrent.ThreadPoolExecutor.getTask(ThreadPoolExecutor.java:1043)
>        at java.util.concurrent.ThreadPoolExecutor.runWorker(ThreadPoolExecutor.java:1103)
>        at java.util.concurrent.ThreadPoolExecutor$Worker.run(ThreadPoolExecutor.java:603)
>        at java.lang.Thread.run(Thread.java:722)
> at __randomizedtesting.SeedInfo.seed([3127684F1AE08B61]:0)
>
>
> REGRESSION:  org.apache.solr.core.TestLazyCores.testLazyLoad
>
> Error Message:
>
>
> Stack Trace:
> java.lang.NullPointerException
> at __randomizedtesting.SeedInfo.seed([3127684F1AE08B61:AA78F492392B81D2]:0)
> at org.apache.solr.core.TestLazyCores.testLazyLoad(TestLazyCores.java:92)
> at sun.reflect.NativeMethodAccessorImpl.invoke0(Native Method)
> at sun.reflect.NativeMethodAccessorImpl.invoke(NativeMethodAccessorImpl.java:57)
> at sun.reflect.DelegatingMethodAccessorImpl.invoke(DelegatingMethodAccessorImpl.java:43)
> at java.lang.reflect.Method.invoke(Method.java:601)
> at com.carrotsearch.randomizedtesting.RandomizedRunner.invoke(RandomizedRunner.java:1559)
> at com.carrotsearch.randomizedtesting.RandomizedRunner.access$600(RandomizedRunner.java:79)
> at com.carrotsearch.randomizedtesting.RandomizedRunner$6.evaluate(RandomizedRunner.java:737)
> at com.carrotsearch.randomizedtesting.RandomizedRunner$7.evaluate(RandomizedRunner.java:773)
> at com.carrotsearch.randomizedtesting.RandomizedRunner$8.evaluate(RandomizedRunner.java:787)
> at com.carrotsearch.randomizedtesting.rules.SystemPropertiesRestoreRule$1.evaluate(SystemPropertiesRestoreRule.java:53)
> at org.apache.lucene.util.TestRuleSetupTeardownChained$1.evaluate(TestRuleSetupTeardownChained.java:50)
> at org.apache.lucene.util.TestRuleFieldCacheSanity$1.evaluate(TestRuleFieldCacheSanity.java:51)
> at org.apache.lucene.util.AbstractBeforeAfterRule$1.evaluate(AbstractBeforeAfterRule.java:45)
> at com.carrotsearch.randomizedtesting.rules.SystemPropertiesInvariantRule$1.evaluate(SystemPropertiesInvariantRule.java:55)
> at org.apache.lucene.util.TestRuleThreadAndTestName$1.evaluate(TestRuleThreadAndTestName.java:48)
> at org.apache.lucene.util.TestRuleIgnoreAfterMaxFailures$1.evaluate(TestRuleIgnoreAfterMaxFailures.java:70)
> at org.apache.lucene.util.TestRuleMarkFailure$1.evaluate(TestRuleMarkFailure.java:48)
> at com.carrotsearch.randomizedtesting.rules.StatementAdapter.evaluate(StatementAdapter.java:36)
> at com.carrotsearch.randomizedtesting.ThreadLeakControl$StatementRunner.run(ThreadLeakControl.java:358)
> at com.carrotsearch.randomizedtesting.ThreadLeakControl.forkTimeoutingTask(ThreadLeakControl.java:782)
> at com.carrotsearch.randomizedtesting.ThreadLeakControl$3.evaluate(ThreadLeakControl.java:442)
> at com.carrotsearch.randomizedtesting.RandomizedRunner.runSingleTest(RandomizedRunner.java:746)
> at com.carrotsearch.randomizedtesting.RandomizedRunner$3.evaluate(RandomizedRunner.java:648)
> at com.carrotsearch.randomizedtesting.RandomizedRunner$4.evaluate(RandomizedRunner.java:682)
> at com.carrotsearch.randomizedtesting.RandomizedRunner$5.evaluate(RandomizedRunner.java:693)
> at com.carrotsearch.randomizedtesting.rules.StatementAdapter.evaluate(StatementAdapter.java:36)
> at com.carrotsearch.randomizedtesting.rules.SystemPropertiesRestoreRule$1.evaluate(SystemPropertiesRestoreRule.java:53)
> at org.apache.lucene.util.AbstractBeforeAfterRule$1.evaluate(AbstractBeforeAfterRule.java:45)
> at org.apache.lucene.util.TestRuleStoreClassName$1.evaluate(TestRuleStoreClassName.java:42)
> at com.carrotsearch.randomizedtesting.rules.SystemPropertiesInvariantRule$1.evaluate(SystemPropertiesInvariantRule.java:55)
> at com.carrotsearch.randomizedtesting.rules.NoShadowingOrOverridesOnMethodsRule$1.evaluate(NoShadowingOrOverridesOnMethodsRule.java:39)
> at com.carrotsearch.randomizedtesting.rules.NoShadowingOrOverridesOnMethodsRule$1.evaluate(NoShadowingOrOverridesOnMethodsRule.java:39)
> at com.carrotsearch.randomizedtesting.rules.StatementAdapter.evaluate(StatementAdapter.java:36)
> at org.apache.lucene.util.TestRuleAssertionsRequired$1.evaluate(TestRuleAssertionsRequired.java:43)
> at org.apache.lucene.util.TestRuleMarkFailure$1.evaluate(TestRuleMarkFailure.java:48)
> at org.apache.lucene.util.TestRuleIgnoreAfterMaxFailures$1.evaluate(TestRuleIgnoreAfterMaxFailures.java:70)
> at org.apache.lucene.util.TestRuleIgnoreTestSuites$1.evaluate(TestRuleIgnoreTestSuites.java:55)
> at com.carrotsearch.randomizedtesting.rules.StatementAdapter.evaluate(StatementAdapter.java:36)
> at com.carrotsearch.randomizedtesting.ThreadLeakControl$StatementRunner.run(ThreadLeakControl.java:358)
> at java.lang.Thread.run(Thread.java:722)
>
>


---------------------------------------------------------------------
To unsubscribe, e-mail: [hidden email]
For additional commands, e-mail: [hidden email]

Reply | Threaded
Open this post in threaded view
|

Re: Fullmetal Jenkins: Solr - Build # 86 - Failure!

Mark Miller-3
Another common fail in the lazy cores tests is:

Error Message

core collection1 was not found in the list of cores
Stacktrace

java.lang.AssertionError: core collection1 was not found in the list of cores
        at __randomizedtesting.SeedInfo.seed([9B09724CE0FEDF8:6CEC385E7F103016]:0)
        at org.junit.Assert.fail(Assert.java:93)
        at org.junit.Assert.assertTrue(Assert.java:43)
        at org.apache.solr.core.TestLazyCores.checkInCores(TestLazyCores.java:226)
        at org.apache.solr.core.TestLazyCores.testCachingLimit(TestLazyCores.java:180

On Nov 20, 2012, at 10:12 PM, Mark Miller <[hidden email]> wrote:

> This test lazy cores test also fails somewhat frequently on my primary linux box.
>
> Usually I see:
>
> java.lang.NullPointerException
> at __randomizedtesting.SeedInfo.seed([3127684F1AE08B61:AA78F492392B81D2]:0)
> at org.apache.solr.core.TestLazyCores.testLazyLoad(TestLazyCores.java:92)
>
> On Nov 20, 2012, at 10:09 PM, [hidden email] wrote:
>
>> Solr - Build # 86 - Failure:
>>
>> Check console output at http://fullmetaljenkins.org/job/Solr/86/ to view the results.
>>
>> 4 tests failed.
>> FAILED:  junit.framework.TestSuite.org.apache.solr.core.TestLazyCores
>>
>> Error Message:
>> ERROR: SolrIndexSearcher opens=19 closes=15
>>
>> Stack Trace:
>> java.lang.AssertionError: ERROR: SolrIndexSearcher opens=19 closes=15
>> at __randomizedtesting.SeedInfo.seed([3127684F1AE08B61]:0)
>> at org.junit.Assert.fail(Assert.java:93)
>> at org.apache.solr.SolrTestCaseJ4.endTrackingSearchers(SolrTestCaseJ4.java:243)
>> at org.apache.solr.SolrTestCaseJ4.afterClass(SolrTestCaseJ4.java:97)
>> at sun.reflect.GeneratedMethodAccessor19.invoke(Unknown Source)
>> at sun.reflect.DelegatingMethodAccessorImpl.invoke(DelegatingMethodAccessorImpl.java:43)
>> at java.lang.reflect.Method.invoke(Method.java:601)
>> at com.carrotsearch.randomizedtesting.RandomizedRunner.invoke(RandomizedRunner.java:1559)
>> at com.carrotsearch.randomizedtesting.RandomizedRunner.access$600(RandomizedRunner.java:79)
>> at com.carrotsearch.randomizedtesting.RandomizedRunner$5.evaluate(RandomizedRunner.java:700)
>> at com.carrotsearch.randomizedtesting.rules.StatementAdapter.evaluate(StatementAdapter.java:36)
>> at com.carrotsearch.randomizedtesting.rules.SystemPropertiesRestoreRule$1.evaluate(SystemPropertiesRestoreRule.java:53)
>> at org.apache.lucene.util.AbstractBeforeAfterRule$1.evaluate(AbstractBeforeAfterRule.java:45)
>> at org.apache.lucene.util.TestRuleStoreClassName$1.evaluate(TestRuleStoreClassName.java:42)
>> at com.carrotsearch.randomizedtesting.rules.SystemPropertiesInvariantRule$1.evaluate(SystemPropertiesInvariantRule.java:55)
>> at com.carrotsearch.randomizedtesting.rules.NoShadowingOrOverridesOnMethodsRule$1.evaluate(NoShadowingOrOverridesOnMethodsRule.java:39)
>> at com.carrotsearch.randomizedtesting.rules.NoShadowingOrOverridesOnMethodsRule$1.evaluate(NoShadowingOrOverridesOnMethodsRule.java:39)
>> at com.carrotsearch.randomizedtesting.rules.StatementAdapter.evaluate(StatementAdapter.java:36)
>> at org.apache.lucene.util.TestRuleAssertionsRequired$1.evaluate(TestRuleAssertionsRequired.java:43)
>> at org.apache.lucene.util.TestRuleMarkFailure$1.evaluate(TestRuleMarkFailure.java:48)
>> at org.apache.lucene.util.TestRuleIgnoreAfterMaxFailures$1.evaluate(TestRuleIgnoreAfterMaxFailures.java:70)
>> at org.apache.lucene.util.TestRuleIgnoreTestSuites$1.evaluate(TestRuleIgnoreTestSuites.java:55)
>> at com.carrotsearch.randomizedtesting.rules.StatementAdapter.evaluate(StatementAdapter.java:36)
>> at com.carrotsearch.randomizedtesting.ThreadLeakControl$StatementRunner.run(ThreadLeakControl.java:358)
>> at java.lang.Thread.run(Thread.java:722)
>>
>>
>> FAILED:  junit.framework.TestSuite.org.apache.solr.core.TestLazyCores
>>
>> Error Message:
>> 4 threads leaked from SUITE scope at org.apache.solr.core.TestLazyCores:     1) Thread[id=1094, name=searcherExecutor-575-thread-1, state=WAITING, group=TGRP-TestLazyCores]         at sun.misc.Unsafe.park(Native Method)         at java.util.concurrent.locks.LockSupport.park(LockSupport.java:186)         at java.util.concurrent.locks.AbstractQueuedSynchronizer$ConditionObject.await(AbstractQueuedSynchronizer.java:2043)         at java.util.concurrent.LinkedBlockingQueue.take(LinkedBlockingQueue.java:442)         at java.util.concurrent.ThreadPoolExecutor.getTask(ThreadPoolExecutor.java:1043)         at java.util.concurrent.ThreadPoolExecutor.runWorker(ThreadPoolExecutor.java:1103)         at java.util.concurrent.ThreadPoolExecutor$Worker.run(ThreadPoolExecutor.java:603)         at java.lang.Thread.run(Thread.java:722)    2) Thread[id=1096, name=searcherExecutor-583-thread-1, state=WAITING, group=TGRP-TestLazyCores]         at sun.misc.Unsafe.park(Native Method)         at java.util.concurrent.locks.LockSupport.park(LockSupport.java:186)         at java.util.concurrent.locks.AbstractQueuedSynchronizer$ConditionObject.await(AbstractQueuedSynchronizer.java:2043)         at java.util.concurrent.LinkedBlockingQueue.take(LinkedBlockingQueue.java:442)         at java.util.concurrent.ThreadPoolExecutor.getTask(ThreadPoolExecutor.java:1043)         at java.util.concurrent.ThreadPoolExecutor.runWorker(ThreadPoolExecutor.java:1103)         at java.util.concurrent.ThreadPoolExecutor$Worker.run(ThreadPoolExecutor.java:603)         at java.lang.Thread.run(Thread.java:722)    3) Thread[id=1098, name=searcherExecutor-589-thread-1, state=WAITING, group=TGRP-TestLazyCores]         at sun.misc.Unsafe.park(Native Method)         at java.util.concurrent.locks.LockSupport.park(LockSupport.java:186)         at java.util.concurrent.locks.AbstractQueuedSynchronizer$ConditionObject.await(AbstractQueuedSynchronizer.java:2043)         at java.util.concurrent.LinkedBlockingQueue.take(LinkedBlockingQueue.java:442)         at java.util.concurrent.ThreadPoolExecutor.getTask(ThreadPoolExecutor.java:1043)         at java.util.concurrent.ThreadPoolExecutor.runWorker(ThreadPoolExecutor.java:1103)         at java.util.concurrent.ThreadPoolExecutor$Worker.run(ThreadPoolExecutor.java:603)         at java.lang.Thread.run(Thread.java:722)    4) Thread[id=1097, name=searcherExecutor-586-thread-1, state=WAITING, group=TGRP-TestLazyCores]         at sun.misc.Unsafe.park(Native Method)         at java.util.concurrent.locks.LockSupport.park(LockSupport.java:186)         at java.util.concurrent.locks.AbstractQueuedSynchronizer$ConditionObject.await(AbstractQueuedSynchronizer.java:2043)         at java.util.concurrent.LinkedBlockingQueue.take(LinkedBlockingQueue.java:442)         at java.util.concurrent.ThreadPoolExecutor.getTask(ThreadPoolExecutor.java:1043)         at java.util.concurrent.ThreadPoolExecutor.runWorker(ThreadPoolExecutor.java:1103)         at java.util.concurrent.ThreadPoolExecutor$Worker.run(ThreadPoolExecutor.java:603)         at java.lang.Thread.run(Thread.java:722)
>>
>> Stack Trace:
>> com.carrotsearch.randomizedtesting.ThreadLeakError: 4 threads leaked from SUITE scope at org.apache.solr.core.TestLazyCores:
>>  1) Thread[id=1094, name=searcherExecutor-575-thread-1, state=WAITING, group=TGRP-TestLazyCores]
>>       at sun.misc.Unsafe.park(Native Method)
>>       at java.util.concurrent.locks.LockSupport.park(LockSupport.java:186)
>>       at java.util.concurrent.locks.AbstractQueuedSynchronizer$ConditionObject.await(AbstractQueuedSynchronizer.java:2043)
>>       at java.util.concurrent.LinkedBlockingQueue.take(LinkedBlockingQueue.java:442)
>>       at java.util.concurrent.ThreadPoolExecutor.getTask(ThreadPoolExecutor.java:1043)
>>       at java.util.concurrent.ThreadPoolExecutor.runWorker(ThreadPoolExecutor.java:1103)
>>       at java.util.concurrent.ThreadPoolExecutor$Worker.run(ThreadPoolExecutor.java:603)
>>       at java.lang.Thread.run(Thread.java:722)
>>  2) Thread[id=1096, name=searcherExecutor-583-thread-1, state=WAITING, group=TGRP-TestLazyCores]
>>       at sun.misc.Unsafe.park(Native Method)
>>       at java.util.concurrent.locks.LockSupport.park(LockSupport.java:186)
>>       at java.util.concurrent.locks.AbstractQueuedSynchronizer$ConditionObject.await(AbstractQueuedSynchronizer.java:2043)
>>       at java.util.concurrent.LinkedBlockingQueue.take(LinkedBlockingQueue.java:442)
>>       at java.util.concurrent.ThreadPoolExecutor.getTask(ThreadPoolExecutor.java:1043)
>>       at java.util.concurrent.ThreadPoolExecutor.runWorker(ThreadPoolExecutor.java:1103)
>>       at java.util.concurrent.ThreadPoolExecutor$Worker.run(ThreadPoolExecutor.java:603)
>>       at java.lang.Thread.run(Thread.java:722)
>>  3) Thread[id=1098, name=searcherExecutor-589-thread-1, state=WAITING, group=TGRP-TestLazyCores]
>>       at sun.misc.Unsafe.park(Native Method)
>>       at java.util.concurrent.locks.LockSupport.park(LockSupport.java:186)
>>       at java.util.concurrent.locks.AbstractQueuedSynchronizer$ConditionObject.await(AbstractQueuedSynchronizer.java:2043)
>>       at java.util.concurrent.LinkedBlockingQueue.take(LinkedBlockingQueue.java:442)
>>       at java.util.concurrent.ThreadPoolExecutor.getTask(ThreadPoolExecutor.java:1043)
>>       at java.util.concurrent.ThreadPoolExecutor.runWorker(ThreadPoolExecutor.java:1103)
>>       at java.util.concurrent.ThreadPoolExecutor$Worker.run(ThreadPoolExecutor.java:603)
>>       at java.lang.Thread.run(Thread.java:722)
>>  4) Thread[id=1097, name=searcherExecutor-586-thread-1, state=WAITING, group=TGRP-TestLazyCores]
>>       at sun.misc.Unsafe.park(Native Method)
>>       at java.util.concurrent.locks.LockSupport.park(LockSupport.java:186)
>>       at java.util.concurrent.locks.AbstractQueuedSynchronizer$ConditionObject.await(AbstractQueuedSynchronizer.java:2043)
>>       at java.util.concurrent.LinkedBlockingQueue.take(LinkedBlockingQueue.java:442)
>>       at java.util.concurrent.ThreadPoolExecutor.getTask(ThreadPoolExecutor.java:1043)
>>       at java.util.concurrent.ThreadPoolExecutor.runWorker(ThreadPoolExecutor.java:1103)
>>       at java.util.concurrent.ThreadPoolExecutor$Worker.run(ThreadPoolExecutor.java:603)
>>       at java.lang.Thread.run(Thread.java:722)
>> at __randomizedtesting.SeedInfo.seed([3127684F1AE08B61]:0)
>>
>>
>> FAILED:  junit.framework.TestSuite.org.apache.solr.core.TestLazyCores
>>
>> Error Message:
>> There are still zombie threads that couldn't be terminated:    1) Thread[id=1094, name=searcherExecutor-575-thread-1, state=WAITING, group=TGRP-TestLazyCores]         at sun.misc.Unsafe.park(Native Method)         at java.util.concurrent.locks.LockSupport.park(LockSupport.java:186)         at java.util.concurrent.locks.AbstractQueuedSynchronizer$ConditionObject.await(AbstractQueuedSynchronizer.java:2043)         at java.util.concurrent.LinkedBlockingQueue.take(LinkedBlockingQueue.java:442)         at java.util.concurrent.ThreadPoolExecutor.getTask(ThreadPoolExecutor.java:1043)         at java.util.concurrent.ThreadPoolExecutor.runWorker(ThreadPoolExecutor.java:1103)         at java.util.concurrent.ThreadPoolExecutor$Worker.run(ThreadPoolExecutor.java:603)         at java.lang.Thread.run(Thread.java:722)    2) Thread[id=1096, name=searcherExecutor-583-thread-1, state=WAITING, group=TGRP-TestLazyCores]         at sun.misc.Unsafe.park(Native Method)         at java.util.concurrent.locks.LockSupport.park(LockSupport.java:186)         at java.util.concurrent.locks.AbstractQueuedSynchronizer$ConditionObject.await(AbstractQueuedSynchronizer.java:2043)         at java.util.concurrent.LinkedBlockingQueue.take(LinkedBlockingQueue.java:442)         at java.util.concurrent.ThreadPoolExecutor.getTask(ThreadPoolExecutor.java:1043)         at java.util.concurrent.ThreadPoolExecutor.runWorker(ThreadPoolExecutor.java:1103)         at java.util.concurrent.ThreadPoolExecutor$Worker.run(ThreadPoolExecutor.java:603)         at java.lang.Thread.run(Thread.java:722)    3) Thread[id=1098, name=searcherExecutor-589-thread-1, state=WAITING, group=TGRP-TestLazyCores]         at sun.misc.Unsafe.park(Native Method)         at java.util.concurrent.locks.LockSupport.park(LockSupport.java:186)         at java.util.concurrent.locks.AbstractQueuedSynchronizer$ConditionObject.await(AbstractQueuedSynchronizer.java:2043)         at java.util.concurrent.LinkedBlockingQueue.take(LinkedBlockingQueue.java:442)         at java.util.concurrent.ThreadPoolExecutor.getTask(ThreadPoolExecutor.java:1043)         at java.util.concurrent.ThreadPoolExecutor.runWorker(ThreadPoolExecutor.java:1103)         at java.util.concurrent.ThreadPoolExecutor$Worker.run(ThreadPoolExecutor.java:603)         at java.lang.Thread.run(Thread.java:722)    4) Thread[id=1097, name=searcherExecutor-586-thread-1, state=WAITING, group=TGRP-TestLazyCores]         at sun.misc.Unsafe.park(Native Method)         at java.util.concurrent.locks.LockSupport.park(LockSupport.java:186)         at java.util.concurrent.locks.AbstractQueuedSynchronizer$ConditionObject.await(AbstractQueuedSynchronizer.java:2043)         at java.util.concurrent.LinkedBlockingQueue.take(LinkedBlockingQueue.java:442)         at java.util.concurrent.ThreadPoolExecutor.getTask(ThreadPoolExecutor.java:1043)         at java.util.concurrent.ThreadPoolExecutor.runWorker(ThreadPoolExecutor.java:1103)         at java.util.concurrent.ThreadPoolExecutor$Worker.run(ThreadPoolExecutor.java:603)         at java.lang.Thread.run(Thread.java:722)
>>
>> Stack Trace:
>> com.carrotsearch.randomizedtesting.ThreadLeakError: There are still zombie threads that couldn't be terminated:
>>  1) Thread[id=1094, name=searcherExecutor-575-thread-1, state=WAITING, group=TGRP-TestLazyCores]
>>       at sun.misc.Unsafe.park(Native Method)
>>       at java.util.concurrent.locks.LockSupport.park(LockSupport.java:186)
>>       at java.util.concurrent.locks.AbstractQueuedSynchronizer$ConditionObject.await(AbstractQueuedSynchronizer.java:2043)
>>       at java.util.concurrent.LinkedBlockingQueue.take(LinkedBlockingQueue.java:442)
>>       at java.util.concurrent.ThreadPoolExecutor.getTask(ThreadPoolExecutor.java:1043)
>>       at java.util.concurrent.ThreadPoolExecutor.runWorker(ThreadPoolExecutor.java:1103)
>>       at java.util.concurrent.ThreadPoolExecutor$Worker.run(ThreadPoolExecutor.java:603)
>>       at java.lang.Thread.run(Thread.java:722)
>>  2) Thread[id=1096, name=searcherExecutor-583-thread-1, state=WAITING, group=TGRP-TestLazyCores]
>>       at sun.misc.Unsafe.park(Native Method)
>>       at java.util.concurrent.locks.LockSupport.park(LockSupport.java:186)
>>       at java.util.concurrent.locks.AbstractQueuedSynchronizer$ConditionObject.await(AbstractQueuedSynchronizer.java:2043)
>>       at java.util.concurrent.LinkedBlockingQueue.take(LinkedBlockingQueue.java:442)
>>       at java.util.concurrent.ThreadPoolExecutor.getTask(ThreadPoolExecutor.java:1043)
>>       at java.util.concurrent.ThreadPoolExecutor.runWorker(ThreadPoolExecutor.java:1103)
>>       at java.util.concurrent.ThreadPoolExecutor$Worker.run(ThreadPoolExecutor.java:603)
>>       at java.lang.Thread.run(Thread.java:722)
>>  3) Thread[id=1098, name=searcherExecutor-589-thread-1, state=WAITING, group=TGRP-TestLazyCores]
>>       at sun.misc.Unsafe.park(Native Method)
>>       at java.util.concurrent.locks.LockSupport.park(LockSupport.java:186)
>>       at java.util.concurrent.locks.AbstractQueuedSynchronizer$ConditionObject.await(AbstractQueuedSynchronizer.java:2043)
>>       at java.util.concurrent.LinkedBlockingQueue.take(LinkedBlockingQueue.java:442)
>>       at java.util.concurrent.ThreadPoolExecutor.getTask(ThreadPoolExecutor.java:1043)
>>       at java.util.concurrent.ThreadPoolExecutor.runWorker(ThreadPoolExecutor.java:1103)
>>       at java.util.concurrent.ThreadPoolExecutor$Worker.run(ThreadPoolExecutor.java:603)
>>       at java.lang.Thread.run(Thread.java:722)
>>  4) Thread[id=1097, name=searcherExecutor-586-thread-1, state=WAITING, group=TGRP-TestLazyCores]
>>       at sun.misc.Unsafe.park(Native Method)
>>       at java.util.concurrent.locks.LockSupport.park(LockSupport.java:186)
>>       at java.util.concurrent.locks.AbstractQueuedSynchronizer$ConditionObject.await(AbstractQueuedSynchronizer.java:2043)
>>       at java.util.concurrent.LinkedBlockingQueue.take(LinkedBlockingQueue.java:442)
>>       at java.util.concurrent.ThreadPoolExecutor.getTask(ThreadPoolExecutor.java:1043)
>>       at java.util.concurrent.ThreadPoolExecutor.runWorker(ThreadPoolExecutor.java:1103)
>>       at java.util.concurrent.ThreadPoolExecutor$Worker.run(ThreadPoolExecutor.java:603)
>>       at java.lang.Thread.run(Thread.java:722)
>> at __randomizedtesting.SeedInfo.seed([3127684F1AE08B61]:0)
>>
>>
>> REGRESSION:  org.apache.solr.core.TestLazyCores.testLazyLoad
>>
>> Error Message:
>>
>>
>> Stack Trace:
>> java.lang.NullPointerException
>> at __randomizedtesting.SeedInfo.seed([3127684F1AE08B61:AA78F492392B81D2]:0)
>> at org.apache.solr.core.TestLazyCores.testLazyLoad(TestLazyCores.java:92)
>> at sun.reflect.NativeMethodAccessorImpl.invoke0(Native Method)
>> at sun.reflect.NativeMethodAccessorImpl.invoke(NativeMethodAccessorImpl.java:57)
>> at sun.reflect.DelegatingMethodAccessorImpl.invoke(DelegatingMethodAccessorImpl.java:43)
>> at java.lang.reflect.Method.invoke(Method.java:601)
>> at com.carrotsearch.randomizedtesting.RandomizedRunner.invoke(RandomizedRunner.java:1559)
>> at com.carrotsearch.randomizedtesting.RandomizedRunner.access$600(RandomizedRunner.java:79)
>> at com.carrotsearch.randomizedtesting.RandomizedRunner$6.evaluate(RandomizedRunner.java:737)
>> at com.carrotsearch.randomizedtesting.RandomizedRunner$7.evaluate(RandomizedRunner.java:773)
>> at com.carrotsearch.randomizedtesting.RandomizedRunner$8.evaluate(RandomizedRunner.java:787)
>> at com.carrotsearch.randomizedtesting.rules.SystemPropertiesRestoreRule$1.evaluate(SystemPropertiesRestoreRule.java:53)
>> at org.apache.lucene.util.TestRuleSetupTeardownChained$1.evaluate(TestRuleSetupTeardownChained.java:50)
>> at org.apache.lucene.util.TestRuleFieldCacheSanity$1.evaluate(TestRuleFieldCacheSanity.java:51)
>> at org.apache.lucene.util.AbstractBeforeAfterRule$1.evaluate(AbstractBeforeAfterRule.java:45)
>> at com.carrotsearch.randomizedtesting.rules.SystemPropertiesInvariantRule$1.evaluate(SystemPropertiesInvariantRule.java:55)
>> at org.apache.lucene.util.TestRuleThreadAndTestName$1.evaluate(TestRuleThreadAndTestName.java:48)
>> at org.apache.lucene.util.TestRuleIgnoreAfterMaxFailures$1.evaluate(TestRuleIgnoreAfterMaxFailures.java:70)
>> at org.apache.lucene.util.TestRuleMarkFailure$1.evaluate(TestRuleMarkFailure.java:48)
>> at com.carrotsearch.randomizedtesting.rules.StatementAdapter.evaluate(StatementAdapter.java:36)
>> at com.carrotsearch.randomizedtesting.ThreadLeakControl$StatementRunner.run(ThreadLeakControl.java:358)
>> at com.carrotsearch.randomizedtesting.ThreadLeakControl.forkTimeoutingTask(ThreadLeakControl.java:782)
>> at com.carrotsearch.randomizedtesting.ThreadLeakControl$3.evaluate(ThreadLeakControl.java:442)
>> at com.carrotsearch.randomizedtesting.RandomizedRunner.runSingleTest(RandomizedRunner.java:746)
>> at com.carrotsearch.randomizedtesting.RandomizedRunner$3.evaluate(RandomizedRunner.java:648)
>> at com.carrotsearch.randomizedtesting.RandomizedRunner$4.evaluate(RandomizedRunner.java:682)
>> at com.carrotsearch.randomizedtesting.RandomizedRunner$5.evaluate(RandomizedRunner.java:693)
>> at com.carrotsearch.randomizedtesting.rules.StatementAdapter.evaluate(StatementAdapter.java:36)
>> at com.carrotsearch.randomizedtesting.rules.SystemPropertiesRestoreRule$1.evaluate(SystemPropertiesRestoreRule.java:53)
>> at org.apache.lucene.util.AbstractBeforeAfterRule$1.evaluate(AbstractBeforeAfterRule.java:45)
>> at org.apache.lucene.util.TestRuleStoreClassName$1.evaluate(TestRuleStoreClassName.java:42)
>> at com.carrotsearch.randomizedtesting.rules.SystemPropertiesInvariantRule$1.evaluate(SystemPropertiesInvariantRule.java:55)
>> at com.carrotsearch.randomizedtesting.rules.NoShadowingOrOverridesOnMethodsRule$1.evaluate(NoShadowingOrOverridesOnMethodsRule.java:39)
>> at com.carrotsearch.randomizedtesting.rules.NoShadowingOrOverridesOnMethodsRule$1.evaluate(NoShadowingOrOverridesOnMethodsRule.java:39)
>> at com.carrotsearch.randomizedtesting.rules.StatementAdapter.evaluate(StatementAdapter.java:36)
>> at org.apache.lucene.util.TestRuleAssertionsRequired$1.evaluate(TestRuleAssertionsRequired.java:43)
>> at org.apache.lucene.util.TestRuleMarkFailure$1.evaluate(TestRuleMarkFailure.java:48)
>> at org.apache.lucene.util.TestRuleIgnoreAfterMaxFailures$1.evaluate(TestRuleIgnoreAfterMaxFailures.java:70)
>> at org.apache.lucene.util.TestRuleIgnoreTestSuites$1.evaluate(TestRuleIgnoreTestSuites.java:55)
>> at com.carrotsearch.randomizedtesting.rules.StatementAdapter.evaluate(StatementAdapter.java:36)
>> at com.carrotsearch.randomizedtesting.ThreadLeakControl$StatementRunner.run(ThreadLeakControl.java:358)
>> at java.lang.Thread.run(Thread.java:722)
>>
>>
>


---------------------------------------------------------------------
To unsubscribe, e-mail: [hidden email]
For additional commands, e-mail: [hidden email]

Reply | Threaded
Open this post in threaded view
|

Re: Fullmetal Jenkins: Solr - Build # 86 - Failure!

Erick Erickson
OK, let me see what I can dig up on this one. 


On Wed, Nov 21, 2012 at 9:35 AM, Mark Miller <[hidden email]> wrote:
Another common fail in the lazy cores tests is:

Error Message

core collection1 was not found in the list of cores
Stacktrace

java.lang.AssertionError: core collection1 was not found in the list of cores
        at __randomizedtesting.SeedInfo.seed([9B09724CE0FEDF8:6CEC385E7F103016]:0)
        at org.junit.Assert.fail(Assert.java:93)
        at org.junit.Assert.assertTrue(Assert.java:43)
        at org.apache.solr.core.TestLazyCores.checkInCores(TestLazyCores.java:226)
        at org.apache.solr.core.TestLazyCores.testCachingLimit(TestLazyCores.java:180

On Nov 20, 2012, at 10:12 PM, Mark Miller <[hidden email]> wrote:

> This test lazy cores test also fails somewhat frequently on my primary linux box.
>
> Usually I see:
>
> java.lang.NullPointerException
>       at __randomizedtesting.SeedInfo.seed([3127684F1AE08B61:AA78F492392B81D2]:0)
>       at org.apache.solr.core.TestLazyCores.testLazyLoad(TestLazyCores.java:92)
>
> On Nov 20, 2012, at 10:09 PM, [hidden email] wrote:
>
>> Solr - Build # 86 - Failure:
>>
>> Check console output at http://fullmetaljenkins.org/job/Solr/86/ to view the results.
>>
>> 4 tests failed.
>> FAILED:  junit.framework.TestSuite.org.apache.solr.core.TestLazyCores
>>
>> Error Message:
>> ERROR: SolrIndexSearcher opens=19 closes=15
>>
>> Stack Trace:
>> java.lang.AssertionError: ERROR: SolrIndexSearcher opens=19 closes=15
>>      at __randomizedtesting.SeedInfo.seed([3127684F1AE08B61]:0)
>>      at org.junit.Assert.fail(Assert.java:93)
>>      at org.apache.solr.SolrTestCaseJ4.endTrackingSearchers(SolrTestCaseJ4.java:243)
>>      at org.apache.solr.SolrTestCaseJ4.afterClass(SolrTestCaseJ4.java:97)
>>      at sun.reflect.GeneratedMethodAccessor19.invoke(Unknown Source)
>>      at sun.reflect.DelegatingMethodAccessorImpl.invoke(DelegatingMethodAccessorImpl.java:43)
>>      at java.lang.reflect.Method.invoke(Method.java:601)
>>      at com.carrotsearch.randomizedtesting.RandomizedRunner.invoke(RandomizedRunner.java:1559)
>>      at com.carrotsearch.randomizedtesting.RandomizedRunner.access$600(RandomizedRunner.java:79)
>>      at com.carrotsearch.randomizedtesting.RandomizedRunner$5.evaluate(RandomizedRunner.java:700)
>>      at com.carrotsearch.randomizedtesting.rules.StatementAdapter.evaluate(StatementAdapter.java:36)
>>      at com.carrotsearch.randomizedtesting.rules.SystemPropertiesRestoreRule$1.evaluate(SystemPropertiesRestoreRule.java:53)
>>      at org.apache.lucene.util.AbstractBeforeAfterRule$1.evaluate(AbstractBeforeAfterRule.java:45)
>>      at org.apache.lucene.util.TestRuleStoreClassName$1.evaluate(TestRuleStoreClassName.java:42)
>>      at com.carrotsearch.randomizedtesting.rules.SystemPropertiesInvariantRule$1.evaluate(SystemPropertiesInvariantRule.java:55)
>>      at com.carrotsearch.randomizedtesting.rules.NoShadowingOrOverridesOnMethodsRule$1.evaluate(NoShadowingOrOverridesOnMethodsRule.java:39)
>>      at com.carrotsearch.randomizedtesting.rules.NoShadowingOrOverridesOnMethodsRule$1.evaluate(NoShadowingOrOverridesOnMethodsRule.java:39)
>>      at com.carrotsearch.randomizedtesting.rules.StatementAdapter.evaluate(StatementAdapter.java:36)
>>      at org.apache.lucene.util.TestRuleAssertionsRequired$1.evaluate(TestRuleAssertionsRequired.java:43)
>>      at org.apache.lucene.util.TestRuleMarkFailure$1.evaluate(TestRuleMarkFailure.java:48)
>>      at org.apache.lucene.util.TestRuleIgnoreAfterMaxFailures$1.evaluate(TestRuleIgnoreAfterMaxFailures.java:70)
>>      at org.apache.lucene.util.TestRuleIgnoreTestSuites$1.evaluate(TestRuleIgnoreTestSuites.java:55)
>>      at com.carrotsearch.randomizedtesting.rules.StatementAdapter.evaluate(StatementAdapter.java:36)
>>      at com.carrotsearch.randomizedtesting.ThreadLeakControl$StatementRunner.run(ThreadLeakControl.java:358)
>>      at java.lang.Thread.run(Thread.java:722)
>>
>>
>> FAILED:  junit.framework.TestSuite.org.apache.solr.core.TestLazyCores
>>
>> Error Message:
>> 4 threads leaked from SUITE scope at org.apache.solr.core.TestLazyCores:     1) Thread[id=1094, name=searcherExecutor-575-thread-1, state=WAITING, group=TGRP-TestLazyCores]         at sun.misc.Unsafe.park(Native Method)         at java.util.concurrent.locks.LockSupport.park(LockSupport.java:186)         at java.util.concurrent.locks.AbstractQueuedSynchronizer$ConditionObject.await(AbstractQueuedSynchronizer.java:2043)         at java.util.concurrent.LinkedBlockingQueue.take(LinkedBlockingQueue.java:442)         at java.util.concurrent.ThreadPoolExecutor.getTask(ThreadPoolExecutor.java:1043)         at java.util.concurrent.ThreadPoolExecutor.runWorker(ThreadPoolExecutor.java:1103)         at java.util.concurrent.ThreadPoolExecutor$Worker.run(ThreadPoolExecutor.java:603)         at java.lang.Thread.run(Thread.java:722)    2) Thread[id=1096, name=searcherExecutor-583-thread-1, state=WAITING, group=TGRP-TestLazyCores]         at sun.misc.Unsafe.park(Native Method)         at java.util.concurrent.locks.LockSupport.park(LockSupport.java:186)         at java.util.concurrent.locks.AbstractQueuedSynchronizer$ConditionObject.await(AbstractQueuedSynchronizer.java:2043)         at java.util.concurrent.LinkedBlockingQueue.take(LinkedBlockingQueue.java:442)         at java.util.concurrent.ThreadPoolExecutor.getTask(ThreadPoolExecutor.java:1043)         at java.util.concurrent.ThreadPoolExecutor.runWorker(ThreadPoolExecutor.java:1103)         at java.util.concurrent.ThreadPoolExecutor$Worker.run(ThreadPoolExecutor.java:603)         at java.lang.Thread.run(Thread.java:722)    3) Thread[id=1098, name=searcherExecutor-589-thread-1, state=WAITING, group=TGRP-TestLazyCores]         at sun.misc.Unsafe.park(Native Method)         at java.util.concurrent.locks.LockSupport.park(LockSupport.java:186)         at java.util.concurrent.locks.AbstractQueuedSynchronizer$ConditionObject.await(AbstractQueuedSynchronizer.java:2043)         at java.util.concurrent.LinkedBlockingQueue.take(LinkedBlockingQueue.java:442)         at java.util.concurrent.ThreadPoolExecutor.getTask(ThreadPoolExecutor.java:1043)         at java.util.concurrent.ThreadPoolExecutor.runWorker(ThreadPoolExecutor.java:1103)         at java.util.concurrent.ThreadPoolExecutor$Worker.run(ThreadPoolExecutor.java:603)         at java.lang.Thread.run(Thread.java:722)    4) Thread[id=1097, name=searcherExecutor-586-thread-1, state=WAITING, group=TGRP-TestLazyCores]         at sun.misc.Unsafe.park(Native Method)         at java.util.concurrent.locks.LockSupport.park(LockSupport.java:186)         at java.util.concurrent.locks.AbstractQueuedSynchronizer$ConditionObject.await(AbstractQueuedSynchronizer.java:2043)         at java.util.concurrent.LinkedBlockingQueue.take(LinkedBlockingQueue.java:442)         at java.util.concurrent.ThreadPoolExecutor.getTask(ThreadPoolExecutor.java:1043)         at java.util.concurrent.ThreadPoolExecutor.runWorker(ThreadPoolExecutor.java:1103)         at java.util.concurrent.ThreadPoolExecutor$Worker.run(ThreadPoolExecutor.java:603)         at java.lang.Thread.run(Thread.java:722)
>>
>> Stack Trace:
>> com.carrotsearch.randomizedtesting.ThreadLeakError: 4 threads leaked from SUITE scope at org.apache.solr.core.TestLazyCores:
>>  1) Thread[id=1094, name=searcherExecutor-575-thread-1, state=WAITING, group=TGRP-TestLazyCores]
>>       at sun.misc.Unsafe.park(Native Method)
>>       at java.util.concurrent.locks.LockSupport.park(LockSupport.java:186)
>>       at java.util.concurrent.locks.AbstractQueuedSynchronizer$ConditionObject.await(AbstractQueuedSynchronizer.java:2043)
>>       at java.util.concurrent.LinkedBlockingQueue.take(LinkedBlockingQueue.java:442)
>>       at java.util.concurrent.ThreadPoolExecutor.getTask(ThreadPoolExecutor.java:1043)
>>       at java.util.concurrent.ThreadPoolExecutor.runWorker(ThreadPoolExecutor.java:1103)
>>       at java.util.concurrent.ThreadPoolExecutor$Worker.run(ThreadPoolExecutor.java:603)
>>       at java.lang.Thread.run(Thread.java:722)
>>  2) Thread[id=1096, name=searcherExecutor-583-thread-1, state=WAITING, group=TGRP-TestLazyCores]
>>       at sun.misc.Unsafe.park(Native Method)
>>       at java.util.concurrent.locks.LockSupport.park(LockSupport.java:186)
>>       at java.util.concurrent.locks.AbstractQueuedSynchronizer$ConditionObject.await(AbstractQueuedSynchronizer.java:2043)
>>       at java.util.concurrent.LinkedBlockingQueue.take(LinkedBlockingQueue.java:442)
>>       at java.util.concurrent.ThreadPoolExecutor.getTask(ThreadPoolExecutor.java:1043)
>>       at java.util.concurrent.ThreadPoolExecutor.runWorker(ThreadPoolExecutor.java:1103)
>>       at java.util.concurrent.ThreadPoolExecutor$Worker.run(ThreadPoolExecutor.java:603)
>>       at java.lang.Thread.run(Thread.java:722)
>>  3) Thread[id=1098, name=searcherExecutor-589-thread-1, state=WAITING, group=TGRP-TestLazyCores]
>>       at sun.misc.Unsafe.park(Native Method)
>>       at java.util.concurrent.locks.LockSupport.park(LockSupport.java:186)
>>       at java.util.concurrent.locks.AbstractQueuedSynchronizer$ConditionObject.await(AbstractQueuedSynchronizer.java:2043)
>>       at java.util.concurrent.LinkedBlockingQueue.take(LinkedBlockingQueue.java:442)
>>       at java.util.concurrent.ThreadPoolExecutor.getTask(ThreadPoolExecutor.java:1043)
>>       at java.util.concurrent.ThreadPoolExecutor.runWorker(ThreadPoolExecutor.java:1103)
>>       at java.util.concurrent.ThreadPoolExecutor$Worker.run(ThreadPoolExecutor.java:603)
>>       at java.lang.Thread.run(Thread.java:722)
>>  4) Thread[id=1097, name=searcherExecutor-586-thread-1, state=WAITING, group=TGRP-TestLazyCores]
>>       at sun.misc.Unsafe.park(Native Method)
>>       at java.util.concurrent.locks.LockSupport.park(LockSupport.java:186)
>>       at java.util.concurrent.locks.AbstractQueuedSynchronizer$ConditionObject.await(AbstractQueuedSynchronizer.java:2043)
>>       at java.util.concurrent.LinkedBlockingQueue.take(LinkedBlockingQueue.java:442)
>>       at java.util.concurrent.ThreadPoolExecutor.getTask(ThreadPoolExecutor.java:1043)
>>       at java.util.concurrent.ThreadPoolExecutor.runWorker(ThreadPoolExecutor.java:1103)
>>       at java.util.concurrent.ThreadPoolExecutor$Worker.run(ThreadPoolExecutor.java:603)
>>       at java.lang.Thread.run(Thread.java:722)
>>      at __randomizedtesting.SeedInfo.seed([3127684F1AE08B61]:0)
>>
>>
>> FAILED:  junit.framework.TestSuite.org.apache.solr.core.TestLazyCores
>>
>> Error Message:
>> There are still zombie threads that couldn't be terminated:    1) Thread[id=1094, name=searcherExecutor-575-thread-1, state=WAITING, group=TGRP-TestLazyCores]         at sun.misc.Unsafe.park(Native Method)         at java.util.concurrent.locks.LockSupport.park(LockSupport.java:186)         at java.util.concurrent.locks.AbstractQueuedSynchronizer$ConditionObject.await(AbstractQueuedSynchronizer.java:2043)         at java.util.concurrent.LinkedBlockingQueue.take(LinkedBlockingQueue.java:442)         at java.util.concurrent.ThreadPoolExecutor.getTask(ThreadPoolExecutor.java:1043)         at java.util.concurrent.ThreadPoolExecutor.runWorker(ThreadPoolExecutor.java:1103)         at java.util.concurrent.ThreadPoolExecutor$Worker.run(ThreadPoolExecutor.java:603)         at java.lang.Thread.run(Thread.java:722)    2) Thread[id=1096, name=searcherExecutor-583-thread-1, state=WAITING, group=TGRP-TestLazyCores]         at sun.misc.Unsafe.park(Native Method)         at java.util.concurrent.locks.LockSupport.park(LockSupport.java:186)         at java.util.concurrent.locks.AbstractQueuedSynchronizer$ConditionObject.await(AbstractQueuedSynchronizer.java:2043)         at java.util.concurrent.LinkedBlockingQueue.take(LinkedBlockingQueue.java:442)         at java.util.concurrent.ThreadPoolExecutor.getTask(ThreadPoolExecutor.java:1043)         at java.util.concurrent.ThreadPoolExecutor.runWorker(ThreadPoolExecutor.java:1103)         at java.util.concurrent.ThreadPoolExecutor$Worker.run(ThreadPoolExecutor.java:603)         at java.lang.Thread.run(Thread.java:722)    3) Thread[id=1098, name=searcherExecutor-589-thread-1, state=WAITING, group=TGRP-TestLazyCores]         at sun.misc.Unsafe.park(Native Method)         at java.util.concurrent.locks.LockSupport.park(LockSupport.java:186)         at java.util.concurrent.locks.AbstractQueuedSynchronizer$ConditionObject.await(AbstractQueuedSynchronizer.java:2043)         at java.util.concurrent.LinkedBlockingQueue.take(LinkedBlockingQueue.java:442)         at java.util.concurrent.ThreadPoolExecutor.getTask(ThreadPoolExecutor.java:1043)         at java.util.concurrent.ThreadPoolExecutor.runWorker(ThreadPoolExecutor.java:1103)         at java.util.concurrent.ThreadPoolExecutor$Worker.run(ThreadPoolExecutor.java:603)         at java.lang.Thread.run(Thread.java:722)    4) Thread[id=1097, name=searcherExecutor-586-thread-1, state=WAITING, group=TGRP-TestLazyCores]         at sun.misc.Unsafe.park(Native Method)         at java.util.concurrent.locks.LockSupport.park(LockSupport.java:186)         at java.util.concurrent.locks.AbstractQueuedSynchronizer$ConditionObject.await(AbstractQueuedSynchronizer.java:2043)         at java.util.concurrent.LinkedBlockingQueue.take(LinkedBlockingQueue.java:442)         at java.util.concurrent.ThreadPoolExecutor.getTask(ThreadPoolExecutor.java:1043)         at java.util.concurrent.ThreadPoolExecutor.runWorker(ThreadPoolExecutor.java:1103)         at java.util.concurrent.ThreadPoolExecutor$Worker.run(ThreadPoolExecutor.java:603)         at java.lang.Thread.run(Thread.java:722)
>>
>> Stack Trace:
>> com.carrotsearch.randomizedtesting.ThreadLeakError: There are still zombie threads that couldn't be terminated:
>>  1) Thread[id=1094, name=searcherExecutor-575-thread-1, state=WAITING, group=TGRP-TestLazyCores]
>>       at sun.misc.Unsafe.park(Native Method)
>>       at java.util.concurrent.locks.LockSupport.park(LockSupport.java:186)
>>       at java.util.concurrent.locks.AbstractQueuedSynchronizer$ConditionObject.await(AbstractQueuedSynchronizer.java:2043)
>>       at java.util.concurrent.LinkedBlockingQueue.take(LinkedBlockingQueue.java:442)
>>       at java.util.concurrent.ThreadPoolExecutor.getTask(ThreadPoolExecutor.java:1043)
>>       at java.util.concurrent.ThreadPoolExecutor.runWorker(ThreadPoolExecutor.java:1103)
>>       at java.util.concurrent.ThreadPoolExecutor$Worker.run(ThreadPoolExecutor.java:603)
>>       at java.lang.Thread.run(Thread.java:722)
>>  2) Thread[id=1096, name=searcherExecutor-583-thread-1, state=WAITING, group=TGRP-TestLazyCores]
>>       at sun.misc.Unsafe.park(Native Method)
>>       at java.util.concurrent.locks.LockSupport.park(LockSupport.java:186)
>>       at java.util.concurrent.locks.AbstractQueuedSynchronizer$ConditionObject.await(AbstractQueuedSynchronizer.java:2043)
>>       at java.util.concurrent.LinkedBlockingQueue.take(LinkedBlockingQueue.java:442)
>>       at java.util.concurrent.ThreadPoolExecutor.getTask(ThreadPoolExecutor.java:1043)
>>       at java.util.concurrent.ThreadPoolExecutor.runWorker(ThreadPoolExecutor.java:1103)
>>       at java.util.concurrent.ThreadPoolExecutor$Worker.run(ThreadPoolExecutor.java:603)
>>       at java.lang.Thread.run(Thread.java:722)
>>  3) Thread[id=1098, name=searcherExecutor-589-thread-1, state=WAITING, group=TGRP-TestLazyCores]
>>       at sun.misc.Unsafe.park(Native Method)
>>       at java.util.concurrent.locks.LockSupport.park(LockSupport.java:186)
>>       at java.util.concurrent.locks.AbstractQueuedSynchronizer$ConditionObject.await(AbstractQueuedSynchronizer.java:2043)
>>       at java.util.concurrent.LinkedBlockingQueue.take(LinkedBlockingQueue.java:442)
>>       at java.util.concurrent.ThreadPoolExecutor.getTask(ThreadPoolExecutor.java:1043)
>>       at java.util.concurrent.ThreadPoolExecutor.runWorker(ThreadPoolExecutor.java:1103)
>>       at java.util.concurrent.ThreadPoolExecutor$Worker.run(ThreadPoolExecutor.java:603)
>>       at java.lang.Thread.run(Thread.java:722)
>>  4) Thread[id=1097, name=searcherExecutor-586-thread-1, state=WAITING, group=TGRP-TestLazyCores]
>>       at sun.misc.Unsafe.park(Native Method)
>>       at java.util.concurrent.locks.LockSupport.park(LockSupport.java:186)
>>       at java.util.concurrent.locks.AbstractQueuedSynchronizer$ConditionObject.await(AbstractQueuedSynchronizer.java:2043)
>>       at java.util.concurrent.LinkedBlockingQueue.take(LinkedBlockingQueue.java:442)
>>       at java.util.concurrent.ThreadPoolExecutor.getTask(ThreadPoolExecutor.java:1043)
>>       at java.util.concurrent.ThreadPoolExecutor.runWorker(ThreadPoolExecutor.java:1103)
>>       at java.util.concurrent.ThreadPoolExecutor$Worker.run(ThreadPoolExecutor.java:603)
>>       at java.lang.Thread.run(Thread.java:722)
>>      at __randomizedtesting.SeedInfo.seed([3127684F1AE08B61]:0)
>>
>>
>> REGRESSION:  org.apache.solr.core.TestLazyCores.testLazyLoad
>>
>> Error Message:
>>
>>
>> Stack Trace:
>> java.lang.NullPointerException
>>      at __randomizedtesting.SeedInfo.seed([3127684F1AE08B61:AA78F492392B81D2]:0)
>>      at org.apache.solr.core.TestLazyCores.testLazyLoad(TestLazyCores.java:92)
>>      at sun.reflect.NativeMethodAccessorImpl.invoke0(Native Method)
>>      at sun.reflect.NativeMethodAccessorImpl.invoke(NativeMethodAccessorImpl.java:57)
>>      at sun.reflect.DelegatingMethodAccessorImpl.invoke(DelegatingMethodAccessorImpl.java:43)
>>      at java.lang.reflect.Method.invoke(Method.java:601)
>>      at com.carrotsearch.randomizedtesting.RandomizedRunner.invoke(RandomizedRunner.java:1559)
>>      at com.carrotsearch.randomizedtesting.RandomizedRunner.access$600(RandomizedRunner.java:79)
>>      at com.carrotsearch.randomizedtesting.RandomizedRunner$6.evaluate(RandomizedRunner.java:737)
>>      at com.carrotsearch.randomizedtesting.RandomizedRunner$7.evaluate(RandomizedRunner.java:773)
>>      at com.carrotsearch.randomizedtesting.RandomizedRunner$8.evaluate(RandomizedRunner.java:787)
>>      at com.carrotsearch.randomizedtesting.rules.SystemPropertiesRestoreRule$1.evaluate(SystemPropertiesRestoreRule.java:53)
>>      at org.apache.lucene.util.TestRuleSetupTeardownChained$1.evaluate(TestRuleSetupTeardownChained.java:50)
>>      at org.apache.lucene.util.TestRuleFieldCacheSanity$1.evaluate(TestRuleFieldCacheSanity.java:51)
>>      at org.apache.lucene.util.AbstractBeforeAfterRule$1.evaluate(AbstractBeforeAfterRule.java:45)
>>      at com.carrotsearch.randomizedtesting.rules.SystemPropertiesInvariantRule$1.evaluate(SystemPropertiesInvariantRule.java:55)
>>      at org.apache.lucene.util.TestRuleThreadAndTestName$1.evaluate(TestRuleThreadAndTestName.java:48)
>>      at org.apache.lucene.util.TestRuleIgnoreAfterMaxFailures$1.evaluate(TestRuleIgnoreAfterMaxFailures.java:70)
>>      at org.apache.lucene.util.TestRuleMarkFailure$1.evaluate(TestRuleMarkFailure.java:48)
>>      at com.carrotsearch.randomizedtesting.rules.StatementAdapter.evaluate(StatementAdapter.java:36)
>>      at com.carrotsearch.randomizedtesting.ThreadLeakControl$StatementRunner.run(ThreadLeakControl.java:358)
>>      at com.carrotsearch.randomizedtesting.ThreadLeakControl.forkTimeoutingTask(ThreadLeakControl.java:782)
>>      at com.carrotsearch.randomizedtesting.ThreadLeakControl$3.evaluate(ThreadLeakControl.java:442)
>>      at com.carrotsearch.randomizedtesting.RandomizedRunner.runSingleTest(RandomizedRunner.java:746)
>>      at com.carrotsearch.randomizedtesting.RandomizedRunner$3.evaluate(RandomizedRunner.java:648)
>>      at com.carrotsearch.randomizedtesting.RandomizedRunner$4.evaluate(RandomizedRunner.java:682)
>>      at com.carrotsearch.randomizedtesting.RandomizedRunner$5.evaluate(RandomizedRunner.java:693)
>>      at com.carrotsearch.randomizedtesting.rules.StatementAdapter.evaluate(StatementAdapter.java:36)
>>      at com.carrotsearch.randomizedtesting.rules.SystemPropertiesRestoreRule$1.evaluate(SystemPropertiesRestoreRule.java:53)
>>      at org.apache.lucene.util.AbstractBeforeAfterRule$1.evaluate(AbstractBeforeAfterRule.java:45)
>>      at org.apache.lucene.util.TestRuleStoreClassName$1.evaluate(TestRuleStoreClassName.java:42)
>>      at com.carrotsearch.randomizedtesting.rules.SystemPropertiesInvariantRule$1.evaluate(SystemPropertiesInvariantRule.java:55)
>>      at com.carrotsearch.randomizedtesting.rules.NoShadowingOrOverridesOnMethodsRule$1.evaluate(NoShadowingOrOverridesOnMethodsRule.java:39)
>>      at com.carrotsearch.randomizedtesting.rules.NoShadowingOrOverridesOnMethodsRule$1.evaluate(NoShadowingOrOverridesOnMethodsRule.java:39)
>>      at com.carrotsearch.randomizedtesting.rules.StatementAdapter.evaluate(StatementAdapter.java:36)
>>      at org.apache.lucene.util.TestRuleAssertionsRequired$1.evaluate(TestRuleAssertionsRequired.java:43)
>>      at org.apache.lucene.util.TestRuleMarkFailure$1.evaluate(TestRuleMarkFailure.java:48)
>>      at org.apache.lucene.util.TestRuleIgnoreAfterMaxFailures$1.evaluate(TestRuleIgnoreAfterMaxFailures.java:70)
>>      at org.apache.lucene.util.TestRuleIgnoreTestSuites$1.evaluate(TestRuleIgnoreTestSuites.java:55)
>>      at com.carrotsearch.randomizedtesting.rules.StatementAdapter.evaluate(StatementAdapter.java:36)
>>      at com.carrotsearch.randomizedtesting.ThreadLeakControl$StatementRunner.run(ThreadLeakControl.java:358)
>>      at java.lang.Thread.run(Thread.java:722)
>>
>>
>


---------------------------------------------------------------------
To unsubscribe, e-mail: [hidden email]
For additional commands, e-mail: [hidden email]


Reply | Threaded
Open this post in threaded view
|

Re: Fullmetal Jenkins: Solr - Build # 86 - Failure!

Mark Miller-3
I'm guessing it's a race of some kind - but I have not had the time to dig in yet.

- Mark

On Nov 21, 2012, at 3:44 PM, Erick Erickson <[hidden email]> wrote:

> OK, let me see what I can dig up on this one.
>
>
> On Wed, Nov 21, 2012 at 9:35 AM, Mark Miller <[hidden email]> wrote:
> Another common fail in the lazy cores tests is:
>
> Error Message
>
> core collection1 was not found in the list of cores
> Stacktrace
>
> java.lang.AssertionError: core collection1 was not found in the list of cores
>         at __randomizedtesting.SeedInfo.seed([9B09724CE0FEDF8:6CEC385E7F103016]:0)
>         at org.junit.Assert.fail(Assert.java:93)
>         at org.junit.Assert.assertTrue(Assert.java:43)
>         at org.apache.solr.core.TestLazyCores.checkInCores(TestLazyCores.java:226)
>         at org.apache.solr.core.TestLazyCores.testCachingLimit(TestLazyCores.java:180
>
> On Nov 20, 2012, at 10:12 PM, Mark Miller <[hidden email]> wrote:
>
> > This test lazy cores test also fails somewhat frequently on my primary linux box.
> >
> > Usually I see:
> >
> > java.lang.NullPointerException
> >       at __randomizedtesting.SeedInfo.seed([3127684F1AE08B61:AA78F492392B81D2]:0)
> >       at org.apache.solr.core.TestLazyCores.testLazyLoad(TestLazyCores.java:92)
> >
> > On Nov 20, 2012, at 10:09 PM, [hidden email] wrote:
> >
> >> Solr - Build # 86 - Failure:
> >>
> >> Check console output at http://fullmetaljenkins.org/job/Solr/86/ to view the results.
> >>
> >> 4 tests failed.
> >> FAILED:  junit.framework.TestSuite.org.apache.solr.core.TestLazyCores
> >>
> >> Error Message:
> >> ERROR: SolrIndexSearcher opens=19 closes=15
> >>
> >> Stack Trace:
> >> java.lang.AssertionError: ERROR: SolrIndexSearcher opens=19 closes=15
> >>      at __randomizedtesting.SeedInfo.seed([3127684F1AE08B61]:0)
> >>      at org.junit.Assert.fail(Assert.java:93)
> >>      at org.apache.solr.SolrTestCaseJ4.endTrackingSearchers(SolrTestCaseJ4.java:243)
> >>      at org.apache.solr.SolrTestCaseJ4.afterClass(SolrTestCaseJ4.java:97)
> >>      at sun.reflect.GeneratedMethodAccessor19.invoke(Unknown Source)
> >>      at sun.reflect.DelegatingMethodAccessorImpl.invoke(DelegatingMethodAccessorImpl.java:43)
> >>      at java.lang.reflect.Method.invoke(Method.java:601)
> >>      at com.carrotsearch.randomizedtesting.RandomizedRunner.invoke(RandomizedRunner.java:1559)
> >>      at com.carrotsearch.randomizedtesting.RandomizedRunner.access$600(RandomizedRunner.java:79)
> >>      at com.carrotsearch.randomizedtesting.RandomizedRunner$5.evaluate(RandomizedRunner.java:700)
> >>      at com.carrotsearch.randomizedtesting.rules.StatementAdapter.evaluate(StatementAdapter.java:36)
> >>      at com.carrotsearch.randomizedtesting.rules.SystemPropertiesRestoreRule$1.evaluate(SystemPropertiesRestoreRule.java:53)
> >>      at org.apache.lucene.util.AbstractBeforeAfterRule$1.evaluate(AbstractBeforeAfterRule.java:45)
> >>      at org.apache.lucene.util.TestRuleStoreClassName$1.evaluate(TestRuleStoreClassName.java:42)
> >>      at com.carrotsearch.randomizedtesting.rules.SystemPropertiesInvariantRule$1.evaluate(SystemPropertiesInvariantRule.java:55)
> >>      at com.carrotsearch.randomizedtesting.rules.NoShadowingOrOverridesOnMethodsRule$1.evaluate(NoShadowingOrOverridesOnMethodsRule.java:39)
> >>      at com.carrotsearch.randomizedtesting.rules.NoShadowingOrOverridesOnMethodsRule$1.evaluate(NoShadowingOrOverridesOnMethodsRule.java:39)
> >>      at com.carrotsearch.randomizedtesting.rules.StatementAdapter.evaluate(StatementAdapter.java:36)
> >>      at org.apache.lucene.util.TestRuleAssertionsRequired$1.evaluate(TestRuleAssertionsRequired.java:43)
> >>      at org.apache.lucene.util.TestRuleMarkFailure$1.evaluate(TestRuleMarkFailure.java:48)
> >>      at org.apache.lucene.util.TestRuleIgnoreAfterMaxFailures$1.evaluate(TestRuleIgnoreAfterMaxFailures.java:70)
> >>      at org.apache.lucene.util.TestRuleIgnoreTestSuites$1.evaluate(TestRuleIgnoreTestSuites.java:55)
> >>      at com.carrotsearch.randomizedtesting.rules.StatementAdapter.evaluate(StatementAdapter.java:36)
> >>      at com.carrotsearch.randomizedtesting.ThreadLeakControl$StatementRunner.run(ThreadLeakControl.java:358)
> >>      at java.lang.Thread.run(Thread.java:722)
> >>
> >>
> >> FAILED:  junit.framework.TestSuite.org.apache.solr.core.TestLazyCores
> >>
> >> Error Message:
> >> 4 threads leaked from SUITE scope at org.apache.solr.core.TestLazyCores:     1) Thread[id=1094, name=searcherExecutor-575-thread-1, state=WAITING, group=TGRP-TestLazyCores]         at sun.misc.Unsafe.park(Native Method)         at java.util.concurrent.locks.LockSupport.park(LockSupport.java:186)         at java.util.concurrent.locks.AbstractQueuedSynchronizer$ConditionObject.await(AbstractQueuedSynchronizer.java:2043)         at java.util.concurrent.LinkedBlockingQueue.take(LinkedBlockingQueue.java:442)         at java.util.concurrent.ThreadPoolExecutor.getTask(ThreadPoolExecutor.java:1043)         at java.util.concurrent.ThreadPoolExecutor.runWorker(ThreadPoolExecutor.java:1103)         at java.util.concurrent.ThreadPoolExecutor$Worker.run(ThreadPoolExecutor.java:603)         at java.lang.Thread.run(Thread.java:722)    2) Thread[id=1096, name=searcherExecutor-583-thread-1, state=WAITING, group=TGRP-TestLazyCores]         at sun.misc.Unsafe.park(Native Method)         at java.util.concurrent.locks.LockSupport.park(LockSupport.java:186)         at java.util.concurrent.locks.AbstractQueuedSynchronizer$ConditionObject.await(AbstractQueuedSynchronizer.java:2043)         at java.util.concurrent.LinkedBlockingQueue.take(LinkedBlockingQueue.java:442)         at java.util.concurrent.ThreadPoolExecutor.getTask(ThreadPoolExecutor.java:1043)         at java.util.concurrent.ThreadPoolExecutor.runWorker(ThreadPoolExecutor.java:1103)         at java.util.concurrent.ThreadPoolExecutor$Worker.run(ThreadPoolExecutor.java:603)         at java.lang.Thread.run(Thread.java:722)    3) Thread[id=1098, name=searcherExecutor-589-thread-1, state=WAITING, group=TGRP-TestLazyCores]         at sun.misc.Unsafe.park(Native Method)         at java.util.concurrent.locks.LockSupport.park(LockSupport.java:186)         at java.util.concurrent.locks.AbstractQueuedSynchronizer$ConditionObject.await(AbstractQueuedSynchronizer.java:2043)         at java.util.concurrent.LinkedBlockingQueue.take(LinkedBlockingQueue.java:442)         at java.util.concurrent.ThreadPoolExecutor.getTask(ThreadPoolExecutor.java:1043)         at java.util.concurrent.ThreadPoolExecutor.runWorker(ThreadPoolExecutor.java:1103)         at java.util.concurrent.ThreadPoolExecutor$Worker.run(ThreadPoolExecutor.java:603)         at java.lang.Thread.run(Thread.java:722)    4) Thread[id=1097, name=searcherExecutor-586-thread-1, state=WAITING, group=TGRP-TestLazyCores]         at sun.misc.Unsafe.park(Native Method)         at java.util.concurrent.locks.LockSupport.park(LockSupport.java:186)         at java.util.concurrent.locks.AbstractQueuedSynchronizer$ConditionObject.await(AbstractQueuedSynchronizer.java:2043)         at java.util.concurrent.LinkedBlockingQueue.take(LinkedBlockingQueue.java:442)         at java.util.concurrent.ThreadPoolExecutor.getTask(ThreadPoolExecutor.java:1043)         at java.util.concurrent.ThreadPoolExecutor.runWorker(ThreadPoolExecutor.java:1103)         at java.util.concurrent.ThreadPoolExecutor$Worker.run(ThreadPoolExecutor.java:603)         at java.lang.Thread.run(Thread.java:722)
> >>
> >> Stack Trace:
> >> com.carrotsearch.randomizedtesting.ThreadLeakError: 4 threads leaked from SUITE scope at org.apache.solr.core.TestLazyCores:
> >>  1) Thread[id=1094, name=searcherExecutor-575-thread-1, state=WAITING, group=TGRP-TestLazyCores]
> >>       at sun.misc.Unsafe.park(Native Method)
> >>       at java.util.concurrent.locks.LockSupport.park(LockSupport.java:186)
> >>       at java.util.concurrent.locks.AbstractQueuedSynchronizer$ConditionObject.await(AbstractQueuedSynchronizer.java:2043)
> >>       at java.util.concurrent.LinkedBlockingQueue.take(LinkedBlockingQueue.java:442)
> >>       at java.util.concurrent.ThreadPoolExecutor.getTask(ThreadPoolExecutor.java:1043)
> >>       at java.util.concurrent.ThreadPoolExecutor.runWorker(ThreadPoolExecutor.java:1103)
> >>       at java.util.concurrent.ThreadPoolExecutor$Worker.run(ThreadPoolExecutor.java:603)
> >>       at java.lang.Thread.run(Thread.java:722)
> >>  2) Thread[id=1096, name=searcherExecutor-583-thread-1, state=WAITING, group=TGRP-TestLazyCores]
> >>       at sun.misc.Unsafe.park(Native Method)
> >>       at java.util.concurrent.locks.LockSupport.park(LockSupport.java:186)
> >>       at java.util.concurrent.locks.AbstractQueuedSynchronizer$ConditionObject.await(AbstractQueuedSynchronizer.java:2043)
> >>       at java.util.concurrent.LinkedBlockingQueue.take(LinkedBlockingQueue.java:442)
> >>       at java.util.concurrent.ThreadPoolExecutor.getTask(ThreadPoolExecutor.java:1043)
> >>       at java.util.concurrent.ThreadPoolExecutor.runWorker(ThreadPoolExecutor.java:1103)
> >>       at java.util.concurrent.ThreadPoolExecutor$Worker.run(ThreadPoolExecutor.java:603)
> >>       at java.lang.Thread.run(Thread.java:722)
> >>  3) Thread[id=1098, name=searcherExecutor-589-thread-1, state=WAITING, group=TGRP-TestLazyCores]
> >>       at sun.misc.Unsafe.park(Native Method)
> >>       at java.util.concurrent.locks.LockSupport.park(LockSupport.java:186)
> >>       at java.util.concurrent.locks.AbstractQueuedSynchronizer$ConditionObject.await(AbstractQueuedSynchronizer.java:2043)
> >>       at java.util.concurrent.LinkedBlockingQueue.take(LinkedBlockingQueue.java:442)
> >>       at java.util.concurrent.ThreadPoolExecutor.getTask(ThreadPoolExecutor.java:1043)
> >>       at java.util.concurrent.ThreadPoolExecutor.runWorker(ThreadPoolExecutor.java:1103)
> >>       at java.util.concurrent.ThreadPoolExecutor$Worker.run(ThreadPoolExecutor.java:603)
> >>       at java.lang.Thread.run(Thread.java:722)
> >>  4) Thread[id=1097, name=searcherExecutor-586-thread-1, state=WAITING, group=TGRP-TestLazyCores]
> >>       at sun.misc.Unsafe.park(Native Method)
> >>       at java.util.concurrent.locks.LockSupport.park(LockSupport.java:186)
> >>       at java.util.concurrent.locks.AbstractQueuedSynchronizer$ConditionObject.await(AbstractQueuedSynchronizer.java:2043)
> >>       at java.util.concurrent.LinkedBlockingQueue.take(LinkedBlockingQueue.java:442)
> >>       at java.util.concurrent.ThreadPoolExecutor.getTask(ThreadPoolExecutor.java:1043)
> >>       at java.util.concurrent.ThreadPoolExecutor.runWorker(ThreadPoolExecutor.java:1103)
> >>       at java.util.concurrent.ThreadPoolExecutor$Worker.run(ThreadPoolExecutor.java:603)
> >>       at java.lang.Thread.run(Thread.java:722)
> >>      at __randomizedtesting.SeedInfo.seed([3127684F1AE08B61]:0)
> >>
> >>
> >> FAILED:  junit.framework.TestSuite.org.apache.solr.core.TestLazyCores
> >>
> >> Error Message:
> >> There are still zombie threads that couldn't be terminated:    1) Thread[id=1094, name=searcherExecutor-575-thread-1, state=WAITING, group=TGRP-TestLazyCores]         at sun.misc.Unsafe.park(Native Method)         at java.util.concurrent.locks.LockSupport.park(LockSupport.java:186)         at java.util.concurrent.locks.AbstractQueuedSynchronizer$ConditionObject.await(AbstractQueuedSynchronizer.java:2043)         at java.util.concurrent.LinkedBlockingQueue.take(LinkedBlockingQueue.java:442)         at java.util.concurrent.ThreadPoolExecutor.getTask(ThreadPoolExecutor.java:1043)         at java.util.concurrent.ThreadPoolExecutor.runWorker(ThreadPoolExecutor.java:1103)         at java.util.concurrent.ThreadPoolExecutor$Worker.run(ThreadPoolExecutor.java:603)         at java.lang.Thread.run(Thread.java:722)    2) Thread[id=1096, name=searcherExecutor-583-thread-1, state=WAITING, group=TGRP-TestLazyCores]         at sun.misc.Unsafe.park(Native Method)         at java.util.concurrent.locks.LockSupport.park(LockSupport.java:186)         at java.util.concurrent.locks.AbstractQueuedSynchronizer$ConditionObject.await(AbstractQueuedSynchronizer.java:2043)         at java.util.concurrent.LinkedBlockingQueue.take(LinkedBlockingQueue.java:442)         at java.util.concurrent.ThreadPoolExecutor.getTask(ThreadPoolExecutor.java:1043)         at java.util.concurrent.ThreadPoolExecutor.runWorker(ThreadPoolExecutor.java:1103)         at java.util.concurrent.ThreadPoolExecutor$Worker.run(ThreadPoolExecutor.java:603)         at java.lang.Thread.run(Thread.java:722)    3) Thread[id=1098, name=searcherExecutor-589-thread-1, state=WAITING, group=TGRP-TestLazyCores]         at sun.misc.Unsafe.park(Native Method)         at java.util.concurrent.locks.LockSupport.park(LockSupport.java:186)         at java.util.concurrent.locks.AbstractQueuedSynchronizer$ConditionObject.await(AbstractQueuedSynchronizer.java:2043)         at java.util.concurrent.LinkedBlockingQueue.take(LinkedBlockingQueue.java:442)         at java.util.concurrent.ThreadPoolExecutor.getTask(ThreadPoolExecutor.java:1043)         at java.util.concurrent.ThreadPoolExecutor.runWorker(ThreadPoolExecutor.java:1103)         at java.util.concurrent.ThreadPoolExecutor$Worker.run(ThreadPoolExecutor.java:603)         at java.lang.Thread.run(Thread.java:722)    4) Thread[id=1097, name=searcherExecutor-586-thread-1, state=WAITING, group=TGRP-TestLazyCores]         at sun.misc.Unsafe.park(Native Method)         at java.util.concurrent.locks.LockSupport.park(LockSupport.java:186)         at java.util.concurrent.locks.AbstractQueuedSynchronizer$ConditionObject.await(AbstractQueuedSynchronizer.java:2043)         at java.util.concurrent.LinkedBlockingQueue.take(LinkedBlockingQueue.java:442)         at java.util.concurrent.ThreadPoolExecutor.getTask(ThreadPoolExecutor.java:1043)         at java.util.concurrent.ThreadPoolExecutor.runWorker(ThreadPoolExecutor.java:1103)         at java.util.concurrent.ThreadPoolExecutor$Worker.run(ThreadPoolExecutor.java:603)         at java.lang.Thread.run(Thread.java:722)
> >>
> >> Stack Trace:
> >> com.carrotsearch.randomizedtesting.ThreadLeakError: There are still zombie threads that couldn't be terminated:
> >>  1) Thread[id=1094, name=searcherExecutor-575-thread-1, state=WAITING, group=TGRP-TestLazyCores]
> >>       at sun.misc.Unsafe.park(Native Method)
> >>       at java.util.concurrent.locks.LockSupport.park(LockSupport.java:186)
> >>       at java.util.concurrent.locks.AbstractQueuedSynchronizer$ConditionObject.await(AbstractQueuedSynchronizer.java:2043)
> >>       at java.util.concurrent.LinkedBlockingQueue.take(LinkedBlockingQueue.java:442)
> >>       at java.util.concurrent.ThreadPoolExecutor.getTask(ThreadPoolExecutor.java:1043)
> >>       at java.util.concurrent.ThreadPoolExecutor.runWorker(ThreadPoolExecutor.java:1103)
> >>       at java.util.concurrent.ThreadPoolExecutor$Worker.run(ThreadPoolExecutor.java:603)
> >>       at java.lang.Thread.run(Thread.java:722)
> >>  2) Thread[id=1096, name=searcherExecutor-583-thread-1, state=WAITING, group=TGRP-TestLazyCores]
> >>       at sun.misc.Unsafe.park(Native Method)
> >>       at java.util.concurrent.locks.LockSupport.park(LockSupport.java:186)
> >>       at java.util.concurrent.locks.AbstractQueuedSynchronizer$ConditionObject.await(AbstractQueuedSynchronizer.java:2043)
> >>       at java.util.concurrent.LinkedBlockingQueue.take(LinkedBlockingQueue.java:442)
> >>       at java.util.concurrent.ThreadPoolExecutor.getTask(ThreadPoolExecutor.java:1043)
> >>       at java.util.concurrent.ThreadPoolExecutor.runWorker(ThreadPoolExecutor.java:1103)
> >>       at java.util.concurrent.ThreadPoolExecutor$Worker.run(ThreadPoolExecutor.java:603)
> >>       at java.lang.Thread.run(Thread.java:722)
> >>  3) Thread[id=1098, name=searcherExecutor-589-thread-1, state=WAITING, group=TGRP-TestLazyCores]
> >>       at sun.misc.Unsafe.park(Native Method)
> >>       at java.util.concurrent.locks.LockSupport.park(LockSupport.java:186)
> >>       at java.util.concurrent.locks.AbstractQueuedSynchronizer$ConditionObject.await(AbstractQueuedSynchronizer.java:2043)
> >>       at java.util.concurrent.LinkedBlockingQueue.take(LinkedBlockingQueue.java:442)
> >>       at java.util.concurrent.ThreadPoolExecutor.getTask(ThreadPoolExecutor.java:1043)
> >>       at java.util.concurrent.ThreadPoolExecutor.runWorker(ThreadPoolExecutor.java:1103)
> >>       at java.util.concurrent.ThreadPoolExecutor$Worker.run(ThreadPoolExecutor.java:603)
> >>       at java.lang.Thread.run(Thread.java:722)
> >>  4) Thread[id=1097, name=searcherExecutor-586-thread-1, state=WAITING, group=TGRP-TestLazyCores]
> >>       at sun.misc.Unsafe.park(Native Method)
> >>       at java.util.concurrent.locks.LockSupport.park(LockSupport.java:186)
> >>       at java.util.concurrent.locks.AbstractQueuedSynchronizer$ConditionObject.await(AbstractQueuedSynchronizer.java:2043)
> >>       at java.util.concurrent.LinkedBlockingQueue.take(LinkedBlockingQueue.java:442)
> >>       at java.util.concurrent.ThreadPoolExecutor.getTask(ThreadPoolExecutor.java:1043)
> >>       at java.util.concurrent.ThreadPoolExecutor.runWorker(ThreadPoolExecutor.java:1103)
> >>       at java.util.concurrent.ThreadPoolExecutor$Worker.run(ThreadPoolExecutor.java:603)
> >>       at java.lang.Thread.run(Thread.java:722)
> >>      at __randomizedtesting.SeedInfo.seed([3127684F1AE08B61]:0)
> >>
> >>
> >> REGRESSION:  org.apache.solr.core.TestLazyCores.testLazyLoad
> >>
> >> Error Message:
> >>
> >>
> >> Stack Trace:
> >> java.lang.NullPointerException
> >>      at __randomizedtesting.SeedInfo.seed([3127684F1AE08B61:AA78F492392B81D2]:0)
> >>      at org.apache.solr.core.TestLazyCores.testLazyLoad(TestLazyCores.java:92)
> >>      at sun.reflect.NativeMethodAccessorImpl.invoke0(Native Method)
> >>      at sun.reflect.NativeMethodAccessorImpl.invoke(NativeMethodAccessorImpl.java:57)
> >>      at sun.reflect.DelegatingMethodAccessorImpl.invoke(DelegatingMethodAccessorImpl.java:43)
> >>      at java.lang.reflect.Method.invoke(Method.java:601)
> >>      at com.carrotsearch.randomizedtesting.RandomizedRunner.invoke(RandomizedRunner.java:1559)
> >>      at com.carrotsearch.randomizedtesting.RandomizedRunner.access$600(RandomizedRunner.java:79)
> >>      at com.carrotsearch.randomizedtesting.RandomizedRunner$6.evaluate(RandomizedRunner.java:737)
> >>      at com.carrotsearch.randomizedtesting.RandomizedRunner$7.evaluate(RandomizedRunner.java:773)
> >>      at com.carrotsearch.randomizedtesting.RandomizedRunner$8.evaluate(RandomizedRunner.java:787)
> >>      at com.carrotsearch.randomizedtesting.rules.SystemPropertiesRestoreRule$1.evaluate(SystemPropertiesRestoreRule.java:53)
> >>      at org.apache.lucene.util.TestRuleSetupTeardownChained$1.evaluate(TestRuleSetupTeardownChained.java:50)
> >>      at org.apache.lucene.util.TestRuleFieldCacheSanity$1.evaluate(TestRuleFieldCacheSanity.java:51)
> >>      at org.apache.lucene.util.AbstractBeforeAfterRule$1.evaluate(AbstractBeforeAfterRule.java:45)
> >>      at com.carrotsearch.randomizedtesting.rules.SystemPropertiesInvariantRule$1.evaluate(SystemPropertiesInvariantRule.java:55)
> >>      at org.apache.lucene.util.TestRuleThreadAndTestName$1.evaluate(TestRuleThreadAndTestName.java:48)
> >>      at org.apache.lucene.util.TestRuleIgnoreAfterMaxFailures$1.evaluate(TestRuleIgnoreAfterMaxFailures.java:70)
> >>      at org.apache.lucene.util.TestRuleMarkFailure$1.evaluate(TestRuleMarkFailure.java:48)
> >>      at com.carrotsearch.randomizedtesting.rules.StatementAdapter.evaluate(StatementAdapter.java:36)
> >>      at com.carrotsearch.randomizedtesting.ThreadLeakControl$StatementRunner.run(ThreadLeakControl.java:358)
> >>      at com.carrotsearch.randomizedtesting.ThreadLeakControl.forkTimeoutingTask(ThreadLeakControl.java:782)
> >>      at com.carrotsearch.randomizedtesting.ThreadLeakControl$3.evaluate(ThreadLeakControl.java:442)
> >>      at com.carrotsearch.randomizedtesting.RandomizedRunner.runSingleTest(RandomizedRunner.java:746)
> >>      at com.carrotsearch.randomizedtesting.RandomizedRunner$3.evaluate(RandomizedRunner.java:648)
> >>      at com.carrotsearch.randomizedtesting.RandomizedRunner$4.evaluate(RandomizedRunner.java:682)
> >>      at com.carrotsearch.randomizedtesting.RandomizedRunner$5.evaluate(RandomizedRunner.java:693)
> >>      at com.carrotsearch.randomizedtesting.rules.StatementAdapter.evaluate(StatementAdapter.java:36)
> >>      at com.carrotsearch.randomizedtesting.rules.SystemPropertiesRestoreRule$1.evaluate(SystemPropertiesRestoreRule.java:53)
> >>      at org.apache.lucene.util.AbstractBeforeAfterRule$1.evaluate(AbstractBeforeAfterRule.java:45)
> >>      at org.apache.lucene.util.TestRuleStoreClassName$1.evaluate(TestRuleStoreClassName.java:42)
> >>      at com.carrotsearch.randomizedtesting.rules.SystemPropertiesInvariantRule$1.evaluate(SystemPropertiesInvariantRule.java:55)
> >>      at com.carrotsearch.randomizedtesting.rules.NoShadowingOrOverridesOnMethodsRule$1.evaluate(NoShadowingOrOverridesOnMethodsRule.java:39)
> >>      at com.carrotsearch.randomizedtesting.rules.NoShadowingOrOverridesOnMethodsRule$1.evaluate(NoShadowingOrOverridesOnMethodsRule.java:39)
> >>      at com.carrotsearch.randomizedtesting.rules.StatementAdapter.evaluate(StatementAdapter.java:36)
> >>      at org.apache.lucene.util.TestRuleAssertionsRequired$1.evaluate(TestRuleAssertionsRequired.java:43)
> >>      at org.apache.lucene.util.TestRuleMarkFailure$1.evaluate(TestRuleMarkFailure.java:48)
> >>      at org.apache.lucene.util.TestRuleIgnoreAfterMaxFailures$1.evaluate(TestRuleIgnoreAfterMaxFailures.java:70)
> >>      at org.apache.lucene.util.TestRuleIgnoreTestSuites$1.evaluate(TestRuleIgnoreTestSuites.java:55)
> >>      at com.carrotsearch.randomizedtesting.rules.StatementAdapter.evaluate(StatementAdapter.java:36)
> >>      at com.carrotsearch.randomizedtesting.ThreadLeakControl$StatementRunner.run(ThreadLeakControl.java:358)
> >>      at java.lang.Thread.run(Thread.java:722)
> >>
> >>
> >
>
>
> ---------------------------------------------------------------------
> To unsubscribe, e-mail: [hidden email]
> For additional commands, e-mail: [hidden email]
>
>


---------------------------------------------------------------------
To unsubscribe, e-mail: [hidden email]
For additional commands, e-mail: [hidden email]

Reply | Threaded
Open this post in threaded view
|

Re: Fullmetal Jenkins: Solr - Build # 86 - Failure!

Erick Erickson
Hmmm, I can't seem to get the failure to occur, running lots and lots of iterations.... Not quite sure wuat to do next....


On Wed, Nov 21, 2012 at 3:51 PM, Mark Miller <[hidden email]> wrote:
I'm guessing it's a race of some kind - but I have not had the time to dig in yet.

- Mark

On Nov 21, 2012, at 3:44 PM, Erick Erickson <[hidden email]> wrote:

> OK, let me see what I can dig up on this one.
>
>
> On Wed, Nov 21, 2012 at 9:35 AM, Mark Miller <[hidden email]> wrote:
> Another common fail in the lazy cores tests is:
>
> Error Message
>
> core collection1 was not found in the list of cores
> Stacktrace
>
> java.lang.AssertionError: core collection1 was not found in the list of cores
>         at __randomizedtesting.SeedInfo.seed([9B09724CE0FEDF8:6CEC385E7F103016]:0)
>         at org.junit.Assert.fail(Assert.java:93)
>         at org.junit.Assert.assertTrue(Assert.java:43)
>         at org.apache.solr.core.TestLazyCores.checkInCores(TestLazyCores.java:226)
>         at org.apache.solr.core.TestLazyCores.testCachingLimit(TestLazyCores.java:180
>
> On Nov 20, 2012, at 10:12 PM, Mark Miller <[hidden email]> wrote:
>
> > This test lazy cores test also fails somewhat frequently on my primary linux box.
> >
> > Usually I see:
> >
> > java.lang.NullPointerException
> >       at __randomizedtesting.SeedInfo.seed([3127684F1AE08B61:AA78F492392B81D2]:0)
> >       at org.apache.solr.core.TestLazyCores.testLazyLoad(TestLazyCores.java:92)
> >
> > On Nov 20, 2012, at 10:09 PM, [hidden email] wrote:
> >
> >> Solr - Build # 86 - Failure:
> >>
> >> Check console output at http://fullmetaljenkins.org/job/Solr/86/ to view the results.
> >>
> >> 4 tests failed.
> >> FAILED:  junit.framework.TestSuite.org.apache.solr.core.TestLazyCores
> >>
> >> Error Message:
> >> ERROR: SolrIndexSearcher opens=19 closes=15
> >>
> >> Stack Trace:
> >> java.lang.AssertionError: ERROR: SolrIndexSearcher opens=19 closes=15
> >>      at __randomizedtesting.SeedInfo.seed([3127684F1AE08B61]:0)
> >>      at org.junit.Assert.fail(Assert.java:93)
> >>      at org.apache.solr.SolrTestCaseJ4.endTrackingSearchers(SolrTestCaseJ4.java:243)
> >>      at org.apache.solr.SolrTestCaseJ4.afterClass(SolrTestCaseJ4.java:97)
> >>      at sun.reflect.GeneratedMethodAccessor19.invoke(Unknown Source)
> >>      at sun.reflect.DelegatingMethodAccessorImpl.invoke(DelegatingMethodAccessorImpl.java:43)
> >>      at java.lang.reflect.Method.invoke(Method.java:601)
> >>      at com.carrotsearch.randomizedtesting.RandomizedRunner.invoke(RandomizedRunner.java:1559)
> >>      at com.carrotsearch.randomizedtesting.RandomizedRunner.access$600(RandomizedRunner.java:79)
> >>      at com.carrotsearch.randomizedtesting.RandomizedRunner$5.evaluate(RandomizedRunner.java:700)
> >>      at com.carrotsearch.randomizedtesting.rules.StatementAdapter.evaluate(StatementAdapter.java:36)
> >>      at com.carrotsearch.randomizedtesting.rules.SystemPropertiesRestoreRule$1.evaluate(SystemPropertiesRestoreRule.java:53)
> >>      at org.apache.lucene.util.AbstractBeforeAfterRule$1.evaluate(AbstractBeforeAfterRule.java:45)
> >>      at org.apache.lucene.util.TestRuleStoreClassName$1.evaluate(TestRuleStoreClassName.java:42)
> >>      at com.carrotsearch.randomizedtesting.rules.SystemPropertiesInvariantRule$1.evaluate(SystemPropertiesInvariantRule.java:55)
> >>      at com.carrotsearch.randomizedtesting.rules.NoShadowingOrOverridesOnMethodsRule$1.evaluate(NoShadowingOrOverridesOnMethodsRule.java:39)
> >>      at com.carrotsearch.randomizedtesting.rules.NoShadowingOrOverridesOnMethodsRule$1.evaluate(NoShadowingOrOverridesOnMethodsRule.java:39)
> >>      at com.carrotsearch.randomizedtesting.rules.StatementAdapter.evaluate(StatementAdapter.java:36)
> >>      at org.apache.lucene.util.TestRuleAssertionsRequired$1.evaluate(TestRuleAssertionsRequired.java:43)
> >>      at org.apache.lucene.util.TestRuleMarkFailure$1.evaluate(TestRuleMarkFailure.java:48)
> >>      at org.apache.lucene.util.TestRuleIgnoreAfterMaxFailures$1.evaluate(TestRuleIgnoreAfterMaxFailures.java:70)
> >>      at org.apache.lucene.util.TestRuleIgnoreTestSuites$1.evaluate(TestRuleIgnoreTestSuites.java:55)
> >>      at com.carrotsearch.randomizedtesting.rules.StatementAdapter.evaluate(StatementAdapter.java:36)
> >>      at com.carrotsearch.randomizedtesting.ThreadLeakControl$StatementRunner.run(ThreadLeakControl.java:358)
> >>      at java.lang.Thread.run(Thread.java:722)
> >>
> >>
> >> FAILED:  junit.framework.TestSuite.org.apache.solr.core.TestLazyCores
> >>
> >> Error Message:
> >> 4 threads leaked from SUITE scope at org.apache.solr.core.TestLazyCores:     1) Thread[id=1094, name=searcherExecutor-575-thread-1, state=WAITING, group=TGRP-TestLazyCores]         at sun.misc.Unsafe.park(Native Method)         at java.util.concurrent.locks.LockSupport.park(LockSupport.java:186)         at java.util.concurrent.locks.AbstractQueuedSynchronizer$ConditionObject.await(AbstractQueuedSynchronizer.java:2043)         at java.util.concurrent.LinkedBlockingQueue.take(LinkedBlockingQueue.java:442)         at java.util.concurrent.ThreadPoolExecutor.getTask(ThreadPoolExecutor.java:1043)         at java.util.concurrent.ThreadPoolExecutor.runWorker(ThreadPoolExecutor.java:1103)         at java.util.concurrent.ThreadPoolExecutor$Worker.run(ThreadPoolExecutor.java:603)         at java.lang.Thread.run(Thread.java:722)    2) Thread[id=1096, name=searcherExecutor-583-thread-1, state=WAITING, group=TGRP-TestLazyCores]         at sun.misc.Unsafe.park(Native Method)         at java.util.concurrent.locks.LockSupport.park(LockSupport.java:186)         at java.util.concurrent.locks.AbstractQueuedSynchronizer$ConditionObject.await(AbstractQueuedSynchronizer.java:2043)         at java.util.concurrent.LinkedBlockingQueue.take(LinkedBlockingQueue.java:442)         at java.util.concurrent.ThreadPoolExecutor.getTask(ThreadPoolExecutor.java:1043)         at java.util.concurrent.ThreadPoolExecutor.runWorker(ThreadPoolExecutor.java:1103)         at java.util.concurrent.ThreadPoolExecutor$Worker.run(ThreadPoolExecutor.java:603)         at java.lang.Thread.run(Thread.java:722)    3) Thread[id=1098, name=searcherExecutor-589-thread-1, state=WAITING, group=TGRP-TestLazyCores]         at sun.misc.Unsafe.park(Native Method)         at java.util.concurrent.locks.LockSupport.park(LockSupport.java:186)         at java.util.concurrent.locks.AbstractQueuedSynchronizer$ConditionObject.await(AbstractQueuedSynchronizer.java:2043)         at java.util.concurrent.LinkedBlockingQueue.take(LinkedBlockingQueue.java:442)         at java.util.concurrent.ThreadPoolExecutor.getTask(ThreadPoolExecutor.java:1043)         at java.util.concurrent.ThreadPoolExecutor.runWorker(ThreadPoolExecutor.java:1103)         at java.util.concurrent.ThreadPoolExecutor$Worker.run(ThreadPoolExecutor.java:603)         at java.lang.Thread.run(Thread.java:722)    4) Thread[id=1097, name=searcherExecutor-586-thread-1, state=WAITING, group=TGRP-TestLazyCores]         at sun.misc.Unsafe.park(Native Method)         at java.util.concurrent.locks.LockSupport.park(LockSupport.java:186)         at java.util.concurrent.locks.AbstractQueuedSynchronizer$ConditionObject.await(AbstractQueuedSynchronizer.java:2043)         at java.util.concurrent.LinkedBlockingQueue.take(LinkedBlockingQueue.java:442)         at java.util.concurrent.ThreadPoolExecutor.getTask(ThreadPoolExecutor.java:1043)         at java.util.concurrent.ThreadPoolExecutor.runWorker(ThreadPoolExecutor.java:1103)         at java.util.concurrent.ThreadPoolExecutor$Worker.run(ThreadPoolExecutor.java:603)         at java.lang.Thread.run(Thread.java:722)
> >>
> >> Stack Trace:
> >> com.carrotsearch.randomizedtesting.ThreadLeakError: 4 threads leaked from SUITE scope at org.apache.solr.core.TestLazyCores:
> >>  1) Thread[id=1094, name=searcherExecutor-575-thread-1, state=WAITING, group=TGRP-TestLazyCores]
> >>       at sun.misc.Unsafe.park(Native Method)
> >>       at java.util.concurrent.locks.LockSupport.park(LockSupport.java:186)
> >>       at java.util.concurrent.locks.AbstractQueuedSynchronizer$ConditionObject.await(AbstractQueuedSynchronizer.java:2043)
> >>       at java.util.concurrent.LinkedBlockingQueue.take(LinkedBlockingQueue.java:442)
> >>       at java.util.concurrent.ThreadPoolExecutor.getTask(ThreadPoolExecutor.java:1043)
> >>       at java.util.concurrent.ThreadPoolExecutor.runWorker(ThreadPoolExecutor.java:1103)
> >>       at java.util.concurrent.ThreadPoolExecutor$Worker.run(ThreadPoolExecutor.java:603)
> >>       at java.lang.Thread.run(Thread.java:722)
> >>  2) Thread[id=1096, name=searcherExecutor-583-thread-1, state=WAITING, group=TGRP-TestLazyCores]
> >>       at sun.misc.Unsafe.park(Native Method)
> >>       at java.util.concurrent.locks.LockSupport.park(LockSupport.java:186)
> >>       at java.util.concurrent.locks.AbstractQueuedSynchronizer$ConditionObject.await(AbstractQueuedSynchronizer.java:2043)
> >>       at java.util.concurrent.LinkedBlockingQueue.take(LinkedBlockingQueue.java:442)
> >>       at java.util.concurrent.ThreadPoolExecutor.getTask(ThreadPoolExecutor.java:1043)
> >>       at java.util.concurrent.ThreadPoolExecutor.runWorker(ThreadPoolExecutor.java:1103)
> >>       at java.util.concurrent.ThreadPoolExecutor$Worker.run(ThreadPoolExecutor.java:603)
> >>       at java.lang.Thread.run(Thread.java:722)
> >>  3) Thread[id=1098, name=searcherExecutor-589-thread-1, state=WAITING, group=TGRP-TestLazyCores]
> >>       at sun.misc.Unsafe.park(Native Method)
> >>       at java.util.concurrent.locks.LockSupport.park(LockSupport.java:186)
> >>       at java.util.concurrent.locks.AbstractQueuedSynchronizer$ConditionObject.await(AbstractQueuedSynchronizer.java:2043)
> >>       at java.util.concurrent.LinkedBlockingQueue.take(LinkedBlockingQueue.java:442)
> >>       at java.util.concurrent.ThreadPoolExecutor.getTask(ThreadPoolExecutor.java:1043)
> >>       at java.util.concurrent.ThreadPoolExecutor.runWorker(ThreadPoolExecutor.java:1103)
> >>       at java.util.concurrent.ThreadPoolExecutor$Worker.run(ThreadPoolExecutor.java:603)
> >>       at java.lang.Thread.run(Thread.java:722)
> >>  4) Thread[id=1097, name=searcherExecutor-586-thread-1, state=WAITING, group=TGRP-TestLazyCores]
> >>       at sun.misc.Unsafe.park(Native Method)
> >>       at java.util.concurrent.locks.LockSupport.park(LockSupport.java:186)
> >>       at java.util.concurrent.locks.AbstractQueuedSynchronizer$ConditionObject.await(AbstractQueuedSynchronizer.java:2043)
> >>       at java.util.concurrent.LinkedBlockingQueue.take(LinkedBlockingQueue.java:442)
> >>       at java.util.concurrent.ThreadPoolExecutor.getTask(ThreadPoolExecutor.java:1043)
> >>       at java.util.concurrent.ThreadPoolExecutor.runWorker(ThreadPoolExecutor.java:1103)
> >>       at java.util.concurrent.ThreadPoolExecutor$Worker.run(ThreadPoolExecutor.java:603)
> >>       at java.lang.Thread.run(Thread.java:722)
> >>      at __randomizedtesting.SeedInfo.seed([3127684F1AE08B61]:0)
> >>
> >>
> >> FAILED:  junit.framework.TestSuite.org.apache.solr.core.TestLazyCores
> >>
> >> Error Message:
> >> There are still zombie threads that couldn't be terminated:    1) Thread[id=1094, name=searcherExecutor-575-thread-1, state=WAITING, group=TGRP-TestLazyCores]         at sun.misc.Unsafe.park(Native Method)         at java.util.concurrent.locks.LockSupport.park(LockSupport.java:186)         at java.util.concurrent.locks.AbstractQueuedSynchronizer$ConditionObject.await(AbstractQueuedSynchronizer.java:2043)         at java.util.concurrent.LinkedBlockingQueue.take(LinkedBlockingQueue.java:442)         at java.util.concurrent.ThreadPoolExecutor.getTask(ThreadPoolExecutor.java:1043)         at java.util.concurrent.ThreadPoolExecutor.runWorker(ThreadPoolExecutor.java:1103)         at java.util.concurrent.ThreadPoolExecutor$Worker.run(ThreadPoolExecutor.java:603)         at java.lang.Thread.run(Thread.java:722)    2) Thread[id=1096, name=searcherExecutor-583-thread-1, state=WAITING, group=TGRP-TestLazyCores]         at sun.misc.Unsafe.park(Native Method)         at java.util.concurrent.locks.LockSupport.park(LockSupport.java:186)         at java.util.concurrent.locks.AbstractQueuedSynchronizer$ConditionObject.await(AbstractQueuedSynchronizer.java:2043)         at java.util.concurrent.LinkedBlockingQueue.take(LinkedBlockingQueue.java:442)         at java.util.concurrent.ThreadPoolExecutor.getTask(ThreadPoolExecutor.java:1043)         at java.util.concurrent.ThreadPoolExecutor.runWorker(ThreadPoolExecutor.java:1103)         at java.util.concurrent.ThreadPoolExecutor$Worker.run(ThreadPoolExecutor.java:603)         at java.lang.Thread.run(Thread.java:722)    3) Thread[id=1098, name=searcherExecutor-589-thread-1, state=WAITING, group=TGRP-TestLazyCores]         at sun.misc.Unsafe.park(Native Method)         at java.util.concurrent.locks.LockSupport.park(LockSupport.java:186)         at java.util.concurrent.locks.AbstractQueuedSynchronizer$ConditionObject.await(AbstractQueuedSynchronizer.java:2043)         at java.util.concurrent.LinkedBlockingQueue.take(LinkedBlockingQueue.java:442)         at java.util.concurrent.ThreadPoolExecutor.getTask(ThreadPoolExecutor.java:1043)         at java.util.concurrent.ThreadPoolExecutor.runWorker(ThreadPoolExecutor.java:1103)         at java.util.concurrent.ThreadPoolExecutor$Worker.run(ThreadPoolExecutor.java:603)         at java.lang.Thread.run(Thread.java:722)    4) Thread[id=1097, name=searcherExecutor-586-thread-1, state=WAITING, group=TGRP-TestLazyCores]         at sun.misc.Unsafe.park(Native Method)         at java.util.concurrent.locks.LockSupport.park(LockSupport.java:186)         at java.util.concurrent.locks.AbstractQueuedSynchronizer$ConditionObject.await(AbstractQueuedSynchronizer.java:2043)         at java.util.concurrent.LinkedBlockingQueue.take(LinkedBlockingQueue.java:442)         at java.util.concurrent.ThreadPoolExecutor.getTask(ThreadPoolExecutor.java:1043)         at java.util.concurrent.ThreadPoolExecutor.runWorker(ThreadPoolExecutor.java:1103)         at java.util.concurrent.ThreadPoolExecutor$Worker.run(ThreadPoolExecutor.java:603)         at java.lang.Thread.run(Thread.java:722)
> >>
> >> Stack Trace:
> >> com.carrotsearch.randomizedtesting.ThreadLeakError: There are still zombie threads that couldn't be terminated:
> >>  1) Thread[id=1094, name=searcherExecutor-575-thread-1, state=WAITING, group=TGRP-TestLazyCores]
> >>       at sun.misc.Unsafe.park(Native Method)
> >>       at java.util.concurrent.locks.LockSupport.park(LockSupport.java:186)
> >>       at java.util.concurrent.locks.AbstractQueuedSynchronizer$ConditionObject.await(AbstractQueuedSynchronizer.java:2043)
> >>       at java.util.concurrent.LinkedBlockingQueue.take(LinkedBlockingQueue.java:442)
> >>       at java.util.concurrent.ThreadPoolExecutor.getTask(ThreadPoolExecutor.java:1043)
> >>       at java.util.concurrent.ThreadPoolExecutor.runWorker(ThreadPoolExecutor.java:1103)
> >>       at java.util.concurrent.ThreadPoolExecutor$Worker.run(ThreadPoolExecutor.java:603)
> >>       at java.lang.Thread.run(Thread.java:722)
> >>  2) Thread[id=1096, name=searcherExecutor-583-thread-1, state=WAITING, group=TGRP-TestLazyCores]
> >>       at sun.misc.Unsafe.park(Native Method)
> >>       at java.util.concurrent.locks.LockSupport.park(LockSupport.java:186)
> >>       at java.util.concurrent.locks.AbstractQueuedSynchronizer$ConditionObject.await(AbstractQueuedSynchronizer.java:2043)
> >>       at java.util.concurrent.LinkedBlockingQueue.take(LinkedBlockingQueue.java:442)
> >>       at java.util.concurrent.ThreadPoolExecutor.getTask(ThreadPoolExecutor.java:1043)
> >>       at java.util.concurrent.ThreadPoolExecutor.runWorker(ThreadPoolExecutor.java:1103)
> >>       at java.util.concurrent.ThreadPoolExecutor$Worker.run(ThreadPoolExecutor.java:603)
> >>       at java.lang.Thread.run(Thread.java:722)
> >>  3) Thread[id=1098, name=searcherExecutor-589-thread-1, state=WAITING, group=TGRP-TestLazyCores]
> >>       at sun.misc.Unsafe.park(Native Method)
> >>       at java.util.concurrent.locks.LockSupport.park(LockSupport.java:186)
> >>       at java.util.concurrent.locks.AbstractQueuedSynchronizer$ConditionObject.await(AbstractQueuedSynchronizer.java:2043)
> >>       at java.util.concurrent.LinkedBlockingQueue.take(LinkedBlockingQueue.java:442)
> >>       at java.util.concurrent.ThreadPoolExecutor.getTask(ThreadPoolExecutor.java:1043)
> >>       at java.util.concurrent.ThreadPoolExecutor.runWorker(ThreadPoolExecutor.java:1103)
> >>       at java.util.concurrent.ThreadPoolExecutor$Worker.run(ThreadPoolExecutor.java:603)
> >>       at java.lang.Thread.run(Thread.java:722)
> >>  4) Thread[id=1097, name=searcherExecutor-586-thread-1, state=WAITING, group=TGRP-TestLazyCores]
> >>       at sun.misc.Unsafe.park(Native Method)
> >>       at java.util.concurrent.locks.LockSupport.park(LockSupport.java:186)
> >>       at java.util.concurrent.locks.AbstractQueuedSynchronizer$ConditionObject.await(AbstractQueuedSynchronizer.java:2043)
> >>       at java.util.concurrent.LinkedBlockingQueue.take(LinkedBlockingQueue.java:442)
> >>       at java.util.concurrent.ThreadPoolExecutor.getTask(ThreadPoolExecutor.java:1043)
> >>       at java.util.concurrent.ThreadPoolExecutor.runWorker(ThreadPoolExecutor.java:1103)
> >>       at java.util.concurrent.ThreadPoolExecutor$Worker.run(ThreadPoolExecutor.java:603)
> >>       at java.lang.Thread.run(Thread.java:722)
> >>      at __randomizedtesting.SeedInfo.seed([3127684F1AE08B61]:0)
> >>
> >>
> >> REGRESSION:  org.apache.solr.core.TestLazyCores.testLazyLoad
> >>
> >> Error Message:
> >>
> >>
> >> Stack Trace:
> >> java.lang.NullPointerException
> >>      at __randomizedtesting.SeedInfo.seed([3127684F1AE08B61:AA78F492392B81D2]:0)
> >>      at org.apache.solr.core.TestLazyCores.testLazyLoad(TestLazyCores.java:92)
> >>      at sun.reflect.NativeMethodAccessorImpl.invoke0(Native Method)
> >>      at sun.reflect.NativeMethodAccessorImpl.invoke(NativeMethodAccessorImpl.java:57)
> >>      at sun.reflect.DelegatingMethodAccessorImpl.invoke(DelegatingMethodAccessorImpl.java:43)
> >>      at java.lang.reflect.Method.invoke(Method.java:601)
> >>      at com.carrotsearch.randomizedtesting.RandomizedRunner.invoke(RandomizedRunner.java:1559)
> >>      at com.carrotsearch.randomizedtesting.RandomizedRunner.access$600(RandomizedRunner.java:79)
> >>      at com.carrotsearch.randomizedtesting.RandomizedRunner$6.evaluate(RandomizedRunner.java:737)
> >>      at com.carrotsearch.randomizedtesting.RandomizedRunner$7.evaluate(RandomizedRunner.java:773)
> >>      at com.carrotsearch.randomizedtesting.RandomizedRunner$8.evaluate(RandomizedRunner.java:787)
> >>      at com.carrotsearch.randomizedtesting.rules.SystemPropertiesRestoreRule$1.evaluate(SystemPropertiesRestoreRule.java:53)
> >>      at org.apache.lucene.util.TestRuleSetupTeardownChained$1.evaluate(TestRuleSetupTeardownChained.java:50)
> >>      at org.apache.lucene.util.TestRuleFieldCacheSanity$1.evaluate(TestRuleFieldCacheSanity.java:51)
> >>      at org.apache.lucene.util.AbstractBeforeAfterRule$1.evaluate(AbstractBeforeAfterRule.java:45)
> >>      at com.carrotsearch.randomizedtesting.rules.SystemPropertiesInvariantRule$1.evaluate(SystemPropertiesInvariantRule.java:55)
> >>      at org.apache.lucene.util.TestRuleThreadAndTestName$1.evaluate(TestRuleThreadAndTestName.java:48)
> >>      at org.apache.lucene.util.TestRuleIgnoreAfterMaxFailures$1.evaluate(TestRuleIgnoreAfterMaxFailures.java:70)
> >>      at org.apache.lucene.util.TestRuleMarkFailure$1.evaluate(TestRuleMarkFailure.java:48)
> >>      at com.carrotsearch.randomizedtesting.rules.StatementAdapter.evaluate(StatementAdapter.java:36)
> >>      at com.carrotsearch.randomizedtesting.ThreadLeakControl$StatementRunner.run(ThreadLeakControl.java:358)
> >>      at com.carrotsearch.randomizedtesting.ThreadLeakControl.forkTimeoutingTask(ThreadLeakControl.java:782)
> >>      at com.carrotsearch.randomizedtesting.ThreadLeakControl$3.evaluate(ThreadLeakControl.java:442)
> >>      at com.carrotsearch.randomizedtesting.RandomizedRunner.runSingleTest(RandomizedRunner.java:746)
> >>      at com.carrotsearch.randomizedtesting.RandomizedRunner$3.evaluate(RandomizedRunner.java:648)
> >>      at com.carrotsearch.randomizedtesting.RandomizedRunner$4.evaluate(RandomizedRunner.java:682)
> >>      at com.carrotsearch.randomizedtesting.RandomizedRunner$5.evaluate(RandomizedRunner.java:693)
> >>      at com.carrotsearch.randomizedtesting.rules.StatementAdapter.evaluate(StatementAdapter.java:36)
> >>      at com.carrotsearch.randomizedtesting.rules.SystemPropertiesRestoreRule$1.evaluate(SystemPropertiesRestoreRule.java:53)
> >>      at org.apache.lucene.util.AbstractBeforeAfterRule$1.evaluate(AbstractBeforeAfterRule.java:45)
> >>      at org.apache.lucene.util.TestRuleStoreClassName$1.evaluate(TestRuleStoreClassName.java:42)
> >>      at com.carrotsearch.randomizedtesting.rules.SystemPropertiesInvariantRule$1.evaluate(SystemPropertiesInvariantRule.java:55)
> >>      at com.carrotsearch.randomizedtesting.rules.NoShadowingOrOverridesOnMethodsRule$1.evaluate(NoShadowingOrOverridesOnMethodsRule.java:39)
> >>      at com.carrotsearch.randomizedtesting.rules.NoShadowingOrOverridesOnMethodsRule$1.evaluate(NoShadowingOrOverridesOnMethodsRule.java:39)
> >>      at com.carrotsearch.randomizedtesting.rules.StatementAdapter.evaluate(StatementAdapter.java:36)
> >>      at org.apache.lucene.util.TestRuleAssertionsRequired$1.evaluate(TestRuleAssertionsRequired.java:43)
> >>      at org.apache.lucene.util.TestRuleMarkFailure$1.evaluate(TestRuleMarkFailure.java:48)
> >>      at org.apache.lucene.util.TestRuleIgnoreAfterMaxFailures$1.evaluate(TestRuleIgnoreAfterMaxFailures.java:70)
> >>      at org.apache.lucene.util.TestRuleIgnoreTestSuites$1.evaluate(TestRuleIgnoreTestSuites.java:55)
> >>      at com.carrotsearch.randomizedtesting.rules.StatementAdapter.evaluate(StatementAdapter.java:36)
> >>      at com.carrotsearch.randomizedtesting.ThreadLeakControl$StatementRunner.run(ThreadLeakControl.java:358)
> >>      at java.lang.Thread.run(Thread.java:722)
> >>
> >>
> >
>
>
> ---------------------------------------------------------------------
> To unsubscribe, e-mail: [hidden email]
> For additional commands, e-mail: [hidden email]
>
>


---------------------------------------------------------------------
To unsubscribe, e-mail: [hidden email]
For additional commands, e-mail: [hidden email]