Solr nightly build failure

classic Classic list List threaded Threaded
4 messages Options
Reply | Threaded
Open this post in threaded view
|

Solr nightly build failure

Solr - Dev mailing list

init-forrest-entities:
    [mkdir] Created dir: /tmp/apache-solr-nightly/build

compile-common:
    [mkdir] Created dir: /tmp/apache-solr-nightly/build/common
    [javac] Compiling 31 source files to /tmp/apache-solr-nightly/build/common
    [javac] Note: Some input files use unchecked or unsafe operations.
    [javac] Note: Recompile with -Xlint:unchecked for details.

compile:
    [mkdir] Created dir: /tmp/apache-solr-nightly/build/core
    [javac] Compiling 310 source files to /tmp/apache-solr-nightly/build/core
    [javac] Note: Some input files use or override a deprecated API.
    [javac] Note: Recompile with -Xlint:deprecation for details.
    [javac] Note: Some input files use unchecked or unsafe operations.
    [javac] Note: Recompile with -Xlint:unchecked for details.

compile-solrj-core:
    [mkdir] Created dir: /tmp/apache-solr-nightly/build/client/solrj
    [javac] Compiling 22 source files to /tmp/apache-solr-nightly/build/client/solrj
    [javac] Note: /tmp/apache-solr-nightly/client/java/solrj/src/org/apache/solr/client/solrj/impl/CommonsHttpSolrServer.java uses or overrides a deprecated API.
    [javac] Note: Recompile with -Xlint:deprecation for details.

compile-solrj:
    [javac] Compiling 2 source files to /tmp/apache-solr-nightly/build/client/solrj

compileTests:
    [mkdir] Created dir: /tmp/apache-solr-nightly/build/tests
    [javac] Compiling 88 source files to /tmp/apache-solr-nightly/build/tests
    [javac] Note: Some input files use or override a deprecated API.
    [javac] Note: Recompile with -Xlint:deprecation for details.
    [javac] Note: Some input files use unchecked or unsafe operations.
    [javac] Note: Recompile with -Xlint:unchecked for details.

junit:
    [mkdir] Created dir: /tmp/apache-solr-nightly/build/test-results
    [junit] Running org.apache.solr.BasicFunctionalityTest
    [junit] Tests run: 25, Failures: 0, Errors: 0, Time elapsed: 74.547 sec
    [junit] Running org.apache.solr.ConvertedLegacyTest
    [junit] Tests run: 1, Failures: 0, Errors: 0, Time elapsed: 21.352 sec
    [junit] Running org.apache.solr.DisMaxRequestHandlerTest
    [junit] Tests run: 3, Failures: 0, Errors: 0, Time elapsed: 11.936 sec
    [junit] Running org.apache.solr.EchoParamsTest
    [junit] Tests run: 4, Failures: 0, Errors: 0, Time elapsed: 5.45 sec
    [junit] Running org.apache.solr.OutputWriterTest
    [junit] Tests run: 3, Failures: 0, Errors: 0, Time elapsed: 8.997 sec
    [junit] Running org.apache.solr.SampleTest
    [junit] Tests run: 2, Failures: 0, Errors: 0, Time elapsed: 6.942 sec
    [junit] Running org.apache.solr.TestDistributedSearch
    [junit] Tests run: 1, Failures: 0, Errors: 0, Time elapsed: 43.633 sec
    [junit] 2008-03-26 17:21:35.765::INFO:  Shutdown hook executing
    [junit] 2008-03-26 17:21:35.766::INFO:  Shutdown hook complete
    [junit] 2008-03-26 17:21:36.775::INFO:  Shutdown hook complete
    [junit] 2008-03-26 17:21:37.784::INFO:  Shutdown hook complete
    [junit] 2008-03-26 17:21:38.845::INFO:  Shutdown hook complete
    [junit] 2008-03-26 17:21:39.854::INFO:  Shutdown hook complete
    [junit] 2008-03-26 17:21:40.974::INFO:  Shutdown hook complete
    [junit] 2008-03-26 17:21:41.984::INFO:  Shutdown hook complete
    [junit] 2008-03-26 17:21:42.994::INFO:  Shutdown hook complete
    [junit] 2008-03-26 17:21:44.004::INFO:  Shutdown hook complete
    [junit] Running org.apache.solr.analysis.HTMLStripReaderTest
    [junit] Tests run: 9, Failures: 0, Errors: 0, Time elapsed: 0.748 sec
    [junit] Running org.apache.solr.analysis.TestBufferedTokenStream
    [junit] Tests run: 2, Failures: 0, Errors: 0, Time elapsed: 2.99 sec
    [junit] Running org.apache.solr.analysis.TestCapitalizationFilter
    [junit] Tests run: 2, Failures: 0, Errors: 0, Time elapsed: 2.875 sec
    [junit] Running org.apache.solr.analysis.TestHyphenatedWordsFilter
    [junit] Tests run: 1, Failures: 0, Errors: 0, Time elapsed: 0.852 sec
    [junit] Running org.apache.solr.analysis.TestKeepWordFilter
    [junit] Tests run: 1, Failures: 0, Errors: 0, Time elapsed: 3.225 sec
    [junit] Running org.apache.solr.analysis.TestPatternReplaceFilter
    [junit] Tests run: 5, Failures: 0, Errors: 0, Time elapsed: 2.01 sec
    [junit] Running org.apache.solr.analysis.TestPatternTokenizerFactory
    [junit] Tests run: 1, Failures: 0, Errors: 0, Time elapsed: 1.484 sec
    [junit] Running org.apache.solr.analysis.TestPhoneticFilter
    [junit] Tests run: 2, Failures: 0, Errors: 0, Time elapsed: 3.167 sec
    [junit] Running org.apache.solr.analysis.TestRemoveDuplicatesTokenFilter
    [junit] Tests run: 3, Failures: 0, Errors: 0, Time elapsed: 3.404 sec
    [junit] Running org.apache.solr.analysis.TestSynonymFilter
    [junit] Tests run: 7, Failures: 0, Errors: 0, Time elapsed: 2.631 sec
    [junit] Running org.apache.solr.analysis.TestTrimFilter
    [junit] Tests run: 1, Failures: 0, Errors: 0, Time elapsed: 1.51 sec
    [junit] Running org.apache.solr.analysis.TestWordDelimiterFilter
    [junit] Tests run: 4, Failures: 0, Errors: 0, Time elapsed: 26.979 sec
    [junit] Running org.apache.solr.common.SolrDocumentTest
    [junit] Tests run: 4, Failures: 0, Errors: 0, Time elapsed: 0.287 sec
    [junit] Running org.apache.solr.common.params.SolrParamTest
    [junit] Tests run: 1, Failures: 0, Errors: 0, Time elapsed: 0.294 sec
    [junit] Running org.apache.solr.common.util.ContentStreamTest
    [junit] Tests run: 3, Failures: 0, Errors: 0, Time elapsed: 1.873 sec
    [junit] Running org.apache.solr.common.util.IteratorChainTest
    [junit] Tests run: 7, Failures: 0, Errors: 0, Time elapsed: 0.282 sec
    [junit] Running org.apache.solr.common.util.TestXMLEscaping
    [junit] Tests run: 7, Failures: 0, Errors: 0, Time elapsed: 0.309 sec
    [junit] Running org.apache.solr.core.RequestHandlersTest
    [junit] Tests run: 2, Failures: 0, Errors: 0, Time elapsed: 8.911 sec
    [junit] Running org.apache.solr.core.ResourceLoaderTest
    [junit] Tests run: 2, Failures: 0, Errors: 0, Time elapsed: 0.602 sec
    [junit] Running org.apache.solr.core.SolrCoreTest
    [junit] Tests run: 1, Failures: 0, Errors: 0, Time elapsed: 6.103 sec
    [junit] Running org.apache.solr.core.TestBadConfig
    [junit] Tests run: 1, Failures: 0, Errors: 0, Time elapsed: 0.398 sec
    [junit] Running org.apache.solr.core.TestConfig
    [junit] Tests run: 2, Failures: 0, Errors: 0, Time elapsed: 11.937 sec
    [junit] Running org.apache.solr.core.TestQuerySenderListener
    [junit] Tests run: 1, Failures: 0, Errors: 0, Time elapsed: 7.101 sec
    [junit] Running org.apache.solr.handler.AnalysisRequestHandlerTest
    [junit] Tests run: 1, Failures: 0, Errors: 0, Time elapsed: 5.241 sec
    [junit] Running org.apache.solr.handler.MoreLikeThisHandlerTest
    [junit] Tests run: 1, Failures: 0, Errors: 0, Time elapsed: 5.394 sec
    [junit] Running org.apache.solr.handler.SpellCheckerRequestHandlerTest
    [junit] Tests run: 5, Failures: 0, Errors: 0, Time elapsed: 16.611 sec
    [junit] Running org.apache.solr.handler.StandardRequestHandlerTest
    [junit] Tests run: 1, Failures: 0, Errors: 0, Time elapsed: 6.678 sec
    [junit] Running org.apache.solr.handler.TestCSVLoader
    [junit] Tests run: 4, Failures: 0, Errors: 0, Time elapsed: 18.965 sec
    [junit] Running org.apache.solr.handler.XmlUpdateRequestHandlerTest
    [junit] Tests run: 1, Failures: 0, Errors: 0, Time elapsed: 6.701 sec
    [junit] Running org.apache.solr.handler.admin.SystemInfoHandlerTest
    [junit] Tests run: 1, Failures: 0, Errors: 0, Time elapsed: 0.473 sec
    [junit] Running org.apache.solr.handler.component.QueryElevationComponentTest
    [junit] Tests run: 3, Failures: 0, Errors: 0, Time elapsed: 17.024 sec
    [junit] Running org.apache.solr.handler.component.SearchHandlerTest
    [junit] Tests run: 1, Failures: 0, Errors: 0, Time elapsed: 4.562 sec
    [junit] Running org.apache.solr.highlight.HighlighterConfigTest
    [junit] Tests run: 1, Failures: 0, Errors: 0, Time elapsed: 7.201 sec
    [junit] Running org.apache.solr.highlight.HighlighterTest
    [junit] Tests run: 15, Failures: 0, Errors: 0, Time elapsed: 33.012 sec
    [junit] Running org.apache.solr.request.JSONWriterTest
    [junit] Tests run: 1, Failures: 0, Errors: 0, Time elapsed: 6.031 sec
    [junit] Running org.apache.solr.schema.BadIndexSchemaTest
    [junit] Tests run: 1, Failures: 0, Errors: 0, Time elapsed: 1.842 sec
    [junit] Running org.apache.solr.schema.IndexSchemaTest
    [junit] Tests run: 1, Failures: 0, Errors: 0, Time elapsed: 4.068 sec
    [junit] Running org.apache.solr.schema.NotRequiredUniqueKeyTest
    [junit] Tests run: 1, Failures: 0, Errors: 0, Time elapsed: 1.783 sec
    [junit] Running org.apache.solr.schema.RequiredFieldsTest
    [junit] Tests run: 3, Failures: 0, Errors: 0, Time elapsed: 10.706 sec
    [junit] Running org.apache.solr.schema.UUIDFieldTest
    [junit] Tests run: 1, Failures: 0, Errors: 0, Time elapsed: 0.911 sec
    [junit] Running org.apache.solr.search.TestDocSet
    [junit] Tests run: 1, Failures: 0, Errors: 0, Time elapsed: 1.087 sec
    [junit] Running org.apache.solr.search.TestQueryTypes
    [junit] Tests run: 1, Failures: 0, Errors: 0, Time elapsed: 3.394 sec
    [junit] Running org.apache.solr.search.TestQueryUtils
    [junit] Tests run: 1, Failures: 0, Errors: 0, Time elapsed: 4.145 sec
    [junit] Running org.apache.solr.search.function.TestFunctionQuery
    [junit] Tests run: 2, Failures: 0, Errors: 0, Time elapsed: 9.233 sec
    [junit] Running org.apache.solr.servlet.CacheHeaderTest
    [junit] Tests run: 3, Failures: 0, Errors: 0, Time elapsed: 11.835 sec
    [junit] 2008-03-26 17:38:09.948::INFO:  Shutdown hook executing
    [junit] 2008-03-26 17:38:09.956::INFO:  Shutdown hook complete
    [junit] 2008-03-26 17:38:10.974::INFO:  Shutdown hook complete
    [junit] 2008-03-26 17:38:11.974::INFO:  Shutdown hook complete
    [junit] Running org.apache.solr.servlet.DirectSolrConnectionTest
    [junit] Tests run: 2, Failures: 0, Errors: 0, Time elapsed: 1.825 sec
    [junit] Running org.apache.solr.servlet.NoCacheHeaderTest
    [junit] Tests run: 3, Failures: 0, Errors: 0, Time elapsed: 1,615.864 sec
    [junit] 2008-03-26 18:05:13.439::INFO:  Shutdown hook executing
    [junit] 2008-03-26 18:05:13.439::INFO:  Shutdown hook complete
    [junit] 2008-03-26 18:05:14.669::INFO:  Shutdown hook complete
    [junit] 2008-03-26 18:05:15.671::INFO:  Shutdown hook complete
    [junit] Running org.apache.solr.servlet.SolrRequestParserTest
    [junit] Tests run: 4, Failures: 0, Errors: 0, Time elapsed: 13.118 sec
    [junit] Running org.apache.solr.update.AutoCommitTest
    [junit] Tests run: 3, Failures: 0, Errors: 0, Time elapsed: 15.993 sec
    [junit] Running org.apache.solr.update.DirectUpdateHandlerTest
    [junit] Tests run: 1, Failures: 0, Errors: 0, Time elapsed: 3.165 sec
    [junit] Running org.apache.solr.update.DocumentBuilderTest
    [junit] Tests run: 2, Failures: 0, Errors: 0, Time elapsed: 9.896 sec
    [junit] Running org.apache.solr.update.processor.UpdateRequestProcessorFactoryTest
    [junit] Tests run: 1, Failures: 0, Errors: 0, Time elapsed: 3.423 sec
    [junit] Running org.apache.solr.util.DateMathParserTest
    [junit] Tests run: 7, Failures: 0, Errors: 0, Time elapsed: 0.528 sec
    [junit] Running org.apache.solr.util.SolrPluginUtilsTest
    [junit] Tests run: 5, Failures: 0, Errors: 0, Time elapsed: 10.554 sec
    [junit] Running org.apache.solr.util.TestCharArrayMap
    [junit] Tests run: 2, Failures: 0, Errors: 0, Time elapsed: 0.662 sec
    [junit] Running org.apache.solr.util.TestOpenBitSet
    [junit] Tests run: 3, Failures: 0, Errors: 0, Time elapsed: 3.68 sec
    [junit] Running org.apache.solr.util.TestUtils
    [junit] Tests run: 1, Failures: 0, Errors: 0, Time elapsed: 0.373 sec
    [junit] Running org.apache.solr.client.solrj.SolrExceptionTest
    [junit] Tests run: 1, Failures: 0, Errors: 0, Time elapsed: 1.141 sec
    [junit] Running org.apache.solr.client.solrj.SolrQueryTest
    [junit] Tests run: 1, Failures: 0, Errors: 0, Time elapsed: 1.334 sec
    [junit] Running org.apache.solr.client.solrj.embedded.JettyWebappTest
    [junit] Tests run: 1, Failures: 0, Errors: 0, Time elapsed: 10.097 sec
    [junit] 2008-03-26 18:07:26.523::INFO:  Shutdown hook executing
    [junit] 2008-03-26 18:07:27.829::INFO:  Shutdown hook complete
    [junit] Running org.apache.solr.client.solrj.embedded.LargeVolumeEmbeddedTest
    [junit] Tests run: 1, Failures: 0, Errors: 0, Time elapsed: 6.041 sec
    [junit] Running org.apache.solr.client.solrj.embedded.LargeVolumeJettyTest
    [junit] Tests run: 1, Failures: 0, Errors: 0, Time elapsed: 13.827 sec
    [junit] 2008-03-26 18:07:56.854::INFO:  Shutdown hook executing
    [junit] 2008-03-26 18:07:56.854::INFO:  Shutdown hook complete
    [junit] Running org.apache.solr.client.solrj.embedded.MultiCoreEmbeddedTest
    [junit] Tests run: 1, Failures: 0, Errors: 0, Time elapsed: 2.202 sec
    [junit] Running org.apache.solr.client.solrj.embedded.MultiCoreExampleJettyTest
    [junit] Tests run: 1, Failures: 0, Errors: 0, Time elapsed: 9.645 sec
    [junit] 2008-03-26 18:08:25.805::INFO:  Shutdown hook executing
    [junit] 2008-03-26 18:08:25.806::INFO:  Shutdown hook complete
    [junit] Running org.apache.solr.client.solrj.embedded.SolrExampleEmbeddedTest
    [junit] Tests run: 6, Failures: 0, Errors: 0, Time elapsed: 11.091 sec
    [junit] Running org.apache.solr.client.solrj.embedded.SolrExampleJettyTest
    [junit] Tests run: 6, Failures: 0, Errors: 0, Time elapsed: 36.008 sec
    [junit] 2008-03-26 18:09:19.466::INFO:  Shutdown hook executing
    [junit] 2008-03-26 18:09:19.466::INFO:  Shutdown hook complete
    [junit] 2008-03-26 18:09:20.472::INFO:  Shutdown hook complete
    [junit] 2008-03-26 18:09:21.513::INFO:  Shutdown hook complete
    [junit] 2008-03-26 18:09:22.575::INFO:  Shutdown hook complete
    [junit] 2008-03-26 18:09:23.582::INFO:  Shutdown hook complete
    [junit] 2008-03-26 18:09:24.592::INFO:  Shutdown hook complete
    [junit] Running org.apache.solr.client.solrj.response.QueryResponseTest
    [junit] Tests run: 1, Failures: 1, Errors: 0, Time elapsed: 0.367 sec
    [junit] Test org.apache.solr.client.solrj.response.QueryResponseTest FAILED
    [junit] Running org.apache.solr.client.solrj.util.ClientUtilsTest
    [junit] Tests run: 1, Failures: 0, Errors: 0, Time elapsed: 0.327 sec

BUILD FAILED
/tmp/apache-solr-nightly/build.xml:498: Tests failed!

Total time: 51 minutes 26 seconds


Reply | Threaded
Open this post in threaded view
|

Re: Solr nightly build failure

Yonik Seeley-2
OK... another try.  I updated to Ant 1.7 for the heck of it, and
didn't put junit in it's lib since Solr as one in it's lib now.

-Yonik

On Wed, Mar 26, 2008 at 2:09 PM,  <[hidden email]> wrote:

>
>  init-forrest-entities:
>     [mkdir] Created dir: /tmp/apache-solr-nightly/build
>
>  compile-common:
>     [mkdir] Created dir: /tmp/apache-solr-nightly/build/common
>     [javac] Compiling 31 source files to /tmp/apache-solr-nightly/build/common
>     [javac] Note: Some input files use unchecked or unsafe operations.
>     [javac] Note: Recompile with -Xlint:unchecked for details.
>
>  compile:
>     [mkdir] Created dir: /tmp/apache-solr-nightly/build/core
>     [javac] Compiling 310 source files to /tmp/apache-solr-nightly/build/core
>     [javac] Note: Some input files use or override a deprecated API.
>     [javac] Note: Recompile with -Xlint:deprecation for details.
>     [javac] Note: Some input files use unchecked or unsafe operations.
>     [javac] Note: Recompile with -Xlint:unchecked for details.
>
>  compile-solrj-core:
>     [mkdir] Created dir: /tmp/apache-solr-nightly/build/client/solrj
>     [javac] Compiling 22 source files to /tmp/apache-solr-nightly/build/client/solrj
>     [javac] Note: /tmp/apache-solr-nightly/client/java/solrj/src/org/apache/solr/client/solrj/impl/CommonsHttpSolrServer.java uses or overrides a deprecated API.
>     [javac] Note: Recompile with -Xlint:deprecation for details.
>
>  compile-solrj:
>     [javac] Compiling 2 source files to /tmp/apache-solr-nightly/build/client/solrj
>
>  compileTests:
>     [mkdir] Created dir: /tmp/apache-solr-nightly/build/tests
>     [javac] Compiling 88 source files to /tmp/apache-solr-nightly/build/tests
>     [javac] Note: Some input files use or override a deprecated API.
>     [javac] Note: Recompile with -Xlint:deprecation for details.
>     [javac] Note: Some input files use unchecked or unsafe operations.
>     [javac] Note: Recompile with -Xlint:unchecked for details.
>
>  junit:
>     [mkdir] Created dir: /tmp/apache-solr-nightly/build/test-results
>     [junit] Running org.apache.solr.BasicFunctionalityTest
>     [junit] Tests run: 25, Failures: 0, Errors: 0, Time elapsed: 74.547 sec
>     [junit] Running org.apache.solr.ConvertedLegacyTest
>     [junit] Tests run: 1, Failures: 0, Errors: 0, Time elapsed: 21.352 sec
>     [junit] Running org.apache.solr.DisMaxRequestHandlerTest
>     [junit] Tests run: 3, Failures: 0, Errors: 0, Time elapsed: 11.936 sec
>     [junit] Running org.apache.solr.EchoParamsTest
>     [junit] Tests run: 4, Failures: 0, Errors: 0, Time elapsed: 5.45 sec
>     [junit] Running org.apache.solr.OutputWriterTest
>     [junit] Tests run: 3, Failures: 0, Errors: 0, Time elapsed: 8.997 sec
>     [junit] Running org.apache.solr.SampleTest
>     [junit] Tests run: 2, Failures: 0, Errors: 0, Time elapsed: 6.942 sec
>     [junit] Running org.apache.solr.TestDistributedSearch
>     [junit] Tests run: 1, Failures: 0, Errors: 0, Time elapsed: 43.633 sec
>     [junit] 2008-03-26 17:21:35.765::INFO:  Shutdown hook executing
>     [junit] 2008-03-26 17:21:35.766::INFO:  Shutdown hook complete
>     [junit] 2008-03-26 17:21:36.775::INFO:  Shutdown hook complete
>     [junit] 2008-03-26 17:21:37.784::INFO:  Shutdown hook complete
>     [junit] 2008-03-26 17:21:38.845::INFO:  Shutdown hook complete
>     [junit] 2008-03-26 17:21:39.854::INFO:  Shutdown hook complete
>     [junit] 2008-03-26 17:21:40.974::INFO:  Shutdown hook complete
>     [junit] 2008-03-26 17:21:41.984::INFO:  Shutdown hook complete
>     [junit] 2008-03-26 17:21:42.994::INFO:  Shutdown hook complete
>     [junit] 2008-03-26 17:21:44.004::INFO:  Shutdown hook complete
>     [junit] Running org.apache.solr.analysis.HTMLStripReaderTest
>     [junit] Tests run: 9, Failures: 0, Errors: 0, Time elapsed: 0.748 sec
>     [junit] Running org.apache.solr.analysis.TestBufferedTokenStream
>     [junit] Tests run: 2, Failures: 0, Errors: 0, Time elapsed: 2.99 sec
>     [junit] Running org.apache.solr.analysis.TestCapitalizationFilter
>     [junit] Tests run: 2, Failures: 0, Errors: 0, Time elapsed: 2.875 sec
>     [junit] Running org.apache.solr.analysis.TestHyphenatedWordsFilter
>     [junit] Tests run: 1, Failures: 0, Errors: 0, Time elapsed: 0.852 sec
>     [junit] Running org.apache.solr.analysis.TestKeepWordFilter
>     [junit] Tests run: 1, Failures: 0, Errors: 0, Time elapsed: 3.225 sec
>     [junit] Running org.apache.solr.analysis.TestPatternReplaceFilter
>     [junit] Tests run: 5, Failures: 0, Errors: 0, Time elapsed: 2.01 sec
>     [junit] Running org.apache.solr.analysis.TestPatternTokenizerFactory
>     [junit] Tests run: 1, Failures: 0, Errors: 0, Time elapsed: 1.484 sec
>     [junit] Running org.apache.solr.analysis.TestPhoneticFilter
>     [junit] Tests run: 2, Failures: 0, Errors: 0, Time elapsed: 3.167 sec
>     [junit] Running org.apache.solr.analysis.TestRemoveDuplicatesTokenFilter
>     [junit] Tests run: 3, Failures: 0, Errors: 0, Time elapsed: 3.404 sec
>     [junit] Running org.apache.solr.analysis.TestSynonymFilter
>     [junit] Tests run: 7, Failures: 0, Errors: 0, Time elapsed: 2.631 sec
>     [junit] Running org.apache.solr.analysis.TestTrimFilter
>     [junit] Tests run: 1, Failures: 0, Errors: 0, Time elapsed: 1.51 sec
>     [junit] Running org.apache.solr.analysis.TestWordDelimiterFilter
>     [junit] Tests run: 4, Failures: 0, Errors: 0, Time elapsed: 26.979 sec
>     [junit] Running org.apache.solr.common.SolrDocumentTest
>     [junit] Tests run: 4, Failures: 0, Errors: 0, Time elapsed: 0.287 sec
>     [junit] Running org.apache.solr.common.params.SolrParamTest
>     [junit] Tests run: 1, Failures: 0, Errors: 0, Time elapsed: 0.294 sec
>     [junit] Running org.apache.solr.common.util.ContentStreamTest
>     [junit] Tests run: 3, Failures: 0, Errors: 0, Time elapsed: 1.873 sec
>     [junit] Running org.apache.solr.common.util.IteratorChainTest
>     [junit] Tests run: 7, Failures: 0, Errors: 0, Time elapsed: 0.282 sec
>     [junit] Running org.apache.solr.common.util.TestXMLEscaping
>     [junit] Tests run: 7, Failures: 0, Errors: 0, Time elapsed: 0.309 sec
>     [junit] Running org.apache.solr.core.RequestHandlersTest
>     [junit] Tests run: 2, Failures: 0, Errors: 0, Time elapsed: 8.911 sec
>     [junit] Running org.apache.solr.core.ResourceLoaderTest
>     [junit] Tests run: 2, Failures: 0, Errors: 0, Time elapsed: 0.602 sec
>     [junit] Running org.apache.solr.core.SolrCoreTest
>     [junit] Tests run: 1, Failures: 0, Errors: 0, Time elapsed: 6.103 sec
>     [junit] Running org.apache.solr.core.TestBadConfig
>     [junit] Tests run: 1, Failures: 0, Errors: 0, Time elapsed: 0.398 sec
>     [junit] Running org.apache.solr.core.TestConfig
>     [junit] Tests run: 2, Failures: 0, Errors: 0, Time elapsed: 11.937 sec
>     [junit] Running org.apache.solr.core.TestQuerySenderListener
>     [junit] Tests run: 1, Failures: 0, Errors: 0, Time elapsed: 7.101 sec
>     [junit] Running org.apache.solr.handler.AnalysisRequestHandlerTest
>     [junit] Tests run: 1, Failures: 0, Errors: 0, Time elapsed: 5.241 sec
>     [junit] Running org.apache.solr.handler.MoreLikeThisHandlerTest
>     [junit] Tests run: 1, Failures: 0, Errors: 0, Time elapsed: 5.394 sec
>     [junit] Running org.apache.solr.handler.SpellCheckerRequestHandlerTest
>     [junit] Tests run: 5, Failures: 0, Errors: 0, Time elapsed: 16.611 sec
>     [junit] Running org.apache.solr.handler.StandardRequestHandlerTest
>     [junit] Tests run: 1, Failures: 0, Errors: 0, Time elapsed: 6.678 sec
>     [junit] Running org.apache.solr.handler.TestCSVLoader
>     [junit] Tests run: 4, Failures: 0, Errors: 0, Time elapsed: 18.965 sec
>     [junit] Running org.apache.solr.handler.XmlUpdateRequestHandlerTest
>     [junit] Tests run: 1, Failures: 0, Errors: 0, Time elapsed: 6.701 sec
>     [junit] Running org.apache.solr.handler.admin.SystemInfoHandlerTest
>     [junit] Tests run: 1, Failures: 0, Errors: 0, Time elapsed: 0.473 sec
>     [junit] Running org.apache.solr.handler.component.QueryElevationComponentTest
>     [junit] Tests run: 3, Failures: 0, Errors: 0, Time elapsed: 17.024 sec
>     [junit] Running org.apache.solr.handler.component.SearchHandlerTest
>     [junit] Tests run: 1, Failures: 0, Errors: 0, Time elapsed: 4.562 sec
>     [junit] Running org.apache.solr.highlight.HighlighterConfigTest
>     [junit] Tests run: 1, Failures: 0, Errors: 0, Time elapsed: 7.201 sec
>     [junit] Running org.apache.solr.highlight.HighlighterTest
>     [junit] Tests run: 15, Failures: 0, Errors: 0, Time elapsed: 33.012 sec
>     [junit] Running org.apache.solr.request.JSONWriterTest
>     [junit] Tests run: 1, Failures: 0, Errors: 0, Time elapsed: 6.031 sec
>     [junit] Running org.apache.solr.schema.BadIndexSchemaTest
>     [junit] Tests run: 1, Failures: 0, Errors: 0, Time elapsed: 1.842 sec
>     [junit] Running org.apache.solr.schema.IndexSchemaTest
>     [junit] Tests run: 1, Failures: 0, Errors: 0, Time elapsed: 4.068 sec
>     [junit] Running org.apache.solr.schema.NotRequiredUniqueKeyTest
>     [junit] Tests run: 1, Failures: 0, Errors: 0, Time elapsed: 1.783 sec
>     [junit] Running org.apache.solr.schema.RequiredFieldsTest
>     [junit] Tests run: 3, Failures: 0, Errors: 0, Time elapsed: 10.706 sec
>     [junit] Running org.apache.solr.schema.UUIDFieldTest
>     [junit] Tests run: 1, Failures: 0, Errors: 0, Time elapsed: 0.911 sec
>     [junit] Running org.apache.solr.search.TestDocSet
>     [junit] Tests run: 1, Failures: 0, Errors: 0, Time elapsed: 1.087 sec
>     [junit] Running org.apache.solr.search.TestQueryTypes
>     [junit] Tests run: 1, Failures: 0, Errors: 0, Time elapsed: 3.394 sec
>     [junit] Running org.apache.solr.search.TestQueryUtils
>     [junit] Tests run: 1, Failures: 0, Errors: 0, Time elapsed: 4.145 sec
>     [junit] Running org.apache.solr.search.function.TestFunctionQuery
>     [junit] Tests run: 2, Failures: 0, Errors: 0, Time elapsed: 9.233 sec
>     [junit] Running org.apache.solr.servlet.CacheHeaderTest
>     [junit] Tests run: 3, Failures: 0, Errors: 0, Time elapsed: 11.835 sec
>     [junit] 2008-03-26 17:38:09.948::INFO:  Shutdown hook executing
>     [junit] 2008-03-26 17:38:09.956::INFO:  Shutdown hook complete
>     [junit] 2008-03-26 17:38:10.974::INFO:  Shutdown hook complete
>     [junit] 2008-03-26 17:38:11.974::INFO:  Shutdown hook complete
>     [junit] Running org.apache.solr.servlet.DirectSolrConnectionTest
>     [junit] Tests run: 2, Failures: 0, Errors: 0, Time elapsed: 1.825 sec
>     [junit] Running org.apache.solr.servlet.NoCacheHeaderTest
>     [junit] Tests run: 3, Failures: 0, Errors: 0, Time elapsed: 1,615.864 sec
>     [junit] 2008-03-26 18:05:13.439::INFO:  Shutdown hook executing
>     [junit] 2008-03-26 18:05:13.439::INFO:  Shutdown hook complete
>     [junit] 2008-03-26 18:05:14.669::INFO:  Shutdown hook complete
>     [junit] 2008-03-26 18:05:15.671::INFO:  Shutdown hook complete
>     [junit] Running org.apache.solr.servlet.SolrRequestParserTest
>     [junit] Tests run: 4, Failures: 0, Errors: 0, Time elapsed: 13.118 sec
>     [junit] Running org.apache.solr.update.AutoCommitTest
>     [junit] Tests run: 3, Failures: 0, Errors: 0, Time elapsed: 15.993 sec
>     [junit] Running org.apache.solr.update.DirectUpdateHandlerTest
>     [junit] Tests run: 1, Failures: 0, Errors: 0, Time elapsed: 3.165 sec
>     [junit] Running org.apache.solr.update.DocumentBuilderTest
>     [junit] Tests run: 2, Failures: 0, Errors: 0, Time elapsed: 9.896 sec
>     [junit] Running org.apache.solr.update.processor.UpdateRequestProcessorFactoryTest
>     [junit] Tests run: 1, Failures: 0, Errors: 0, Time elapsed: 3.423 sec
>     [junit] Running org.apache.solr.util.DateMathParserTest
>     [junit] Tests run: 7, Failures: 0, Errors: 0, Time elapsed: 0.528 sec
>     [junit] Running org.apache.solr.util.SolrPluginUtilsTest
>     [junit] Tests run: 5, Failures: 0, Errors: 0, Time elapsed: 10.554 sec
>     [junit] Running org.apache.solr.util.TestCharArrayMap
>     [junit] Tests run: 2, Failures: 0, Errors: 0, Time elapsed: 0.662 sec
>     [junit] Running org.apache.solr.util.TestOpenBitSet
>     [junit] Tests run: 3, Failures: 0, Errors: 0, Time elapsed: 3.68 sec
>     [junit] Running org.apache.solr.util.TestUtils
>     [junit] Tests run: 1, Failures: 0, Errors: 0, Time elapsed: 0.373 sec
>     [junit] Running org.apache.solr.client.solrj.SolrExceptionTest
>     [junit] Tests run: 1, Failures: 0, Errors: 0, Time elapsed: 1.141 sec
>     [junit] Running org.apache.solr.client.solrj.SolrQueryTest
>     [junit] Tests run: 1, Failures: 0, Errors: 0, Time elapsed: 1.334 sec
>     [junit] Running org.apache.solr.client.solrj.embedded.JettyWebappTest
>     [junit] Tests run: 1, Failures: 0, Errors: 0, Time elapsed: 10.097 sec
>     [junit] 2008-03-26 18:07:26.523::INFO:  Shutdown hook executing
>     [junit] 2008-03-26 18:07:27.829::INFO:  Shutdown hook complete
>     [junit] Running org.apache.solr.client.solrj.embedded.LargeVolumeEmbeddedTest
>     [junit] Tests run: 1, Failures: 0, Errors: 0, Time elapsed: 6.041 sec
>     [junit] Running org.apache.solr.client.solrj.embedded.LargeVolumeJettyTest
>     [junit] Tests run: 1, Failures: 0, Errors: 0, Time elapsed: 13.827 sec
>     [junit] 2008-03-26 18:07:56.854::INFO:  Shutdown hook executing
>     [junit] 2008-03-26 18:07:56.854::INFO:  Shutdown hook complete
>     [junit] Running org.apache.solr.client.solrj.embedded.MultiCoreEmbeddedTest
>     [junit] Tests run: 1, Failures: 0, Errors: 0, Time elapsed: 2.202 sec
>     [junit] Running org.apache.solr.client.solrj.embedded.MultiCoreExampleJettyTest
>     [junit] Tests run: 1, Failures: 0, Errors: 0, Time elapsed: 9.645 sec
>     [junit] 2008-03-26 18:08:25.805::INFO:  Shutdown hook executing
>     [junit] 2008-03-26 18:08:25.806::INFO:  Shutdown hook complete
>     [junit] Running org.apache.solr.client.solrj.embedded.SolrExampleEmbeddedTest
>     [junit] Tests run: 6, Failures: 0, Errors: 0, Time elapsed: 11.091 sec
>     [junit] Running org.apache.solr.client.solrj.embedded.SolrExampleJettyTest
>     [junit] Tests run: 6, Failures: 0, Errors: 0, Time elapsed: 36.008 sec
>     [junit] 2008-03-26 18:09:19.466::INFO:  Shutdown hook executing
>     [junit] 2008-03-26 18:09:19.466::INFO:  Shutdown hook complete
>     [junit] 2008-03-26 18:09:20.472::INFO:  Shutdown hook complete
>     [junit] 2008-03-26 18:09:21.513::INFO:  Shutdown hook complete
>     [junit] 2008-03-26 18:09:22.575::INFO:  Shutdown hook complete
>     [junit] 2008-03-26 18:09:23.582::INFO:  Shutdown hook complete
>     [junit] 2008-03-26 18:09:24.592::INFO:  Shutdown hook complete
>     [junit] Running org.apache.solr.client.solrj.response.QueryResponseTest
>     [junit] Tests run: 1, Failures: 1, Errors: 0, Time elapsed: 0.367 sec
>     [junit] Test org.apache.solr.client.solrj.response.QueryResponseTest FAILED
>     [junit] Running org.apache.solr.client.solrj.util.ClientUtilsTest
>     [junit] Tests run: 1, Failures: 0, Errors: 0, Time elapsed: 0.327 sec
>
>  BUILD FAILED
>  /tmp/apache-solr-nightly/build.xml:498: Tests failed!
>
>  Total time: 51 minutes 26 seconds
>
>
>
Reply | Threaded
Open this post in threaded view
|

Re: Solr nightly build failure

Yonik Seeley-2
Yup, last try succeeded.

On Wed, Mar 26, 2008 at 2:24 PM, Yonik Seeley <[hidden email]> wrote:

> OK... another try.  I updated to Ant 1.7 for the heck of it, and
>  didn't put junit in it's lib since Solr as one in it's lib now.
>
>  -Yonik
>
>
>
>  On Wed, Mar 26, 2008 at 2:09 PM,  <[hidden email]> wrote:
>  >
>  >  init-forrest-entities:
>  >     [mkdir] Created dir: /tmp/apache-solr-nightly/build
>  >
>  >  compile-common:
>  >     [mkdir] Created dir: /tmp/apache-solr-nightly/build/common
>  >     [javac] Compiling 31 source files to /tmp/apache-solr-nightly/build/common
>  >     [javac] Note: Some input files use unchecked or unsafe operations.
>  >     [javac] Note: Recompile with -Xlint:unchecked for details.
>  >
>  >  compile:
>  >     [mkdir] Created dir: /tmp/apache-solr-nightly/build/core
>  >     [javac] Compiling 310 source files to /tmp/apache-solr-nightly/build/core
>  >     [javac] Note: Some input files use or override a deprecated API.
>  >     [javac] Note: Recompile with -Xlint:deprecation for details.
>  >     [javac] Note: Some input files use unchecked or unsafe operations.
>  >     [javac] Note: Recompile with -Xlint:unchecked for details.
>  >
>  >  compile-solrj-core:
>  >     [mkdir] Created dir: /tmp/apache-solr-nightly/build/client/solrj
>  >     [javac] Compiling 22 source files to /tmp/apache-solr-nightly/build/client/solrj
>  >     [javac] Note: /tmp/apache-solr-nightly/client/java/solrj/src/org/apache/solr/client/solrj/impl/CommonsHttpSolrServer.java uses or overrides a deprecated API.
>  >     [javac] Note: Recompile with -Xlint:deprecation for details.
>  >
>  >  compile-solrj:
>  >     [javac] Compiling 2 source files to /tmp/apache-solr-nightly/build/client/solrj
>  >
>  >  compileTests:
>  >     [mkdir] Created dir: /tmp/apache-solr-nightly/build/tests
>  >     [javac] Compiling 88 source files to /tmp/apache-solr-nightly/build/tests
>  >     [javac] Note: Some input files use or override a deprecated API.
>  >     [javac] Note: Recompile with -Xlint:deprecation for details.
>  >     [javac] Note: Some input files use unchecked or unsafe operations.
>  >     [javac] Note: Recompile with -Xlint:unchecked for details.
>  >
>  >  junit:
>  >     [mkdir] Created dir: /tmp/apache-solr-nightly/build/test-results
>  >     [junit] Running org.apache.solr.BasicFunctionalityTest
>  >     [junit] Tests run: 25, Failures: 0, Errors: 0, Time elapsed: 74.547 sec
>  >     [junit] Running org.apache.solr.ConvertedLegacyTest
>  >     [junit] Tests run: 1, Failures: 0, Errors: 0, Time elapsed: 21.352 sec
>  >     [junit] Running org.apache.solr.DisMaxRequestHandlerTest
>  >     [junit] Tests run: 3, Failures: 0, Errors: 0, Time elapsed: 11.936 sec
>  >     [junit] Running org.apache.solr.EchoParamsTest
>  >     [junit] Tests run: 4, Failures: 0, Errors: 0, Time elapsed: 5.45 sec
>  >     [junit] Running org.apache.solr.OutputWriterTest
>  >     [junit] Tests run: 3, Failures: 0, Errors: 0, Time elapsed: 8.997 sec
>  >     [junit] Running org.apache.solr.SampleTest
>  >     [junit] Tests run: 2, Failures: 0, Errors: 0, Time elapsed: 6.942 sec
>  >     [junit] Running org.apache.solr.TestDistributedSearch
>  >     [junit] Tests run: 1, Failures: 0, Errors: 0, Time elapsed: 43.633 sec
>  >     [junit] 2008-03-26 17:21:35.765::INFO:  Shutdown hook executing
>  >     [junit] 2008-03-26 17:21:35.766::INFO:  Shutdown hook complete
>  >     [junit] 2008-03-26 17:21:36.775::INFO:  Shutdown hook complete
>  >     [junit] 2008-03-26 17:21:37.784::INFO:  Shutdown hook complete
>  >     [junit] 2008-03-26 17:21:38.845::INFO:  Shutdown hook complete
>  >     [junit] 2008-03-26 17:21:39.854::INFO:  Shutdown hook complete
>  >     [junit] 2008-03-26 17:21:40.974::INFO:  Shutdown hook complete
>  >     [junit] 2008-03-26 17:21:41.984::INFO:  Shutdown hook complete
>  >     [junit] 2008-03-26 17:21:42.994::INFO:  Shutdown hook complete
>  >     [junit] 2008-03-26 17:21:44.004::INFO:  Shutdown hook complete
>  >     [junit] Running org.apache.solr.analysis.HTMLStripReaderTest
>  >     [junit] Tests run: 9, Failures: 0, Errors: 0, Time elapsed: 0.748 sec
>  >     [junit] Running org.apache.solr.analysis.TestBufferedTokenStream
>  >     [junit] Tests run: 2, Failures: 0, Errors: 0, Time elapsed: 2.99 sec
>  >     [junit] Running org.apache.solr.analysis.TestCapitalizationFilter
>  >     [junit] Tests run: 2, Failures: 0, Errors: 0, Time elapsed: 2.875 sec
>  >     [junit] Running org.apache.solr.analysis.TestHyphenatedWordsFilter
>  >     [junit] Tests run: 1, Failures: 0, Errors: 0, Time elapsed: 0.852 sec
>  >     [junit] Running org.apache.solr.analysis.TestKeepWordFilter
>  >     [junit] Tests run: 1, Failures: 0, Errors: 0, Time elapsed: 3.225 sec
>  >     [junit] Running org.apache.solr.analysis.TestPatternReplaceFilter
>  >     [junit] Tests run: 5, Failures: 0, Errors: 0, Time elapsed: 2.01 sec
>  >     [junit] Running org.apache.solr.analysis.TestPatternTokenizerFactory
>  >     [junit] Tests run: 1, Failures: 0, Errors: 0, Time elapsed: 1.484 sec
>  >     [junit] Running org.apache.solr.analysis.TestPhoneticFilter
>  >     [junit] Tests run: 2, Failures: 0, Errors: 0, Time elapsed: 3.167 sec
>  >     [junit] Running org.apache.solr.analysis.TestRemoveDuplicatesTokenFilter
>  >     [junit] Tests run: 3, Failures: 0, Errors: 0, Time elapsed: 3.404 sec
>  >     [junit] Running org.apache.solr.analysis.TestSynonymFilter
>  >     [junit] Tests run: 7, Failures: 0, Errors: 0, Time elapsed: 2.631 sec
>  >     [junit] Running org.apache.solr.analysis.TestTrimFilter
>  >     [junit] Tests run: 1, Failures: 0, Errors: 0, Time elapsed: 1.51 sec
>  >     [junit] Running org.apache.solr.analysis.TestWordDelimiterFilter
>  >     [junit] Tests run: 4, Failures: 0, Errors: 0, Time elapsed: 26.979 sec
>  >     [junit] Running org.apache.solr.common.SolrDocumentTest
>  >     [junit] Tests run: 4, Failures: 0, Errors: 0, Time elapsed: 0.287 sec
>  >     [junit] Running org.apache.solr.common.params.SolrParamTest
>  >     [junit] Tests run: 1, Failures: 0, Errors: 0, Time elapsed: 0.294 sec
>  >     [junit] Running org.apache.solr.common.util.ContentStreamTest
>  >     [junit] Tests run: 3, Failures: 0, Errors: 0, Time elapsed: 1.873 sec
>  >     [junit] Running org.apache.solr.common.util.IteratorChainTest
>  >     [junit] Tests run: 7, Failures: 0, Errors: 0, Time elapsed: 0.282 sec
>  >     [junit] Running org.apache.solr.common.util.TestXMLEscaping
>  >     [junit] Tests run: 7, Failures: 0, Errors: 0, Time elapsed: 0.309 sec
>  >     [junit] Running org.apache.solr.core.RequestHandlersTest
>  >     [junit] Tests run: 2, Failures: 0, Errors: 0, Time elapsed: 8.911 sec
>  >     [junit] Running org.apache.solr.core.ResourceLoaderTest
>  >     [junit] Tests run: 2, Failures: 0, Errors: 0, Time elapsed: 0.602 sec
>  >     [junit] Running org.apache.solr.core.SolrCoreTest
>  >     [junit] Tests run: 1, Failures: 0, Errors: 0, Time elapsed: 6.103 sec
>  >     [junit] Running org.apache.solr.core.TestBadConfig
>  >     [junit] Tests run: 1, Failures: 0, Errors: 0, Time elapsed: 0.398 sec
>  >     [junit] Running org.apache.solr.core.TestConfig
>  >     [junit] Tests run: 2, Failures: 0, Errors: 0, Time elapsed: 11.937 sec
>  >     [junit] Running org.apache.solr.core.TestQuerySenderListener
>  >     [junit] Tests run: 1, Failures: 0, Errors: 0, Time elapsed: 7.101 sec
>  >     [junit] Running org.apache.solr.handler.AnalysisRequestHandlerTest
>  >     [junit] Tests run: 1, Failures: 0, Errors: 0, Time elapsed: 5.241 sec
>  >     [junit] Running org.apache.solr.handler.MoreLikeThisHandlerTest
>  >     [junit] Tests run: 1, Failures: 0, Errors: 0, Time elapsed: 5.394 sec
>  >     [junit] Running org.apache.solr.handler.SpellCheckerRequestHandlerTest
>  >     [junit] Tests run: 5, Failures: 0, Errors: 0, Time elapsed: 16.611 sec
>  >     [junit] Running org.apache.solr.handler.StandardRequestHandlerTest
>  >     [junit] Tests run: 1, Failures: 0, Errors: 0, Time elapsed: 6.678 sec
>  >     [junit] Running org.apache.solr.handler.TestCSVLoader
>  >     [junit] Tests run: 4, Failures: 0, Errors: 0, Time elapsed: 18.965 sec
>  >     [junit] Running org.apache.solr.handler.XmlUpdateRequestHandlerTest
>  >     [junit] Tests run: 1, Failures: 0, Errors: 0, Time elapsed: 6.701 sec
>  >     [junit] Running org.apache.solr.handler.admin.SystemInfoHandlerTest
>  >     [junit] Tests run: 1, Failures: 0, Errors: 0, Time elapsed: 0.473 sec
>  >     [junit] Running org.apache.solr.handler.component.QueryElevationComponentTest
>  >     [junit] Tests run: 3, Failures: 0, Errors: 0, Time elapsed: 17.024 sec
>  >     [junit] Running org.apache.solr.handler.component.SearchHandlerTest
>  >     [junit] Tests run: 1, Failures: 0, Errors: 0, Time elapsed: 4.562 sec
>  >     [junit] Running org.apache.solr.highlight.HighlighterConfigTest
>  >     [junit] Tests run: 1, Failures: 0, Errors: 0, Time elapsed: 7.201 sec
>  >     [junit] Running org.apache.solr.highlight.HighlighterTest
>  >     [junit] Tests run: 15, Failures: 0, Errors: 0, Time elapsed: 33.012 sec
>  >     [junit] Running org.apache.solr.request.JSONWriterTest
>  >     [junit] Tests run: 1, Failures: 0, Errors: 0, Time elapsed: 6.031 sec
>  >     [junit] Running org.apache.solr.schema.BadIndexSchemaTest
>  >     [junit] Tests run: 1, Failures: 0, Errors: 0, Time elapsed: 1.842 sec
>  >     [junit] Running org.apache.solr.schema.IndexSchemaTest
>  >     [junit] Tests run: 1, Failures: 0, Errors: 0, Time elapsed: 4.068 sec
>  >     [junit] Running org.apache.solr.schema.NotRequiredUniqueKeyTest
>  >     [junit] Tests run: 1, Failures: 0, Errors: 0, Time elapsed: 1.783 sec
>  >     [junit] Running org.apache.solr.schema.RequiredFieldsTest
>  >     [junit] Tests run: 3, Failures: 0, Errors: 0, Time elapsed: 10.706 sec
>  >     [junit] Running org.apache.solr.schema.UUIDFieldTest
>  >     [junit] Tests run: 1, Failures: 0, Errors: 0, Time elapsed: 0.911 sec
>  >     [junit] Running org.apache.solr.search.TestDocSet
>  >     [junit] Tests run: 1, Failures: 0, Errors: 0, Time elapsed: 1.087 sec
>  >     [junit] Running org.apache.solr.search.TestQueryTypes
>  >     [junit] Tests run: 1, Failures: 0, Errors: 0, Time elapsed: 3.394 sec
>  >     [junit] Running org.apache.solr.search.TestQueryUtils
>  >     [junit] Tests run: 1, Failures: 0, Errors: 0, Time elapsed: 4.145 sec
>  >     [junit] Running org.apache.solr.search.function.TestFunctionQuery
>  >     [junit] Tests run: 2, Failures: 0, Errors: 0, Time elapsed: 9.233 sec
>  >     [junit] Running org.apache.solr.servlet.CacheHeaderTest
>  >     [junit] Tests run: 3, Failures: 0, Errors: 0, Time elapsed: 11.835 sec
>  >     [junit] 2008-03-26 17:38:09.948::INFO:  Shutdown hook executing
>  >     [junit] 2008-03-26 17:38:09.956::INFO:  Shutdown hook complete
>  >     [junit] 2008-03-26 17:38:10.974::INFO:  Shutdown hook complete
>  >     [junit] 2008-03-26 17:38:11.974::INFO:  Shutdown hook complete
>  >     [junit] Running org.apache.solr.servlet.DirectSolrConnectionTest
>  >     [junit] Tests run: 2, Failures: 0, Errors: 0, Time elapsed: 1.825 sec
>  >     [junit] Running org.apache.solr.servlet.NoCacheHeaderTest
>  >     [junit] Tests run: 3, Failures: 0, Errors: 0, Time elapsed: 1,615.864 sec
>  >     [junit] 2008-03-26 18:05:13.439::INFO:  Shutdown hook executing
>  >     [junit] 2008-03-26 18:05:13.439::INFO:  Shutdown hook complete
>  >     [junit] 2008-03-26 18:05:14.669::INFO:  Shutdown hook complete
>  >     [junit] 2008-03-26 18:05:15.671::INFO:  Shutdown hook complete
>  >     [junit] Running org.apache.solr.servlet.SolrRequestParserTest
>  >     [junit] Tests run: 4, Failures: 0, Errors: 0, Time elapsed: 13.118 sec
>  >     [junit] Running org.apache.solr.update.AutoCommitTest
>  >     [junit] Tests run: 3, Failures: 0, Errors: 0, Time elapsed: 15.993 sec
>  >     [junit] Running org.apache.solr.update.DirectUpdateHandlerTest
>  >     [junit] Tests run: 1, Failures: 0, Errors: 0, Time elapsed: 3.165 sec
>  >     [junit] Running org.apache.solr.update.DocumentBuilderTest
>  >     [junit] Tests run: 2, Failures: 0, Errors: 0, Time elapsed: 9.896 sec
>  >     [junit] Running org.apache.solr.update.processor.UpdateRequestProcessorFactoryTest
>  >     [junit] Tests run: 1, Failures: 0, Errors: 0, Time elapsed: 3.423 sec
>  >     [junit] Running org.apache.solr.util.DateMathParserTest
>  >     [junit] Tests run: 7, Failures: 0, Errors: 0, Time elapsed: 0.528 sec
>  >     [junit] Running org.apache.solr.util.SolrPluginUtilsTest
>  >     [junit] Tests run: 5, Failures: 0, Errors: 0, Time elapsed: 10.554 sec
>  >     [junit] Running org.apache.solr.util.TestCharArrayMap
>  >     [junit] Tests run: 2, Failures: 0, Errors: 0, Time elapsed: 0.662 sec
>  >     [junit] Running org.apache.solr.util.TestOpenBitSet
>  >     [junit] Tests run: 3, Failures: 0, Errors: 0, Time elapsed: 3.68 sec
>  >     [junit] Running org.apache.solr.util.TestUtils
>  >     [junit] Tests run: 1, Failures: 0, Errors: 0, Time elapsed: 0.373 sec
>  >     [junit] Running org.apache.solr.client.solrj.SolrExceptionTest
>  >     [junit] Tests run: 1, Failures: 0, Errors: 0, Time elapsed: 1.141 sec
>  >     [junit] Running org.apache.solr.client.solrj.SolrQueryTest
>  >     [junit] Tests run: 1, Failures: 0, Errors: 0, Time elapsed: 1.334 sec
>  >     [junit] Running org.apache.solr.client.solrj.embedded.JettyWebappTest
>  >     [junit] Tests run: 1, Failures: 0, Errors: 0, Time elapsed: 10.097 sec
>  >     [junit] 2008-03-26 18:07:26.523::INFO:  Shutdown hook executing
>  >     [junit] 2008-03-26 18:07:27.829::INFO:  Shutdown hook complete
>  >     [junit] Running org.apache.solr.client.solrj.embedded.LargeVolumeEmbeddedTest
>  >     [junit] Tests run: 1, Failures: 0, Errors: 0, Time elapsed: 6.041 sec
>  >     [junit] Running org.apache.solr.client.solrj.embedded.LargeVolumeJettyTest
>  >     [junit] Tests run: 1, Failures: 0, Errors: 0, Time elapsed: 13.827 sec
>  >     [junit] 2008-03-26 18:07:56.854::INFO:  Shutdown hook executing
>  >     [junit] 2008-03-26 18:07:56.854::INFO:  Shutdown hook complete
>  >     [junit] Running org.apache.solr.client.solrj.embedded.MultiCoreEmbeddedTest
>  >     [junit] Tests run: 1, Failures: 0, Errors: 0, Time elapsed: 2.202 sec
>  >     [junit] Running org.apache.solr.client.solrj.embedded.MultiCoreExampleJettyTest
>  >     [junit] Tests run: 1, Failures: 0, Errors: 0, Time elapsed: 9.645 sec
>  >     [junit] 2008-03-26 18:08:25.805::INFO:  Shutdown hook executing
>  >     [junit] 2008-03-26 18:08:25.806::INFO:  Shutdown hook complete
>  >     [junit] Running org.apache.solr.client.solrj.embedded.SolrExampleEmbeddedTest
>  >     [junit] Tests run: 6, Failures: 0, Errors: 0, Time elapsed: 11.091 sec
>  >     [junit] Running org.apache.solr.client.solrj.embedded.SolrExampleJettyTest
>  >     [junit] Tests run: 6, Failures: 0, Errors: 0, Time elapsed: 36.008 sec
>  >     [junit] 2008-03-26 18:09:19.466::INFO:  Shutdown hook executing
>  >     [junit] 2008-03-26 18:09:19.466::INFO:  Shutdown hook complete
>  >     [junit] 2008-03-26 18:09:20.472::INFO:  Shutdown hook complete
>  >     [junit] 2008-03-26 18:09:21.513::INFO:  Shutdown hook complete
>  >     [junit] 2008-03-26 18:09:22.575::INFO:  Shutdown hook complete
>  >     [junit] 2008-03-26 18:09:23.582::INFO:  Shutdown hook complete
>  >     [junit] 2008-03-26 18:09:24.592::INFO:  Shutdown hook complete
>  >     [junit] Running org.apache.solr.client.solrj.response.QueryResponseTest
>  >     [junit] Tests run: 1, Failures: 1, Errors: 0, Time elapsed: 0.367 sec
>  >     [junit] Test org.apache.solr.client.solrj.response.QueryResponseTest FAILED
>  >     [junit] Running org.apache.solr.client.solrj.util.ClientUtilsTest
>  >     [junit] Tests run: 1, Failures: 0, Errors: 0, Time elapsed: 0.327 sec
>  >
>  >  BUILD FAILED
>  >  /tmp/apache-solr-nightly/build.xml:498: Tests failed!
>  >
>  >  Total time: 51 minutes 26 seconds
>  >
>  >
>  >
>
Reply | Threaded
Open this post in threaded view
|

Re: Solr nightly build failure

hossman

: Yup, last try succeeded.

Cool .. thanx yonik (i completley missed seeing the change in test style)



-Hoss