Solr nightly build failure

classic Classic list List threaded Threaded
1 message Options
Reply | Threaded
Open this post in threaded view
|

Solr nightly build failure

Solr - Dev mailing list

init-forrest-entities:
    [mkdir] Created dir: /tmp/apache-solr-nightly/build

compile-common:
    [mkdir] Created dir: /tmp/apache-solr-nightly/build/common
    [javac] Compiling 31 source files to /tmp/apache-solr-nightly/build/common
    [javac] Note: Some input files use unchecked or unsafe operations.
    [javac] Note: Recompile with -Xlint:unchecked for details.

compile:
    [mkdir] Created dir: /tmp/apache-solr-nightly/build/core
    [javac] Compiling 310 source files to /tmp/apache-solr-nightly/build/core
    [javac] Note: Some input files use or override a deprecated API.
    [javac] Note: Recompile with -Xlint:deprecation for details.
    [javac] Note: Some input files use unchecked or unsafe operations.
    [javac] Note: Recompile with -Xlint:unchecked for details.

compile-solrj-core:
    [mkdir] Created dir: /tmp/apache-solr-nightly/build/client/solrj
    [javac] Compiling 22 source files to /tmp/apache-solr-nightly/build/client/solrj
    [javac] Note: /tmp/apache-solr-nightly/client/java/solrj/src/org/apache/solr/client/solrj/impl/CommonsHttpSolrServer.java uses or overrides a deprecated API.
    [javac] Note: Recompile with -Xlint:deprecation for details.

compile-solrj:
    [javac] Compiling 2 source files to /tmp/apache-solr-nightly/build/client/solrj

compileTests:
    [mkdir] Created dir: /tmp/apache-solr-nightly/build/tests
    [javac] Compiling 88 source files to /tmp/apache-solr-nightly/build/tests
    [javac] Note: Some input files use or override a deprecated API.
    [javac] Note: Recompile with -Xlint:deprecation for details.
    [javac] Note: Some input files use unchecked or unsafe operations.
    [javac] Note: Recompile with -Xlint:unchecked for details.

junit:
    [mkdir] Created dir: /tmp/apache-solr-nightly/build/test-results
    [junit] Running org.apache.solr.BasicFunctionalityTest
    [junit] Tests run: 25, Failures: 0, Errors: 0, Time elapsed: 176.717 sec
    [junit] Running org.apache.solr.ConvertedLegacyTest
    [junit] Tests run: 1, Failures: 0, Errors: 0, Time elapsed: 31.55 sec
    [junit] Running org.apache.solr.DisMaxRequestHandlerTest
    [junit] Tests run: 3, Failures: 0, Errors: 0, Time elapsed: 18.267 sec
    [junit] Running org.apache.solr.EchoParamsTest
    [junit] Tests run: 4, Failures: 0, Errors: 0, Time elapsed: 5.737 sec
    [junit] Running org.apache.solr.OutputWriterTest
    [junit] Tests run: 3, Failures: 0, Errors: 0, Time elapsed: 7.807 sec
    [junit] Running org.apache.solr.SampleTest
    [junit] Tests run: 2, Failures: 0, Errors: 0, Time elapsed: 2.043 sec
    [junit] Running org.apache.solr.TestDistributedSearch
    [junit] Tests run: 1, Failures: 0, Errors: 0, Time elapsed: 60.417 sec
    [junit] 2008-03-28 08:13:59.566::INFO:  Shutdown hook executing
    [junit] 2008-03-28 08:13:59.566::INFO:  Shutdown hook complete
    [junit] 2008-03-28 08:14:00.571::INFO:  Shutdown hook complete
    [junit] 2008-03-28 08:14:01.610::INFO:  Shutdown hook complete
    [junit] 2008-03-28 08:14:02.611::INFO:  Shutdown hook complete
    [junit] 2008-03-28 08:14:03.622::INFO:  Shutdown hook complete
    [junit] 2008-03-28 08:14:04.630::INFO:  Shutdown hook complete
    [junit] 2008-03-28 08:14:05.640::INFO:  Shutdown hook complete
    [junit] 2008-03-28 08:14:06.650::INFO:  Shutdown hook complete
    [junit] 2008-03-28 08:14:07.676::INFO:  Shutdown hook complete
    [junit] Running org.apache.solr.analysis.HTMLStripReaderTest
    [junit] Tests run: 9, Failures: 0, Errors: 0, Time elapsed: 1.786 sec
    [junit] Running org.apache.solr.analysis.TestBufferedTokenStream
    [junit] Tests run: 2, Failures: 0, Errors: 0, Time elapsed: 3.376 sec
    [junit] Running org.apache.solr.analysis.TestCapitalizationFilter
    [junit] Tests run: 2, Failures: 0, Errors: 0, Time elapsed: 2.116 sec
    [junit] Running org.apache.solr.analysis.TestHyphenatedWordsFilter
    [junit] Tests run: 1, Failures: 0, Errors: 0, Time elapsed: 0.784 sec
    [junit] Running org.apache.solr.analysis.TestKeepWordFilter
    [junit] Tests run: 1, Failures: 0, Errors: 0, Time elapsed: 1.038 sec
    [junit] Running org.apache.solr.analysis.TestPatternReplaceFilter
    [junit] Tests run: 5, Failures: 0, Errors: 0, Time elapsed: 3.175 sec
    [junit] Running org.apache.solr.analysis.TestPatternTokenizerFactory
    [junit] Tests run: 1, Failures: 0, Errors: 0, Time elapsed: 0.695 sec
    [junit] Running org.apache.solr.analysis.TestPhoneticFilter
    [junit] Tests run: 2, Failures: 0, Errors: 0, Time elapsed: 1.311 sec
    [junit] Running org.apache.solr.analysis.TestRemoveDuplicatesTokenFilter
    [junit] Tests run: 3, Failures: 0, Errors: 0, Time elapsed: 3.496 sec
    [junit] Running org.apache.solr.analysis.TestSynonymFilter
    [junit] Tests run: 7, Failures: 0, Errors: 0, Time elapsed: 7.852 sec
    [junit] Running org.apache.solr.analysis.TestTrimFilter
    [junit] Tests run: 1, Failures: 0, Errors: 0, Time elapsed: 1.87 sec
    [junit] Running org.apache.solr.analysis.TestWordDelimiterFilter
    [junit] Tests run: 4, Failures: 0, Errors: 0, Time elapsed: 15.505 sec
    [junit] Running org.apache.solr.common.SolrDocumentTest
    [junit] Tests run: 4, Failures: 0, Errors: 0, Time elapsed: 1.023 sec
    [junit] Running org.apache.solr.common.params.SolrParamTest
    [junit] Tests run: 1, Failures: 0, Errors: 0, Time elapsed: 0.971 sec
    [junit] Running org.apache.solr.common.util.ContentStreamTest
    [junit] Tests run: 3, Failures: 0, Errors: 0, Time elapsed: 0.534 sec
    [junit] Running org.apache.solr.common.util.IteratorChainTest
    [junit] Tests run: 7, Failures: 0, Errors: 0, Time elapsed: 0.497 sec
    [junit] Running org.apache.solr.common.util.TestXMLEscaping
    [junit] Tests run: 7, Failures: 0, Errors: 0, Time elapsed: 0.469 sec
    [junit] Running org.apache.solr.core.RequestHandlersTest
    [junit] Tests run: 2, Failures: 0, Errors: 0, Time elapsed: 14.105 sec
    [junit] Running org.apache.solr.core.ResourceLoaderTest
    [junit] Tests run: 2, Failures: 0, Errors: 0, Time elapsed: 0.521 sec
    [junit] Running org.apache.solr.core.SolrCoreTest
    [junit] Tests run: 1, Failures: 0, Errors: 0, Time elapsed: 6.248 sec
    [junit] Running org.apache.solr.core.TestBadConfig
    [junit] Tests run: 1, Failures: 0, Errors: 0, Time elapsed: 0.773 sec
    [junit] Running org.apache.solr.core.TestConfig
    [junit] Tests run: 2, Failures: 0, Errors: 0, Time elapsed: 5.69 sec
    [junit] Running org.apache.solr.core.TestQuerySenderListener
    [junit] Tests run: 1, Failures: 0, Errors: 0, Time elapsed: 2.396 sec
    [junit] Running org.apache.solr.handler.AnalysisRequestHandlerTest
    [junit] Tests run: 1, Failures: 0, Errors: 0, Time elapsed: 2.172 sec
    [junit] Running org.apache.solr.handler.MoreLikeThisHandlerTest
    [junit] Tests run: 1, Failures: 0, Errors: 0, Time elapsed: 3.348 sec
    [junit] Running org.apache.solr.handler.SpellCheckerRequestHandlerTest
    [junit] Tests run: 5, Failures: 0, Errors: 0, Time elapsed: 5.81 sec
    [junit] Running org.apache.solr.handler.StandardRequestHandlerTest
    [junit] Tests run: 1, Failures: 0, Errors: 0, Time elapsed: 6.652 sec
    [junit] Running org.apache.solr.handler.TestCSVLoader
    [junit] Tests run: 4, Failures: 0, Errors: 0, Time elapsed: 14.875 sec
    [junit] Running org.apache.solr.handler.XmlUpdateRequestHandlerTest
    [junit] Tests run: 1, Failures: 0, Errors: 0, Time elapsed: 16.251 sec
    [junit] Running org.apache.solr.handler.admin.SystemInfoHandlerTest
    [junit] Tests run: 1, Failures: 0, Errors: 0, Time elapsed: 0.659 sec
    [junit] Running org.apache.solr.handler.component.QueryElevationComponentTest
    [junit] Tests run: 3, Failures: 0, Errors: 0, Time elapsed: 7.694 sec
    [junit] Running org.apache.solr.handler.component.SearchHandlerTest
    [junit] Tests run: 1, Failures: 0, Errors: 0, Time elapsed: 5.395 sec
    [junit] Running org.apache.solr.highlight.HighlighterConfigTest
    [junit] Tests run: 1, Failures: 0, Errors: 0, Time elapsed: 6.928 sec
    [junit] Running org.apache.solr.highlight.HighlighterTest
    [junit] Tests run: 15, Failures: 0, Errors: 0, Time elapsed: 35.856 sec
    [junit] Running org.apache.solr.request.JSONWriterTest
    [junit] Tests run: 1, Failures: 0, Errors: 0, Time elapsed: 10.87 sec
    [junit] Running org.apache.solr.schema.BadIndexSchemaTest
    [junit] Tests run: 1, Failures: 0, Errors: 0, Time elapsed: 1.95 sec
    [junit] Running org.apache.solr.schema.IndexSchemaTest
    [junit] Tests run: 1, Failures: 0, Errors: 0, Time elapsed: 5.008 sec
    [junit] Running org.apache.solr.schema.NotRequiredUniqueKeyTest
    [junit] Tests run: 1, Failures: 0, Errors: 0, Time elapsed: 2.151 sec
    [junit] Running org.apache.solr.schema.RequiredFieldsTest
    [junit] Tests run: 3, Failures: 0, Errors: 0, Time elapsed: 11.377 sec
    [junit] Running org.apache.solr.schema.UUIDFieldTest
    [junit] Tests run: 1, Failures: 0, Errors: 0, Time elapsed: 0.921 sec
    [junit] Running org.apache.solr.search.TestDocSet
    [junit] Tests run: 1, Failures: 0, Errors: 0, Time elapsed: 1.31 sec
    [junit] Running org.apache.solr.search.TestQueryTypes
    [junit] Tests run: 1, Failures: 0, Errors: 0, Time elapsed: 15.185 sec
    [junit] Running org.apache.solr.search.TestQueryUtils
    [junit] Tests run: 1, Failures: 0, Errors: 0, Time elapsed: 8.458 sec
    [junit] Running org.apache.solr.search.function.TestFunctionQuery
    [junit] Tests run: 2, Failures: 0, Errors: 0, Time elapsed: 21.685 sec
    [junit] Running org.apache.solr.servlet.CacheHeaderTest
    [junit] Tests run: 3, Failures: 0, Errors: 1, Time elapsed: 34.622 sec
    [junit] 2008-03-28 08:44:55.392::INFO:  Shutdown hook executing
    [junit] 2008-03-28 08:44:55.392::INFO:  Shutdown hook complete
    [junit] 2008-03-28 08:44:56.504::INFO:  Shutdown hook complete
    [junit] 2008-03-28 08:44:57.506::INFO:  Shutdown hook complete
    [junit] Test org.apache.solr.servlet.CacheHeaderTest FAILED
    [junit] Running org.apache.solr.servlet.DirectSolrConnectionTest
    [junit] Tests run: 2, Failures: 0, Errors: 0, Time elapsed: 7.944 sec
    [junit] Running org.apache.solr.servlet.NoCacheHeaderTest
    [junit] Tests run: 3, Failures: 0, Errors: 1, Time elapsed: 18.164 sec
    [junit] 2008-03-28 08:45:33.371::INFO:  Shutdown hook executing
    [junit] 2008-03-28 08:45:33.942::INFO:  Shutdown hook complete
    [junit] 2008-03-28 08:45:34.950::INFO:  Shutdown hook complete
    [junit] 2008-03-28 08:45:35.964::INFO:  Shutdown hook complete
    [junit] Test org.apache.solr.servlet.NoCacheHeaderTest FAILED
    [junit] Running org.apache.solr.servlet.SolrRequestParserTest
    [junit] Tests run: 4, Failures: 0, Errors: 0, Time elapsed: 11.141 sec
    [junit] Running org.apache.solr.update.AutoCommitTest
    [junit] Tests run: 3, Failures: 0, Errors: 0, Time elapsed: 27.522 sec
    [junit] Running org.apache.solr.update.DirectUpdateHandlerTest
    [junit] Tests run: 1, Failures: 0, Errors: 0, Time elapsed: 5.275 sec
    [junit] Running org.apache.solr.update.DocumentBuilderTest
    [junit] Tests run: 2, Failures: 0, Errors: 0, Time elapsed: 10.343 sec
    [junit] Running org.apache.solr.update.processor.UpdateRequestProcessorFactoryTest
    [junit] Tests run: 1, Failures: 0, Errors: 0, Time elapsed: 6.355 sec
    [junit] Running org.apache.solr.util.DateMathParserTest
    [junit] Tests run: 7, Failures: 0, Errors: 0, Time elapsed: 0.475 sec
    [junit] Running org.apache.solr.util.SolrPluginUtilsTest
    [junit] Tests run: 5, Failures: 0, Errors: 0, Time elapsed: 37.12 sec
    [junit] Running org.apache.solr.util.TestCharArrayMap
    [junit] Tests run: 2, Failures: 0, Errors: 0, Time elapsed: 0.66 sec
    [junit] Running org.apache.solr.util.TestOpenBitSet
    [junit] Tests run: 3, Failures: 0, Errors: 0, Time elapsed: 5.291 sec
    [junit] Running org.apache.solr.util.TestUtils
    [junit] Tests run: 1, Failures: 0, Errors: 0, Time elapsed: 0.444 sec
    [junit] Running org.apache.solr.client.solrj.SolrExceptionTest
    [junit] Tests run: 1, Failures: 0, Errors: 0, Time elapsed: 1.624 sec
    [junit] Running org.apache.solr.client.solrj.SolrQueryTest
    [junit] Tests run: 1, Failures: 0, Errors: 0, Time elapsed: 1.511 sec
    [junit] Running org.apache.solr.client.solrj.embedded.JettyWebappTest
    [junit] Tests run: 1, Failures: 0, Errors: 0, Time elapsed: 20.992 sec
    [junit] 2008-03-28 09:00:39.442::INFO:  Shutdown hook executing
    [junit] 2008-03-28 09:00:40.431::INFO:  Shutdown hook complete
    [junit] Running org.apache.solr.client.solrj.embedded.LargeVolumeEmbeddedTest
    [junit] Tests run: 1, Failures: 0, Errors: 0, Time elapsed: 10.302 sec
    [junit] Running org.apache.solr.client.solrj.embedded.LargeVolumeJettyTest
    [junit] Tests run: 1, Failures: 0, Errors: 0, Time elapsed: 6.028 sec
    [junit] 2008-03-28 09:05:16.642::INFO:  Shutdown hook executing
    [junit] 2008-03-28 09:05:16.642::INFO:  Shutdown hook complete
    [junit] Running org.apache.solr.client.solrj.embedded.MultiCoreEmbeddedTest
    [junit] Tests run: 1, Failures: 0, Errors: 0, Time elapsed: 3.34 sec
    [junit] Running org.apache.solr.client.solrj.embedded.MultiCoreExampleJettyTest
    [junit] Tests run: 1, Failures: 0, Errors: 0, Time elapsed: 11.287 sec
    [junit] 2008-03-28 09:05:36.543::INFO:  Shutdown hook executing
    [junit] 2008-03-28 09:05:36.544::INFO:  Shutdown hook complete
    [junit] Running org.apache.solr.client.solrj.embedded.SolrExampleEmbeddedTest
    [junit] Tests run: 6, Failures: 0, Errors: 0, Time elapsed: 26.583 sec
    [junit] Running org.apache.solr.client.solrj.embedded.SolrExampleJettyTest
    [junit] Tests run: 6, Failures: 0, Errors: 0, Time elapsed: 24.562 sec
    [junit] 2008-03-28 09:06:58.454::INFO:  Shutdown hook executing
    [junit] 2008-03-28 09:06:58.454::INFO:  Shutdown hook complete
    [junit] 2008-03-28 09:06:59.454::INFO:  Shutdown hook complete
    [junit] 2008-03-28 09:07:00.464::INFO:  Shutdown hook complete
    [junit] 2008-03-28 09:07:01.474::INFO:  Shutdown hook complete
    [junit] 2008-03-28 09:07:02.544::INFO:  Shutdown hook complete
    [junit] 2008-03-28 09:07:03.815::INFO:  Shutdown hook complete
    [junit] Running org.apache.solr.client.solrj.response.QueryResponseTest
    [junit] Tests run: 1, Failures: 0, Errors: 0, Time elapsed: 0.365 sec
    [junit] Running org.apache.solr.client.solrj.util.ClientUtilsTest
    [junit] Tests run: 1, Failures: 0, Errors: 0, Time elapsed: 0.426 sec

BUILD FAILED
/tmp/apache-solr-nightly/build.xml:498: Tests failed!

Total time: 58 minutes 55 seconds