Solr nightly build failure

classic Classic list List threaded Threaded
2 messages Options
Reply | Threaded
Open this post in threaded view
|

Solr nightly build failure

Solr - Dev mailing list

init-forrest-entities:
    [mkdir] Created dir: /tmp/apache-solr-nightly/build

compile-common:
    [mkdir] Created dir: /tmp/apache-solr-nightly/build/common
    [javac] Compiling 31 source files to /tmp/apache-solr-nightly/build/common
    [javac] Note: Some input files use unchecked or unsafe operations.
    [javac] Note: Recompile with -Xlint:unchecked for details.

compile:
    [mkdir] Created dir: /tmp/apache-solr-nightly/build/core
    [javac] Compiling 311 source files to /tmp/apache-solr-nightly/build/core
    [javac] Note: Some input files use or override a deprecated API.
    [javac] Note: Recompile with -Xlint:deprecation for details.
    [javac] Note: Some input files use unchecked or unsafe operations.
    [javac] Note: Recompile with -Xlint:unchecked for details.

compile-solrj-core:
    [mkdir] Created dir: /tmp/apache-solr-nightly/build/client/solrj
    [javac] Compiling 22 source files to /tmp/apache-solr-nightly/build/client/solrj
    [javac] Note: /tmp/apache-solr-nightly/client/java/solrj/src/org/apache/solr/client/solrj/impl/CommonsHttpSolrServer.java uses or overrides a deprecated API.
    [javac] Note: Recompile with -Xlint:deprecation for details.

compile-solrj:
    [javac] Compiling 2 source files to /tmp/apache-solr-nightly/build/client/solrj

compileTests:
    [mkdir] Created dir: /tmp/apache-solr-nightly/build/tests
    [javac] Compiling 91 source files to /tmp/apache-solr-nightly/build/tests
    [javac] Note: Some input files use or override a deprecated API.
    [javac] Note: Recompile with -Xlint:deprecation for details.
    [javac] Note: Some input files use unchecked or unsafe operations.
    [javac] Note: Recompile with -Xlint:unchecked for details.

junit:
    [mkdir] Created dir: /tmp/apache-solr-nightly/build/test-results
    [junit] Running org.apache.solr.BasicFunctionalityTest
    [junit] Tests run: 25, Failures: 0, Errors: 0, Time elapsed: 265.949 sec
    [junit] Running org.apache.solr.ConvertedLegacyTest
    [junit] Tests run: 1, Failures: 0, Errors: 0, Time elapsed: 50.603 sec
    [junit] Running org.apache.solr.DisMaxRequestHandlerTest
    [junit] Tests run: 3, Failures: 0, Errors: 0, Time elapsed: 31.405 sec
    [junit] Running org.apache.solr.EchoParamsTest
    [junit] Tests run: 4, Failures: 0, Errors: 0, Time elapsed: 15.712 sec
    [junit] Running org.apache.solr.OutputWriterTest
    [junit] Tests run: 3, Failures: 0, Errors: 0, Time elapsed: 9.894 sec
    [junit] Running org.apache.solr.SampleTest
    [junit] Tests run: 2, Failures: 0, Errors: 0, Time elapsed: 4.535 sec
    [junit] Running org.apache.solr.TestDistributedSearch
    [junit] Tests run: 1, Failures: 0, Errors: 0, Time elapsed: 61.069 sec
    [junit] 2008-04-04 08:16:50.017::INFO:  Shutdown hook executing
    [junit] 2008-04-04 08:16:50.018::INFO:  Shutdown hook complete
    [junit] 2008-04-04 08:16:51.095::INFO:  Shutdown hook complete
    [junit] 2008-04-04 08:16:52.114::INFO:  Shutdown hook complete
    [junit] 2008-04-04 08:16:53.326::INFO:  Shutdown hook complete
    [junit] 2008-04-04 08:16:54.333::INFO:  Shutdown hook complete
    [junit] 2008-04-04 08:16:55.343::INFO:  Shutdown hook complete
    [junit] 2008-04-04 08:16:56.353::INFO:  Shutdown hook complete
    [junit] 2008-04-04 08:16:57.363::INFO:  Shutdown hook complete
    [junit] 2008-04-04 08:16:58.373::INFO:  Shutdown hook complete
    [junit] Running org.apache.solr.analysis.EnglishPorterFilterFactoryTest
    [junit] Tests run: 2, Failures: 0, Errors: 0, Time elapsed: 2.782 sec
    [junit] Running org.apache.solr.analysis.HTMLStripReaderTest
    [junit] Tests run: 9, Failures: 0, Errors: 0, Time elapsed: 4.362 sec
    [junit] Running org.apache.solr.analysis.LengthFilterTest
    [junit] Tests run: 1, Failures: 0, Errors: 0, Time elapsed: 3.74 sec
    [junit] Running org.apache.solr.analysis.TestBufferedTokenStream
    [junit] Tests run: 2, Failures: 0, Errors: 0, Time elapsed: 5.525 sec
    [junit] Running org.apache.solr.analysis.TestCapitalizationFilter
    [junit] Tests run: 2, Failures: 0, Errors: 0, Time elapsed: 4.94 sec
    [junit] Running org.apache.solr.analysis.TestHyphenatedWordsFilter
    [junit] Tests run: 1, Failures: 0, Errors: 0, Time elapsed: 2.258 sec
    [junit] Running org.apache.solr.analysis.TestKeepWordFilter
    [junit] Tests run: 1, Failures: 0, Errors: 0, Time elapsed: 3.059 sec
    [junit] Running org.apache.solr.analysis.TestPatternReplaceFilter
    [junit] Tests run: 5, Failures: 0, Errors: 0, Time elapsed: 7.071 sec
    [junit] Running org.apache.solr.analysis.TestPatternTokenizerFactory
    [junit] Tests run: 1, Failures: 0, Errors: 0, Time elapsed: 2.711 sec
    [junit] Running org.apache.solr.analysis.TestPhoneticFilter
    [junit] Tests run: 2, Failures: 0, Errors: 0, Time elapsed: 6.304 sec
    [junit] Running org.apache.solr.analysis.TestRemoveDuplicatesTokenFilter
    [junit] Tests run: 3, Failures: 0, Errors: 0, Time elapsed: 5.535 sec
    [junit] Running org.apache.solr.analysis.TestSynonymFilter
    [junit] Tests run: 7, Failures: 0, Errors: 0, Time elapsed: 5.669 sec
    [junit] Running org.apache.solr.analysis.TestTrimFilter
    [junit] Tests run: 1, Failures: 0, Errors: 0, Time elapsed: 2.645 sec
    [junit] Running org.apache.solr.analysis.TestWordDelimiterFilter
    [junit] Tests run: 4, Failures: 0, Errors: 0, Time elapsed: 14.586 sec
    [junit] Running org.apache.solr.common.SolrDocumentTest
    [junit] Tests run: 4, Failures: 0, Errors: 0, Time elapsed: 0.435 sec
    [junit] Running org.apache.solr.common.params.SolrParamTest
    [junit] Tests run: 1, Failures: 0, Errors: 0, Time elapsed: 0.435 sec
    [junit] Running org.apache.solr.common.util.ContentStreamTest
    [junit] Tests run: 3, Failures: 0, Errors: 0, Time elapsed: 1.025 sec
    [junit] Running org.apache.solr.common.util.IteratorChainTest
    [junit] Tests run: 7, Failures: 0, Errors: 0, Time elapsed: 0.371 sec
    [junit] Running org.apache.solr.common.util.TestXMLEscaping
    [junit] Tests run: 7, Failures: 0, Errors: 0, Time elapsed: 1.732 sec
    [junit] Running org.apache.solr.core.RequestHandlersTest
    [junit] Tests run: 2, Failures: 0, Errors: 0, Time elapsed: 23.42 sec
    [junit] Running org.apache.solr.core.ResourceLoaderTest
    [junit] Tests run: 2, Failures: 0, Errors: 0, Time elapsed: 0.51 sec
    [junit] Running org.apache.solr.core.SolrCoreTest
    [junit] Tests run: 1, Failures: 0, Errors: 0, Time elapsed: 8.354 sec
    [junit] Running org.apache.solr.core.TestBadConfig
    [junit] Tests run: 1, Failures: 0, Errors: 0, Time elapsed: 1.137 sec
    [junit] Running org.apache.solr.core.TestConfig
    [junit] Tests run: 2, Failures: 0, Errors: 0, Time elapsed: 18.371 sec
    [junit] Running org.apache.solr.core.TestQuerySenderListener
    [junit] Tests run: 1, Failures: 0, Errors: 0, Time elapsed: 4.556 sec
    [junit] Running org.apache.solr.handler.AnalysisRequestHandlerTest
    [junit] Tests run: 1, Failures: 0, Errors: 0, Time elapsed: 23.161 sec
    [junit] Running org.apache.solr.handler.MoreLikeThisHandlerTest
    [junit] Tests run: 1, Failures: 0, Errors: 0, Time elapsed: 12.473 sec
    [junit] Running org.apache.solr.handler.SpellCheckerRequestHandlerTest
    [junit] Tests run: 5, Failures: 0, Errors: 0, Time elapsed: 16.955 sec
    [junit] Running org.apache.solr.handler.StandardRequestHandlerTest
    [junit] Tests run: 1, Failures: 0, Errors: 0, Time elapsed: 9.305 sec
    [junit] Running org.apache.solr.handler.TestCSVLoader
    [junit] Tests run: 4, Failures: 0, Errors: 0, Time elapsed: 25.523 sec
    [junit] Running org.apache.solr.handler.XmlUpdateRequestHandlerTest
    [junit] Tests run: 1, Failures: 0, Errors: 0, Time elapsed: 12.529 sec
    [junit] Running org.apache.solr.handler.admin.SystemInfoHandlerTest
    [junit] Tests run: 1, Failures: 0, Errors: 0, Time elapsed: 4.352 sec
    [junit] Running org.apache.solr.handler.component.QueryElevationComponentTest
    [junit] Tests run: 3, Failures: 0, Errors: 0, Time elapsed: 13.456 sec
    [junit] Running org.apache.solr.handler.component.SearchHandlerTest
    [junit] Tests run: 1, Failures: 0, Errors: 0, Time elapsed: 5.654 sec
    [junit] Running org.apache.solr.highlight.HighlighterConfigTest
    [junit] Tests run: 1, Failures: 0, Errors: 0, Time elapsed: 4.442 sec
    [junit] Running org.apache.solr.highlight.HighlighterTest
    [junit] Tests run: 15, Failures: 0, Errors: 0, Time elapsed: 41.21 sec
    [junit] Running org.apache.solr.request.JSONWriterTest
    [junit] Tests run: 1, Failures: 0, Errors: 0, Time elapsed: 11.662 sec
    [junit] Running org.apache.solr.schema.BadIndexSchemaTest
    [junit] Tests run: 1, Failures: 0, Errors: 0, Time elapsed: 4.27 sec
    [junit] Running org.apache.solr.schema.IndexSchemaTest
    [junit] Tests run: 1, Failures: 0, Errors: 0, Time elapsed: 7.089 sec
    [junit] Running org.apache.solr.schema.NotRequiredUniqueKeyTest
    [junit] Tests run: 1, Failures: 0, Errors: 0, Time elapsed: 4.88 sec
    [junit] Running org.apache.solr.schema.RequiredFieldsTest
    [junit] Tests run: 3, Failures: 0, Errors: 0, Time elapsed: 14.53 sec
    [junit] Running org.apache.solr.schema.UUIDFieldTest
    [junit] Tests run: 1, Failures: 0, Errors: 0, Time elapsed: 0.896 sec
    [junit] Running org.apache.solr.search.TestDocSet
    [junit] Tests run: 1, Failures: 0, Errors: 0, Time elapsed: 1.221 sec
    [junit] Running org.apache.solr.search.TestQueryTypes
    [junit] Tests run: 1, Failures: 0, Errors: 0, Time elapsed: 9.847 sec
    [junit] Running org.apache.solr.search.TestQueryUtils
    [junit] Tests run: 1, Failures: 0, Errors: 0, Time elapsed: 8.773 sec
    [junit] Running org.apache.solr.search.function.TestFunctionQuery
    [junit] Tests run: 2, Failures: 0, Errors: 0, Time elapsed: 27.206 sec
    [junit] Running org.apache.solr.servlet.CacheHeaderTest
    [junit] Tests run: 3, Failures: 0, Errors: 0, Time elapsed: 30.832 sec
    [junit] 2008-04-04 08:27:44.259::INFO:  Shutdown hook executing
    [junit] 2008-04-04 08:27:44.266::INFO:  Shutdown hook complete
    [junit] 2008-04-04 08:27:46.257::INFO:  Shutdown hook complete
    [junit] 2008-04-04 08:27:47.258::INFO:  Shutdown hook complete
    [junit] Running org.apache.solr.servlet.DirectSolrConnectionTest
    [junit] Tests run: 2, Failures: 0, Errors: 0, Time elapsed: 5.744 sec
    [junit] Running org.apache.solr.servlet.NoCacheHeaderTest
    [junit] Tests run: 3, Failures: 0, Errors: 0, Time elapsed: 24.977 sec
    [junit] 2008-04-04 08:28:50.556::INFO:  Shutdown hook executing
    [junit] 2008-04-04 08:28:50.556::INFO:  Shutdown hook complete
    [junit] 2008-04-04 08:28:51.559::INFO:  Shutdown hook complete
    [junit] 2008-04-04 08:28:52.568::INFO:  Shutdown hook complete
    [junit] Running org.apache.solr.servlet.SolrRequestParserTest
    [junit] Tests run: 4, Failures: 0, Errors: 0, Time elapsed: 8.473 sec
    [junit] Running org.apache.solr.update.AutoCommitTest
    [junit] <response>
    [junit] <lst name="responseHeader"><int name="status">0</int><int name="QTime">1</int></lst><result name="response" numFound="0" start="0"/>
    [junit] </response>
    [junit] )
    [junit] <response>
    [junit] <lst name="responseHeader"><int name="status">0</int><int name="QTime">47</int></lst><result name="response" numFound="1" start="0"><doc><arr name="field_t"><str>what's inside?</str></arr><int name="id">531</int><int name="intDefault">42</int><arr name="multiDefault"><str>muLti-Default</str></arr><arr name="subject"><str>info</str></arr><date name="timestamp">2008-04-04T08:29:19.053Z</date></doc></result>
    [junit] </response>
    [junit] )
    [junit] Tests run: 3, Failures: 2, Errors: 0, Time elapsed: 14.972 sec
    [junit] Test org.apache.solr.update.AutoCommitTest FAILED
    [junit] Running org.apache.solr.update.DirectUpdateHandlerTest
    [junit] Tests run: 1, Failures: 0, Errors: 0, Time elapsed: 4.877 sec
    [junit] Running org.apache.solr.update.DocumentBuilderTest
    [junit] Tests run: 2, Failures: 0, Errors: 0, Time elapsed: 11.16 sec
    [junit] Running org.apache.solr.update.processor.UpdateRequestProcessorFactoryTest
    [junit] Tests run: 1, Failures: 0, Errors: 0, Time elapsed: 6.295 sec
    [junit] Running org.apache.solr.util.ArraysUtilsTest
    [junit] Tests run: 1, Failures: 0, Errors: 0, Time elapsed: 0.753 sec
    [junit] Running org.apache.solr.util.DateMathParserTest
    [junit] Tests run: 7, Failures: 0, Errors: 0, Time elapsed: 1.071 sec
    [junit] Running org.apache.solr.util.SolrPluginUtilsTest
    [junit] Tests run: 5, Failures: 0, Errors: 0, Time elapsed: 17.525 sec
    [junit] Running org.apache.solr.util.TestCharArrayMap
    [junit] Tests run: 2, Failures: 0, Errors: 0, Time elapsed: 1.237 sec
    [junit] Running org.apache.solr.util.TestOpenBitSet
    [junit] Tests run: 3, Failures: 0, Errors: 0, Time elapsed: 3.483 sec
    [junit] Running org.apache.solr.util.TestUtils
    [junit] Tests run: 1, Failures: 0, Errors: 0, Time elapsed: 0.377 sec
    [junit] Running org.apache.solr.client.solrj.SolrExceptionTest
    [junit] Tests run: 1, Failures: 0, Errors: 0, Time elapsed: 4.905 sec
    [junit] Running org.apache.solr.client.solrj.SolrQueryTest
    [junit] Tests run: 1, Failures: 0, Errors: 0, Time elapsed: 0.431 sec
    [junit] Running org.apache.solr.client.solrj.embedded.JettyWebappTest
    [junit] Tests run: 1, Failures: 0, Errors: 0, Time elapsed: 11.984 sec
    [junit] 2008-04-04 08:30:54.090::INFO:  Shutdown hook executing
    [junit] 2008-04-04 08:30:54.356::INFO:  Shutdown hook complete
    [junit] Running org.apache.solr.client.solrj.embedded.LargeVolumeEmbeddedTest
    [junit] Tests run: 1, Failures: 0, Errors: 0, Time elapsed: 8.208 sec
    [junit] Running org.apache.solr.client.solrj.embedded.LargeVolumeJettyTest
    [junit] Tests run: 1, Failures: 0, Errors: 0, Time elapsed: 13.196 sec
    [junit] 2008-04-04 08:31:20.397::INFO:  Shutdown hook executing
    [junit] 2008-04-04 08:31:20.398::INFO:  Shutdown hook complete
    [junit] Running org.apache.solr.client.solrj.embedded.MultiCoreEmbeddedTest
    [junit] Tests run: 1, Failures: 0, Errors: 0, Time elapsed: 4.229 sec
    [junit] Running org.apache.solr.client.solrj.embedded.MultiCoreExampleJettyTest
    [junit] Tests run: 1, Failures: 0, Errors: 0, Time elapsed: 5.447 sec
    [junit] 2008-04-04 08:31:35.596::INFO:  Shutdown hook executing
    [junit] 2008-04-04 08:31:35.596::INFO:  Shutdown hook complete
    [junit] Running org.apache.solr.client.solrj.embedded.SolrExampleEmbeddedTest
    [junit] Tests run: 6, Failures: 0, Errors: 0, Time elapsed: 21.457 sec
    [junit] Running org.apache.solr.client.solrj.embedded.SolrExampleJettyTest
    [junit] Tests run: 6, Failures: 0, Errors: 0, Time elapsed: 60.623 sec
    [junit] 2008-04-04 08:33:02.889::INFO:  Shutdown hook executing
    [junit] 2008-04-04 08:33:02.889::INFO:  Shutdown hook complete
    [junit] 2008-04-04 08:33:03.893::INFO:  Shutdown hook complete
    [junit] 2008-04-04 08:33:04.903::INFO:  Shutdown hook complete
    [junit] 2008-04-04 08:33:05.913::INFO:  Shutdown hook complete
    [junit] 2008-04-04 08:33:06.922::INFO:  Shutdown hook complete
    [junit] 2008-04-04 08:33:07.952::INFO:  Shutdown hook complete
    [junit] Running org.apache.solr.client.solrj.response.QueryResponseTest
    [junit] Tests run: 1, Failures: 0, Errors: 0, Time elapsed: 0.544 sec
    [junit] Running org.apache.solr.client.solrj.util.ClientUtilsTest
    [junit] Tests run: 1, Failures: 0, Errors: 0, Time elapsed: 0.437 sec

BUILD FAILED
/tmp/apache-solr-nightly/build.xml:498: Tests failed!

Total time: 25 minutes 22 seconds


Reply | Threaded
Open this post in threaded view
|

Re: Solr nightly build failure

Mike Klaas

On 4-Apr-08, at 1:33 AM, [hidden email] wrote:

>
>    [junit] Running org.apache.solr.update.AutoCommitTest
>    [junit] <response>
>    [junit] <lst name="responseHeader"><int name="status">0</int><int  
> name="QTime">1</int></lst><result name="response" numFound="0"  
> start="0"/>
>    [junit] </response>
>    [junit] )
>    [junit] <response>
>    [junit] <lst name="responseHeader"><int name="status">0</int><int  
> name="QTime">47</int></lst><result name="response" numFound="1"  
> start="0"><doc><arr name="field_t"><str>what's inside?</str></
> arr><int name="id">531</int><int name="intDefault">42</int><arr  
> name="multiDefault"><str>muLti-Default</str></arr><arr  
> name="subject"><str>info</str></arr><date  
> name="timestamp">2008-04-04T08:29:19.053Z</date></doc></result>
>    [junit] </response>
>    [junit] )
>    [junit] Tests run: 3, Failures: 2, Errors: 0, Time elapsed:  
> 14.972 sec
>    [junit] Test org.apache.solr.update.AutoCommitTest FAILED

I think I'm going to disable this test until I can figure out why it  
is failing (on only one of the two daily builds).

-Mike