[jira] [Created] (HADOOP-16088) Build failure for -Dhbase.profile=2.0

classic Classic list List threaded Threaded
1 message Options
Reply | Threaded
Open this post in threaded view
|

[jira] [Created] (HADOOP-16088) Build failure for -Dhbase.profile=2.0

JIRA jira@apache.org
Rohith Sharma K S created HADOOP-16088:
------------------------------------------

             Summary: Build failure for -Dhbase.profile=2.0
                 Key: HADOOP-16088
                 URL: https://issues.apache.org/jira/browse/HADOOP-16088
             Project: Hadoop Common
          Issue Type: Bug
            Reporter: Rohith Sharma K S


Post HADOOP-14178, hadoop build failure due to incorrect pom.xml.

{noformat}
HW12723:hadoop rsharmaks$ mci
[INFO] Scanning for projects...
[ERROR] [ERROR] Some problems were encountered while processing the POMs:
[ERROR] 'dependencies.dependency.version' for org.mockito:mockito-all:jar is missing. @ line 485, column 21
 @
[ERROR] The build could not read 1 project -> [Help 1]
[ERROR]
[ERROR]   The project org.apache.hadoop:hadoop-yarn-server-timelineservice-hbase-tests:3.3.0-SNAPSHOT (/Users/rsharmaks/Repos/Apache/hadoop/hadoop-yarn-project/hadoop-yarn/hadoop-yarn-server/hadoop-yarn-server-timelineservice-hbase-tests/pom.xml) has 1 error
[ERROR]     'dependencies.dependency.version' for org.mockito:mockito-all:jar is missing. @ line 485, column 21
[ERROR]
[ERROR] To see the full stack trace of the errors, re-run Maven with the -e switch.
[ERROR] Re-run Maven using the -X switch to enable full debug logging.
[ERROR]
[ERROR] For more information about the errors and possible solutions, please read the following articles:
[ERROR] [Help 1] http://cwiki.apache.org/confluence/display/MAVEN/ProjectBuildingException
{noformat}

cc:/ [~ajisakaa]



--
This message was sent by Atlassian JIRA
(v7.6.3#76005)

---------------------------------------------------------------------
To unsubscribe, e-mail: [hidden email]
For additional commands, e-mail: [hidden email]