[jira] Created: (SOLR-2160) TestTrie test failure

classic Classic list List threaded Threaded
23 messages Options
12
Reply | Threaded
Open this post in threaded view
|

[jira] Created: (SOLR-2160) TestTrie test failure

JIRA jira@apache.org
TestTrie test failure
---------------------

                 Key: SOLR-2160
                 URL: https://issues.apache.org/jira/browse/SOLR-2160
             Project: Solr
          Issue Type: Bug
          Components: Build
    Affects Versions: 3.1, 4.0
         Environment: Hudson
            Reporter: Robert Muir
             Fix For: 3.1, 4.0


Several test methods in TestTrie failed in hudson, with errors such as this:

Caused by: org.apache.solr.common.SolrException: Unknown query type 'func'

Here is the stacktrace:
{noformat}
   [junit] Testsuite: org.apache.solr.TestTrie
    [junit] Testcase: testTrieIntRangeSearch(org.apache.solr.TestTrie): Caused an ERROR
    [junit] Exception during query
    [junit] java.lang.RuntimeException: Exception during query
    [junit] at org.apache.solr.SolrTestCaseJ4.assertQ(SolrTestCaseJ4.java:339)
    [junit] at org.apache.solr.TestTrie.testTrieIntRangeSearch(TestTrie.java:76)
    [junit] at org.apache.lucene.util.LuceneTestCase$LuceneTestCaseRunner.runChild(LuceneTestCase.java:795)
    [junit] at org.apache.lucene.util.LuceneTestCase$LuceneTestCaseRunner.runChild(LuceneTestCase.java:768)
    [junit] Caused by: org.apache.solr.common.SolrException: Unknown query type 'func'
    [junit] at org.apache.solr.core.SolrCore.getQueryPlugin(SolrCore.java:1474)
    [junit] at org.apache.solr.search.QParser.getParser(QParser.java:286)
    [junit] at org.apache.solr.search.QParser.subQuery(QParser.java:176)
    [junit] at org.apache.solr.search.SolrQueryParser.getFieldQuery(SolrQueryParser.java:142)
    [junit] at org.apache.lucene.queryParser.QueryParser.getFieldQuery(QueryParser.java:754)
    [junit] at org.apache.lucene.queryParser.QueryParser.Term(QueryParser.java:1594)
    [junit] at org.apache.lucene.queryParser.QueryParser.Clause(QueryParser.java:1337)
    [junit] at org.apache.lucene.queryParser.QueryParser.Query(QueryParser.java:1263)
    [junit] at org.apache.lucene.queryParser.QueryParser.TopLevelQuery(QueryParser.java:1252)
    [junit] at org.apache.lucene.queryParser.QueryParser.parse(QueryParser.java:208)
    [junit] at org.apache.solr.search.LuceneQParser.parse(LuceneQParserPlugin.java:73)
    [junit] at org.apache.solr.search.QParser.getQuery(QParser.java:142)
    [junit] at org.apache.solr.handler.component.QueryComponent.prepare(QueryComponent.java:93)
    [junit] at org.apache.solr.handler.component.SearchHandler.handleRequestBody(SearchHandler.java:210)
    [junit] at org.apache.solr.handler.RequestHandlerBase.handleRequest(RequestHandlerBase.java:131)
    [junit] at org.apache.solr.core.SolrCore.execute(SolrCore.java:1325)
    [junit] at org.apache.solr.util.TestHarness.queryAndResponse(TestHarness.java:334)
    [junit] at org.apache.solr.util.TestHarness.query(TestHarness.java:321)
    [junit] at org.apache.solr.util.TestHarness.query(TestHarness.java:307)
    [junit] at org.apache.solr.SolrTestCaseJ4.assertQ(SolrTestCaseJ4.java:317)
    [junit]
    [junit]
    [junit] Testcase: testTrieFloatRangeSearch(org.apache.solr.TestTrie): Caused an ERROR
    [junit] Exception during query
    [junit] java.lang.RuntimeException: Exception during query
    [junit] at org.apache.solr.SolrTestCaseJ4.assertQ(SolrTestCaseJ4.java:339)
    [junit] at org.apache.solr.TestTrie.testTrieFloatRangeSearch(TestTrie.java:119)
    [junit] at org.apache.lucene.util.LuceneTestCase$LuceneTestCaseRunner.runChild(LuceneTestCase.java:795)
    [junit] at org.apache.lucene.util.LuceneTestCase$LuceneTestCaseRunner.runChild(LuceneTestCase.java:768)
    [junit] Caused by: org.apache.solr.common.SolrException: Unknown query type 'func'
    [junit] at org.apache.solr.core.SolrCore.getQueryPlugin(SolrCore.java:1474)
    [junit] at org.apache.solr.search.QParser.getParser(QParser.java:286)
    [junit] at org.apache.solr.search.QParser.subQuery(QParser.java:176)
    [junit] at org.apache.solr.search.SolrQueryParser.getFieldQuery(SolrQueryParser.java:142)
    [junit] at org.apache.lucene.queryParser.QueryParser.getFieldQuery(QueryParser.java:754)
    [junit] at org.apache.lucene.queryParser.QueryParser.Term(QueryParser.java:1594)
    [junit] at org.apache.lucene.queryParser.QueryParser.Clause(QueryParser.java:1337)
    [junit] at org.apache.lucene.queryParser.QueryParser.Query(QueryParser.java:1263)
    [junit] at org.apache.lucene.queryParser.QueryParser.TopLevelQuery(QueryParser.java:1252)
    [junit] at org.apache.lucene.queryParser.QueryParser.parse(QueryParser.java:208)
    [junit] at org.apache.solr.search.LuceneQParser.parse(LuceneQParserPlugin.java:73)
    [junit] at org.apache.solr.search.QParser.getQuery(QParser.java:142)
    [junit] at org.apache.solr.handler.component.QueryComponent.prepare(QueryComponent.java:93)
    [junit] at org.apache.solr.handler.component.SearchHandler.handleRequestBody(SearchHandler.java:210)
    [junit] at org.apache.solr.handler.RequestHandlerBase.handleRequest(RequestHandlerBase.java:131)
    [junit] at org.apache.solr.core.SolrCore.execute(SolrCore.java:1325)
    [junit] at org.apache.solr.util.TestHarness.queryAndResponse(TestHarness.java:334)
    [junit] at org.apache.solr.util.TestHarness.query(TestHarness.java:321)
    [junit] at org.apache.solr.util.TestHarness.query(TestHarness.java:307)
    [junit] at org.apache.solr.SolrTestCaseJ4.assertQ(SolrTestCaseJ4.java:317)
    [junit]
    [junit]
    [junit] Testcase: testTrieLongRangeSearch(org.apache.solr.TestTrie): Caused an ERROR
    [junit] Exception during query
    [junit] java.lang.RuntimeException: Exception during query
    [junit] at org.apache.solr.SolrTestCaseJ4.assertQ(SolrTestCaseJ4.java:339)
    [junit] at org.apache.solr.TestTrie.testTrieLongRangeSearch(TestTrie.java:138)
    [junit] at org.apache.lucene.util.LuceneTestCase$LuceneTestCaseRunner.runChild(LuceneTestCase.java:795)
    [junit] at org.apache.lucene.util.LuceneTestCase$LuceneTestCaseRunner.runChild(LuceneTestCase.java:768)
    [junit] Caused by: org.apache.solr.common.SolrException: Unknown query type 'func'
    [junit] at org.apache.solr.core.SolrCore.getQueryPlugin(SolrCore.java:1474)
    [junit] at org.apache.solr.search.QParser.getParser(QParser.java:286)
    [junit] at org.apache.solr.search.QParser.subQuery(QParser.java:176)
    [junit] at org.apache.solr.search.SolrQueryParser.getFieldQuery(SolrQueryParser.java:142)
    [junit] at org.apache.lucene.queryParser.QueryParser.getFieldQuery(QueryParser.java:754)
    [junit] at org.apache.lucene.queryParser.QueryParser.Term(QueryParser.java:1594)
    [junit] at org.apache.lucene.queryParser.QueryParser.Clause(QueryParser.java:1337)
    [junit] at org.apache.lucene.queryParser.QueryParser.Query(QueryParser.java:1263)
    [junit] at org.apache.lucene.queryParser.QueryParser.TopLevelQuery(QueryParser.java:1252)
    [junit] at org.apache.lucene.queryParser.QueryParser.parse(QueryParser.java:208)
    [junit] at org.apache.solr.search.LuceneQParser.parse(LuceneQParserPlugin.java:73)
    [junit] at org.apache.solr.search.QParser.getQuery(QParser.java:142)
    [junit] at org.apache.solr.handler.component.QueryComponent.prepare(QueryComponent.java:93)
    [junit] at org.apache.solr.handler.component.SearchHandler.handleRequestBody(SearchHandler.java:210)
    [junit] at org.apache.solr.handler.RequestHandlerBase.handleRequest(RequestHandlerBase.java:131)
    [junit] at org.apache.solr.core.SolrCore.execute(SolrCore.java:1325)
    [junit] at org.apache.solr.util.TestHarness.queryAndResponse(TestHarness.java:334)
    [junit] at org.apache.solr.util.TestHarness.query(TestHarness.java:321)
    [junit] at org.apache.solr.util.TestHarness.query(TestHarness.java:307)
    [junit] at org.apache.solr.SolrTestCaseJ4.assertQ(SolrTestCaseJ4.java:317)
    [junit]
    [junit]
    [junit] Testcase: testTrieDoubleRangeSearch(org.apache.solr.TestTrie): Caused an ERROR
    [junit] Exception during query
    [junit] java.lang.RuntimeException: Exception during query
    [junit] at org.apache.solr.SolrTestCaseJ4.assertQ(SolrTestCaseJ4.java:339)
    [junit] at org.apache.solr.TestTrie.testTrieDoubleRangeSearch(TestTrie.java:156)
    [junit] at org.apache.lucene.util.LuceneTestCase$LuceneTestCaseRunner.runChild(LuceneTestCase.java:795)
    [junit] at org.apache.lucene.util.LuceneTestCase$LuceneTestCaseRunner.runChild(LuceneTestCase.java:768)
    [junit] Caused by: org.apache.solr.common.SolrException: Unknown query type 'func'
    [junit] at org.apache.solr.core.SolrCore.getQueryPlugin(SolrCore.java:1474)
    [junit] at org.apache.solr.search.QParser.getParser(QParser.java:286)
    [junit] at org.apache.solr.search.QParser.subQuery(QParser.java:176)
    [junit] at org.apache.solr.search.SolrQueryParser.getFieldQuery(SolrQueryParser.java:142)
    [junit] at org.apache.lucene.queryParser.QueryParser.getFieldQuery(QueryParser.java:754)
    [junit] at org.apache.lucene.queryParser.QueryParser.Term(QueryParser.java:1594)
    [junit] at org.apache.lucene.queryParser.QueryParser.Clause(QueryParser.java:1337)
    [junit] at org.apache.lucene.queryParser.QueryParser.Query(QueryParser.java:1263)
    [junit] at org.apache.lucene.queryParser.QueryParser.TopLevelQuery(QueryParser.java:1252)
    [junit] at org.apache.lucene.queryParser.QueryParser.parse(QueryParser.java:208)
    [junit] at org.apache.solr.search.LuceneQParser.parse(LuceneQParserPlugin.java:73)
    [junit] at org.apache.solr.search.QParser.getQuery(QParser.java:142)
    [junit] at org.apache.solr.handler.component.QueryComponent.prepare(QueryComponent.java:93)
    [junit] at org.apache.solr.handler.component.SearchHandler.handleRequestBody(SearchHandler.java:210)
    [junit] at org.apache.solr.handler.RequestHandlerBase.handleRequest(RequestHandlerBase.java:131)
    [junit] at org.apache.solr.core.SolrCore.execute(SolrCore.java:1325)
    [junit] at org.apache.solr.util.TestHarness.queryAndResponse(TestHarness.java:334)
    [junit] at org.apache.solr.util.TestHarness.query(TestHarness.java:321)
    [junit] at org.apache.solr.util.TestHarness.query(TestHarness.java:307)
    [junit] at org.apache.solr.SolrTestCaseJ4.assertQ(SolrTestCaseJ4.java:317)
    [junit]
    [junit]
    [junit] Testcase: testTrieDateRangeSearch(org.apache.solr.TestTrie): Caused an ERROR
    [junit] Exception during query
    [junit] java.lang.RuntimeException: Exception during query
    [junit] at org.apache.solr.SolrTestCaseJ4.assertQ(SolrTestCaseJ4.java:339)
    [junit] at org.apache.solr.TestTrie.testTrieDateRangeSearch(TestTrie.java:202)
    [junit] at org.apache.lucene.util.LuceneTestCase$LuceneTestCaseRunner.runChild(LuceneTestCase.java:795)
    [junit] at org.apache.lucene.util.LuceneTestCase$LuceneTestCaseRunner.runChild(LuceneTestCase.java:768)
    [junit] Caused by: org.apache.solr.common.SolrException: Unknown query type 'func'
    [junit] at org.apache.solr.core.SolrCore.getQueryPlugin(SolrCore.java:1474)
    [junit] at org.apache.solr.search.QParser.getParser(QParser.java:286)
    [junit] at org.apache.solr.search.QParser.subQuery(QParser.java:176)
    [junit] at org.apache.solr.search.SolrQueryParser.getFieldQuery(SolrQueryParser.java:142)
    [junit] at org.apache.lucene.queryParser.QueryParser.getFieldQuery(QueryParser.java:754)
    [junit] at org.apache.lucene.queryParser.QueryParser.Term(QueryParser.java:1594)
    [junit] at org.apache.lucene.queryParser.QueryParser.Clause(QueryParser.java:1337)
    [junit] at org.apache.lucene.queryParser.QueryParser.Query(QueryParser.java:1263)
    [junit] at org.apache.lucene.queryParser.QueryParser.TopLevelQuery(QueryParser.java:1252)
    [junit] at org.apache.lucene.queryParser.QueryParser.parse(QueryParser.java:208)
    [junit] at org.apache.solr.search.LuceneQParser.parse(LuceneQParserPlugin.java:73)
    [junit] at org.apache.solr.search.QParser.getQuery(QParser.java:142)
    [junit] at org.apache.solr.handler.component.QueryComponent.prepare(QueryComponent.java:93)
    [junit] at org.apache.solr.handler.component.SearchHandler.handleRequestBody(SearchHandler.java:210)
    [junit] at org.apache.solr.handler.RequestHandlerBase.handleRequest(RequestHandlerBase.java:131)
    [junit] at org.apache.solr.core.SolrCore.execute(SolrCore.java:1325)
    [junit] at org.apache.solr.util.TestHarness.queryAndResponse(TestHarness.java:334)
    [junit] at org.apache.solr.util.TestHarness.query(TestHarness.java:321)
    [junit] at org.apache.solr.util.TestHarness.query(TestHarness.java:307)
    [junit] at org.apache.solr.SolrTestCaseJ4.assertQ(SolrTestCaseJ4.java:317)
    [junit]
    [junit]
    [junit] Tests run: 8, Failures: 0, Errors: 5, Time elapsed: 3.814 sec
    [junit]
    [junit] ------------- Standard Output ---------------
    [junit] NOTE: reproduce with: ant test -Dtestcase=TestTrie -Dtestmethod=testTrieIntRangeSearch -Dtests.seed=-2722426925580758488:-212535574334114449
    [junit] NOTE: reproduce with: ant test -Dtestcase=TestTrie -Dtestmethod=testTrieFloatRangeSearch -Dtests.seed=-2722426925580758488:-8980412733871305155
    [junit] NOTE: reproduce with: ant test -Dtestcase=TestTrie -Dtestmethod=testTrieLongRangeSearch -Dtests.seed=-2722426925580758488:-8688081968302257420
    [junit] NOTE: reproduce with: ant test -Dtestcase=TestTrie -Dtestmethod=testTrieDoubleRangeSearch -Dtests.seed=-2722426925580758488:1705446365560533918
    [junit] NOTE: reproduce with: ant test -Dtestcase=TestTrie -Dtestmethod=testTrieDateRangeSearch -Dtests.seed=-2722426925580758488:2549506927018087212
    [junit] NOTE: test params are: codec=Standard, locale=sl, timezone=Japan
    [junit] ------------- ---------------- ---------------
    [junit] ------------- Standard Error -----------------
    [junit] 15.10.2010 7:29:20 org.apache.solr.common.SolrException log
    [junit] SEVERE: org.apache.solr.common.SolrException: Unknown query type 'func'
    [junit] at org.apache.solr.core.SolrCore.getQueryPlugin(SolrCore.java:1474)
    [junit] at org.apache.solr.search.QParser.getParser(QParser.java:286)
    [junit] at org.apache.solr.search.QParser.subQuery(QParser.java:176)
    [junit] at org.apache.solr.search.SolrQueryParser.getFieldQuery(SolrQueryParser.java:142)
    [junit] at org.apache.lucene.queryParser.QueryParser.getFieldQuery(QueryParser.java:754)
    [junit] at org.apache.lucene.queryParser.QueryParser.Term(QueryParser.java:1594)
    [junit] at org.apache.lucene.queryParser.QueryParser.Clause(QueryParser.java:1337)
    [junit] at org.apache.lucene.queryParser.QueryParser.Query(QueryParser.java:1263)
    [junit] at org.apache.lucene.queryParser.QueryParser.TopLevelQuery(QueryParser.java:1252)
    [junit] at org.apache.lucene.queryParser.QueryParser.parse(QueryParser.java:208)
    [junit] at org.apache.solr.search.LuceneQParser.parse(LuceneQParserPlugin.java:73)
    [junit] at org.apache.solr.search.QParser.getQuery(QParser.java:142)
    [junit] at org.apache.solr.handler.component.QueryComponent.prepare(QueryComponent.java:93)
    [junit] at org.apache.solr.handler.component.SearchHandler.handleRequestBody(SearchHandler.java:210)
    [junit] at org.apache.solr.handler.RequestHandlerBase.handleRequest(RequestHandlerBase.java:131)
    [junit] at org.apache.solr.core.SolrCore.execute(SolrCore.java:1325)
    [junit] at org.apache.solr.util.TestHarness.queryAndResponse(TestHarness.java:334)
    [junit] at org.apache.solr.util.TestHarness.query(TestHarness.java:321)
    [junit] at org.apache.solr.util.TestHarness.query(TestHarness.java:307)
    [junit] at org.apache.solr.SolrTestCaseJ4.assertQ(SolrTestCaseJ4.java:317)
    [junit] at org.apache.solr.TestTrie.testTrieIntRangeSearch(TestTrie.java:76)
    [junit] at sun.reflect.NativeMethodAccessorImpl.invoke0(Native Method)
    [junit] at sun.reflect.NativeMethodAccessorImpl.invoke(NativeMethodAccessorImpl.java:57)
    [junit] at sun.reflect.DelegatingMethodAccessorImpl.invoke(DelegatingMethodAccessorImpl.java:43)
    [junit] at java.lang.reflect.Method.invoke(Method.java:616)
    [junit] at org.junit.runners.model.FrameworkMethod$1.runReflectiveCall(FrameworkMethod.java:44)
    [junit] at org.junit.internal.runners.model.ReflectiveCallable.run(ReflectiveCallable.java:15)
    [junit] at org.junit.runners.model.FrameworkMethod.invokeExplosively(FrameworkMethod.java:41)
    [junit] at org.junit.internal.runners.statements.InvokeMethod.evaluate(InvokeMethod.java:20)
    [junit] at org.junit.rules.TestWatchman$1.evaluate(TestWatchman.java:48)
    [junit] at org.junit.internal.runners.statements.RunBefores.evaluate(RunBefores.java:28)
    [junit] at org.junit.internal.runners.statements.RunAfters.evaluate(RunAfters.java:31)
    [junit] at org.junit.runners.BlockJUnit4ClassRunner.runChild(BlockJUnit4ClassRunner.java:76)
    [junit] at org.apache.lucene.util.LuceneTestCase$LuceneTestCaseRunner.runChild(LuceneTestCase.java:795)
    [junit] at org.apache.lucene.util.LuceneTestCase$LuceneTestCaseRunner.runChild(LuceneTestCase.java:768)
    [junit] at org.junit.runners.ParentRunner$3.run(ParentRunner.java:193)
    [junit] at org.junit.runners.ParentRunner$1.schedule(ParentRunner.java:52)
    [junit] at org.junit.runners.ParentRunner.runChildren(ParentRunner.java:191)
    [junit] at org.junit.runners.ParentRunner.access$000(ParentRunner.java:42)
    [junit] at org.junit.runners.ParentRunner$2.evaluate(ParentRunner.java:184)
    [junit] at org.junit.internal.runners.statements.RunBefores.evaluate(RunBefores.java:28)
    [junit] at org.junit.internal.runners.statements.RunAfters.evaluate(RunAfters.java:31)
    [junit] at org.junit.runners.ParentRunner.run(ParentRunner.java:236)
    [junit] at junit.framework.JUnit4TestAdapter.run(JUnit4TestAdapter.java:39)
    [junit] at org.apache.tools.ant.taskdefs.optional.junit.JUnitTestRunner.run(JUnitTestRunner.java:421)
    [junit] at org.apache.tools.ant.taskdefs.optional.junit.JUnitTestRunner.launch(JUnitTestRunner.java:912)
    [junit] at org.apache.tools.ant.taskdefs.optional.junit.JUnitTestRunner.main(JUnitTestRunner.java:743)
    [junit]
    [junit] 15.10.2010 7:29:20 org.apache.solr.common.SolrException log
    [junit] SEVERE: org.apache.solr.common.SolrException: Unknown query type 'func'
    [junit] at org.apache.solr.core.SolrCore.getQueryPlugin(SolrCore.java:1474)
    [junit] at org.apache.solr.search.QParser.getParser(QParser.java:286)
    [junit] at org.apache.solr.search.QParser.subQuery(QParser.java:176)
    [junit] at org.apache.solr.search.SolrQueryParser.getFieldQuery(SolrQueryParser.java:142)
    [junit] at org.apache.lucene.queryParser.QueryParser.getFieldQuery(QueryParser.java:754)
    [junit] at org.apache.lucene.queryParser.QueryParser.Term(QueryParser.java:1594)
    [junit] at org.apache.lucene.queryParser.QueryParser.Clause(QueryParser.java:1337)
    [junit] at org.apache.lucene.queryParser.QueryParser.Query(QueryParser.java:1263)
    [junit] at org.apache.lucene.queryParser.QueryParser.TopLevelQuery(QueryParser.java:1252)
    [junit] at org.apache.lucene.queryParser.QueryParser.parse(QueryParser.java:208)
    [junit] at org.apache.solr.search.LuceneQParser.parse(LuceneQParserPlugin.java:73)
    [junit] at org.apache.solr.search.QParser.getQuery(QParser.java:142)
    [junit] at org.apache.solr.handler.component.QueryComponent.prepare(QueryComponent.java:93)
    [junit] at org.apache.solr.handler.component.SearchHandler.handleRequestBody(SearchHandler.java:210)
    [junit] at org.apache.solr.handler.RequestHandlerBase.handleRequest(RequestHandlerBase.java:131)
    [junit] at org.apache.solr.core.SolrCore.execute(SolrCore.java:1325)
    [junit] at org.apache.solr.util.TestHarness.queryAndResponse(TestHarness.java:334)
    [junit] at org.apache.solr.util.TestHarness.query(TestHarness.java:321)
    [junit] at org.apache.solr.util.TestHarness.query(TestHarness.java:307)
    [junit] at org.apache.solr.SolrTestCaseJ4.assertQ(SolrTestCaseJ4.java:317)
    [junit] at org.apache.solr.TestTrie.testTrieFloatRangeSearch(TestTrie.java:119)
    [junit] at sun.reflect.NativeMethodAccessorImpl.invoke0(Native Method)
    [junit] at sun.reflect.NativeMethodAccessorImpl.invoke(NativeMethodAccessorImpl.java:57)
    [junit] at sun.reflect.DelegatingMethodAccessorImpl.invoke(DelegatingMethodAccessorImpl.java:43)
    [junit] at java.lang.reflect.Method.invoke(Method.java:616)
    [junit] at org.junit.runners.model.FrameworkMethod$1.runReflectiveCall(FrameworkMethod.java:44)
    [junit] at org.junit.internal.runners.model.ReflectiveCallable.run(ReflectiveCallable.java:15)
    [junit] at org.junit.runners.model.FrameworkMethod.invokeExplosively(FrameworkMethod.java:41)
    [junit] at org.junit.internal.runners.statements.InvokeMethod.evaluate(InvokeMethod.java:20)
    [junit] at org.junit.rules.TestWatchman$1.evaluate(TestWatchman.java:48)
    [junit] at org.junit.internal.runners.statements.RunBefores.evaluate(RunBefores.java:28)
    [junit] at org.junit.internal.runners.statements.RunAfters.evaluate(RunAfters.java:31)
    [junit] at org.junit.runners.BlockJUnit4ClassRunner.runChild(BlockJUnit4ClassRunner.java:76)
    [junit] at org.apache.lucene.util.LuceneTestCase$LuceneTestCaseRunner.runChild(LuceneTestCase.java:795)
    [junit] at org.apache.lucene.util.LuceneTestCase$LuceneTestCaseRunner.runChild(LuceneTestCase.java:768)
    [junit] at org.junit.runners.ParentRunner$3.run(ParentRunner.java:193)
    [junit] at org.junit.runners.ParentRunner$1.schedule(ParentRunner.java:52)
    [junit] at org.junit.runners.ParentRunner.runChildren(ParentRunner.java:191)
    [junit] at org.junit.runners.ParentRunner.access$000(ParentRunner.java:42)
    [junit] at org.junit.runners.ParentRunner$2.evaluate(ParentRunner.java:184)
    [junit] at org.junit.internal.runners.statements.RunBefores.evaluate(RunBefores.java:28)
    [junit] at org.junit.internal.runners.statements.RunAfters.evaluate(RunAfters.java:31)
    [junit] at org.junit.runners.ParentRunner.run(ParentRunner.java:236)
    [junit] at junit.framework.JUnit4TestAdapter.run(JUnit4TestAdapter.java:39)
    [junit] at org.apache.tools.ant.taskdefs.optional.junit.JUnitTestRunner.run(JUnitTestRunner.java:421)
    [junit] at org.apache.tools.ant.taskdefs.optional.junit.JUnitTestRunner.launch(JUnitTestRunner.java:912)
    [junit] at org.apache.tools.ant.taskdefs.optional.junit.JUnitTestRunner.main(JUnitTestRunner.java:743)
    [junit]
    [junit] 15.10.2010 7:29:20 org.apache.solr.common.SolrException log
    [junit] SEVERE: org.apache.solr.common.SolrException: Unknown query type 'func'
    [junit] at org.apache.solr.core.SolrCore.getQueryPlugin(SolrCore.java:1474)
    [junit] at org.apache.solr.search.QParser.getParser(QParser.java:286)
    [junit] at org.apache.solr.search.QParser.subQuery(QParser.java:176)
    [junit] at org.apache.solr.search.SolrQueryParser.getFieldQuery(SolrQueryParser.java:142)
    [junit] at org.apache.lucene.queryParser.QueryParser.getFieldQuery(QueryParser.java:754)
    [junit] at org.apache.lucene.queryParser.QueryParser.Term(QueryParser.java:1594)
    [junit] at org.apache.lucene.queryParser.QueryParser.Clause(QueryParser.java:1337)
    [junit] at org.apache.lucene.queryParser.QueryParser.Query(QueryParser.java:1263)
    [junit] at org.apache.lucene.queryParser.QueryParser.TopLevelQuery(QueryParser.java:1252)
    [junit] at org.apache.lucene.queryParser.QueryParser.parse(QueryParser.java:208)
    [junit] at org.apache.solr.search.LuceneQParser.parse(LuceneQParserPlugin.java:73)
    [junit] at org.apache.solr.search.QParser.getQuery(QParser.java:142)
    [junit] at org.apache.solr.handler.component.QueryComponent.prepare(QueryComponent.java:93)
    [junit] at org.apache.solr.handler.component.SearchHandler.handleRequestBody(SearchHandler.java:210)
    [junit] at org.apache.solr.handler.RequestHandlerBase.handleRequest(RequestHandlerBase.java:131)
    [junit] at org.apache.solr.core.SolrCore.execute(SolrCore.java:1325)
    [junit] at org.apache.solr.util.TestHarness.queryAndResponse(TestHarness.java:334)
    [junit] at org.apache.solr.util.TestHarness.query(TestHarness.java:321)
    [junit] at org.apache.solr.util.TestHarness.query(TestHarness.java:307)
    [junit] at org.apache.solr.SolrTestCaseJ4.assertQ(SolrTestCaseJ4.java:317)
    [junit] at org.apache.solr.TestTrie.testTrieLongRangeSearch(TestTrie.java:138)
    [junit] at sun.reflect.NativeMethodAccessorImpl.invoke0(Native Method)
    [junit] at sun.reflect.NativeMethodAccessorImpl.invoke(NativeMethodAccessorImpl.java:57)
    [junit] at sun.reflect.DelegatingMethodAccessorImpl.invoke(DelegatingMethodAccessorImpl.java:43)
    [junit] at java.lang.reflect.Method.invoke(Method.java:616)
    [junit] at org.junit.runners.model.FrameworkMethod$1.runReflectiveCall(FrameworkMethod.java:44)
    [junit] at org.junit.internal.runners.model.ReflectiveCallable.run(ReflectiveCallable.java:15)
    [junit] at org.junit.runners.model.FrameworkMethod.invokeExplosively(FrameworkMethod.java:41)
    [junit] at org.junit.internal.runners.statements.InvokeMethod.evaluate(InvokeMethod.java:20)
    [junit] at org.junit.rules.TestWatchman$1.evaluate(TestWatchman.java:48)
    [junit] at org.junit.internal.runners.statements.RunBefores.evaluate(RunBefores.java:28)
    [junit] at org.junit.internal.runners.statements.RunAfters.evaluate(RunAfters.java:31)
    [junit] at org.junit.runners.BlockJUnit4ClassRunner.runChild(BlockJUnit4ClassRunner.java:76)
    [junit] at org.apache.lucene.util.LuceneTestCase$LuceneTestCaseRunner.runChild(LuceneTestCase.java:795)
    [junit] at org.apache.lucene.util.LuceneTestCase$LuceneTestCaseRunner.runChild(LuceneTestCase.java:768)
    [junit] at org.junit.runners.ParentRunner$3.run(ParentRunner.java:193)
    [junit] at org.junit.runners.ParentRunner$1.schedule(ParentRunner.java:52)
    [junit] at org.junit.runners.ParentRunner.runChildren(ParentRunner.java:191)
    [junit] at org.junit.runners.ParentRunner.access$000(ParentRunner.java:42)
    [junit] at org.junit.runners.ParentRunner$2.evaluate(ParentRunner.java:184)
    [junit] at org.junit.internal.runners.statements.RunBefores.evaluate(RunBefores.java:28)
    [junit] at org.junit.internal.runners.statements.RunAfters.evaluate(RunAfters.java:31)
    [junit] at org.junit.runners.ParentRunner.run(ParentRunner.java:236)
    [junit] at junit.framework.JUnit4TestAdapter.run(JUnit4TestAdapter.java:39)
    [junit] at org.apache.tools.ant.taskdefs.optional.junit.JUnitTestRunner.run(JUnitTestRunner.java:421)
    [junit] at org.apache.tools.ant.taskdefs.optional.junit.JUnitTestRunner.launch(JUnitTestRunner.java:912)
    [junit] at org.apache.tools.ant.taskdefs.optional.junit.JUnitTestRunner.main(JUnitTestRunner.java:743)
    [junit]
    [junit] 15.10.2010 7:29:21 org.apache.solr.common.SolrException log
    [junit] SEVERE: org.apache.solr.common.SolrException: Unknown query type 'func'
    [junit] at org.apache.solr.core.SolrCore.getQueryPlugin(SolrCore.java:1474)
    [junit] at org.apache.solr.search.QParser.getParser(QParser.java:286)
    [junit] at org.apache.solr.search.QParser.subQuery(QParser.java:176)
    [junit] at org.apache.solr.search.SolrQueryParser.getFieldQuery(SolrQueryParser.java:142)
    [junit] at org.apache.lucene.queryParser.QueryParser.getFieldQuery(QueryParser.java:754)
    [junit] at org.apache.lucene.queryParser.QueryParser.Term(QueryParser.java:1594)
    [junit] at org.apache.lucene.queryParser.QueryParser.Clause(QueryParser.java:1337)
    [junit] at org.apache.lucene.queryParser.QueryParser.Query(QueryParser.java:1263)
    [junit] at org.apache.lucene.queryParser.QueryParser.TopLevelQuery(QueryParser.java:1252)
    [junit] at org.apache.lucene.queryParser.QueryParser.parse(QueryParser.java:208)
    [junit] at org.apache.solr.search.LuceneQParser.parse(LuceneQParserPlugin.java:73)
    [junit] at org.apache.solr.search.QParser.getQuery(QParser.java:142)
    [junit] at org.apache.solr.handler.component.QueryComponent.prepare(QueryComponent.java:93)
    [junit] at org.apache.solr.handler.component.SearchHandler.handleRequestBody(SearchHandler.java:210)
    [junit] at org.apache.solr.handler.RequestHandlerBase.handleRequest(RequestHandlerBase.java:131)
    [junit] at org.apache.solr.core.SolrCore.execute(SolrCore.java:1325)
    [junit] at org.apache.solr.util.TestHarness.queryAndResponse(TestHarness.java:334)
    [junit] at org.apache.solr.util.TestHarness.query(TestHarness.java:321)
    [junit] at org.apache.solr.util.TestHarness.query(TestHarness.java:307)
    [junit] at org.apache.solr.SolrTestCaseJ4.assertQ(SolrTestCaseJ4.java:317)
    [junit] at org.apache.solr.TestTrie.testTrieDoubleRangeSearch(TestTrie.java:156)
    [junit] at sun.reflect.NativeMethodAccessorImpl.invoke0(Native Method)
    [junit] at sun.reflect.NativeMethodAccessorImpl.invoke(NativeMethodAccessorImpl.java:57)
    [junit] at sun.reflect.DelegatingMethodAccessorImpl.invoke(DelegatingMethodAccessorImpl.java:43)
    [junit] at java.lang.reflect.Method.invoke(Method.java:616)
    [junit] at org.junit.runners.model.FrameworkMethod$1.runReflectiveCall(FrameworkMethod.java:44)
    [junit] at org.junit.internal.runners.model.ReflectiveCallable.run(ReflectiveCallable.java:15)
    [junit] at org.junit.runners.model.FrameworkMethod.invokeExplosively(FrameworkMethod.java:41)
    [junit] at org.junit.internal.runners.statements.InvokeMethod.evaluate(InvokeMethod.java:20)
    [junit] at org.junit.rules.TestWatchman$1.evaluate(TestWatchman.java:48)
    [junit] at org.junit.internal.runners.statements.RunBefores.evaluate(RunBefores.java:28)
    [junit] at org.junit.internal.runners.statements.RunAfters.evaluate(RunAfters.java:31)
    [junit] at org.junit.runners.BlockJUnit4ClassRunner.runChild(BlockJUnit4ClassRunner.java:76)
    [junit] at org.apache.lucene.util.LuceneTestCase$LuceneTestCaseRunner.runChild(LuceneTestCase.java:795)
    [junit] at org.apache.lucene.util.LuceneTestCase$LuceneTestCaseRunner.runChild(LuceneTestCase.java:768)
    [junit] at org.junit.runners.ParentRunner$3.run(ParentRunner.java:193)
    [junit] at org.junit.runners.ParentRunner$1.schedule(ParentRunner.java:52)
    [junit] at org.junit.runners.ParentRunner.runChildren(ParentRunner.java:191)
    [junit] at org.junit.runners.ParentRunner.access$000(ParentRunner.java:42)
    [junit] at org.junit.runners.ParentRunner$2.evaluate(ParentRunner.java:184)
    [junit] at org.junit.internal.runners.statements.RunBefores.evaluate(RunBefores.java:28)
    [junit] at org.junit.internal.runners.statements.RunAfters.evaluate(RunAfters.java:31)
    [junit] at org.junit.runners.ParentRunner.run(ParentRunner.java:236)
    [junit] at junit.framework.JUnit4TestAdapter.run(JUnit4TestAdapter.java:39)
    [junit] at org.apache.tools.ant.taskdefs.optional.junit.JUnitTestRunner.run(JUnitTestRunner.java:421)
    [junit] at org.apache.tools.ant.taskdefs.optional.junit.JUnitTestRunner.launch(JUnitTestRunner.java:912)
    [junit] at org.apache.tools.ant.taskdefs.optional.junit.JUnitTestRunner.main(JUnitTestRunner.java:743)
    [junit]
    [junit] 15.10.2010 7:29:21 org.apache.solr.common.SolrException log
    [junit] SEVERE: org.apache.solr.common.SolrException: Unknown query type 'func'
    [junit] at org.apache.solr.core.SolrCore.getQueryPlugin(SolrCore.java:1474)
    [junit] at org.apache.solr.search.QParser.getParser(QParser.java:286)
    [junit] at org.apache.solr.search.QParser.subQuery(QParser.java:176)
    [junit] at org.apache.solr.search.SolrQueryParser.getFieldQuery(SolrQueryParser.java:142)
    [junit] Testsuite: org.apache.solr.analysis.SnowballPorterFilterFactoryTest
    [junit] at org.apache.lucene.queryParser.QueryParser.getFieldQuery(QueryParser.java:754)
    [junit] Tests run: 3, Failures: 0, Errors: 0, Time elapsed: 0.02 sec
    [junit] at org.apache.lucene.queryParser.QueryParser.Term(QueryParser.java:1594)
    [junit]
    [junit] at org.apache.lucene.queryParser.QueryParser.Clause(QueryParser.java:1337)
    [junit] at org.apache.lucene.queryParser.QueryParser.Query(QueryParser.java:1263)
    [junit] at org.apache.lucene.queryParser.QueryParser.TopLevelQuery(QueryParser.java:1252)
    [junit] at org.apache.lucene.queryParser.QueryParser.parse(QueryParser.java:208)
    [junit] at org.apache.solr.search.LuceneQParser.parse(LuceneQParserPlugin.java:73)
    [junit] at org.apache.solr.search.QParser.getQuery(QParser.java:142)
    [junit] at org.apache.solr.handler.component.QueryComponent.prepare(QueryComponent.java:93)
    [junit] at org.apache.solr.handler.component.SearchHandler.handleRequestBody(SearchHandler.java:210)
    [junit] at org.apache.solr.handler.RequestHandlerBase.handleRequest(RequestHandlerBase.java:131)
    [junit] at org.apache.solr.core.SolrCore.execute(SolrCore.java:1325)
    [junit] at org.apache.solr.util.TestHarness.queryAndResponse(TestHarness.java:334)
    [junit] at org.apache.solr.util.TestHarness.query(TestHarness.java:321)
    [junit] at org.apache.solr.util.TestHarness.query(TestHarness.java:307)
    [junit] at org.apache.solr.SolrTestCaseJ4.assertQ(SolrTestCaseJ4.java:317)
    [junit] at org.apache.solr.TestTrie.testTrieDateRangeSearch(TestTrie.java:202)
    [junit] at sun.reflect.NativeMethodAccessorImpl.invoke0(Native Method)
    [junit] at sun.reflect.NativeMethodAccessorImpl.invoke(NativeMethodAccessorImpl.java:57)
    [junit] at sun.reflect.DelegatingMethodAccessorImpl.invoke(DelegatingMethodAccessorImpl.java:43)
    [junit] at java.lang.reflect.Method.invoke(Method.java:616)
    [junit] at org.junit.runners.model.FrameworkMethod$1.runReflectiveCall(FrameworkMethod.java:44)
    [junit] at org.junit.internal.runners.model.ReflectiveCallable.run(ReflectiveCallable.java:15)
    [junit] at org.junit.runners.model.FrameworkMethod.invokeExplosively(FrameworkMethod.java:41)
    [junit] at org.junit.internal.runners.statements.InvokeMethod.evaluate(InvokeMethod.java:20)
    [junit] at org.junit.rules.TestWatchman$1.evaluate(TestWatchman.java:48)
    [junit] at org.junit.internal.runners.statements.RunBefores.evaluate(RunBefores.java:28)
    [junit] at org.junit.internal.runners.statements.RunAfters.evaluate(RunAfters.java:31)
    [junit] at org.junit.runners.BlockJUnit4ClassRunner.runChild(BlockJUnit4ClassRunner.java:76)
    [junit] at org.apache.lucene.util.LuceneTestCase$LuceneTestCaseRunner.runChild(LuceneTestCase.java:795)
    [junit] at org.apache.lucene.util.LuceneTestCase$LuceneTestCaseRunner.runChild(LuceneTestCase.java:768)
    [junit] at org.junit.runners.ParentRunner$3.run(ParentRunner.java:193)
    [junit] at org.junit.runners.ParentRunner$1.schedule(ParentRunner.java:52)
    [junit] at org.junit.runners.ParentRunner.runChildren(ParentRunner.java:191)
    [junit] at org.junit.runners.ParentRunner.access$000(ParentRunner.java:42)
    [junit] at org.junit.runners.ParentRunner$2.evaluate(ParentRunner.java:184)
    [junit] at org.junit.internal.runners.statements.RunBefores.evaluate(RunBefores.java:28)
    [junit] at org.junit.internal.runners.statements.RunAfters.evaluate(RunAfters.java:31)
    [junit] at org.junit.runners.ParentRunner.run(ParentRunner.java:236)
    [junit] at junit.framework.JUnit4TestAdapter.run(JUnit4TestAdapter.java:39)
    [junit] at org.apache.tools.ant.taskdefs.optional.junit.JUnitTestRunner.run(JUnitTestRunner.java:421)
    [junit] at org.apache.tools.ant.taskdefs.optional.junit.JUnitTestRunner.launch(JUnitTestRunner.java:912)
    [junit] at org.apache.tools.ant.taskdefs.optional.junit.JUnitTestRunner.main(JUnitTestRunner.java:743)
    [junit]
    [junit] ------------- ---------------- ---------------
    [junit] TEST org.apache.solr.TestTrie FAILED
{noformat}

--
This message is automatically generated by JIRA.
-
You can reply to this email to add a comment to the issue online.


---------------------------------------------------------------------
To unsubscribe, e-mail: [hidden email]
For additional commands, e-mail: [hidden email]

Reply | Threaded
Open this post in threaded view
|

[jira] Commented: (SOLR-2160) TestTrie test failure

JIRA jira@apache.org

    [ https://issues.apache.org/jira/browse/SOLR-2160?page=com.atlassian.jira.plugin.system.issuetabpanels:comment-tabpanel&focusedCommentId=12921330#action_12921330 ]

Yonik Seeley commented on SOLR-2160:
------------------------------------

Hmmm, "func" (the function query parser) not found?
Must be meddling from another test.

Is there a way to find out what test(s) run before any given test in the same JVM?

> TestTrie test failure
> ---------------------
>
>                 Key: SOLR-2160
>                 URL: https://issues.apache.org/jira/browse/SOLR-2160
>             Project: Solr
>          Issue Type: Bug
>          Components: Build
>    Affects Versions: 3.1, 4.0
>         Environment: Hudson
>            Reporter: Robert Muir
>             Fix For: 3.1, 4.0
>
>
> Several test methods in TestTrie failed in hudson, with errors such as this:
> Caused by: org.apache.solr.common.SolrException: Unknown query type 'func'
> Here is the stacktrace:
> {noformat}
>    [junit] Testsuite: org.apache.solr.TestTrie
>     [junit] Testcase: testTrieIntRangeSearch(org.apache.solr.TestTrie): Caused an ERROR
>     [junit] Exception during query
>     [junit] java.lang.RuntimeException: Exception during query
>     [junit] at org.apache.solr.SolrTestCaseJ4.assertQ(SolrTestCaseJ4.java:339)
>     [junit] at org.apache.solr.TestTrie.testTrieIntRangeSearch(TestTrie.java:76)
>     [junit] at org.apache.lucene.util.LuceneTestCase$LuceneTestCaseRunner.runChild(LuceneTestCase.java:795)
>     [junit] at org.apache.lucene.util.LuceneTestCase$LuceneTestCaseRunner.runChild(LuceneTestCase.java:768)
>     [junit] Caused by: org.apache.solr.common.SolrException: Unknown query type 'func'
>     [junit] at org.apache.solr.core.SolrCore.getQueryPlugin(SolrCore.java:1474)
>     [junit] at org.apache.solr.search.QParser.getParser(QParser.java:286)
>     [junit] at org.apache.solr.search.QParser.subQuery(QParser.java:176)
>     [junit] at org.apache.solr.search.SolrQueryParser.getFieldQuery(SolrQueryParser.java:142)
>     [junit] at org.apache.lucene.queryParser.QueryParser.getFieldQuery(QueryParser.java:754)
>     [junit] at org.apache.lucene.queryParser.QueryParser.Term(QueryParser.java:1594)
>     [junit] at org.apache.lucene.queryParser.QueryParser.Clause(QueryParser.java:1337)
>     [junit] at org.apache.lucene.queryParser.QueryParser.Query(QueryParser.java:1263)
>     [junit] at org.apache.lucene.queryParser.QueryParser.TopLevelQuery(QueryParser.java:1252)
>     [junit] at org.apache.lucene.queryParser.QueryParser.parse(QueryParser.java:208)
>     [junit] at org.apache.solr.search.LuceneQParser.parse(LuceneQParserPlugin.java:73)
>     [junit] at org.apache.solr.search.QParser.getQuery(QParser.java:142)
>     [junit] at org.apache.solr.handler.component.QueryComponent.prepare(QueryComponent.java:93)
>     [junit] at org.apache.solr.handler.component.SearchHandler.handleRequestBody(SearchHandler.java:210)
>     [junit] at org.apache.solr.handler.RequestHandlerBase.handleRequest(RequestHandlerBase.java:131)
>     [junit] at org.apache.solr.core.SolrCore.execute(SolrCore.java:1325)
>     [junit] at org.apache.solr.util.TestHarness.queryAndResponse(TestHarness.java:334)
>     [junit] at org.apache.solr.util.TestHarness.query(TestHarness.java:321)
>     [junit] at org.apache.solr.util.TestHarness.query(TestHarness.java:307)
>     [junit] at org.apache.solr.SolrTestCaseJ4.assertQ(SolrTestCaseJ4.java:317)
>     [junit]
>     [junit]
>     [junit] Testcase: testTrieFloatRangeSearch(org.apache.solr.TestTrie): Caused an ERROR
>     [junit] Exception during query
>     [junit] java.lang.RuntimeException: Exception during query
>     [junit] at org.apache.solr.SolrTestCaseJ4.assertQ(SolrTestCaseJ4.java:339)
>     [junit] at org.apache.solr.TestTrie.testTrieFloatRangeSearch(TestTrie.java:119)
>     [junit] at org.apache.lucene.util.LuceneTestCase$LuceneTestCaseRunner.runChild(LuceneTestCase.java:795)
>     [junit] at org.apache.lucene.util.LuceneTestCase$LuceneTestCaseRunner.runChild(LuceneTestCase.java:768)
>     [junit] Caused by: org.apache.solr.common.SolrException: Unknown query type 'func'
>     [junit] at org.apache.solr.core.SolrCore.getQueryPlugin(SolrCore.java:1474)
>     [junit] at org.apache.solr.search.QParser.getParser(QParser.java:286)
>     [junit] at org.apache.solr.search.QParser.subQuery(QParser.java:176)
>     [junit] at org.apache.solr.search.SolrQueryParser.getFieldQuery(SolrQueryParser.java:142)
>     [junit] at org.apache.lucene.queryParser.QueryParser.getFieldQuery(QueryParser.java:754)
>     [junit] at org.apache.lucene.queryParser.QueryParser.Term(QueryParser.java:1594)
>     [junit] at org.apache.lucene.queryParser.QueryParser.Clause(QueryParser.java:1337)
>     [junit] at org.apache.lucene.queryParser.QueryParser.Query(QueryParser.java:1263)
>     [junit] at org.apache.lucene.queryParser.QueryParser.TopLevelQuery(QueryParser.java:1252)
>     [junit] at org.apache.lucene.queryParser.QueryParser.parse(QueryParser.java:208)
>     [junit] at org.apache.solr.search.LuceneQParser.parse(LuceneQParserPlugin.java:73)
>     [junit] at org.apache.solr.search.QParser.getQuery(QParser.java:142)
>     [junit] at org.apache.solr.handler.component.QueryComponent.prepare(QueryComponent.java:93)
>     [junit] at org.apache.solr.handler.component.SearchHandler.handleRequestBody(SearchHandler.java:210)
>     [junit] at org.apache.solr.handler.RequestHandlerBase.handleRequest(RequestHandlerBase.java:131)
>     [junit] at org.apache.solr.core.SolrCore.execute(SolrCore.java:1325)
>     [junit] at org.apache.solr.util.TestHarness.queryAndResponse(TestHarness.java:334)
>     [junit] at org.apache.solr.util.TestHarness.query(TestHarness.java:321)
>     [junit] at org.apache.solr.util.TestHarness.query(TestHarness.java:307)
>     [junit] at org.apache.solr.SolrTestCaseJ4.assertQ(SolrTestCaseJ4.java:317)
>     [junit]
>     [junit]
>     [junit] Testcase: testTrieLongRangeSearch(org.apache.solr.TestTrie): Caused an ERROR
>     [junit] Exception during query
>     [junit] java.lang.RuntimeException: Exception during query
>     [junit] at org.apache.solr.SolrTestCaseJ4.assertQ(SolrTestCaseJ4.java:339)
>     [junit] at org.apache.solr.TestTrie.testTrieLongRangeSearch(TestTrie.java:138)
>     [junit] at org.apache.lucene.util.LuceneTestCase$LuceneTestCaseRunner.runChild(LuceneTestCase.java:795)
>     [junit] at org.apache.lucene.util.LuceneTestCase$LuceneTestCaseRunner.runChild(LuceneTestCase.java:768)
>     [junit] Caused by: org.apache.solr.common.SolrException: Unknown query type 'func'
>     [junit] at org.apache.solr.core.SolrCore.getQueryPlugin(SolrCore.java:1474)
>     [junit] at org.apache.solr.search.QParser.getParser(QParser.java:286)
>     [junit] at org.apache.solr.search.QParser.subQuery(QParser.java:176)
>     [junit] at org.apache.solr.search.SolrQueryParser.getFieldQuery(SolrQueryParser.java:142)
>     [junit] at org.apache.lucene.queryParser.QueryParser.getFieldQuery(QueryParser.java:754)
>     [junit] at org.apache.lucene.queryParser.QueryParser.Term(QueryParser.java:1594)
>     [junit] at org.apache.lucene.queryParser.QueryParser.Clause(QueryParser.java:1337)
>     [junit] at org.apache.lucene.queryParser.QueryParser.Query(QueryParser.java:1263)
>     [junit] at org.apache.lucene.queryParser.QueryParser.TopLevelQuery(QueryParser.java:1252)
>     [junit] at org.apache.lucene.queryParser.QueryParser.parse(QueryParser.java:208)
>     [junit] at org.apache.solr.search.LuceneQParser.parse(LuceneQParserPlugin.java:73)
>     [junit] at org.apache.solr.search.QParser.getQuery(QParser.java:142)
>     [junit] at org.apache.solr.handler.component.QueryComponent.prepare(QueryComponent.java:93)
>     [junit] at org.apache.solr.handler.component.SearchHandler.handleRequestBody(SearchHandler.java:210)
>     [junit] at org.apache.solr.handler.RequestHandlerBase.handleRequest(RequestHandlerBase.java:131)
>     [junit] at org.apache.solr.core.SolrCore.execute(SolrCore.java:1325)
>     [junit] at org.apache.solr.util.TestHarness.queryAndResponse(TestHarness.java:334)
>     [junit] at org.apache.solr.util.TestHarness.query(TestHarness.java:321)
>     [junit] at org.apache.solr.util.TestHarness.query(TestHarness.java:307)
>     [junit] at org.apache.solr.SolrTestCaseJ4.assertQ(SolrTestCaseJ4.java:317)
>     [junit]
>     [junit]
>     [junit] Testcase: testTrieDoubleRangeSearch(org.apache.solr.TestTrie): Caused an ERROR
>     [junit] Exception during query
>     [junit] java.lang.RuntimeException: Exception during query
>     [junit] at org.apache.solr.SolrTestCaseJ4.assertQ(SolrTestCaseJ4.java:339)
>     [junit] at org.apache.solr.TestTrie.testTrieDoubleRangeSearch(TestTrie.java:156)
>     [junit] at org.apache.lucene.util.LuceneTestCase$LuceneTestCaseRunner.runChild(LuceneTestCase.java:795)
>     [junit] at org.apache.lucene.util.LuceneTestCase$LuceneTestCaseRunner.runChild(LuceneTestCase.java:768)
>     [junit] Caused by: org.apache.solr.common.SolrException: Unknown query type 'func'
>     [junit] at org.apache.solr.core.SolrCore.getQueryPlugin(SolrCore.java:1474)
>     [junit] at org.apache.solr.search.QParser.getParser(QParser.java:286)
>     [junit] at org.apache.solr.search.QParser.subQuery(QParser.java:176)
>     [junit] at org.apache.solr.search.SolrQueryParser.getFieldQuery(SolrQueryParser.java:142)
>     [junit] at org.apache.lucene.queryParser.QueryParser.getFieldQuery(QueryParser.java:754)
>     [junit] at org.apache.lucene.queryParser.QueryParser.Term(QueryParser.java:1594)
>     [junit] at org.apache.lucene.queryParser.QueryParser.Clause(QueryParser.java:1337)
>     [junit] at org.apache.lucene.queryParser.QueryParser.Query(QueryParser.java:1263)
>     [junit] at org.apache.lucene.queryParser.QueryParser.TopLevelQuery(QueryParser.java:1252)
>     [junit] at org.apache.lucene.queryParser.QueryParser.parse(QueryParser.java:208)
>     [junit] at org.apache.solr.search.LuceneQParser.parse(LuceneQParserPlugin.java:73)
>     [junit] at org.apache.solr.search.QParser.getQuery(QParser.java:142)
>     [junit] at org.apache.solr.handler.component.QueryComponent.prepare(QueryComponent.java:93)
>     [junit] at org.apache.solr.handler.component.SearchHandler.handleRequestBody(SearchHandler.java:210)
>     [junit] at org.apache.solr.handler.RequestHandlerBase.handleRequest(RequestHandlerBase.java:131)
>     [junit] at org.apache.solr.core.SolrCore.execute(SolrCore.java:1325)
>     [junit] at org.apache.solr.util.TestHarness.queryAndResponse(TestHarness.java:334)
>     [junit] at org.apache.solr.util.TestHarness.query(TestHarness.java:321)
>     [junit] at org.apache.solr.util.TestHarness.query(TestHarness.java:307)
>     [junit] at org.apache.solr.SolrTestCaseJ4.assertQ(SolrTestCaseJ4.java:317)
>     [junit]
>     [junit]
>     [junit] Testcase: testTrieDateRangeSearch(org.apache.solr.TestTrie): Caused an ERROR
>     [junit] Exception during query
>     [junit] java.lang.RuntimeException: Exception during query
>     [junit] at org.apache.solr.SolrTestCaseJ4.assertQ(SolrTestCaseJ4.java:339)
>     [junit] at org.apache.solr.TestTrie.testTrieDateRangeSearch(TestTrie.java:202)
>     [junit] at org.apache.lucene.util.LuceneTestCase$LuceneTestCaseRunner.runChild(LuceneTestCase.java:795)
>     [junit] at org.apache.lucene.util.LuceneTestCase$LuceneTestCaseRunner.runChild(LuceneTestCase.java:768)
>     [junit] Caused by: org.apache.solr.common.SolrException: Unknown query type 'func'
>     [junit] at org.apache.solr.core.SolrCore.getQueryPlugin(SolrCore.java:1474)
>     [junit] at org.apache.solr.search.QParser.getParser(QParser.java:286)
>     [junit] at org.apache.solr.search.QParser.subQuery(QParser.java:176)
>     [junit] at org.apache.solr.search.SolrQueryParser.getFieldQuery(SolrQueryParser.java:142)
>     [junit] at org.apache.lucene.queryParser.QueryParser.getFieldQuery(QueryParser.java:754)
>     [junit] at org.apache.lucene.queryParser.QueryParser.Term(QueryParser.java:1594)
>     [junit] at org.apache.lucene.queryParser.QueryParser.Clause(QueryParser.java:1337)
>     [junit] at org.apache.lucene.queryParser.QueryParser.Query(QueryParser.java:1263)
>     [junit] at org.apache.lucene.queryParser.QueryParser.TopLevelQuery(QueryParser.java:1252)
>     [junit] at org.apache.lucene.queryParser.QueryParser.parse(QueryParser.java:208)
>     [junit] at org.apache.solr.search.LuceneQParser.parse(LuceneQParserPlugin.java:73)
>     [junit] at org.apache.solr.search.QParser.getQuery(QParser.java:142)
>     [junit] at org.apache.solr.handler.component.QueryComponent.prepare(QueryComponent.java:93)
>     [junit] at org.apache.solr.handler.component.SearchHandler.handleRequestBody(SearchHandler.java:210)
>     [junit] at org.apache.solr.handler.RequestHandlerBase.handleRequest(RequestHandlerBase.java:131)
>     [junit] at org.apache.solr.core.SolrCore.execute(SolrCore.java:1325)
>     [junit] at org.apache.solr.util.TestHarness.queryAndResponse(TestHarness.java:334)
>     [junit] at org.apache.solr.util.TestHarness.query(TestHarness.java:321)
>     [junit] at org.apache.solr.util.TestHarness.query(TestHarness.java:307)
>     [junit] at org.apache.solr.SolrTestCaseJ4.assertQ(SolrTestCaseJ4.java:317)
>     [junit]
>     [junit]
>     [junit] Tests run: 8, Failures: 0, Errors: 5, Time elapsed: 3.814 sec
>     [junit]
>     [junit] ------------- Standard Output ---------------
>     [junit] NOTE: reproduce with: ant test -Dtestcase=TestTrie -Dtestmethod=testTrieIntRangeSearch -Dtests.seed=-2722426925580758488:-212535574334114449
>     [junit] NOTE: reproduce with: ant test -Dtestcase=TestTrie -Dtestmethod=testTrieFloatRangeSearch -Dtests.seed=-2722426925580758488:-8980412733871305155
>     [junit] NOTE: reproduce with: ant test -Dtestcase=TestTrie -Dtestmethod=testTrieLongRangeSearch -Dtests.seed=-2722426925580758488:-8688081968302257420
>     [junit] NOTE: reproduce with: ant test -Dtestcase=TestTrie -Dtestmethod=testTrieDoubleRangeSearch -Dtests.seed=-2722426925580758488:1705446365560533918
>     [junit] NOTE: reproduce with: ant test -Dtestcase=TestTrie -Dtestmethod=testTrieDateRangeSearch -Dtests.seed=-2722426925580758488:2549506927018087212
>     [junit] NOTE: test params are: codec=Standard, locale=sl, timezone=Japan
>     [junit] ------------- ---------------- ---------------
>     [junit] ------------- Standard Error -----------------
>     [junit] 15.10.2010 7:29:20 org.apache.solr.common.SolrException log
>     [junit] SEVERE: org.apache.solr.common.SolrException: Unknown query type 'func'
>     [junit] at org.apache.solr.core.SolrCore.getQueryPlugin(SolrCore.java:1474)
>     [junit] at org.apache.solr.search.QParser.getParser(QParser.java:286)
>     [junit] at org.apache.solr.search.QParser.subQuery(QParser.java:176)
>     [junit] at org.apache.solr.search.SolrQueryParser.getFieldQuery(SolrQueryParser.java:142)
>     [junit] at org.apache.lucene.queryParser.QueryParser.getFieldQuery(QueryParser.java:754)
>     [junit] at org.apache.lucene.queryParser.QueryParser.Term(QueryParser.java:1594)
>     [junit] at org.apache.lucene.queryParser.QueryParser.Clause(QueryParser.java:1337)
>     [junit] at org.apache.lucene.queryParser.QueryParser.Query(QueryParser.java:1263)
>     [junit] at org.apache.lucene.queryParser.QueryParser.TopLevelQuery(QueryParser.java:1252)
>     [junit] at org.apache.lucene.queryParser.QueryParser.parse(QueryParser.java:208)
>     [junit] at org.apache.solr.search.LuceneQParser.parse(LuceneQParserPlugin.java:73)
>     [junit] at org.apache.solr.search.QParser.getQuery(QParser.java:142)
>     [junit] at org.apache.solr.handler.component.QueryComponent.prepare(QueryComponent.java:93)
>     [junit] at org.apache.solr.handler.component.SearchHandler.handleRequestBody(SearchHandler.java:210)
>     [junit] at org.apache.solr.handler.RequestHandlerBase.handleRequest(RequestHandlerBase.java:131)
>     [junit] at org.apache.solr.core.SolrCore.execute(SolrCore.java:1325)
>     [junit] at org.apache.solr.util.TestHarness.queryAndResponse(TestHarness.java:334)
>     [junit] at org.apache.solr.util.TestHarness.query(TestHarness.java:321)
>     [junit] at org.apache.solr.util.TestHarness.query(TestHarness.java:307)
>     [junit] at org.apache.solr.SolrTestCaseJ4.assertQ(SolrTestCaseJ4.java:317)
>     [junit] at org.apache.solr.TestTrie.testTrieIntRangeSearch(TestTrie.java:76)
>     [junit] at sun.reflect.NativeMethodAccessorImpl.invoke0(Native Method)
>     [junit] at sun.reflect.NativeMethodAccessorImpl.invoke(NativeMethodAccessorImpl.java:57)
>     [junit] at sun.reflect.DelegatingMethodAccessorImpl.invoke(DelegatingMethodAccessorImpl.java:43)
>     [junit] at java.lang.reflect.Method.invoke(Method.java:616)
>     [junit] at org.junit.runners.model.FrameworkMethod$1.runReflectiveCall(FrameworkMethod.java:44)
>     [junit] at org.junit.internal.runners.model.ReflectiveCallable.run(ReflectiveCallable.java:15)
>     [junit] at org.junit.runners.model.FrameworkMethod.invokeExplosively(FrameworkMethod.java:41)
>     [junit] at org.junit.internal.runners.statements.InvokeMethod.evaluate(InvokeMethod.java:20)
>     [junit] at org.junit.rules.TestWatchman$1.evaluate(TestWatchman.java:48)
>     [junit] at org.junit.internal.runners.statements.RunBefores.evaluate(RunBefores.java:28)
>     [junit] at org.junit.internal.runners.statements.RunAfters.evaluate(RunAfters.java:31)
>     [junit] at org.junit.runners.BlockJUnit4ClassRunner.runChild(BlockJUnit4ClassRunner.java:76)
>     [junit] at org.apache.lucene.util.LuceneTestCase$LuceneTestCaseRunner.runChild(LuceneTestCase.java:795)
>     [junit] at org.apache.lucene.util.LuceneTestCase$LuceneTestCaseRunner.runChild(LuceneTestCase.java:768)
>     [junit] at org.junit.runners.ParentRunner$3.run(ParentRunner.java:193)
>     [junit] at org.junit.runners.ParentRunner$1.schedule(ParentRunner.java:52)
>     [junit] at org.junit.runners.ParentRunner.runChildren(ParentRunner.java:191)
>     [junit] at org.junit.runners.ParentRunner.access$000(ParentRunner.java:42)
>     [junit] at org.junit.runners.ParentRunner$2.evaluate(ParentRunner.java:184)
>     [junit] at org.junit.internal.runners.statements.RunBefores.evaluate(RunBefores.java:28)
>     [junit] at org.junit.internal.runners.statements.RunAfters.evaluate(RunAfters.java:31)
>     [junit] at org.junit.runners.ParentRunner.run(ParentRunner.java:236)
>     [junit] at junit.framework.JUnit4TestAdapter.run(JUnit4TestAdapter.java:39)
>     [junit] at org.apache.tools.ant.taskdefs.optional.junit.JUnitTestRunner.run(JUnitTestRunner.java:421)
>     [junit] at org.apache.tools.ant.taskdefs.optional.junit.JUnitTestRunner.launch(JUnitTestRunner.java:912)
>     [junit] at org.apache.tools.ant.taskdefs.optional.junit.JUnitTestRunner.main(JUnitTestRunner.java:743)
>     [junit]
>     [junit] 15.10.2010 7:29:20 org.apache.solr.common.SolrException log
>     [junit] SEVERE: org.apache.solr.common.SolrException: Unknown query type 'func'
>     [junit] at org.apache.solr.core.SolrCore.getQueryPlugin(SolrCore.java:1474)
>     [junit] at org.apache.solr.search.QParser.getParser(QParser.java:286)
>     [junit] at org.apache.solr.search.QParser.subQuery(QParser.java:176)
>     [junit] at org.apache.solr.search.SolrQueryParser.getFieldQuery(SolrQueryParser.java:142)
>     [junit] at org.apache.lucene.queryParser.QueryParser.getFieldQuery(QueryParser.java:754)
>     [junit] at org.apache.lucene.queryParser.QueryParser.Term(QueryParser.java:1594)
>     [junit] at org.apache.lucene.queryParser.QueryParser.Clause(QueryParser.java:1337)
>     [junit] at org.apache.lucene.queryParser.QueryParser.Query(QueryParser.java:1263)
>     [junit] at org.apache.lucene.queryParser.QueryParser.TopLevelQuery(QueryParser.java:1252)
>     [junit] at org.apache.lucene.queryParser.QueryParser.parse(QueryParser.java:208)
>     [junit] at org.apache.solr.search.LuceneQParser.parse(LuceneQParserPlugin.java:73)
>     [junit] at org.apache.solr.search.QParser.getQuery(QParser.java:142)
>     [junit] at org.apache.solr.handler.component.QueryComponent.prepare(QueryComponent.java:93)
>     [junit] at org.apache.solr.handler.component.SearchHandler.handleRequestBody(SearchHandler.java:210)
>     [junit] at org.apache.solr.handler.RequestHandlerBase.handleRequest(RequestHandlerBase.java:131)
>     [junit] at org.apache.solr.core.SolrCore.execute(SolrCore.java:1325)
>     [junit] at org.apache.solr.util.TestHarness.queryAndResponse(TestHarness.java:334)
>     [junit] at org.apache.solr.util.TestHarness.query(TestHarness.java:321)
>     [junit] at org.apache.solr.util.TestHarness.query(TestHarness.java:307)
>     [junit] at org.apache.solr.SolrTestCaseJ4.assertQ(SolrTestCaseJ4.java:317)
>     [junit] at org.apache.solr.TestTrie.testTrieFloatRangeSearch(TestTrie.java:119)
>     [junit] at sun.reflect.NativeMethodAccessorImpl.invoke0(Native Method)
>     [junit] at sun.reflect.NativeMethodAccessorImpl.invoke(NativeMethodAccessorImpl.java:57)
>     [junit] at sun.reflect.DelegatingMethodAccessorImpl.invoke(DelegatingMethodAccessorImpl.java:43)
>     [junit] at java.lang.reflect.Method.invoke(Method.java:616)
>     [junit] at org.junit.runners.model.FrameworkMethod$1.runReflectiveCall(FrameworkMethod.java:44)
>     [junit] at org.junit.internal.runners.model.ReflectiveCallable.run(ReflectiveCallable.java:15)
>     [junit] at org.junit.runners.model.FrameworkMethod.invokeExplosively(FrameworkMethod.java:41)
>     [junit] at org.junit.internal.runners.statements.InvokeMethod.evaluate(InvokeMethod.java:20)
>     [junit] at org.junit.rules.TestWatchman$1.evaluate(TestWatchman.java:48)
>     [junit] at org.junit.internal.runners.statements.RunBefores.evaluate(RunBefores.java:28)
>     [junit] at org.junit.internal.runners.statements.RunAfters.evaluate(RunAfters.java:31)
>     [junit] at org.junit.runners.BlockJUnit4ClassRunner.runChild(BlockJUnit4ClassRunner.java:76)
>     [junit] at org.apache.lucene.util.LuceneTestCase$LuceneTestCaseRunner.runChild(LuceneTestCase.java:795)
>     [junit] at org.apache.lucene.util.LuceneTestCase$LuceneTestCaseRunner.runChild(LuceneTestCase.java:768)
>     [junit] at org.junit.runners.ParentRunner$3.run(ParentRunner.java:193)
>     [junit] at org.junit.runners.ParentRunner$1.schedule(ParentRunner.java:52)
>     [junit] at org.junit.runners.ParentRunner.runChildren(ParentRunner.java:191)
>     [junit] at org.junit.runners.ParentRunner.access$000(ParentRunner.java:42)
>     [junit] at org.junit.runners.ParentRunner$2.evaluate(ParentRunner.java:184)
>     [junit] at org.junit.internal.runners.statements.RunBefores.evaluate(RunBefores.java:28)
>     [junit] at org.junit.internal.runners.statements.RunAfters.evaluate(RunAfters.java:31)
>     [junit] at org.junit.runners.ParentRunner.run(ParentRunner.java:236)
>     [junit] at junit.framework.JUnit4TestAdapter.run(JUnit4TestAdapter.java:39)
>     [junit] at org.apache.tools.ant.taskdefs.optional.junit.JUnitTestRunner.run(JUnitTestRunner.java:421)
>     [junit] at org.apache.tools.ant.taskdefs.optional.junit.JUnitTestRunner.launch(JUnitTestRunner.java:912)
>     [junit] at org.apache.tools.ant.taskdefs.optional.junit.JUnitTestRunner.main(JUnitTestRunner.java:743)
>     [junit]
>     [junit] 15.10.2010 7:29:20 org.apache.solr.common.SolrException log
>     [junit] SEVERE: org.apache.solr.common.SolrException: Unknown query type 'func'
>     [junit] at org.apache.solr.core.SolrCore.getQueryPlugin(SolrCore.java:1474)
>     [junit] at org.apache.solr.search.QParser.getParser(QParser.java:286)
>     [junit] at org.apache.solr.search.QParser.subQuery(QParser.java:176)
>     [junit] at org.apache.solr.search.SolrQueryParser.getFieldQuery(SolrQueryParser.java:142)
>     [junit] at org.apache.lucene.queryParser.QueryParser.getFieldQuery(QueryParser.java:754)
>     [junit] at org.apache.lucene.queryParser.QueryParser.Term(QueryParser.java:1594)
>     [junit] at org.apache.lucene.queryParser.QueryParser.Clause(QueryParser.java:1337)
>     [junit] at org.apache.lucene.queryParser.QueryParser.Query(QueryParser.java:1263)
>     [junit] at org.apache.lucene.queryParser.QueryParser.TopLevelQuery(QueryParser.java:1252)
>     [junit] at org.apache.lucene.queryParser.QueryParser.parse(QueryParser.java:208)
>     [junit] at org.apache.solr.search.LuceneQParser.parse(LuceneQParserPlugin.java:73)
>     [junit] at org.apache.solr.search.QParser.getQuery(QParser.java:142)
>     [junit] at org.apache.solr.handler.component.QueryComponent.prepare(QueryComponent.java:93)
>     [junit] at org.apache.solr.handler.component.SearchHandler.handleRequestBody(SearchHandler.java:210)
>     [junit] at org.apache.solr.handler.RequestHandlerBase.handleRequest(RequestHandlerBase.java:131)
>     [junit] at org.apache.solr.core.SolrCore.execute(SolrCore.java:1325)
>     [junit] at org.apache.solr.util.TestHarness.queryAndResponse(TestHarness.java:334)
>     [junit] at org.apache.solr.util.TestHarness.query(TestHarness.java:321)
>     [junit] at org.apache.solr.util.TestHarness.query(TestHarness.java:307)
>     [junit] at org.apache.solr.SolrTestCaseJ4.assertQ(SolrTestCaseJ4.java:317)
>     [junit] at org.apache.solr.TestTrie.testTrieLongRangeSearch(TestTrie.java:138)
>     [junit] at sun.reflect.NativeMethodAccessorImpl.invoke0(Native Method)
>     [junit] at sun.reflect.NativeMethodAccessorImpl.invoke(NativeMethodAccessorImpl.java:57)
>     [junit] at sun.reflect.DelegatingMethodAccessorImpl.invoke(DelegatingMethodAccessorImpl.java:43)
>     [junit] at java.lang.reflect.Method.invoke(Method.java:616)
>     [junit] at org.junit.runners.model.FrameworkMethod$1.runReflectiveCall(FrameworkMethod.java:44)
>     [junit] at org.junit.internal.runners.model.ReflectiveCallable.run(ReflectiveCallable.java:15)
>     [junit] at org.junit.runners.model.FrameworkMethod.invokeExplosively(FrameworkMethod.java:41)
>     [junit] at org.junit.internal.runners.statements.InvokeMethod.evaluate(InvokeMethod.java:20)
>     [junit] at org.junit.rules.TestWatchman$1.evaluate(TestWatchman.java:48)
>     [junit] at org.junit.internal.runners.statements.RunBefores.evaluate(RunBefores.java:28)
>     [junit] at org.junit.internal.runners.statements.RunAfters.evaluate(RunAfters.java:31)
>     [junit] at org.junit.runners.BlockJUnit4ClassRunner.runChild(BlockJUnit4ClassRunner.java:76)
>     [junit] at org.apache.lucene.util.LuceneTestCase$LuceneTestCaseRunner.runChild(LuceneTestCase.java:795)
>     [junit] at org.apache.lucene.util.LuceneTestCase$LuceneTestCaseRunner.runChild(LuceneTestCase.java:768)
>     [junit] at org.junit.runners.ParentRunner$3.run(ParentRunner.java:193)
>     [junit] at org.junit.runners.ParentRunner$1.schedule(ParentRunner.java:52)
>     [junit] at org.junit.runners.ParentRunner.runChildren(ParentRunner.java:191)
>     [junit] at org.junit.runners.ParentRunner.access$000(ParentRunner.java:42)
>     [junit] at org.junit.runners.ParentRunner$2.evaluate(ParentRunner.java:184)
>     [junit] at org.junit.internal.runners.statements.RunBefores.evaluate(RunBefores.java:28)
>     [junit] at org.junit.internal.runners.statements.RunAfters.evaluate(RunAfters.java:31)
>     [junit] at org.junit.runners.ParentRunner.run(ParentRunner.java:236)
>     [junit] at junit.framework.JUnit4TestAdapter.run(JUnit4TestAdapter.java:39)
>     [junit] at org.apache.tools.ant.taskdefs.optional.junit.JUnitTestRunner.run(JUnitTestRunner.java:421)
>     [junit] at org.apache.tools.ant.taskdefs.optional.junit.JUnitTestRunner.launch(JUnitTestRunner.java:912)
>     [junit] at org.apache.tools.ant.taskdefs.optional.junit.JUnitTestRunner.main(JUnitTestRunner.java:743)
>     [junit]
>     [junit] 15.10.2010 7:29:21 org.apache.solr.common.SolrException log
>     [junit] SEVERE: org.apache.solr.common.SolrException: Unknown query type 'func'
>     [junit] at org.apache.solr.core.SolrCore.getQueryPlugin(SolrCore.java:1474)
>     [junit] at org.apache.solr.search.QParser.getParser(QParser.java:286)
>     [junit] at org.apache.solr.search.QParser.subQuery(QParser.java:176)
>     [junit] at org.apache.solr.search.SolrQueryParser.getFieldQuery(SolrQueryParser.java:142)
>     [junit] at org.apache.lucene.queryParser.QueryParser.getFieldQuery(QueryParser.java:754)
>     [junit] at org.apache.lucene.queryParser.QueryParser.Term(QueryParser.java:1594)
>     [junit] at org.apache.lucene.queryParser.QueryParser.Clause(QueryParser.java:1337)
>     [junit] at org.apache.lucene.queryParser.QueryParser.Query(QueryParser.java:1263)
>     [junit] at org.apache.lucene.queryParser.QueryParser.TopLevelQuery(QueryParser.java:1252)
>     [junit] at org.apache.lucene.queryParser.QueryParser.parse(QueryParser.java:208)
>     [junit] at org.apache.solr.search.LuceneQParser.parse(LuceneQParserPlugin.java:73)
>     [junit] at org.apache.solr.search.QParser.getQuery(QParser.java:142)
>     [junit] at org.apache.solr.handler.component.QueryComponent.prepare(QueryComponent.java:93)
>     [junit] at org.apache.solr.handler.component.SearchHandler.handleRequestBody(SearchHandler.java:210)
>     [junit] at org.apache.solr.handler.RequestHandlerBase.handleRequest(RequestHandlerBase.java:131)
>     [junit] at org.apache.solr.core.SolrCore.execute(SolrCore.java:1325)
>     [junit] at org.apache.solr.util.TestHarness.queryAndResponse(TestHarness.java:334)
>     [junit] at org.apache.solr.util.TestHarness.query(TestHarness.java:321)
>     [junit] at org.apache.solr.util.TestHarness.query(TestHarness.java:307)
>     [junit] at org.apache.solr.SolrTestCaseJ4.assertQ(SolrTestCaseJ4.java:317)
>     [junit] at org.apache.solr.TestTrie.testTrieDoubleRangeSearch(TestTrie.java:156)
>     [junit] at sun.reflect.NativeMethodAccessorImpl.invoke0(Native Method)
>     [junit] at sun.reflect.NativeMethodAccessorImpl.invoke(NativeMethodAccessorImpl.java:57)
>     [junit] at sun.reflect.DelegatingMethodAccessorImpl.invoke(DelegatingMethodAccessorImpl.java:43)
>     [junit] at java.lang.reflect.Method.invoke(Method.java:616)
>     [junit] at org.junit.runners.model.FrameworkMethod$1.runReflectiveCall(FrameworkMethod.java:44)
>     [junit] at org.junit.internal.runners.model.ReflectiveCallable.run(ReflectiveCallable.java:15)
>     [junit] at org.junit.runners.model.FrameworkMethod.invokeExplosively(FrameworkMethod.java:41)
>     [junit] at org.junit.internal.runners.statements.InvokeMethod.evaluate(InvokeMethod.java:20)
>     [junit] at org.junit.rules.TestWatchman$1.evaluate(TestWatchman.java:48)
>     [junit] at org.junit.internal.runners.statements.RunBefores.evaluate(RunBefores.java:28)
>     [junit] at org.junit.internal.runners.statements.RunAfters.evaluate(RunAfters.java:31)
>     [junit] at org.junit.runners.BlockJUnit4ClassRunner.runChild(BlockJUnit4ClassRunner.java:76)
>     [junit] at org.apache.lucene.util.LuceneTestCase$LuceneTestCaseRunner.runChild(LuceneTestCase.java:795)
>     [junit] at org.apache.lucene.util.LuceneTestCase$LuceneTestCaseRunner.runChild(LuceneTestCase.java:768)
>     [junit] at org.junit.runners.ParentRunner$3.run(ParentRunner.java:193)
>     [junit] at org.junit.runners.ParentRunner$1.schedule(ParentRunner.java:52)
>     [junit] at org.junit.runners.ParentRunner.runChildren(ParentRunner.java:191)
>     [junit] at org.junit.runners.ParentRunner.access$000(ParentRunner.java:42)
>     [junit] at org.junit.runners.ParentRunner$2.evaluate(ParentRunner.java:184)
>     [junit] at org.junit.internal.runners.statements.RunBefores.evaluate(RunBefores.java:28)
>     [junit] at org.junit.internal.runners.statements.RunAfters.evaluate(RunAfters.java:31)
>     [junit] at org.junit.runners.ParentRunner.run(ParentRunner.java:236)
>     [junit] at junit.framework.JUnit4TestAdapter.run(JUnit4TestAdapter.java:39)
>     [junit] at org.apache.tools.ant.taskdefs.optional.junit.JUnitTestRunner.run(JUnitTestRunner.java:421)
>     [junit] at org.apache.tools.ant.taskdefs.optional.junit.JUnitTestRunner.launch(JUnitTestRunner.java:912)
>     [junit] at org.apache.tools.ant.taskdefs.optional.junit.JUnitTestRunner.main(JUnitTestRunner.java:743)
>     [junit]
>     [junit] 15.10.2010 7:29:21 org.apache.solr.common.SolrException log
>     [junit] SEVERE: org.apache.solr.common.SolrException: Unknown query type 'func'
>     [junit] at org.apache.solr.core.SolrCore.getQueryPlugin(SolrCore.java:1474)
>     [junit] at org.apache.solr.search.QParser.getParser(QParser.java:286)
>     [junit] at org.apache.solr.search.QParser.subQuery(QParser.java:176)
>     [junit] at org.apache.solr.search.SolrQueryParser.getFieldQuery(SolrQueryParser.java:142)
>     [junit] Testsuite: org.apache.solr.analysis.SnowballPorterFilterFactoryTest
>     [junit] at org.apache.lucene.queryParser.QueryParser.getFieldQuery(QueryParser.java:754)
>     [junit] Tests run: 3, Failures: 0, Errors: 0, Time elapsed: 0.02 sec
>     [junit] at org.apache.lucene.queryParser.QueryParser.Term(QueryParser.java:1594)
>     [junit]
>     [junit] at org.apache.lucene.queryParser.QueryParser.Clause(QueryParser.java:1337)
>     [junit] at org.apache.lucene.queryParser.QueryParser.Query(QueryParser.java:1263)
>     [junit] at org.apache.lucene.queryParser.QueryParser.TopLevelQuery(QueryParser.java:1252)
>     [junit] at org.apache.lucene.queryParser.QueryParser.parse(QueryParser.java:208)
>     [junit] at org.apache.solr.search.LuceneQParser.parse(LuceneQParserPlugin.java:73)
>     [junit] at org.apache.solr.search.QParser.getQuery(QParser.java:142)
>     [junit] at org.apache.solr.handler.component.QueryComponent.prepare(QueryComponent.java:93)
>     [junit] at org.apache.solr.handler.component.SearchHandler.handleRequestBody(SearchHandler.java:210)
>     [junit] at org.apache.solr.handler.RequestHandlerBase.handleRequest(RequestHandlerBase.java:131)
>     [junit] at org.apache.solr.core.SolrCore.execute(SolrCore.java:1325)
>     [junit] at org.apache.solr.util.TestHarness.queryAndResponse(TestHarness.java:334)
>     [junit] at org.apache.solr.util.TestHarness.query(TestHarness.java:321)
>     [junit] at org.apache.solr.util.TestHarness.query(TestHarness.java:307)
>     [junit] at org.apache.solr.SolrTestCaseJ4.assertQ(SolrTestCaseJ4.java:317)
>     [junit] at org.apache.solr.TestTrie.testTrieDateRangeSearch(TestTrie.java:202)
>     [junit] at sun.reflect.NativeMethodAccessorImpl.invoke0(Native Method)
>     [junit] at sun.reflect.NativeMethodAccessorImpl.invoke(NativeMethodAccessorImpl.java:57)
>     [junit] at sun.reflect.DelegatingMethodAccessorImpl.invoke(DelegatingMethodAccessorImpl.java:43)
>     [junit] at java.lang.reflect.Method.invoke(Method.java:616)
>     [junit] at org.junit.runners.model.FrameworkMethod$1.runReflectiveCall(FrameworkMethod.java:44)
>     [junit] at org.junit.internal.runners.model.ReflectiveCallable.run(ReflectiveCallable.java:15)
>     [junit] at org.junit.runners.model.FrameworkMethod.invokeExplosively(FrameworkMethod.java:41)
>     [junit] at org.junit.internal.runners.statements.InvokeMethod.evaluate(InvokeMethod.java:20)
>     [junit] at org.junit.rules.TestWatchman$1.evaluate(TestWatchman.java:48)
>     [junit] at org.junit.internal.runners.statements.RunBefores.evaluate(RunBefores.java:28)
>     [junit] at org.junit.internal.runners.statements.RunAfters.evaluate(RunAfters.java:31)
>     [junit] at org.junit.runners.BlockJUnit4ClassRunner.runChild(BlockJUnit4ClassRunner.java:76)
>     [junit] at org.apache.lucene.util.LuceneTestCase$LuceneTestCaseRunner.runChild(LuceneTestCase.java:795)
>     [junit] at org.apache.lucene.util.LuceneTestCase$LuceneTestCaseRunner.runChild(LuceneTestCase.java:768)
>     [junit] at org.junit.runners.ParentRunner$3.run(ParentRunner.java:193)
>     [junit] at org.junit.runners.ParentRunner$1.schedule(ParentRunner.java:52)
>     [junit] at org.junit.runners.ParentRunner.runChildren(ParentRunner.java:191)
>     [junit] at org.junit.runners.ParentRunner.access$000(ParentRunner.java:42)
>     [junit] at org.junit.runners.ParentRunner$2.evaluate(ParentRunner.java:184)
>     [junit] at org.junit.internal.runners.statements.RunBefores.evaluate(RunBefores.java:28)
>     [junit] at org.junit.internal.runners.statements.RunAfters.evaluate(RunAfters.java:31)
>     [junit] at org.junit.runners.ParentRunner.run(ParentRunner.java:236)
>     [junit] at junit.framework.JUnit4TestAdapter.run(JUnit4TestAdapter.java:39)
>     [junit] at org.apache.tools.ant.taskdefs.optional.junit.JUnitTestRunner.run(JUnitTestRunner.java:421)
>     [junit] at org.apache.tools.ant.taskdefs.optional.junit.JUnitTestRunner.launch(JUnitTestRunner.java:912)
>     [junit] at org.apache.tools.ant.taskdefs.optional.junit.JUnitTestRunner.main(JUnitTestRunner.java:743)
>     [junit]
>     [junit] ------------- ---------------- ---------------
>     [junit] TEST org.apache.solr.TestTrie FAILED
> {noformat}

--
This message is automatically generated by JIRA.
-
You can reply to this email to add a comment to the issue online.


---------------------------------------------------------------------
To unsubscribe, e-mail: [hidden email]
For additional commands, e-mail: [hidden email]

Reply | Threaded
Open this post in threaded view
|

[jira] Commented: (SOLR-2160) TestTrie test failure

JIRA jira@apache.org
In reply to this post by JIRA jira@apache.org

    [ https://issues.apache.org/jira/browse/SOLR-2160?page=com.atlassian.jira.plugin.system.issuetabpanels:comment-tabpanel&focusedCommentId=12921334#action_12921334 ]

Robert Muir commented on SOLR-2160:
-----------------------------------

{quote}
Must be meddling from another test
Is there a way to find out what test(s) run before any given test in the same JVM?
{quote}

At the moment, its very hackish. The way i hack around it is by looking in build/test-results/temp
There you see unique temp folders for each jvm (0, 1, 2, 3, etc).
And if you disable Solr's deletion of its temp folders in AbstractSolrTestCase/SolrTestCaseJ4 (the recursiveDelete),
then you have a log of all tests that ran in that jvm, sorta.

I think we really need to improve the build system to somehow provide this information easier when a test fails.
Otherwise its extremely difficult to debug an issue like this.

> TestTrie test failure
> ---------------------
>
>                 Key: SOLR-2160
>                 URL: https://issues.apache.org/jira/browse/SOLR-2160
>             Project: Solr
>          Issue Type: Bug
>          Components: Build
>    Affects Versions: 3.1, 4.0
>         Environment: Hudson
>            Reporter: Robert Muir
>             Fix For: 3.1, 4.0
>
>
> Several test methods in TestTrie failed in hudson, with errors such as this:
> Caused by: org.apache.solr.common.SolrException: Unknown query type 'func'
> Here is the stacktrace:
> {noformat}
>    [junit] Testsuite: org.apache.solr.TestTrie
>     [junit] Testcase: testTrieIntRangeSearch(org.apache.solr.TestTrie): Caused an ERROR
>     [junit] Exception during query
>     [junit] java.lang.RuntimeException: Exception during query
>     [junit] at org.apache.solr.SolrTestCaseJ4.assertQ(SolrTestCaseJ4.java:339)
>     [junit] at org.apache.solr.TestTrie.testTrieIntRangeSearch(TestTrie.java:76)
>     [junit] at org.apache.lucene.util.LuceneTestCase$LuceneTestCaseRunner.runChild(LuceneTestCase.java:795)
>     [junit] at org.apache.lucene.util.LuceneTestCase$LuceneTestCaseRunner.runChild(LuceneTestCase.java:768)
>     [junit] Caused by: org.apache.solr.common.SolrException: Unknown query type 'func'
>     [junit] at org.apache.solr.core.SolrCore.getQueryPlugin(SolrCore.java:1474)
>     [junit] at org.apache.solr.search.QParser.getParser(QParser.java:286)
>     [junit] at org.apache.solr.search.QParser.subQuery(QParser.java:176)
>     [junit] at org.apache.solr.search.SolrQueryParser.getFieldQuery(SolrQueryParser.java:142)
>     [junit] at org.apache.lucene.queryParser.QueryParser.getFieldQuery(QueryParser.java:754)
>     [junit] at org.apache.lucene.queryParser.QueryParser.Term(QueryParser.java:1594)
>     [junit] at org.apache.lucene.queryParser.QueryParser.Clause(QueryParser.java:1337)
>     [junit] at org.apache.lucene.queryParser.QueryParser.Query(QueryParser.java:1263)
>     [junit] at org.apache.lucene.queryParser.QueryParser.TopLevelQuery(QueryParser.java:1252)
>     [junit] at org.apache.lucene.queryParser.QueryParser.parse(QueryParser.java:208)
>     [junit] at org.apache.solr.search.LuceneQParser.parse(LuceneQParserPlugin.java:73)
>     [junit] at org.apache.solr.search.QParser.getQuery(QParser.java:142)
>     [junit] at org.apache.solr.handler.component.QueryComponent.prepare(QueryComponent.java:93)
>     [junit] at org.apache.solr.handler.component.SearchHandler.handleRequestBody(SearchHandler.java:210)
>     [junit] at org.apache.solr.handler.RequestHandlerBase.handleRequest(RequestHandlerBase.java:131)
>     [junit] at org.apache.solr.core.SolrCore.execute(SolrCore.java:1325)
>     [junit] at org.apache.solr.util.TestHarness.queryAndResponse(TestHarness.java:334)
>     [junit] at org.apache.solr.util.TestHarness.query(TestHarness.java:321)
>     [junit] at org.apache.solr.util.TestHarness.query(TestHarness.java:307)
>     [junit] at org.apache.solr.SolrTestCaseJ4.assertQ(SolrTestCaseJ4.java:317)
>     [junit]
>     [junit]
>     [junit] Testcase: testTrieFloatRangeSearch(org.apache.solr.TestTrie): Caused an ERROR
>     [junit] Exception during query
>     [junit] java.lang.RuntimeException: Exception during query
>     [junit] at org.apache.solr.SolrTestCaseJ4.assertQ(SolrTestCaseJ4.java:339)
>     [junit] at org.apache.solr.TestTrie.testTrieFloatRangeSearch(TestTrie.java:119)
>     [junit] at org.apache.lucene.util.LuceneTestCase$LuceneTestCaseRunner.runChild(LuceneTestCase.java:795)
>     [junit] at org.apache.lucene.util.LuceneTestCase$LuceneTestCaseRunner.runChild(LuceneTestCase.java:768)
>     [junit] Caused by: org.apache.solr.common.SolrException: Unknown query type 'func'
>     [junit] at org.apache.solr.core.SolrCore.getQueryPlugin(SolrCore.java:1474)
>     [junit] at org.apache.solr.search.QParser.getParser(QParser.java:286)
>     [junit] at org.apache.solr.search.QParser.subQuery(QParser.java:176)
>     [junit] at org.apache.solr.search.SolrQueryParser.getFieldQuery(SolrQueryParser.java:142)
>     [junit] at org.apache.lucene.queryParser.QueryParser.getFieldQuery(QueryParser.java:754)
>     [junit] at org.apache.lucene.queryParser.QueryParser.Term(QueryParser.java:1594)
>     [junit] at org.apache.lucene.queryParser.QueryParser.Clause(QueryParser.java:1337)
>     [junit] at org.apache.lucene.queryParser.QueryParser.Query(QueryParser.java:1263)
>     [junit] at org.apache.lucene.queryParser.QueryParser.TopLevelQuery(QueryParser.java:1252)
>     [junit] at org.apache.lucene.queryParser.QueryParser.parse(QueryParser.java:208)
>     [junit] at org.apache.solr.search.LuceneQParser.parse(LuceneQParserPlugin.java:73)
>     [junit] at org.apache.solr.search.QParser.getQuery(QParser.java:142)
>     [junit] at org.apache.solr.handler.component.QueryComponent.prepare(QueryComponent.java:93)
>     [junit] at org.apache.solr.handler.component.SearchHandler.handleRequestBody(SearchHandler.java:210)
>     [junit] at org.apache.solr.handler.RequestHandlerBase.handleRequest(RequestHandlerBase.java:131)
>     [junit] at org.apache.solr.core.SolrCore.execute(SolrCore.java:1325)
>     [junit] at org.apache.solr.util.TestHarness.queryAndResponse(TestHarness.java:334)
>     [junit] at org.apache.solr.util.TestHarness.query(TestHarness.java:321)
>     [junit] at org.apache.solr.util.TestHarness.query(TestHarness.java:307)
>     [junit] at org.apache.solr.SolrTestCaseJ4.assertQ(SolrTestCaseJ4.java:317)
>     [junit]
>     [junit]
>     [junit] Testcase: testTrieLongRangeSearch(org.apache.solr.TestTrie): Caused an ERROR
>     [junit] Exception during query
>     [junit] java.lang.RuntimeException: Exception during query
>     [junit] at org.apache.solr.SolrTestCaseJ4.assertQ(SolrTestCaseJ4.java:339)
>     [junit] at org.apache.solr.TestTrie.testTrieLongRangeSearch(TestTrie.java:138)
>     [junit] at org.apache.lucene.util.LuceneTestCase$LuceneTestCaseRunner.runChild(LuceneTestCase.java:795)
>     [junit] at org.apache.lucene.util.LuceneTestCase$LuceneTestCaseRunner.runChild(LuceneTestCase.java:768)
>     [junit] Caused by: org.apache.solr.common.SolrException: Unknown query type 'func'
>     [junit] at org.apache.solr.core.SolrCore.getQueryPlugin(SolrCore.java:1474)
>     [junit] at org.apache.solr.search.QParser.getParser(QParser.java:286)
>     [junit] at org.apache.solr.search.QParser.subQuery(QParser.java:176)
>     [junit] at org.apache.solr.search.SolrQueryParser.getFieldQuery(SolrQueryParser.java:142)
>     [junit] at org.apache.lucene.queryParser.QueryParser.getFieldQuery(QueryParser.java:754)
>     [junit] at org.apache.lucene.queryParser.QueryParser.Term(QueryParser.java:1594)
>     [junit] at org.apache.lucene.queryParser.QueryParser.Clause(QueryParser.java:1337)
>     [junit] at org.apache.lucene.queryParser.QueryParser.Query(QueryParser.java:1263)
>     [junit] at org.apache.lucene.queryParser.QueryParser.TopLevelQuery(QueryParser.java:1252)
>     [junit] at org.apache.lucene.queryParser.QueryParser.parse(QueryParser.java:208)
>     [junit] at org.apache.solr.search.LuceneQParser.parse(LuceneQParserPlugin.java:73)
>     [junit] at org.apache.solr.search.QParser.getQuery(QParser.java:142)
>     [junit] at org.apache.solr.handler.component.QueryComponent.prepare(QueryComponent.java:93)
>     [junit] at org.apache.solr.handler.component.SearchHandler.handleRequestBody(SearchHandler.java:210)
>     [junit] at org.apache.solr.handler.RequestHandlerBase.handleRequest(RequestHandlerBase.java:131)
>     [junit] at org.apache.solr.core.SolrCore.execute(SolrCore.java:1325)
>     [junit] at org.apache.solr.util.TestHarness.queryAndResponse(TestHarness.java:334)
>     [junit] at org.apache.solr.util.TestHarness.query(TestHarness.java:321)
>     [junit] at org.apache.solr.util.TestHarness.query(TestHarness.java:307)
>     [junit] at org.apache.solr.SolrTestCaseJ4.assertQ(SolrTestCaseJ4.java:317)
>     [junit]
>     [junit]
>     [junit] Testcase: testTrieDoubleRangeSearch(org.apache.solr.TestTrie): Caused an ERROR
>     [junit] Exception during query
>     [junit] java.lang.RuntimeException: Exception during query
>     [junit] at org.apache.solr.SolrTestCaseJ4.assertQ(SolrTestCaseJ4.java:339)
>     [junit] at org.apache.solr.TestTrie.testTrieDoubleRangeSearch(TestTrie.java:156)
>     [junit] at org.apache.lucene.util.LuceneTestCase$LuceneTestCaseRunner.runChild(LuceneTestCase.java:795)
>     [junit] at org.apache.lucene.util.LuceneTestCase$LuceneTestCaseRunner.runChild(LuceneTestCase.java:768)
>     [junit] Caused by: org.apache.solr.common.SolrException: Unknown query type 'func'
>     [junit] at org.apache.solr.core.SolrCore.getQueryPlugin(SolrCore.java:1474)
>     [junit] at org.apache.solr.search.QParser.getParser(QParser.java:286)
>     [junit] at org.apache.solr.search.QParser.subQuery(QParser.java:176)
>     [junit] at org.apache.solr.search.SolrQueryParser.getFieldQuery(SolrQueryParser.java:142)
>     [junit] at org.apache.lucene.queryParser.QueryParser.getFieldQuery(QueryParser.java:754)
>     [junit] at org.apache.lucene.queryParser.QueryParser.Term(QueryParser.java:1594)
>     [junit] at org.apache.lucene.queryParser.QueryParser.Clause(QueryParser.java:1337)
>     [junit] at org.apache.lucene.queryParser.QueryParser.Query(QueryParser.java:1263)
>     [junit] at org.apache.lucene.queryParser.QueryParser.TopLevelQuery(QueryParser.java:1252)
>     [junit] at org.apache.lucene.queryParser.QueryParser.parse(QueryParser.java:208)
>     [junit] at org.apache.solr.search.LuceneQParser.parse(LuceneQParserPlugin.java:73)
>     [junit] at org.apache.solr.search.QParser.getQuery(QParser.java:142)
>     [junit] at org.apache.solr.handler.component.QueryComponent.prepare(QueryComponent.java:93)
>     [junit] at org.apache.solr.handler.component.SearchHandler.handleRequestBody(SearchHandler.java:210)
>     [junit] at org.apache.solr.handler.RequestHandlerBase.handleRequest(RequestHandlerBase.java:131)
>     [junit] at org.apache.solr.core.SolrCore.execute(SolrCore.java:1325)
>     [junit] at org.apache.solr.util.TestHarness.queryAndResponse(TestHarness.java:334)
>     [junit] at org.apache.solr.util.TestHarness.query(TestHarness.java:321)
>     [junit] at org.apache.solr.util.TestHarness.query(TestHarness.java:307)
>     [junit] at org.apache.solr.SolrTestCaseJ4.assertQ(SolrTestCaseJ4.java:317)
>     [junit]
>     [junit]
>     [junit] Testcase: testTrieDateRangeSearch(org.apache.solr.TestTrie): Caused an ERROR
>     [junit] Exception during query
>     [junit] java.lang.RuntimeException: Exception during query
>     [junit] at org.apache.solr.SolrTestCaseJ4.assertQ(SolrTestCaseJ4.java:339)
>     [junit] at org.apache.solr.TestTrie.testTrieDateRangeSearch(TestTrie.java:202)
>     [junit] at org.apache.lucene.util.LuceneTestCase$LuceneTestCaseRunner.runChild(LuceneTestCase.java:795)
>     [junit] at org.apache.lucene.util.LuceneTestCase$LuceneTestCaseRunner.runChild(LuceneTestCase.java:768)
>     [junit] Caused by: org.apache.solr.common.SolrException: Unknown query type 'func'
>     [junit] at org.apache.solr.core.SolrCore.getQueryPlugin(SolrCore.java:1474)
>     [junit] at org.apache.solr.search.QParser.getParser(QParser.java:286)
>     [junit] at org.apache.solr.search.QParser.subQuery(QParser.java:176)
>     [junit] at org.apache.solr.search.SolrQueryParser.getFieldQuery(SolrQueryParser.java:142)
>     [junit] at org.apache.lucene.queryParser.QueryParser.getFieldQuery(QueryParser.java:754)
>     [junit] at org.apache.lucene.queryParser.QueryParser.Term(QueryParser.java:1594)
>     [junit] at org.apache.lucene.queryParser.QueryParser.Clause(QueryParser.java:1337)
>     [junit] at org.apache.lucene.queryParser.QueryParser.Query(QueryParser.java:1263)
>     [junit] at org.apache.lucene.queryParser.QueryParser.TopLevelQuery(QueryParser.java:1252)
>     [junit] at org.apache.lucene.queryParser.QueryParser.parse(QueryParser.java:208)
>     [junit] at org.apache.solr.search.LuceneQParser.parse(LuceneQParserPlugin.java:73)
>     [junit] at org.apache.solr.search.QParser.getQuery(QParser.java:142)
>     [junit] at org.apache.solr.handler.component.QueryComponent.prepare(QueryComponent.java:93)
>     [junit] at org.apache.solr.handler.component.SearchHandler.handleRequestBody(SearchHandler.java:210)
>     [junit] at org.apache.solr.handler.RequestHandlerBase.handleRequest(RequestHandlerBase.java:131)
>     [junit] at org.apache.solr.core.SolrCore.execute(SolrCore.java:1325)
>     [junit] at org.apache.solr.util.TestHarness.queryAndResponse(TestHarness.java:334)
>     [junit] at org.apache.solr.util.TestHarness.query(TestHarness.java:321)
>     [junit] at org.apache.solr.util.TestHarness.query(TestHarness.java:307)
>     [junit] at org.apache.solr.SolrTestCaseJ4.assertQ(SolrTestCaseJ4.java:317)
>     [junit]
>     [junit]
>     [junit] Tests run: 8, Failures: 0, Errors: 5, Time elapsed: 3.814 sec
>     [junit]
>     [junit] ------------- Standard Output ---------------
>     [junit] NOTE: reproduce with: ant test -Dtestcase=TestTrie -Dtestmethod=testTrieIntRangeSearch -Dtests.seed=-2722426925580758488:-212535574334114449
>     [junit] NOTE: reproduce with: ant test -Dtestcase=TestTrie -Dtestmethod=testTrieFloatRangeSearch -Dtests.seed=-2722426925580758488:-8980412733871305155
>     [junit] NOTE: reproduce with: ant test -Dtestcase=TestTrie -Dtestmethod=testTrieLongRangeSearch -Dtests.seed=-2722426925580758488:-8688081968302257420
>     [junit] NOTE: reproduce with: ant test -Dtestcase=TestTrie -Dtestmethod=testTrieDoubleRangeSearch -Dtests.seed=-2722426925580758488:1705446365560533918
>     [junit] NOTE: reproduce with: ant test -Dtestcase=TestTrie -Dtestmethod=testTrieDateRangeSearch -Dtests.seed=-2722426925580758488:2549506927018087212
>     [junit] NOTE: test params are: codec=Standard, locale=sl, timezone=Japan
>     [junit] ------------- ---------------- ---------------
>     [junit] ------------- Standard Error -----------------
>     [junit] 15.10.2010 7:29:20 org.apache.solr.common.SolrException log
>     [junit] SEVERE: org.apache.solr.common.SolrException: Unknown query type 'func'
>     [junit] at org.apache.solr.core.SolrCore.getQueryPlugin(SolrCore.java:1474)
>     [junit] at org.apache.solr.search.QParser.getParser(QParser.java:286)
>     [junit] at org.apache.solr.search.QParser.subQuery(QParser.java:176)
>     [junit] at org.apache.solr.search.SolrQueryParser.getFieldQuery(SolrQueryParser.java:142)
>     [junit] at org.apache.lucene.queryParser.QueryParser.getFieldQuery(QueryParser.java:754)
>     [junit] at org.apache.lucene.queryParser.QueryParser.Term(QueryParser.java:1594)
>     [junit] at org.apache.lucene.queryParser.QueryParser.Clause(QueryParser.java:1337)
>     [junit] at org.apache.lucene.queryParser.QueryParser.Query(QueryParser.java:1263)
>     [junit] at org.apache.lucene.queryParser.QueryParser.TopLevelQuery(QueryParser.java:1252)
>     [junit] at org.apache.lucene.queryParser.QueryParser.parse(QueryParser.java:208)
>     [junit] at org.apache.solr.search.LuceneQParser.parse(LuceneQParserPlugin.java:73)
>     [junit] at org.apache.solr.search.QParser.getQuery(QParser.java:142)
>     [junit] at org.apache.solr.handler.component.QueryComponent.prepare(QueryComponent.java:93)
>     [junit] at org.apache.solr.handler.component.SearchHandler.handleRequestBody(SearchHandler.java:210)
>     [junit] at org.apache.solr.handler.RequestHandlerBase.handleRequest(RequestHandlerBase.java:131)
>     [junit] at org.apache.solr.core.SolrCore.execute(SolrCore.java:1325)
>     [junit] at org.apache.solr.util.TestHarness.queryAndResponse(TestHarness.java:334)
>     [junit] at org.apache.solr.util.TestHarness.query(TestHarness.java:321)
>     [junit] at org.apache.solr.util.TestHarness.query(TestHarness.java:307)
>     [junit] at org.apache.solr.SolrTestCaseJ4.assertQ(SolrTestCaseJ4.java:317)
>     [junit] at org.apache.solr.TestTrie.testTrieIntRangeSearch(TestTrie.java:76)
>     [junit] at sun.reflect.NativeMethodAccessorImpl.invoke0(Native Method)
>     [junit] at sun.reflect.NativeMethodAccessorImpl.invoke(NativeMethodAccessorImpl.java:57)
>     [junit] at sun.reflect.DelegatingMethodAccessorImpl.invoke(DelegatingMethodAccessorImpl.java:43)
>     [junit] at java.lang.reflect.Method.invoke(Method.java:616)
>     [junit] at org.junit.runners.model.FrameworkMethod$1.runReflectiveCall(FrameworkMethod.java:44)
>     [junit] at org.junit.internal.runners.model.ReflectiveCallable.run(ReflectiveCallable.java:15)
>     [junit] at org.junit.runners.model.FrameworkMethod.invokeExplosively(FrameworkMethod.java:41)
>     [junit] at org.junit.internal.runners.statements.InvokeMethod.evaluate(InvokeMethod.java:20)
>     [junit] at org.junit.rules.TestWatchman$1.evaluate(TestWatchman.java:48)
>     [junit] at org.junit.internal.runners.statements.RunBefores.evaluate(RunBefores.java:28)
>     [junit] at org.junit.internal.runners.statements.RunAfters.evaluate(RunAfters.java:31)
>     [junit] at org.junit.runners.BlockJUnit4ClassRunner.runChild(BlockJUnit4ClassRunner.java:76)
>     [junit] at org.apache.lucene.util.LuceneTestCase$LuceneTestCaseRunner.runChild(LuceneTestCase.java:795)
>     [junit] at org.apache.lucene.util.LuceneTestCase$LuceneTestCaseRunner.runChild(LuceneTestCase.java:768)
>     [junit] at org.junit.runners.ParentRunner$3.run(ParentRunner.java:193)
>     [junit] at org.junit.runners.ParentRunner$1.schedule(ParentRunner.java:52)
>     [junit] at org.junit.runners.ParentRunner.runChildren(ParentRunner.java:191)
>     [junit] at org.junit.runners.ParentRunner.access$000(ParentRunner.java:42)
>     [junit] at org.junit.runners.ParentRunner$2.evaluate(ParentRunner.java:184)
>     [junit] at org.junit.internal.runners.statements.RunBefores.evaluate(RunBefores.java:28)
>     [junit] at org.junit.internal.runners.statements.RunAfters.evaluate(RunAfters.java:31)
>     [junit] at org.junit.runners.ParentRunner.run(ParentRunner.java:236)
>     [junit] at junit.framework.JUnit4TestAdapter.run(JUnit4TestAdapter.java:39)
>     [junit] at org.apache.tools.ant.taskdefs.optional.junit.JUnitTestRunner.run(JUnitTestRunner.java:421)
>     [junit] at org.apache.tools.ant.taskdefs.optional.junit.JUnitTestRunner.launch(JUnitTestRunner.java:912)
>     [junit] at org.apache.tools.ant.taskdefs.optional.junit.JUnitTestRunner.main(JUnitTestRunner.java:743)
>     [junit]
>     [junit] 15.10.2010 7:29:20 org.apache.solr.common.SolrException log
>     [junit] SEVERE: org.apache.solr.common.SolrException: Unknown query type 'func'
>     [junit] at org.apache.solr.core.SolrCore.getQueryPlugin(SolrCore.java:1474)
>     [junit] at org.apache.solr.search.QParser.getParser(QParser.java:286)
>     [junit] at org.apache.solr.search.QParser.subQuery(QParser.java:176)
>     [junit] at org.apache.solr.search.SolrQueryParser.getFieldQuery(SolrQueryParser.java:142)
>     [junit] at org.apache.lucene.queryParser.QueryParser.getFieldQuery(QueryParser.java:754)
>     [junit] at org.apache.lucene.queryParser.QueryParser.Term(QueryParser.java:1594)
>     [junit] at org.apache.lucene.queryParser.QueryParser.Clause(QueryParser.java:1337)
>     [junit] at org.apache.lucene.queryParser.QueryParser.Query(QueryParser.java:1263)
>     [junit] at org.apache.lucene.queryParser.QueryParser.TopLevelQuery(QueryParser.java:1252)
>     [junit] at org.apache.lucene.queryParser.QueryParser.parse(QueryParser.java:208)
>     [junit] at org.apache.solr.search.LuceneQParser.parse(LuceneQParserPlugin.java:73)
>     [junit] at org.apache.solr.search.QParser.getQuery(QParser.java:142)
>     [junit] at org.apache.solr.handler.component.QueryComponent.prepare(QueryComponent.java:93)
>     [junit] at org.apache.solr.handler.component.SearchHandler.handleRequestBody(SearchHandler.java:210)
>     [junit] at org.apache.solr.handler.RequestHandlerBase.handleRequest(RequestHandlerBase.java:131)
>     [junit] at org.apache.solr.core.SolrCore.execute(SolrCore.java:1325)
>     [junit] at org.apache.solr.util.TestHarness.queryAndResponse(TestHarness.java:334)
>     [junit] at org.apache.solr.util.TestHarness.query(TestHarness.java:321)
>     [junit] at org.apache.solr.util.TestHarness.query(TestHarness.java:307)
>     [junit] at org.apache.solr.SolrTestCaseJ4.assertQ(SolrTestCaseJ4.java:317)
>     [junit] at org.apache.solr.TestTrie.testTrieFloatRangeSearch(TestTrie.java:119)
>     [junit] at sun.reflect.NativeMethodAccessorImpl.invoke0(Native Method)
>     [junit] at sun.reflect.NativeMethodAccessorImpl.invoke(NativeMethodAccessorImpl.java:57)
>     [junit] at sun.reflect.DelegatingMethodAccessorImpl.invoke(DelegatingMethodAccessorImpl.java:43)
>     [junit] at java.lang.reflect.Method.invoke(Method.java:616)
>     [junit] at org.junit.runners.model.FrameworkMethod$1.runReflectiveCall(FrameworkMethod.java:44)
>     [junit] at org.junit.internal.runners.model.ReflectiveCallable.run(ReflectiveCallable.java:15)
>     [junit] at org.junit.runners.model.FrameworkMethod.invokeExplosively(FrameworkMethod.java:41)
>     [junit] at org.junit.internal.runners.statements.InvokeMethod.evaluate(InvokeMethod.java:20)
>     [junit] at org.junit.rules.TestWatchman$1.evaluate(TestWatchman.java:48)
>     [junit] at org.junit.internal.runners.statements.RunBefores.evaluate(RunBefores.java:28)
>     [junit] at org.junit.internal.runners.statements.RunAfters.evaluate(RunAfters.java:31)
>     [junit] at org.junit.runners.BlockJUnit4ClassRunner.runChild(BlockJUnit4ClassRunner.java:76)
>     [junit] at org.apache.lucene.util.LuceneTestCase$LuceneTestCaseRunner.runChild(LuceneTestCase.java:795)
>     [junit] at org.apache.lucene.util.LuceneTestCase$LuceneTestCaseRunner.runChild(LuceneTestCase.java:768)
>     [junit] at org.junit.runners.ParentRunner$3.run(ParentRunner.java:193)
>     [junit] at org.junit.runners.ParentRunner$1.schedule(ParentRunner.java:52)
>     [junit] at org.junit.runners.ParentRunner.runChildren(ParentRunner.java:191)
>     [junit] at org.junit.runners.ParentRunner.access$000(ParentRunner.java:42)
>     [junit] at org.junit.runners.ParentRunner$2.evaluate(ParentRunner.java:184)
>     [junit] at org.junit.internal.runners.statements.RunBefores.evaluate(RunBefores.java:28)
>     [junit] at org.junit.internal.runners.statements.RunAfters.evaluate(RunAfters.java:31)
>     [junit] at org.junit.runners.ParentRunner.run(ParentRunner.java:236)
>     [junit] at junit.framework.JUnit4TestAdapter.run(JUnit4TestAdapter.java:39)
>     [junit] at org.apache.tools.ant.taskdefs.optional.junit.JUnitTestRunner.run(JUnitTestRunner.java:421)
>     [junit] at org.apache.tools.ant.taskdefs.optional.junit.JUnitTestRunner.launch(JUnitTestRunner.java:912)
>     [junit] at org.apache.tools.ant.taskdefs.optional.junit.JUnitTestRunner.main(JUnitTestRunner.java:743)
>     [junit]
>     [junit] 15.10.2010 7:29:20 org.apache.solr.common.SolrException log
>     [junit] SEVERE: org.apache.solr.common.SolrException: Unknown query type 'func'
>     [junit] at org.apache.solr.core.SolrCore.getQueryPlugin(SolrCore.java:1474)
>     [junit] at org.apache.solr.search.QParser.getParser(QParser.java:286)
>     [junit] at org.apache.solr.search.QParser.subQuery(QParser.java:176)
>     [junit] at org.apache.solr.search.SolrQueryParser.getFieldQuery(SolrQueryParser.java:142)
>     [junit] at org.apache.lucene.queryParser.QueryParser.getFieldQuery(QueryParser.java:754)
>     [junit] at org.apache.lucene.queryParser.QueryParser.Term(QueryParser.java:1594)
>     [junit] at org.apache.lucene.queryParser.QueryParser.Clause(QueryParser.java:1337)
>     [junit] at org.apache.lucene.queryParser.QueryParser.Query(QueryParser.java:1263)
>     [junit] at org.apache.lucene.queryParser.QueryParser.TopLevelQuery(QueryParser.java:1252)
>     [junit] at org.apache.lucene.queryParser.QueryParser.parse(QueryParser.java:208)
>     [junit] at org.apache.solr.search.LuceneQParser.parse(LuceneQParserPlugin.java:73)
>     [junit] at org.apache.solr.search.QParser.getQuery(QParser.java:142)
>     [junit] at org.apache.solr.handler.component.QueryComponent.prepare(QueryComponent.java:93)
>     [junit] at org.apache.solr.handler.component.SearchHandler.handleRequestBody(SearchHandler.java:210)
>     [junit] at org.apache.solr.handler.RequestHandlerBase.handleRequest(RequestHandlerBase.java:131)
>     [junit] at org.apache.solr.core.SolrCore.execute(SolrCore.java:1325)
>     [junit] at org.apache.solr.util.TestHarness.queryAndResponse(TestHarness.java:334)
>     [junit] at org.apache.solr.util.TestHarness.query(TestHarness.java:321)
>     [junit] at org.apache.solr.util.TestHarness.query(TestHarness.java:307)
>     [junit] at org.apache.solr.SolrTestCaseJ4.assertQ(SolrTestCaseJ4.java:317)
>     [junit] at org.apache.solr.TestTrie.testTrieLongRangeSearch(TestTrie.java:138)
>     [junit] at sun.reflect.NativeMethodAccessorImpl.invoke0(Native Method)
>     [junit] at sun.reflect.NativeMethodAccessorImpl.invoke(NativeMethodAccessorImpl.java:57)
>     [junit] at sun.reflect.DelegatingMethodAccessorImpl.invoke(DelegatingMethodAccessorImpl.java:43)
>     [junit] at java.lang.reflect.Method.invoke(Method.java:616)
>     [junit] at org.junit.runners.model.FrameworkMethod$1.runReflectiveCall(FrameworkMethod.java:44)
>     [junit] at org.junit.internal.runners.model.ReflectiveCallable.run(ReflectiveCallable.java:15)
>     [junit] at org.junit.runners.model.FrameworkMethod.invokeExplosively(FrameworkMethod.java:41)
>     [junit] at org.junit.internal.runners.statements.InvokeMethod.evaluate(InvokeMethod.java:20)
>     [junit] at org.junit.rules.TestWatchman$1.evaluate(TestWatchman.java:48)
>     [junit] at org.junit.internal.runners.statements.RunBefores.evaluate(RunBefores.java:28)
>     [junit] at org.junit.internal.runners.statements.RunAfters.evaluate(RunAfters.java:31)
>     [junit] at org.junit.runners.BlockJUnit4ClassRunner.runChild(BlockJUnit4ClassRunner.java:76)
>     [junit] at org.apache.lucene.util.LuceneTestCase$LuceneTestCaseRunner.runChild(LuceneTestCase.java:795)
>     [junit] at org.apache.lucene.util.LuceneTestCase$LuceneTestCaseRunner.runChild(LuceneTestCase.java:768)
>     [junit] at org.junit.runners.ParentRunner$3.run(ParentRunner.java:193)
>     [junit] at org.junit.runners.ParentRunner$1.schedule(ParentRunner.java:52)
>     [junit] at org.junit.runners.ParentRunner.runChildren(ParentRunner.java:191)
>     [junit] at org.junit.runners.ParentRunner.access$000(ParentRunner.java:42)
>     [junit] at org.junit.runners.ParentRunner$2.evaluate(ParentRunner.java:184)
>     [junit] at org.junit.internal.runners.statements.RunBefores.evaluate(RunBefores.java:28)
>     [junit] at org.junit.internal.runners.statements.RunAfters.evaluate(RunAfters.java:31)
>     [junit] at org.junit.runners.ParentRunner.run(ParentRunner.java:236)
>     [junit] at junit.framework.JUnit4TestAdapter.run(JUnit4TestAdapter.java:39)
>     [junit] at org.apache.tools.ant.taskdefs.optional.junit.JUnitTestRunner.run(JUnitTestRunner.java:421)
>     [junit] at org.apache.tools.ant.taskdefs.optional.junit.JUnitTestRunner.launch(JUnitTestRunner.java:912)
>     [junit] at org.apache.tools.ant.taskdefs.optional.junit.JUnitTestRunner.main(JUnitTestRunner.java:743)
>     [junit]
>     [junit] 15.10.2010 7:29:21 org.apache.solr.common.SolrException log
>     [junit] SEVERE: org.apache.solr.common.SolrException: Unknown query type 'func'
>     [junit] at org.apache.solr.core.SolrCore.getQueryPlugin(SolrCore.java:1474)
>     [junit] at org.apache.solr.search.QParser.getParser(QParser.java:286)
>     [junit] at org.apache.solr.search.QParser.subQuery(QParser.java:176)
>     [junit] at org.apache.solr.search.SolrQueryParser.getFieldQuery(SolrQueryParser.java:142)
>     [junit] at org.apache.lucene.queryParser.QueryParser.getFieldQuery(QueryParser.java:754)
>     [junit] at org.apache.lucene.queryParser.QueryParser.Term(QueryParser.java:1594)
>     [junit] at org.apache.lucene.queryParser.QueryParser.Clause(QueryParser.java:1337)
>     [junit] at org.apache.lucene.queryParser.QueryParser.Query(QueryParser.java:1263)
>     [junit] at org.apache.lucene.queryParser.QueryParser.TopLevelQuery(QueryParser.java:1252)
>     [junit] at org.apache.lucene.queryParser.QueryParser.parse(QueryParser.java:208)
>     [junit] at org.apache.solr.search.LuceneQParser.parse(LuceneQParserPlugin.java:73)
>     [junit] at org.apache.solr.search.QParser.getQuery(QParser.java:142)
>     [junit] at org.apache.solr.handler.component.QueryComponent.prepare(QueryComponent.java:93)
>     [junit] at org.apache.solr.handler.component.SearchHandler.handleRequestBody(SearchHandler.java:210)
>     [junit] at org.apache.solr.handler.RequestHandlerBase.handleRequest(RequestHandlerBase.java:131)
>     [junit] at org.apache.solr.core.SolrCore.execute(SolrCore.java:1325)
>     [junit] at org.apache.solr.util.TestHarness.queryAndResponse(TestHarness.java:334)
>     [junit] at org.apache.solr.util.TestHarness.query(TestHarness.java:321)
>     [junit] at org.apache.solr.util.TestHarness.query(TestHarness.java:307)
>     [junit] at org.apache.solr.SolrTestCaseJ4.assertQ(SolrTestCaseJ4.java:317)
>     [junit] at org.apache.solr.TestTrie.testTrieDoubleRangeSearch(TestTrie.java:156)
>     [junit] at sun.reflect.NativeMethodAccessorImpl.invoke0(Native Method)
>     [junit] at sun.reflect.NativeMethodAccessorImpl.invoke(NativeMethodAccessorImpl.java:57)
>     [junit] at sun.reflect.DelegatingMethodAccessorImpl.invoke(DelegatingMethodAccessorImpl.java:43)
>     [junit] at java.lang.reflect.Method.invoke(Method.java:616)
>     [junit] at org.junit.runners.model.FrameworkMethod$1.runReflectiveCall(FrameworkMethod.java:44)
>     [junit] at org.junit.internal.runners.model.ReflectiveCallable.run(ReflectiveCallable.java:15)
>     [junit] at org.junit.runners.model.FrameworkMethod.invokeExplosively(FrameworkMethod.java:41)
>     [junit] at org.junit.internal.runners.statements.InvokeMethod.evaluate(InvokeMethod.java:20)
>     [junit] at org.junit.rules.TestWatchman$1.evaluate(TestWatchman.java:48)
>     [junit] at org.junit.internal.runners.statements.RunBefores.evaluate(RunBefores.java:28)
>     [junit] at org.junit.internal.runners.statements.RunAfters.evaluate(RunAfters.java:31)
>     [junit] at org.junit.runners.BlockJUnit4ClassRunner.runChild(BlockJUnit4ClassRunner.java:76)
>     [junit] at org.apache.lucene.util.LuceneTestCase$LuceneTestCaseRunner.runChild(LuceneTestCase.java:795)
>     [junit] at org.apache.lucene.util.LuceneTestCase$LuceneTestCaseRunner.runChild(LuceneTestCase.java:768)
>     [junit] at org.junit.runners.ParentRunner$3.run(ParentRunner.java:193)
>     [junit] at org.junit.runners.ParentRunner$1.schedule(ParentRunner.java:52)
>     [junit] at org.junit.runners.ParentRunner.runChildren(ParentRunner.java:191)
>     [junit] at org.junit.runners.ParentRunner.access$000(ParentRunner.java:42)
>     [junit] at org.junit.runners.ParentRunner$2.evaluate(ParentRunner.java:184)
>     [junit] at org.junit.internal.runners.statements.RunBefores.evaluate(RunBefores.java:28)
>     [junit] at org.junit.internal.runners.statements.RunAfters.evaluate(RunAfters.java:31)
>     [junit] at org.junit.runners.ParentRunner.run(ParentRunner.java:236)
>     [junit] at junit.framework.JUnit4TestAdapter.run(JUnit4TestAdapter.java:39)
>     [junit] at org.apache.tools.ant.taskdefs.optional.junit.JUnitTestRunner.run(JUnitTestRunner.java:421)
>     [junit] at org.apache.tools.ant.taskdefs.optional.junit.JUnitTestRunner.launch(JUnitTestRunner.java:912)
>     [junit] at org.apache.tools.ant.taskdefs.optional.junit.JUnitTestRunner.main(JUnitTestRunner.java:743)
>     [junit]
>     [junit] 15.10.2010 7:29:21 org.apache.solr.common.SolrException log
>     [junit] SEVERE: org.apache.solr.common.SolrException: Unknown query type 'func'
>     [junit] at org.apache.solr.core.SolrCore.getQueryPlugin(SolrCore.java:1474)
>     [junit] at org.apache.solr.search.QParser.getParser(QParser.java:286)
>     [junit] at org.apache.solr.search.QParser.subQuery(QParser.java:176)
>     [junit] at org.apache.solr.search.SolrQueryParser.getFieldQuery(SolrQueryParser.java:142)
>     [junit] Testsuite: org.apache.solr.analysis.SnowballPorterFilterFactoryTest
>     [junit] at org.apache.lucene.queryParser.QueryParser.getFieldQuery(QueryParser.java:754)
>     [junit] Tests run: 3, Failures: 0, Errors: 0, Time elapsed: 0.02 sec
>     [junit] at org.apache.lucene.queryParser.QueryParser.Term(QueryParser.java:1594)
>     [junit]
>     [junit] at org.apache.lucene.queryParser.QueryParser.Clause(QueryParser.java:1337)
>     [junit] at org.apache.lucene.queryParser.QueryParser.Query(QueryParser.java:1263)
>     [junit] at org.apache.lucene.queryParser.QueryParser.TopLevelQuery(QueryParser.java:1252)
>     [junit] at org.apache.lucene.queryParser.QueryParser.parse(QueryParser.java:208)
>     [junit] at org.apache.solr.search.LuceneQParser.parse(LuceneQParserPlugin.java:73)
>     [junit] at org.apache.solr.search.QParser.getQuery(QParser.java:142)
>     [junit] at org.apache.solr.handler.component.QueryComponent.prepare(QueryComponent.java:93)
>     [junit] at org.apache.solr.handler.component.SearchHandler.handleRequestBody(SearchHandler.java:210)
>     [junit] at org.apache.solr.handler.RequestHandlerBase.handleRequest(RequestHandlerBase.java:131)
>     [junit] at org.apache.solr.core.SolrCore.execute(SolrCore.java:1325)
>     [junit] at org.apache.solr.util.TestHarness.queryAndResponse(TestHarness.java:334)
>     [junit] at org.apache.solr.util.TestHarness.query(TestHarness.java:321)
>     [junit] at org.apache.solr.util.TestHarness.query(TestHarness.java:307)
>     [junit] at org.apache.solr.SolrTestCaseJ4.assertQ(SolrTestCaseJ4.java:317)
>     [junit] at org.apache.solr.TestTrie.testTrieDateRangeSearch(TestTrie.java:202)
>     [junit] at sun.reflect.NativeMethodAccessorImpl.invoke0(Native Method)
>     [junit] at sun.reflect.NativeMethodAccessorImpl.invoke(NativeMethodAccessorImpl.java:57)
>     [junit] at sun.reflect.DelegatingMethodAccessorImpl.invoke(DelegatingMethodAccessorImpl.java:43)
>     [junit] at java.lang.reflect.Method.invoke(Method.java:616)
>     [junit] at org.junit.runners.model.FrameworkMethod$1.runReflectiveCall(FrameworkMethod.java:44)
>     [junit] at org.junit.internal.runners.model.ReflectiveCallable.run(ReflectiveCallable.java:15)
>     [junit] at org.junit.runners.model.FrameworkMethod.invokeExplosively(FrameworkMethod.java:41)
>     [junit] at org.junit.internal.runners.statements.InvokeMethod.evaluate(InvokeMethod.java:20)
>     [junit] at org.junit.rules.TestWatchman$1.evaluate(TestWatchman.java:48)
>     [junit] at org.junit.internal.runners.statements.RunBefores.evaluate(RunBefores.java:28)
>     [junit] at org.junit.internal.runners.statements.RunAfters.evaluate(RunAfters.java:31)
>     [junit] at org.junit.runners.BlockJUnit4ClassRunner.runChild(BlockJUnit4ClassRunner.java:76)
>     [junit] at org.apache.lucene.util.LuceneTestCase$LuceneTestCaseRunner.runChild(LuceneTestCase.java:795)
>     [junit] at org.apache.lucene.util.LuceneTestCase$LuceneTestCaseRunner.runChild(LuceneTestCase.java:768)
>     [junit] at org.junit.runners.ParentRunner$3.run(ParentRunner.java:193)
>     [junit] at org.junit.runners.ParentRunner$1.schedule(ParentRunner.java:52)
>     [junit] at org.junit.runners.ParentRunner.runChildren(ParentRunner.java:191)
>     [junit] at org.junit.runners.ParentRunner.access$000(ParentRunner.java:42)
>     [junit] at org.junit.runners.ParentRunner$2.evaluate(ParentRunner.java:184)
>     [junit] at org.junit.internal.runners.statements.RunBefores.evaluate(RunBefores.java:28)
>     [junit] at org.junit.internal.runners.statements.RunAfters.evaluate(RunAfters.java:31)
>     [junit] at org.junit.runners.ParentRunner.run(ParentRunner.java:236)
>     [junit] at junit.framework.JUnit4TestAdapter.run(JUnit4TestAdapter.java:39)
>     [junit] at org.apache.tools.ant.taskdefs.optional.junit.JUnitTestRunner.run(JUnitTestRunner.java:421)
>     [junit] at org.apache.tools.ant.taskdefs.optional.junit.JUnitTestRunner.launch(JUnitTestRunner.java:912)
>     [junit] at org.apache.tools.ant.taskdefs.optional.junit.JUnitTestRunner.main(JUnitTestRunner.java:743)
>     [junit]
>     [junit] ------------- ---------------- ---------------
>     [junit] TEST org.apache.solr.TestTrie FAILED
> {noformat}

--
This message is automatically generated by JIRA.
-
You can reply to this email to add a comment to the issue online.


---------------------------------------------------------------------
To unsubscribe, e-mail: [hidden email]
For additional commands, e-mail: [hidden email]

Reply | Threaded
Open this post in threaded view
|

[jira] Updated: (SOLR-2160) Unknown query type 'func'

JIRA jira@apache.org
In reply to this post by JIRA jira@apache.org

     [ https://issues.apache.org/jira/browse/SOLR-2160?page=com.atlassian.jira.plugin.system.issuetabpanels:all-tabpanel ]

Yonik Seeley updated SOLR-2160:
-------------------------------

    Description:
Several test methods in TestTrie failed in hudson, with errors such as this:

Caused by: org.apache.solr.common.SolrException: Unknown query type 'func'


  was:
Several test methods in TestTrie failed in hudson, with errors such as this:

Caused by: org.apache.solr.common.SolrException: Unknown query type 'func'

Here is the stacktrace:
{noformat}
   [junit] Testsuite: org.apache.solr.TestTrie
    [junit] Testcase: testTrieIntRangeSearch(org.apache.solr.TestTrie): Caused an ERROR
    [junit] Exception during query
    [junit] java.lang.RuntimeException: Exception during query
    [junit] at org.apache.solr.SolrTestCaseJ4.assertQ(SolrTestCaseJ4.java:339)
    [junit] at org.apache.solr.TestTrie.testTrieIntRangeSearch(TestTrie.java:76)
    [junit] at org.apache.lucene.util.LuceneTestCase$LuceneTestCaseRunner.runChild(LuceneTestCase.java:795)
    [junit] at org.apache.lucene.util.LuceneTestCase$LuceneTestCaseRunner.runChild(LuceneTestCase.java:768)
    [junit] Caused by: org.apache.solr.common.SolrException: Unknown query type 'func'
    [junit] at org.apache.solr.core.SolrCore.getQueryPlugin(SolrCore.java:1474)
    [junit] at org.apache.solr.search.QParser.getParser(QParser.java:286)
    [junit] at org.apache.solr.search.QParser.subQuery(QParser.java:176)
    [junit] at org.apache.solr.search.SolrQueryParser.getFieldQuery(SolrQueryParser.java:142)
    [junit] at org.apache.lucene.queryParser.QueryParser.getFieldQuery(QueryParser.java:754)
    [junit] at org.apache.lucene.queryParser.QueryParser.Term(QueryParser.java:1594)
    [junit] at org.apache.lucene.queryParser.QueryParser.Clause(QueryParser.java:1337)
    [junit] at org.apache.lucene.queryParser.QueryParser.Query(QueryParser.java:1263)
    [junit] at org.apache.lucene.queryParser.QueryParser.TopLevelQuery(QueryParser.java:1252)
    [junit] at org.apache.lucene.queryParser.QueryParser.parse(QueryParser.java:208)
    [junit] at org.apache.solr.search.LuceneQParser.parse(LuceneQParserPlugin.java:73)
    [junit] at org.apache.solr.search.QParser.getQuery(QParser.java:142)
    [junit] at org.apache.solr.handler.component.QueryComponent.prepare(QueryComponent.java:93)
    [junit] at org.apache.solr.handler.component.SearchHandler.handleRequestBody(SearchHandler.java:210)
    [junit] at org.apache.solr.handler.RequestHandlerBase.handleRequest(RequestHandlerBase.java:131)
    [junit] at org.apache.solr.core.SolrCore.execute(SolrCore.java:1325)
    [junit] at org.apache.solr.util.TestHarness.queryAndResponse(TestHarness.java:334)
    [junit] at org.apache.solr.util.TestHarness.query(TestHarness.java:321)
    [junit] at org.apache.solr.util.TestHarness.query(TestHarness.java:307)
    [junit] at org.apache.solr.SolrTestCaseJ4.assertQ(SolrTestCaseJ4.java:317)
    [junit]
    [junit]
    [junit] Testcase: testTrieFloatRangeSearch(org.apache.solr.TestTrie): Caused an ERROR
    [junit] Exception during query
    [junit] java.lang.RuntimeException: Exception during query
    [junit] at org.apache.solr.SolrTestCaseJ4.assertQ(SolrTestCaseJ4.java:339)
    [junit] at org.apache.solr.TestTrie.testTrieFloatRangeSearch(TestTrie.java:119)
    [junit] at org.apache.lucene.util.LuceneTestCase$LuceneTestCaseRunner.runChild(LuceneTestCase.java:795)
    [junit] at org.apache.lucene.util.LuceneTestCase$LuceneTestCaseRunner.runChild(LuceneTestCase.java:768)
    [junit] Caused by: org.apache.solr.common.SolrException: Unknown query type 'func'
    [junit] at org.apache.solr.core.SolrCore.getQueryPlugin(SolrCore.java:1474)
    [junit] at org.apache.solr.search.QParser.getParser(QParser.java:286)
    [junit] at org.apache.solr.search.QParser.subQuery(QParser.java:176)
    [junit] at org.apache.solr.search.SolrQueryParser.getFieldQuery(SolrQueryParser.java:142)
    [junit] at org.apache.lucene.queryParser.QueryParser.getFieldQuery(QueryParser.java:754)
    [junit] at org.apache.lucene.queryParser.QueryParser.Term(QueryParser.java:1594)
    [junit] at org.apache.lucene.queryParser.QueryParser.Clause(QueryParser.java:1337)
    [junit] at org.apache.lucene.queryParser.QueryParser.Query(QueryParser.java:1263)
    [junit] at org.apache.lucene.queryParser.QueryParser.TopLevelQuery(QueryParser.java:1252)
    [junit] at org.apache.lucene.queryParser.QueryParser.parse(QueryParser.java:208)
    [junit] at org.apache.solr.search.LuceneQParser.parse(LuceneQParserPlugin.java:73)
    [junit] at org.apache.solr.search.QParser.getQuery(QParser.java:142)
    [junit] at org.apache.solr.handler.component.QueryComponent.prepare(QueryComponent.java:93)
    [junit] at org.apache.solr.handler.component.SearchHandler.handleRequestBody(SearchHandler.java:210)
    [junit] at org.apache.solr.handler.RequestHandlerBase.handleRequest(RequestHandlerBase.java:131)
    [junit] at org.apache.solr.core.SolrCore.execute(SolrCore.java:1325)
    [junit] at org.apache.solr.util.TestHarness.queryAndResponse(TestHarness.java:334)
    [junit] at org.apache.solr.util.TestHarness.query(TestHarness.java:321)
    [junit] at org.apache.solr.util.TestHarness.query(TestHarness.java:307)
    [junit] at org.apache.solr.SolrTestCaseJ4.assertQ(SolrTestCaseJ4.java:317)
    [junit]
    [junit]
    [junit] Testcase: testTrieLongRangeSearch(org.apache.solr.TestTrie): Caused an ERROR
    [junit] Exception during query
    [junit] java.lang.RuntimeException: Exception during query
    [junit] at org.apache.solr.SolrTestCaseJ4.assertQ(SolrTestCaseJ4.java:339)
    [junit] at org.apache.solr.TestTrie.testTrieLongRangeSearch(TestTrie.java:138)
    [junit] at org.apache.lucene.util.LuceneTestCase$LuceneTestCaseRunner.runChild(LuceneTestCase.java:795)
    [junit] at org.apache.lucene.util.LuceneTestCase$LuceneTestCaseRunner.runChild(LuceneTestCase.java:768)
    [junit] Caused by: org.apache.solr.common.SolrException: Unknown query type 'func'
    [junit] at org.apache.solr.core.SolrCore.getQueryPlugin(SolrCore.java:1474)
    [junit] at org.apache.solr.search.QParser.getParser(QParser.java:286)
    [junit] at org.apache.solr.search.QParser.subQuery(QParser.java:176)
    [junit] at org.apache.solr.search.SolrQueryParser.getFieldQuery(SolrQueryParser.java:142)
    [junit] at org.apache.lucene.queryParser.QueryParser.getFieldQuery(QueryParser.java:754)
    [junit] at org.apache.lucene.queryParser.QueryParser.Term(QueryParser.java:1594)
    [junit] at org.apache.lucene.queryParser.QueryParser.Clause(QueryParser.java:1337)
    [junit] at org.apache.lucene.queryParser.QueryParser.Query(QueryParser.java:1263)
    [junit] at org.apache.lucene.queryParser.QueryParser.TopLevelQuery(QueryParser.java:1252)
    [junit] at org.apache.lucene.queryParser.QueryParser.parse(QueryParser.java:208)
    [junit] at org.apache.solr.search.LuceneQParser.parse(LuceneQParserPlugin.java:73)
    [junit] at org.apache.solr.search.QParser.getQuery(QParser.java:142)
    [junit] at org.apache.solr.handler.component.QueryComponent.prepare(QueryComponent.java:93)
    [junit] at org.apache.solr.handler.component.SearchHandler.handleRequestBody(SearchHandler.java:210)
    [junit] at org.apache.solr.handler.RequestHandlerBase.handleRequest(RequestHandlerBase.java:131)
    [junit] at org.apache.solr.core.SolrCore.execute(SolrCore.java:1325)
    [junit] at org.apache.solr.util.TestHarness.queryAndResponse(TestHarness.java:334)
    [junit] at org.apache.solr.util.TestHarness.query(TestHarness.java:321)
    [junit] at org.apache.solr.util.TestHarness.query(TestHarness.java:307)
    [junit] at org.apache.solr.SolrTestCaseJ4.assertQ(SolrTestCaseJ4.java:317)
    [junit]
    [junit]
    [junit] Testcase: testTrieDoubleRangeSearch(org.apache.solr.TestTrie): Caused an ERROR
    [junit] Exception during query
    [junit] java.lang.RuntimeException: Exception during query
    [junit] at org.apache.solr.SolrTestCaseJ4.assertQ(SolrTestCaseJ4.java:339)
    [junit] at org.apache.solr.TestTrie.testTrieDoubleRangeSearch(TestTrie.java:156)
    [junit] at org.apache.lucene.util.LuceneTestCase$LuceneTestCaseRunner.runChild(LuceneTestCase.java:795)
    [junit] at org.apache.lucene.util.LuceneTestCase$LuceneTestCaseRunner.runChild(LuceneTestCase.java:768)
    [junit] Caused by: org.apache.solr.common.SolrException: Unknown query type 'func'
    [junit] at org.apache.solr.core.SolrCore.getQueryPlugin(SolrCore.java:1474)
    [junit] at org.apache.solr.search.QParser.getParser(QParser.java:286)
    [junit] at org.apache.solr.search.QParser.subQuery(QParser.java:176)
    [junit] at org.apache.solr.search.SolrQueryParser.getFieldQuery(SolrQueryParser.java:142)
    [junit] at org.apache.lucene.queryParser.QueryParser.getFieldQuery(QueryParser.java:754)
    [junit] at org.apache.lucene.queryParser.QueryParser.Term(QueryParser.java:1594)
    [junit] at org.apache.lucene.queryParser.QueryParser.Clause(QueryParser.java:1337)
    [junit] at org.apache.lucene.queryParser.QueryParser.Query(QueryParser.java:1263)
    [junit] at org.apache.lucene.queryParser.QueryParser.TopLevelQuery(QueryParser.java:1252)
    [junit] at org.apache.lucene.queryParser.QueryParser.parse(QueryParser.java:208)
    [junit] at org.apache.solr.search.LuceneQParser.parse(LuceneQParserPlugin.java:73)
    [junit] at org.apache.solr.search.QParser.getQuery(QParser.java:142)
    [junit] at org.apache.solr.handler.component.QueryComponent.prepare(QueryComponent.java:93)
    [junit] at org.apache.solr.handler.component.SearchHandler.handleRequestBody(SearchHandler.java:210)
    [junit] at org.apache.solr.handler.RequestHandlerBase.handleRequest(RequestHandlerBase.java:131)
    [junit] at org.apache.solr.core.SolrCore.execute(SolrCore.java:1325)
    [junit] at org.apache.solr.util.TestHarness.queryAndResponse(TestHarness.java:334)
    [junit] at org.apache.solr.util.TestHarness.query(TestHarness.java:321)
    [junit] at org.apache.solr.util.TestHarness.query(TestHarness.java:307)
    [junit] at org.apache.solr.SolrTestCaseJ4.assertQ(SolrTestCaseJ4.java:317)
    [junit]
    [junit]
    [junit] Testcase: testTrieDateRangeSearch(org.apache.solr.TestTrie): Caused an ERROR
    [junit] Exception during query
    [junit] java.lang.RuntimeException: Exception during query
    [junit] at org.apache.solr.SolrTestCaseJ4.assertQ(SolrTestCaseJ4.java:339)
    [junit] at org.apache.solr.TestTrie.testTrieDateRangeSearch(TestTrie.java:202)
    [junit] at org.apache.lucene.util.LuceneTestCase$LuceneTestCaseRunner.runChild(LuceneTestCase.java:795)
    [junit] at org.apache.lucene.util.LuceneTestCase$LuceneTestCaseRunner.runChild(LuceneTestCase.java:768)
    [junit] Caused by: org.apache.solr.common.SolrException: Unknown query type 'func'
    [junit] at org.apache.solr.core.SolrCore.getQueryPlugin(SolrCore.java:1474)
    [junit] at org.apache.solr.search.QParser.getParser(QParser.java:286)
    [junit] at org.apache.solr.search.QParser.subQuery(QParser.java:176)
    [junit] at org.apache.solr.search.SolrQueryParser.getFieldQuery(SolrQueryParser.java:142)
    [junit] at org.apache.lucene.queryParser.QueryParser.getFieldQuery(QueryParser.java:754)
    [junit] at org.apache.lucene.queryParser.QueryParser.Term(QueryParser.java:1594)
    [junit] at org.apache.lucene.queryParser.QueryParser.Clause(QueryParser.java:1337)
    [junit] at org.apache.lucene.queryParser.QueryParser.Query(QueryParser.java:1263)
    [junit] at org.apache.lucene.queryParser.QueryParser.TopLevelQuery(QueryParser.java:1252)
    [junit] at org.apache.lucene.queryParser.QueryParser.parse(QueryParser.java:208)
    [junit] at org.apache.solr.search.LuceneQParser.parse(LuceneQParserPlugin.java:73)
    [junit] at org.apache.solr.search.QParser.getQuery(QParser.java:142)
    [junit] at org.apache.solr.handler.component.QueryComponent.prepare(QueryComponent.java:93)
    [junit] at org.apache.solr.handler.component.SearchHandler.handleRequestBody(SearchHandler.java:210)
    [junit] at org.apache.solr.handler.RequestHandlerBase.handleRequest(RequestHandlerBase.java:131)
    [junit] at org.apache.solr.core.SolrCore.execute(SolrCore.java:1325)
    [junit] at org.apache.solr.util.TestHarness.queryAndResponse(TestHarness.java:334)
    [junit] at org.apache.solr.util.TestHarness.query(TestHarness.java:321)
    [junit] at org.apache.solr.util.TestHarness.query(TestHarness.java:307)
    [junit] at org.apache.solr.SolrTestCaseJ4.assertQ(SolrTestCaseJ4.java:317)
    [junit]
    [junit]
    [junit] Tests run: 8, Failures: 0, Errors: 5, Time elapsed: 3.814 sec
    [junit]
    [junit] ------------- Standard Output ---------------
    [junit] NOTE: reproduce with: ant test -Dtestcase=TestTrie -Dtestmethod=testTrieIntRangeSearch -Dtests.seed=-2722426925580758488:-212535574334114449
    [junit] NOTE: reproduce with: ant test -Dtestcase=TestTrie -Dtestmethod=testTrieFloatRangeSearch -Dtests.seed=-2722426925580758488:-8980412733871305155
    [junit] NOTE: reproduce with: ant test -Dtestcase=TestTrie -Dtestmethod=testTrieLongRangeSearch -Dtests.seed=-2722426925580758488:-8688081968302257420
    [junit] NOTE: reproduce with: ant test -Dtestcase=TestTrie -Dtestmethod=testTrieDoubleRangeSearch -Dtests.seed=-2722426925580758488:1705446365560533918
    [junit] NOTE: reproduce with: ant test -Dtestcase=TestTrie -Dtestmethod=testTrieDateRangeSearch -Dtests.seed=-2722426925580758488:2549506927018087212
    [junit] NOTE: test params are: codec=Standard, locale=sl, timezone=Japan
    [junit] ------------- ---------------- ---------------
    [junit] ------------- Standard Error -----------------
    [junit] 15.10.2010 7:29:20 org.apache.solr.common.SolrException log
    [junit] SEVERE: org.apache.solr.common.SolrException: Unknown query type 'func'
    [junit] at org.apache.solr.core.SolrCore.getQueryPlugin(SolrCore.java:1474)
    [junit] at org.apache.solr.search.QParser.getParser(QParser.java:286)
    [junit] at org.apache.solr.search.QParser.subQuery(QParser.java:176)
    [junit] at org.apache.solr.search.SolrQueryParser.getFieldQuery(SolrQueryParser.java:142)
    [junit] at org.apache.lucene.queryParser.QueryParser.getFieldQuery(QueryParser.java:754)
    [junit] at org.apache.lucene.queryParser.QueryParser.Term(QueryParser.java:1594)
    [junit] at org.apache.lucene.queryParser.QueryParser.Clause(QueryParser.java:1337)
    [junit] at org.apache.lucene.queryParser.QueryParser.Query(QueryParser.java:1263)
    [junit] at org.apache.lucene.queryParser.QueryParser.TopLevelQuery(QueryParser.java:1252)
    [junit] at org.apache.lucene.queryParser.QueryParser.parse(QueryParser.java:208)
    [junit] at org.apache.solr.search.LuceneQParser.parse(LuceneQParserPlugin.java:73)
    [junit] at org.apache.solr.search.QParser.getQuery(QParser.java:142)
    [junit] at org.apache.solr.handler.component.QueryComponent.prepare(QueryComponent.java:93)
    [junit] at org.apache.solr.handler.component.SearchHandler.handleRequestBody(SearchHandler.java:210)
    [junit] at org.apache.solr.handler.RequestHandlerBase.handleRequest(RequestHandlerBase.java:131)
    [junit] at org.apache.solr.core.SolrCore.execute(SolrCore.java:1325)
    [junit] at org.apache.solr.util.TestHarness.queryAndResponse(TestHarness.java:334)
    [junit] at org.apache.solr.util.TestHarness.query(TestHarness.java:321)
    [junit] at org.apache.solr.util.TestHarness.query(TestHarness.java:307)
    [junit] at org.apache.solr.SolrTestCaseJ4.assertQ(SolrTestCaseJ4.java:317)
    [junit] at org.apache.solr.TestTrie.testTrieIntRangeSearch(TestTrie.java:76)
    [junit] at sun.reflect.NativeMethodAccessorImpl.invoke0(Native Method)
    [junit] at sun.reflect.NativeMethodAccessorImpl.invoke(NativeMethodAccessorImpl.java:57)
    [junit] at sun.reflect.DelegatingMethodAccessorImpl.invoke(DelegatingMethodAccessorImpl.java:43)
    [junit] at java.lang.reflect.Method.invoke(Method.java:616)
    [junit] at org.junit.runners.model.FrameworkMethod$1.runReflectiveCall(FrameworkMethod.java:44)
    [junit] at org.junit.internal.runners.model.ReflectiveCallable.run(ReflectiveCallable.java:15)
    [junit] at org.junit.runners.model.FrameworkMethod.invokeExplosively(FrameworkMethod.java:41)
    [junit] at org.junit.internal.runners.statements.InvokeMethod.evaluate(InvokeMethod.java:20)
    [junit] at org.junit.rules.TestWatchman$1.evaluate(TestWatchman.java:48)
    [junit] at org.junit.internal.runners.statements.RunBefores.evaluate(RunBefores.java:28)
    [junit] at org.junit.internal.runners.statements.RunAfters.evaluate(RunAfters.java:31)
    [junit] at org.junit.runners.BlockJUnit4ClassRunner.runChild(BlockJUnit4ClassRunner.java:76)
    [junit] at org.apache.lucene.util.LuceneTestCase$LuceneTestCaseRunner.runChild(LuceneTestCase.java:795)
    [junit] at org.apache.lucene.util.LuceneTestCase$LuceneTestCaseRunner.runChild(LuceneTestCase.java:768)
    [junit] at org.junit.runners.ParentRunner$3.run(ParentRunner.java:193)
    [junit] at org.junit.runners.ParentRunner$1.schedule(ParentRunner.java:52)
    [junit] at org.junit.runners.ParentRunner.runChildren(ParentRunner.java:191)
    [junit] at org.junit.runners.ParentRunner.access$000(ParentRunner.java:42)
    [junit] at org.junit.runners.ParentRunner$2.evaluate(ParentRunner.java:184)
    [junit] at org.junit.internal.runners.statements.RunBefores.evaluate(RunBefores.java:28)
    [junit] at org.junit.internal.runners.statements.RunAfters.evaluate(RunAfters.java:31)
    [junit] at org.junit.runners.ParentRunner.run(ParentRunner.java:236)
    [junit] at junit.framework.JUnit4TestAdapter.run(JUnit4TestAdapter.java:39)
    [junit] at org.apache.tools.ant.taskdefs.optional.junit.JUnitTestRunner.run(JUnitTestRunner.java:421)
    [junit] at org.apache.tools.ant.taskdefs.optional.junit.JUnitTestRunner.launch(JUnitTestRunner.java:912)
    [junit] at org.apache.tools.ant.taskdefs.optional.junit.JUnitTestRunner.main(JUnitTestRunner.java:743)
    [junit]
    [junit] 15.10.2010 7:29:20 org.apache.solr.common.SolrException log
    [junit] SEVERE: org.apache.solr.common.SolrException: Unknown query type 'func'
    [junit] at org.apache.solr.core.SolrCore.getQueryPlugin(SolrCore.java:1474)
    [junit] at org.apache.solr.search.QParser.getParser(QParser.java:286)
    [junit] at org.apache.solr.search.QParser.subQuery(QParser.java:176)
    [junit] at org.apache.solr.search.SolrQueryParser.getFieldQuery(SolrQueryParser.java:142)
    [junit] at org.apache.lucene.queryParser.QueryParser.getFieldQuery(QueryParser.java:754)
    [junit] at org.apache.lucene.queryParser.QueryParser.Term(QueryParser.java:1594)
    [junit] at org.apache.lucene.queryParser.QueryParser.Clause(QueryParser.java:1337)
    [junit] at org.apache.lucene.queryParser.QueryParser.Query(QueryParser.java:1263)
    [junit] at org.apache.lucene.queryParser.QueryParser.TopLevelQuery(QueryParser.java:1252)
    [junit] at org.apache.lucene.queryParser.QueryParser.parse(QueryParser.java:208)
    [junit] at org.apache.solr.search.LuceneQParser.parse(LuceneQParserPlugin.java:73)
    [junit] at org.apache.solr.search.QParser.getQuery(QParser.java:142)
    [junit] at org.apache.solr.handler.component.QueryComponent.prepare(QueryComponent.java:93)
    [junit] at org.apache.solr.handler.component.SearchHandler.handleRequestBody(SearchHandler.java:210)
    [junit] at org.apache.solr.handler.RequestHandlerBase.handleRequest(RequestHandlerBase.java:131)
    [junit] at org.apache.solr.core.SolrCore.execute(SolrCore.java:1325)
    [junit] at org.apache.solr.util.TestHarness.queryAndResponse(TestHarness.java:334)
    [junit] at org.apache.solr.util.TestHarness.query(TestHarness.java:321)
    [junit] at org.apache.solr.util.TestHarness.query(TestHarness.java:307)
    [junit] at org.apache.solr.SolrTestCaseJ4.assertQ(SolrTestCaseJ4.java:317)
    [junit] at org.apache.solr.TestTrie.testTrieFloatRangeSearch(TestTrie.java:119)
    [junit] at sun.reflect.NativeMethodAccessorImpl.invoke0(Native Method)
    [junit] at sun.reflect.NativeMethodAccessorImpl.invoke(NativeMethodAccessorImpl.java:57)
    [junit] at sun.reflect.DelegatingMethodAccessorImpl.invoke(DelegatingMethodAccessorImpl.java:43)
    [junit] at java.lang.reflect.Method.invoke(Method.java:616)
    [junit] at org.junit.runners.model.FrameworkMethod$1.runReflectiveCall(FrameworkMethod.java:44)
    [junit] at org.junit.internal.runners.model.ReflectiveCallable.run(ReflectiveCallable.java:15)
    [junit] at org.junit.runners.model.FrameworkMethod.invokeExplosively(FrameworkMethod.java:41)
    [junit] at org.junit.internal.runners.statements.InvokeMethod.evaluate(InvokeMethod.java:20)
    [junit] at org.junit.rules.TestWatchman$1.evaluate(TestWatchman.java:48)
    [junit] at org.junit.internal.runners.statements.RunBefores.evaluate(RunBefores.java:28)
    [junit] at org.junit.internal.runners.statements.RunAfters.evaluate(RunAfters.java:31)
    [junit] at org.junit.runners.BlockJUnit4ClassRunner.runChild(BlockJUnit4ClassRunner.java:76)
    [junit] at org.apache.lucene.util.LuceneTestCase$LuceneTestCaseRunner.runChild(LuceneTestCase.java:795)
    [junit] at org.apache.lucene.util.LuceneTestCase$LuceneTestCaseRunner.runChild(LuceneTestCase.java:768)
    [junit] at org.junit.runners.ParentRunner$3.run(ParentRunner.java:193)
    [junit] at org.junit.runners.ParentRunner$1.schedule(ParentRunner.java:52)
    [junit] at org.junit.runners.ParentRunner.runChildren(ParentRunner.java:191)
    [junit] at org.junit.runners.ParentRunner.access$000(ParentRunner.java:42)
    [junit] at org.junit.runners.ParentRunner$2.evaluate(ParentRunner.java:184)
    [junit] at org.junit.internal.runners.statements.RunBefores.evaluate(RunBefores.java:28)
    [junit] at org.junit.internal.runners.statements.RunAfters.evaluate(RunAfters.java:31)
    [junit] at org.junit.runners.ParentRunner.run(ParentRunner.java:236)
    [junit] at junit.framework.JUnit4TestAdapter.run(JUnit4TestAdapter.java:39)
    [junit] at org.apache.tools.ant.taskdefs.optional.junit.JUnitTestRunner.run(JUnitTestRunner.java:421)
    [junit] at org.apache.tools.ant.taskdefs.optional.junit.JUnitTestRunner.launch(JUnitTestRunner.java:912)
    [junit] at org.apache.tools.ant.taskdefs.optional.junit.JUnitTestRunner.main(JUnitTestRunner.java:743)
    [junit]
    [junit] 15.10.2010 7:29:20 org.apache.solr.common.SolrException log
    [junit] SEVERE: org.apache.solr.common.SolrException: Unknown query type 'func'
    [junit] at org.apache.solr.core.SolrCore.getQueryPlugin(SolrCore.java:1474)
    [junit] at org.apache.solr.search.QParser.getParser(QParser.java:286)
    [junit] at org.apache.solr.search.QParser.subQuery(QParser.java:176)
    [junit] at org.apache.solr.search.SolrQueryParser.getFieldQuery(SolrQueryParser.java:142)
    [junit] at org.apache.lucene.queryParser.QueryParser.getFieldQuery(QueryParser.java:754)
    [junit] at org.apache.lucene.queryParser.QueryParser.Term(QueryParser.java:1594)
    [junit] at org.apache.lucene.queryParser.QueryParser.Clause(QueryParser.java:1337)
    [junit] at org.apache.lucene.queryParser.QueryParser.Query(QueryParser.java:1263)
    [junit] at org.apache.lucene.queryParser.QueryParser.TopLevelQuery(QueryParser.java:1252)
    [junit] at org.apache.lucene.queryParser.QueryParser.parse(QueryParser.java:208)
    [junit] at org.apache.solr.search.LuceneQParser.parse(LuceneQParserPlugin.java:73)
    [junit] at org.apache.solr.search.QParser.getQuery(QParser.java:142)
    [junit] at org.apache.solr.handler.component.QueryComponent.prepare(QueryComponent.java:93)
    [junit] at org.apache.solr.handler.component.SearchHandler.handleRequestBody(SearchHandler.java:210)
    [junit] at org.apache.solr.handler.RequestHandlerBase.handleRequest(RequestHandlerBase.java:131)
    [junit] at org.apache.solr.core.SolrCore.execute(SolrCore.java:1325)
    [junit] at org.apache.solr.util.TestHarness.queryAndResponse(TestHarness.java:334)
    [junit] at org.apache.solr.util.TestHarness.query(TestHarness.java:321)
    [junit] at org.apache.solr.util.TestHarness.query(TestHarness.java:307)
    [junit] at org.apache.solr.SolrTestCaseJ4.assertQ(SolrTestCaseJ4.java:317)
    [junit] at org.apache.solr.TestTrie.testTrieLongRangeSearch(TestTrie.java:138)
    [junit] at sun.reflect.NativeMethodAccessorImpl.invoke0(Native Method)
    [junit] at sun.reflect.NativeMethodAccessorImpl.invoke(NativeMethodAccessorImpl.java:57)
    [junit] at sun.reflect.DelegatingMethodAccessorImpl.invoke(DelegatingMethodAccessorImpl.java:43)
    [junit] at java.lang.reflect.Method.invoke(Method.java:616)
    [junit] at org.junit.runners.model.FrameworkMethod$1.runReflectiveCall(FrameworkMethod.java:44)
    [junit] at org.junit.internal.runners.model.ReflectiveCallable.run(ReflectiveCallable.java:15)
    [junit] at org.junit.runners.model.FrameworkMethod.invokeExplosively(FrameworkMethod.java:41)
    [junit] at org.junit.internal.runners.statements.InvokeMethod.evaluate(InvokeMethod.java:20)
    [junit] at org.junit.rules.TestWatchman$1.evaluate(TestWatchman.java:48)
    [junit] at org.junit.internal.runners.statements.RunBefores.evaluate(RunBefores.java:28)
    [junit] at org.junit.internal.runners.statements.RunAfters.evaluate(RunAfters.java:31)
    [junit] at org.junit.runners.BlockJUnit4ClassRunner.runChild(BlockJUnit4ClassRunner.java:76)
    [junit] at org.apache.lucene.util.LuceneTestCase$LuceneTestCaseRunner.runChild(LuceneTestCase.java:795)
    [junit] at org.apache.lucene.util.LuceneTestCase$LuceneTestCaseRunner.runChild(LuceneTestCase.java:768)
    [junit] at org.junit.runners.ParentRunner$3.run(ParentRunner.java:193)
    [junit] at org.junit.runners.ParentRunner$1.schedule(ParentRunner.java:52)
    [junit] at org.junit.runners.ParentRunner.runChildren(ParentRunner.java:191)
    [junit] at org.junit.runners.ParentRunner.access$000(ParentRunner.java:42)
    [junit] at org.junit.runners.ParentRunner$2.evaluate(ParentRunner.java:184)
    [junit] at org.junit.internal.runners.statements.RunBefores.evaluate(RunBefores.java:28)
    [junit] at org.junit.internal.runners.statements.RunAfters.evaluate(RunAfters.java:31)
    [junit] at org.junit.runners.ParentRunner.run(ParentRunner.java:236)
    [junit] at junit.framework.JUnit4TestAdapter.run(JUnit4TestAdapter.java:39)
    [junit] at org.apache.tools.ant.taskdefs.optional.junit.JUnitTestRunner.run(JUnitTestRunner.java:421)
    [junit] at org.apache.tools.ant.taskdefs.optional.junit.JUnitTestRunner.launch(JUnitTestRunner.java:912)
    [junit] at org.apache.tools.ant.taskdefs.optional.junit.JUnitTestRunner.main(JUnitTestRunner.java:743)
    [junit]
    [junit] 15.10.2010 7:29:21 org.apache.solr.common.SolrException log
    [junit] SEVERE: org.apache.solr.common.SolrException: Unknown query type 'func'
    [junit] at org.apache.solr.core.SolrCore.getQueryPlugin(SolrCore.java:1474)
    [junit] at org.apache.solr.search.QParser.getParser(QParser.java:286)
    [junit] at org.apache.solr.search.QParser.subQuery(QParser.java:176)
    [junit] at org.apache.solr.search.SolrQueryParser.getFieldQuery(SolrQueryParser.java:142)
    [junit] at org.apache.lucene.queryParser.QueryParser.getFieldQuery(QueryParser.java:754)
    [junit] at org.apache.lucene.queryParser.QueryParser.Term(QueryParser.java:1594)
    [junit] at org.apache.lucene.queryParser.QueryParser.Clause(QueryParser.java:1337)
    [junit] at org.apache.lucene.queryParser.QueryParser.Query(QueryParser.java:1263)
    [junit] at org.apache.lucene.queryParser.QueryParser.TopLevelQuery(QueryParser.java:1252)
    [junit] at org.apache.lucene.queryParser.QueryParser.parse(QueryParser.java:208)
    [junit] at org.apache.solr.search.LuceneQParser.parse(LuceneQParserPlugin.java:73)
    [junit] at org.apache.solr.search.QParser.getQuery(QParser.java:142)
    [junit] at org.apache.solr.handler.component.QueryComponent.prepare(QueryComponent.java:93)
    [junit] at org.apache.solr.handler.component.SearchHandler.handleRequestBody(SearchHandler.java:210)
    [junit] at org.apache.solr.handler.RequestHandlerBase.handleRequest(RequestHandlerBase.java:131)
    [junit] at org.apache.solr.core.SolrCore.execute(SolrCore.java:1325)
    [junit] at org.apache.solr.util.TestHarness.queryAndResponse(TestHarness.java:334)
    [junit] at org.apache.solr.util.TestHarness.query(TestHarness.java:321)
    [junit] at org.apache.solr.util.TestHarness.query(TestHarness.java:307)
    [junit] at org.apache.solr.SolrTestCaseJ4.assertQ(SolrTestCaseJ4.java:317)
    [junit] at org.apache.solr.TestTrie.testTrieDoubleRangeSearch(TestTrie.java:156)
    [junit] at sun.reflect.NativeMethodAccessorImpl.invoke0(Native Method)
    [junit] at sun.reflect.NativeMethodAccessorImpl.invoke(NativeMethodAccessorImpl.java:57)
    [junit] at sun.reflect.DelegatingMethodAccessorImpl.invoke(DelegatingMethodAccessorImpl.java:43)
    [junit] at java.lang.reflect.Method.invoke(Method.java:616)
    [junit] at org.junit.runners.model.FrameworkMethod$1.runReflectiveCall(FrameworkMethod.java:44)
    [junit] at org.junit.internal.runners.model.ReflectiveCallable.run(ReflectiveCallable.java:15)
    [junit] at org.junit.runners.model.FrameworkMethod.invokeExplosively(FrameworkMethod.java:41)
    [junit] at org.junit.internal.runners.statements.InvokeMethod.evaluate(InvokeMethod.java:20)
    [junit] at org.junit.rules.TestWatchman$1.evaluate(TestWatchman.java:48)
    [junit] at org.junit.internal.runners.statements.RunBefores.evaluate(RunBefores.java:28)
    [junit] at org.junit.internal.runners.statements.RunAfters.evaluate(RunAfters.java:31)
    [junit] at org.junit.runners.BlockJUnit4ClassRunner.runChild(BlockJUnit4ClassRunner.java:76)
    [junit] at org.apache.lucene.util.LuceneTestCase$LuceneTestCaseRunner.runChild(LuceneTestCase.java:795)
    [junit] at org.apache.lucene.util.LuceneTestCase$LuceneTestCaseRunner.runChild(LuceneTestCase.java:768)
    [junit] at org.junit.runners.ParentRunner$3.run(ParentRunner.java:193)
    [junit] at org.junit.runners.ParentRunner$1.schedule(ParentRunner.java:52)
    [junit] at org.junit.runners.ParentRunner.runChildren(ParentRunner.java:191)
    [junit] at org.junit.runners.ParentRunner.access$000(ParentRunner.java:42)
    [junit] at org.junit.runners.ParentRunner$2.evaluate(ParentRunner.java:184)
    [junit] at org.junit.internal.runners.statements.RunBefores.evaluate(RunBefores.java:28)
    [junit] at org.junit.internal.runners.statements.RunAfters.evaluate(RunAfters.java:31)
    [junit] at org.junit.runners.ParentRunner.run(ParentRunner.java:236)
    [junit] at junit.framework.JUnit4TestAdapter.run(JUnit4TestAdapter.java:39)
    [junit] at org.apache.tools.ant.taskdefs.optional.junit.JUnitTestRunner.run(JUnitTestRunner.java:421)
    [junit] at org.apache.tools.ant.taskdefs.optional.junit.JUnitTestRunner.launch(JUnitTestRunner.java:912)
    [junit] at org.apache.tools.ant.taskdefs.optional.junit.JUnitTestRunner.main(JUnitTestRunner.java:743)
    [junit]
    [junit] 15.10.2010 7:29:21 org.apache.solr.common.SolrException log
    [junit] SEVERE: org.apache.solr.common.SolrException: Unknown query type 'func'
    [junit] at org.apache.solr.core.SolrCore.getQueryPlugin(SolrCore.java:1474)
    [junit] at org.apache.solr.search.QParser.getParser(QParser.java:286)
    [junit] at org.apache.solr.search.QParser.subQuery(QParser.java:176)
    [junit] at org.apache.solr.search.SolrQueryParser.getFieldQuery(SolrQueryParser.java:142)
    [junit] Testsuite: org.apache.solr.analysis.SnowballPorterFilterFactoryTest
    [junit] at org.apache.lucene.queryParser.QueryParser.getFieldQuery(QueryParser.java:754)
    [junit] Tests run: 3, Failures: 0, Errors: 0, Time elapsed: 0.02 sec
    [junit] at org.apache.lucene.queryParser.QueryParser.Term(QueryParser.java:1594)
    [junit]
    [junit] at org.apache.lucene.queryParser.QueryParser.Clause(QueryParser.java:1337)
    [junit] at org.apache.lucene.queryParser.QueryParser.Query(QueryParser.java:1263)
    [junit] at org.apache.lucene.queryParser.QueryParser.TopLevelQuery(QueryParser.java:1252)
    [junit] at org.apache.lucene.queryParser.QueryParser.parse(QueryParser.java:208)
    [junit] at org.apache.solr.search.LuceneQParser.parse(LuceneQParserPlugin.java:73)
    [junit] at org.apache.solr.search.QParser.getQuery(QParser.java:142)
    [junit] at org.apache.solr.handler.component.QueryComponent.prepare(QueryComponent.java:93)
    [junit] at org.apache.solr.handler.component.SearchHandler.handleRequestBody(SearchHandler.java:210)
    [junit] at org.apache.solr.handler.RequestHandlerBase.handleRequest(RequestHandlerBase.java:131)
    [junit] at org.apache.solr.core.SolrCore.execute(SolrCore.java:1325)
    [junit] at org.apache.solr.util.TestHarness.queryAndResponse(TestHarness.java:334)
    [junit] at org.apache.solr.util.TestHarness.query(TestHarness.java:321)
    [junit] at org.apache.solr.util.TestHarness.query(TestHarness.java:307)
    [junit] at org.apache.solr.SolrTestCaseJ4.assertQ(SolrTestCaseJ4.java:317)
    [junit] at org.apache.solr.TestTrie.testTrieDateRangeSearch(TestTrie.java:202)
    [junit] at sun.reflect.NativeMethodAccessorImpl.invoke0(Native Method)
    [junit] at sun.reflect.NativeMethodAccessorImpl.invoke(NativeMethodAccessorImpl.java:57)
    [junit] at sun.reflect.DelegatingMethodAccessorImpl.invoke(DelegatingMethodAccessorImpl.java:43)
    [junit] at java.lang.reflect.Method.invoke(Method.java:616)
    [junit] at org.junit.runners.model.FrameworkMethod$1.runReflectiveCall(FrameworkMethod.java:44)
    [junit] at org.junit.internal.runners.model.ReflectiveCallable.run(ReflectiveCallable.java:15)
    [junit] at org.junit.runners.model.FrameworkMethod.invokeExplosively(FrameworkMethod.java:41)
    [junit] at org.junit.internal.runners.statements.InvokeMethod.evaluate(InvokeMethod.java:20)
    [junit] at org.junit.rules.TestWatchman$1.evaluate(TestWatchman.java:48)
    [junit] at org.junit.internal.runners.statements.RunBefores.evaluate(RunBefores.java:28)
    [junit] at org.junit.internal.runners.statements.RunAfters.evaluate(RunAfters.java:31)
    [junit] at org.junit.runners.BlockJUnit4ClassRunner.runChild(BlockJUnit4ClassRunner.java:76)
    [junit] at org.apache.lucene.util.LuceneTestCase$LuceneTestCaseRunner.runChild(LuceneTestCase.java:795)
    [junit] at org.apache.lucene.util.LuceneTestCase$LuceneTestCaseRunner.runChild(LuceneTestCase.java:768)
    [junit] at org.junit.runners.ParentRunner$3.run(ParentRunner.java:193)
    [junit] at org.junit.runners.ParentRunner$1.schedule(ParentRunner.java:52)
    [junit] at org.junit.runners.ParentRunner.runChildren(ParentRunner.java:191)
    [junit] at org.junit.runners.ParentRunner.access$000(ParentRunner.java:42)
    [junit] at org.junit.runners.ParentRunner$2.evaluate(ParentRunner.java:184)
    [junit] at org.junit.internal.runners.statements.RunBefores.evaluate(RunBefores.java:28)
    [junit] at org.junit.internal.runners.statements.RunAfters.evaluate(RunAfters.java:31)
    [junit] at org.junit.runners.ParentRunner.run(ParentRunner.java:236)
    [junit] at junit.framework.JUnit4TestAdapter.run(JUnit4TestAdapter.java:39)
    [junit] at org.apache.tools.ant.taskdefs.optional.junit.JUnitTestRunner.run(JUnitTestRunner.java:421)
    [junit] at org.apache.tools.ant.taskdefs.optional.junit.JUnitTestRunner.launch(JUnitTestRunner.java:912)
    [junit] at org.apache.tools.ant.taskdefs.optional.junit.JUnitTestRunner.main(JUnitTestRunner.java:743)
    [junit]
    [junit] ------------- ---------------- ---------------
    [junit] TEST org.apache.solr.TestTrie FAILED
{noformat}

     Issue Type: Test  (was: Bug)
        Summary: Unknown query type 'func'  (was: TestTrie test failure)

Moving stacktrace out of description:

Here is the stacktrace:
{noformat}
   [junit] Testsuite: org.apache.solr.TestTrie
    [junit] Testcase: testTrieIntRangeSearch(org.apache.solr.TestTrie): Caused an ERROR
    [junit] Exception during query
    [junit] java.lang.RuntimeException: Exception during query
    [junit] at org.apache.solr.SolrTestCaseJ4.assertQ(SolrTestCaseJ4.java:339)
    [junit] at org.apache.solr.TestTrie.testTrieIntRangeSearch(TestTrie.java:76)
    [junit] at org.apache.lucene.util.LuceneTestCase$LuceneTestCaseRunner.runChild(LuceneTestCase.java:795)
    [junit] at org.apache.lucene.util.LuceneTestCase$LuceneTestCaseRunner.runChild(LuceneTestCase.java:768)
    [junit] Caused by: org.apache.solr.common.SolrException: Unknown query type 'func'
    [junit] at org.apache.solr.core.SolrCore.getQueryPlugin(SolrCore.java:1474)
    [junit] at org.apache.solr.search.QParser.getParser(QParser.java:286)
    [junit] at org.apache.solr.search.QParser.subQuery(QParser.java:176)
    [junit] at org.apache.solr.search.SolrQueryParser.getFieldQuery(SolrQueryParser.java:142)
    [junit] at org.apache.lucene.queryParser.QueryParser.getFieldQuery(QueryParser.java:754)
    [junit] at org.apache.lucene.queryParser.QueryParser.Term(QueryParser.java:1594)
    [junit] at org.apache.lucene.queryParser.QueryParser.Clause(QueryParser.java:1337)
    [junit] at org.apache.lucene.queryParser.QueryParser.Query(QueryParser.java:1263)
    [junit] at org.apache.lucene.queryParser.QueryParser.TopLevelQuery(QueryParser.java:1252)
    [junit] at org.apache.lucene.queryParser.QueryParser.parse(QueryParser.java:208)
    [junit] at org.apache.solr.search.LuceneQParser.parse(LuceneQParserPlugin.java:73)
    [junit] at org.apache.solr.search.QParser.getQuery(QParser.java:142)
    [junit] at org.apache.solr.handler.component.QueryComponent.prepare(QueryComponent.java:93)
    [junit] at org.apache.solr.handler.component.SearchHandler.handleRequestBody(SearchHandler.java:210)
    [junit] at org.apache.solr.handler.RequestHandlerBase.handleRequest(RequestHandlerBase.java:131)
    [junit] at org.apache.solr.core.SolrCore.execute(SolrCore.java:1325)
    [junit] at org.apache.solr.util.TestHarness.queryAndResponse(TestHarness.java:334)
    [junit] at org.apache.solr.util.TestHarness.query(TestHarness.java:321)
    [junit] at org.apache.solr.util.TestHarness.query(TestHarness.java:307)
    [junit] at org.apache.solr.SolrTestCaseJ4.assertQ(SolrTestCaseJ4.java:317)
    [junit]
    [junit]
    [junit] Testcase: testTrieFloatRangeSearch(org.apache.solr.TestTrie): Caused an ERROR
    [junit] Exception during query
    [junit] java.lang.RuntimeException: Exception during query
    [junit] at org.apache.solr.SolrTestCaseJ4.assertQ(SolrTestCaseJ4.java:339)
    [junit] at org.apache.solr.TestTrie.testTrieFloatRangeSearch(TestTrie.java:119)
    [junit] at org.apache.lucene.util.LuceneTestCase$LuceneTestCaseRunner.runChild(LuceneTestCase.java:795)
    [junit] at org.apache.lucene.util.LuceneTestCase$LuceneTestCaseRunner.runChild(LuceneTestCase.java:768)
    [junit] Caused by: org.apache.solr.common.SolrException: Unknown query type 'func'
    [junit] at org.apache.solr.core.SolrCore.getQueryPlugin(SolrCore.java:1474)
    [junit] at org.apache.solr.search.QParser.getParser(QParser.java:286)
    [junit] at org.apache.solr.search.QParser.subQuery(QParser.java:176)
    [junit] at org.apache.solr.search.SolrQueryParser.getFieldQuery(SolrQueryParser.java:142)
    [junit] at org.apache.lucene.queryParser.QueryParser.getFieldQuery(QueryParser.java:754)
    [junit] at org.apache.lucene.queryParser.QueryParser.Term(QueryParser.java:1594)
    [junit] at org.apache.lucene.queryParser.QueryParser.Clause(QueryParser.java:1337)
    [junit] at org.apache.lucene.queryParser.QueryParser.Query(QueryParser.java:1263)
    [junit] at org.apache.lucene.queryParser.QueryParser.TopLevelQuery(QueryParser.java:1252)
    [junit] at org.apache.lucene.queryParser.QueryParser.parse(QueryParser.java:208)
    [junit] at org.apache.solr.search.LuceneQParser.parse(LuceneQParserPlugin.java:73)
    [junit] at org.apache.solr.search.QParser.getQuery(QParser.java:142)
    [junit] at org.apache.solr.handler.component.QueryComponent.prepare(QueryComponent.java:93)
    [junit] at org.apache.solr.handler.component.SearchHandler.handleRequestBody(SearchHandler.java:210)
    [junit] at org.apache.solr.handler.RequestHandlerBase.handleRequest(RequestHandlerBase.java:131)
    [junit] at org.apache.solr.core.SolrCore.execute(SolrCore.java:1325)
    [junit] at org.apache.solr.util.TestHarness.queryAndResponse(TestHarness.java:334)
    [junit] at org.apache.solr.util.TestHarness.query(TestHarness.java:321)
    [junit] at org.apache.solr.util.TestHarness.query(TestHarness.java:307)
    [junit] at org.apache.solr.SolrTestCaseJ4.assertQ(SolrTestCaseJ4.java:317)
    [junit]
    [junit]
    [junit] Testcase: testTrieLongRangeSearch(org.apache.solr.TestTrie): Caused an ERROR
    [junit] Exception during query
    [junit] java.lang.RuntimeException: Exception during query
    [junit] at org.apache.solr.SolrTestCaseJ4.assertQ(SolrTestCaseJ4.java:339)
    [junit] at org.apache.solr.TestTrie.testTrieLongRangeSearch(TestTrie.java:138)
    [junit] at org.apache.lucene.util.LuceneTestCase$LuceneTestCaseRunner.runChild(LuceneTestCase.java:795)
    [junit] at org.apache.lucene.util.LuceneTestCase$LuceneTestCaseRunner.runChild(LuceneTestCase.java:768)
    [junit] Caused by: org.apache.solr.common.SolrException: Unknown query type 'func'
    [junit] at org.apache.solr.core.SolrCore.getQueryPlugin(SolrCore.java:1474)
    [junit] at org.apache.solr.search.QParser.getParser(QParser.java:286)
    [junit] at org.apache.solr.search.QParser.subQuery(QParser.java:176)
    [junit] at org.apache.solr.search.SolrQueryParser.getFieldQuery(SolrQueryParser.java:142)
    [junit] at org.apache.lucene.queryParser.QueryParser.getFieldQuery(QueryParser.java:754)
    [junit] at org.apache.lucene.queryParser.QueryParser.Term(QueryParser.java:1594)
    [junit] at org.apache.lucene.queryParser.QueryParser.Clause(QueryParser.java:1337)
    [junit] at org.apache.lucene.queryParser.QueryParser.Query(QueryParser.java:1263)
    [junit] at org.apache.lucene.queryParser.QueryParser.TopLevelQuery(QueryParser.java:1252)
    [junit] at org.apache.lucene.queryParser.QueryParser.parse(QueryParser.java:208)
    [junit] at org.apache.solr.search.LuceneQParser.parse(LuceneQParserPlugin.java:73)
    [junit] at org.apache.solr.search.QParser.getQuery(QParser.java:142)
    [junit] at org.apache.solr.handler.component.QueryComponent.prepare(QueryComponent.java:93)
    [junit] at org.apache.solr.handler.component.SearchHandler.handleRequestBody(SearchHandler.java:210)
    [junit] at org.apache.solr.handler.RequestHandlerBase.handleRequest(RequestHandlerBase.java:131)
    [junit] at org.apache.solr.core.SolrCore.execute(SolrCore.java:1325)
    [junit] at org.apache.solr.util.TestHarness.queryAndResponse(TestHarness.java:334)
    [junit] at org.apache.solr.util.TestHarness.query(TestHarness.java:321)
    [junit] at org.apache.solr.util.TestHarness.query(TestHarness.java:307)
    [junit] at org.apache.solr.SolrTestCaseJ4.assertQ(SolrTestCaseJ4.java:317)
    [junit]
    [junit]
    [junit] Testcase: testTrieDoubleRangeSearch(org.apache.solr.TestTrie): Caused an ERROR
    [junit] Exception during query
    [junit] java.lang.RuntimeException: Exception during query
    [junit] at org.apache.solr.SolrTestCaseJ4.assertQ(SolrTestCaseJ4.java:339)
    [junit] at org.apache.solr.TestTrie.testTrieDoubleRangeSearch(TestTrie.java:156)
    [junit] at org.apache.lucene.util.LuceneTestCase$LuceneTestCaseRunner.runChild(LuceneTestCase.java:795)
    [junit] at org.apache.lucene.util.LuceneTestCase$LuceneTestCaseRunner.runChild(LuceneTestCase.java:768)
    [junit] Caused by: org.apache.solr.common.SolrException: Unknown query type 'func'
    [junit] at org.apache.solr.core.SolrCore.getQueryPlugin(SolrCore.java:1474)
    [junit] at org.apache.solr.search.QParser.getParser(QParser.java:286)
    [junit] at org.apache.solr.search.QParser.subQuery(QParser.java:176)
    [junit] at org.apache.solr.search.SolrQueryParser.getFieldQuery(SolrQueryParser.java:142)
    [junit] at org.apache.lucene.queryParser.QueryParser.getFieldQuery(QueryParser.java:754)
    [junit] at org.apache.lucene.queryParser.QueryParser.Term(QueryParser.java:1594)
    [junit] at org.apache.lucene.queryParser.QueryParser.Clause(QueryParser.java:1337)
    [junit] at org.apache.lucene.queryParser.QueryParser.Query(QueryParser.java:1263)
    [junit] at org.apache.lucene.queryParser.QueryParser.TopLevelQuery(QueryParser.java:1252)
    [junit] at org.apache.lucene.queryParser.QueryParser.parse(QueryParser.java:208)
    [junit] at org.apache.solr.search.LuceneQParser.parse(LuceneQParserPlugin.java:73)
    [junit] at org.apache.solr.search.QParser.getQuery(QParser.java:142)
    [junit] at org.apache.solr.handler.component.QueryComponent.prepare(QueryComponent.java:93)
    [junit] at org.apache.solr.handler.component.SearchHandler.handleRequestBody(SearchHandler.java:210)
    [junit] at org.apache.solr.handler.RequestHandlerBase.handleRequest(RequestHandlerBase.java:131)
    [junit] at org.apache.solr.core.SolrCore.execute(SolrCore.java:1325)
    [junit] at org.apache.solr.util.TestHarness.queryAndResponse(TestHarness.java:334)
    [junit] at org.apache.solr.util.TestHarness.query(TestHarness.java:321)
    [junit] at org.apache.solr.util.TestHarness.query(TestHarness.java:307)
    [junit] at org.apache.solr.SolrTestCaseJ4.assertQ(SolrTestCaseJ4.java:317)
    [junit]
    [junit]
    [junit] Testcase: testTrieDateRangeSearch(org.apache.solr.TestTrie): Caused an ERROR
    [junit] Exception during query
    [junit] java.lang.RuntimeException: Exception during query
    [junit] at org.apache.solr.SolrTestCaseJ4.assertQ(SolrTestCaseJ4.java:339)
    [junit] at org.apache.solr.TestTrie.testTrieDateRangeSearch(TestTrie.java:202)
    [junit] at org.apache.lucene.util.LuceneTestCase$LuceneTestCaseRunner.runChild(LuceneTestCase.java:795)
    [junit] at org.apache.lucene.util.LuceneTestCase$LuceneTestCaseRunner.runChild(LuceneTestCase.java:768)
    [junit] Caused by: org.apache.solr.common.SolrException: Unknown query type 'func'
    [junit] at org.apache.solr.core.SolrCore.getQueryPlugin(SolrCore.java:1474)
    [junit] at org.apache.solr.search.QParser.getParser(QParser.java:286)
    [junit] at org.apache.solr.search.QParser.subQuery(QParser.java:176)
    [junit] at org.apache.solr.search.SolrQueryParser.getFieldQuery(SolrQueryParser.java:142)
    [junit] at org.apache.lucene.queryParser.QueryParser.getFieldQuery(QueryParser.java:754)
    [junit] at org.apache.lucene.queryParser.QueryParser.Term(QueryParser.java:1594)
    [junit] at org.apache.lucene.queryParser.QueryParser.Clause(QueryParser.java:1337)
    [junit] at org.apache.lucene.queryParser.QueryParser.Query(QueryParser.java:1263)
    [junit] at org.apache.lucene.queryParser.QueryParser.TopLevelQuery(QueryParser.java:1252)
    [junit] at org.apache.lucene.queryParser.QueryParser.parse(QueryParser.java:208)
    [junit] at org.apache.solr.search.LuceneQParser.parse(LuceneQParserPlugin.java:73)
    [junit] at org.apache.solr.search.QParser.getQuery(QParser.java:142)
    [junit] at org.apache.solr.handler.component.QueryComponent.prepare(QueryComponent.java:93)
    [junit] at org.apache.solr.handler.component.SearchHandler.handleRequestBody(SearchHandler.java:210)
    [junit] at org.apache.solr.handler.RequestHandlerBase.handleRequest(RequestHandlerBase.java:131)
    [junit] at org.apache.solr.core.SolrCore.execute(SolrCore.java:1325)
    [junit] at org.apache.solr.util.TestHarness.queryAndResponse(TestHarness.java:334)
    [junit] at org.apache.solr.util.TestHarness.query(TestHarness.java:321)
    [junit] at org.apache.solr.util.TestHarness.query(TestHarness.java:307)
    [junit] at org.apache.solr.SolrTestCaseJ4.assertQ(SolrTestCaseJ4.java:317)
    [junit]
    [junit]
    [junit] Tests run: 8, Failures: 0, Errors: 5, Time elapsed: 3.814 sec
    [junit]
    [junit] ------------- Standard Output ---------------
    [junit] NOTE: reproduce with: ant test -Dtestcase=TestTrie -Dtestmethod=testTrieIntRangeSearch -Dtests.seed=-2722426925580758488:-212535574334114449
    [junit] NOTE: reproduce with: ant test -Dtestcase=TestTrie -Dtestmethod=testTrieFloatRangeSearch -Dtests.seed=-2722426925580758488:-8980412733871305155
    [junit] NOTE: reproduce with: ant test -Dtestcase=TestTrie -Dtestmethod=testTrieLongRangeSearch -Dtests.seed=-2722426925580758488:-8688081968302257420
    [junit] NOTE: reproduce with: ant test -Dtestcase=TestTrie -Dtestmethod=testTrieDoubleRangeSearch -Dtests.seed=-2722426925580758488:1705446365560533918
    [junit] NOTE: reproduce with: ant test -Dtestcase=TestTrie -Dtestmethod=testTrieDateRangeSearch -Dtests.seed=-2722426925580758488:2549506927018087212
    [junit] NOTE: test params are: codec=Standard, locale=sl, timezone=Japan
    [junit] ------------- ---------------- ---------------
    [junit] ------------- Standard Error -----------------
    [junit] 15.10.2010 7:29:20 org.apache.solr.common.SolrException log
    [junit] SEVERE: org.apache.solr.common.SolrException: Unknown query type 'func'
    [junit] at org.apache.solr.core.SolrCore.getQueryPlugin(SolrCore.java:1474)
    [junit] at org.apache.solr.search.QParser.getParser(QParser.java:286)
    [junit] at org.apache.solr.search.QParser.subQuery(QParser.java:176)
    [junit] at org.apache.solr.search.SolrQueryParser.getFieldQuery(SolrQueryParser.java:142)
    [junit] at org.apache.lucene.queryParser.QueryParser.getFieldQuery(QueryParser.java:754)
    [junit] at org.apache.lucene.queryParser.QueryParser.Term(QueryParser.java:1594)
    [junit] at org.apache.lucene.queryParser.QueryParser.Clause(QueryParser.java:1337)
    [junit] at org.apache.lucene.queryParser.QueryParser.Query(QueryParser.java:1263)
    [junit] at org.apache.lucene.queryParser.QueryParser.TopLevelQuery(QueryParser.java:1252)
    [junit] at org.apache.lucene.queryParser.QueryParser.parse(QueryParser.java:208)
    [junit] at org.apache.solr.search.LuceneQParser.parse(LuceneQParserPlugin.java:73)
    [junit] at org.apache.solr.search.QParser.getQuery(QParser.java:142)
    [junit] at org.apache.solr.handler.component.QueryComponent.prepare(QueryComponent.java:93)
    [junit] at org.apache.solr.handler.component.SearchHandler.handleRequestBody(SearchHandler.java:210)
    [junit] at org.apache.solr.handler.RequestHandlerBase.handleRequest(RequestHandlerBase.java:131)
    [junit] at org.apache.solr.core.SolrCore.execute(SolrCore.java:1325)
    [junit] at org.apache.solr.util.TestHarness.queryAndResponse(TestHarness.java:334)
    [junit] at org.apache.solr.util.TestHarness.query(TestHarness.java:321)
    [junit] at org.apache.solr.util.TestHarness.query(TestHarness.java:307)
    [junit] at org.apache.solr.SolrTestCaseJ4.assertQ(SolrTestCaseJ4.java:317)
    [junit] at org.apache.solr.TestTrie.testTrieIntRangeSearch(TestTrie.java:76)
    [junit] at sun.reflect.NativeMethodAccessorImpl.invoke0(Native Method)
    [junit] at sun.reflect.NativeMethodAccessorImpl.invoke(NativeMethodAccessorImpl.java:57)
    [junit] at sun.reflect.DelegatingMethodAccessorImpl.invoke(DelegatingMethodAccessorImpl.java:43)
    [junit] at java.lang.reflect.Method.invoke(Method.java:616)
    [junit] at org.junit.runners.model.FrameworkMethod$1.runReflectiveCall(FrameworkMethod.java:44)
    [junit] at org.junit.internal.runners.model.ReflectiveCallable.run(ReflectiveCallable.java:15)
    [junit] at org.junit.runners.model.FrameworkMethod.invokeExplosively(FrameworkMethod.java:41)
    [junit] at org.junit.internal.runners.statements.InvokeMethod.evaluate(InvokeMethod.java:20)
    [junit] at org.junit.rules.TestWatchman$1.evaluate(TestWatchman.java:48)
    [junit] at org.junit.internal.runners.statements.RunBefores.evaluate(RunBefores.java:28)
    [junit] at org.junit.internal.runners.statements.RunAfters.evaluate(RunAfters.java:31)
    [junit] at org.junit.runners.BlockJUnit4ClassRunner.runChild(BlockJUnit4ClassRunner.java:76)
    [junit] at org.apache.lucene.util.LuceneTestCase$LuceneTestCaseRunner.runChild(LuceneTestCase.java:795)
    [junit] at org.apache.lucene.util.LuceneTestCase$LuceneTestCaseRunner.runChild(LuceneTestCase.java:768)
    [junit] at org.junit.runners.ParentRunner$3.run(ParentRunner.java:193)
    [junit] at org.junit.runners.ParentRunner$1.schedule(ParentRunner.java:52)
    [junit] at org.junit.runners.ParentRunner.runChildren(ParentRunner.java:191)
    [junit] at org.junit.runners.ParentRunner.access$000(ParentRunner.java:42)
    [junit] at org.junit.runners.ParentRunner$2.evaluate(ParentRunner.java:184)
    [junit] at org.junit.internal.runners.statements.RunBefores.evaluate(RunBefores.java:28)
    [junit] at org.junit.internal.runners.statements.RunAfters.evaluate(RunAfters.java:31)
    [junit] at org.junit.runners.ParentRunner.run(ParentRunner.java:236)
    [junit] at junit.framework.JUnit4TestAdapter.run(JUnit4TestAdapter.java:39)
    [junit] at org.apache.tools.ant.taskdefs.optional.junit.JUnitTestRunner.run(JUnitTestRunner.java:421)
    [junit] at org.apache.tools.ant.taskdefs.optional.junit.JUnitTestRunner.launch(JUnitTestRunner.java:912)
    [junit] at org.apache.tools.ant.taskdefs.optional.junit.JUnitTestRunner.main(JUnitTestRunner.java:743)
    [junit]
    [junit] 15.10.2010 7:29:20 org.apache.solr.common.SolrException log
    [junit] SEVERE: org.apache.solr.common.SolrException: Unknown query type 'func'
    [junit] at org.apache.solr.core.SolrCore.getQueryPlugin(SolrCore.java:1474)
    [junit] at org.apache.solr.search.QParser.getParser(QParser.java:286)
    [junit] at org.apache.solr.search.QParser.subQuery(QParser.java:176)
    [junit] at org.apache.solr.search.SolrQueryParser.getFieldQuery(SolrQueryParser.java:142)
    [junit] at org.apache.lucene.queryParser.QueryParser.getFieldQuery(QueryParser.java:754)
    [junit] at org.apache.lucene.queryParser.QueryParser.Term(QueryParser.java:1594)
    [junit] at org.apache.lucene.queryParser.QueryParser.Clause(QueryParser.java:1337)
    [junit] at org.apache.lucene.queryParser.QueryParser.Query(QueryParser.java:1263)
    [junit] at org.apache.lucene.queryParser.QueryParser.TopLevelQuery(QueryParser.java:1252)
    [junit] at org.apache.lucene.queryParser.QueryParser.parse(QueryParser.java:208)
    [junit] at org.apache.solr.search.LuceneQParser.parse(LuceneQParserPlugin.java:73)
    [junit] at org.apache.solr.search.QParser.getQuery(QParser.java:142)
    [junit] at org.apache.solr.handler.component.QueryComponent.prepare(QueryComponent.java:93)
    [junit] at org.apache.solr.handler.component.SearchHandler.handleRequestBody(SearchHandler.java:210)
    [junit] at org.apache.solr.handler.RequestHandlerBase.handleRequest(RequestHandlerBase.java:131)
    [junit] at org.apache.solr.core.SolrCore.execute(SolrCore.java:1325)
    [junit] at org.apache.solr.util.TestHarness.queryAndResponse(TestHarness.java:334)
    [junit] at org.apache.solr.util.TestHarness.query(TestHarness.java:321)
    [junit] at org.apache.solr.util.TestHarness.query(TestHarness.java:307)
    [junit] at org.apache.solr.SolrTestCaseJ4.assertQ(SolrTestCaseJ4.java:317)
    [junit] at org.apache.solr.TestTrie.testTrieFloatRangeSearch(TestTrie.java:119)
    [junit] at sun.reflect.NativeMethodAccessorImpl.invoke0(Native Method)
    [junit] at sun.reflect.NativeMethodAccessorImpl.invoke(NativeMethodAccessorImpl.java:57)
    [junit] at sun.reflect.DelegatingMethodAccessorImpl.invoke(DelegatingMethodAccessorImpl.java:43)
    [junit] at java.lang.reflect.Method.invoke(Method.java:616)
    [junit] at org.junit.runners.model.FrameworkMethod$1.runReflectiveCall(FrameworkMethod.java:44)
    [junit] at org.junit.internal.runners.model.ReflectiveCallable.run(ReflectiveCallable.java:15)
    [junit] at org.junit.runners.model.FrameworkMethod.invokeExplosively(FrameworkMethod.java:41)
    [junit] at org.junit.internal.runners.statements.InvokeMethod.evaluate(InvokeMethod.java:20)
    [junit] at org.junit.rules.TestWatchman$1.evaluate(TestWatchman.java:48)
    [junit] at org.junit.internal.runners.statements.RunBefores.evaluate(RunBefores.java:28)
    [junit] at org.junit.internal.runners.statements.RunAfters.evaluate(RunAfters.java:31)
    [junit] at org.junit.runners.BlockJUnit4ClassRunner.runChild(BlockJUnit4ClassRunner.java:76)
    [junit] at org.apache.lucene.util.LuceneTestCase$LuceneTestCaseRunner.runChild(LuceneTestCase.java:795)
    [junit] at org.apache.lucene.util.LuceneTestCase$LuceneTestCaseRunner.runChild(LuceneTestCase.java:768)
    [junit] at org.junit.runners.ParentRunner$3.run(ParentRunner.java:193)
    [junit] at org.junit.runners.ParentRunner$1.schedule(ParentRunner.java:52)
    [junit] at org.junit.runners.ParentRunner.runChildren(ParentRunner.java:191)
    [junit] at org.junit.runners.ParentRunner.access$000(ParentRunner.java:42)
    [junit] at org.junit.runners.ParentRunner$2.evaluate(ParentRunner.java:184)
    [junit] at org.junit.internal.runners.statements.RunBefores.evaluate(RunBefores.java:28)
    [junit] at org.junit.internal.runners.statements.RunAfters.evaluate(RunAfters.java:31)
    [junit] at org.junit.runners.ParentRunner.run(ParentRunner.java:236)
    [junit] at junit.framework.JUnit4TestAdapter.run(JUnit4TestAdapter.java:39)
    [junit] at org.apache.tools.ant.taskdefs.optional.junit.JUnitTestRunner.run(JUnitTestRunner.java:421)
    [junit] at org.apache.tools.ant.taskdefs.optional.junit.JUnitTestRunner.launch(JUnitTestRunner.java:912)
    [junit] at org.apache.tools.ant.taskdefs.optional.junit.JUnitTestRunner.main(JUnitTestRunner.java:743)
    [junit]
    [junit] 15.10.2010 7:29:20 org.apache.solr.common.SolrException log
    [junit] SEVERE: org.apache.solr.common.SolrException: Unknown query type 'func'
    [junit] at org.apache.solr.core.SolrCore.getQueryPlugin(SolrCore.java:1474)
    [junit] at org.apache.solr.search.QParser.getParser(QParser.java:286)
    [junit] at org.apache.solr.search.QParser.subQuery(QParser.java:176)
    [junit] at org.apache.solr.search.SolrQueryParser.getFieldQuery(SolrQueryParser.java:142)
    [junit] at org.apache.lucene.queryParser.QueryParser.getFieldQuery(QueryParser.java:754)
    [junit] at org.apache.lucene.queryParser.QueryParser.Term(QueryParser.java:1594)
    [junit] at org.apache.lucene.queryParser.QueryParser.Clause(QueryParser.java:1337)
    [junit] at org.apache.lucene.queryParser.QueryParser.Query(QueryParser.java:1263)
    [junit] at org.apache.lucene.queryParser.QueryParser.TopLevelQuery(QueryParser.java:1252)
    [junit] at org.apache.lucene.queryParser.QueryParser.parse(QueryParser.java:208)
    [junit] at org.apache.solr.search.LuceneQParser.parse(LuceneQParserPlugin.java:73)
    [junit] at org.apache.solr.search.QParser.getQuery(QParser.java:142)
    [junit] at org.apache.solr.handler.component.QueryComponent.prepare(QueryComponent.java:93)
    [junit] at org.apache.solr.handler.component.SearchHandler.handleRequestBody(SearchHandler.java:210)
    [junit] at org.apache.solr.handler.RequestHandlerBase.handleRequest(RequestHandlerBase.java:131)
    [junit] at org.apache.solr.core.SolrCore.execute(SolrCore.java:1325)
    [junit] at org.apache.solr.util.TestHarness.queryAndResponse(TestHarness.java:334)
    [junit] at org.apache.solr.util.TestHarness.query(TestHarness.java:321)
    [junit] at org.apache.solr.util.TestHarness.query(TestHarness.java:307)
    [junit] at org.apache.solr.SolrTestCaseJ4.assertQ(SolrTestCaseJ4.java:317)
    [junit] at org.apache.solr.TestTrie.testTrieLongRangeSearch(TestTrie.java:138)
    [junit] at sun.reflect.NativeMethodAccessorImpl.invoke0(Native Method)
    [junit] at sun.reflect.NativeMethodAccessorImpl.invoke(NativeMethodAccessorImpl.java:57)
    [junit] at sun.reflect.DelegatingMethodAccessorImpl.invoke(DelegatingMethodAccessorImpl.java:43)
    [junit] at java.lang.reflect.Method.invoke(Method.java:616)
    [junit] at org.junit.runners.model.FrameworkMethod$1.runReflectiveCall(FrameworkMethod.java:44)
    [junit] at org.junit.internal.runners.model.ReflectiveCallable.run(ReflectiveCallable.java:15)
    [junit] at org.junit.runners.model.FrameworkMethod.invokeExplosively(FrameworkMethod.java:41)
    [junit] at org.junit.internal.runners.statements.InvokeMethod.evaluate(InvokeMethod.java:20)
    [junit] at org.junit.rules.TestWatchman$1.evaluate(TestWatchman.java:48)
    [junit] at org.junit.internal.runners.statements.RunBefores.evaluate(RunBefores.java:28)
    [junit] at org.junit.internal.runners.statements.RunAfters.evaluate(RunAfters.java:31)
    [junit] at org.junit.runners.BlockJUnit4ClassRunner.runChild(BlockJUnit4ClassRunner.java:76)
    [junit] at org.apache.lucene.util.LuceneTestCase$LuceneTestCaseRunner.runChild(LuceneTestCase.java:795)
    [junit] at org.apache.lucene.util.LuceneTestCase$LuceneTestCaseRunner.runChild(LuceneTestCase.java:768)
    [junit] at org.junit.runners.ParentRunner$3.run(ParentRunner.java:193)
    [junit] at org.junit.runners.ParentRunner$1.schedule(ParentRunner.java:52)
    [junit] at org.junit.runners.ParentRunner.runChildren(ParentRunner.java:191)
    [junit] at org.junit.runners.ParentRunner.access$000(ParentRunner.java:42)
    [junit] at org.junit.runners.ParentRunner$2.evaluate(ParentRunner.java:184)
    [junit] at org.junit.internal.runners.statements.RunBefores.evaluate(RunBefores.java:28)
    [junit] at org.junit.internal.runners.statements.RunAfters.evaluate(RunAfters.java:31)
    [junit] at org.junit.runners.ParentRunner.run(ParentRunner.java:236)
    [junit] at junit.framework.JUnit4TestAdapter.run(JUnit4TestAdapter.java:39)
    [junit] at org.apache.tools.ant.taskdefs.optional.junit.JUnitTestRunner.run(JUnitTestRunner.java:421)
    [junit] at org.apache.tools.ant.taskdefs.optional.junit.JUnitTestRunner.launch(JUnitTestRunner.java:912)
    [junit] at org.apache.tools.ant.taskdefs.optional.junit.JUnitTestRunner.main(JUnitTestRunner.java:743)
    [junit]
    [junit] 15.10.2010 7:29:21 org.apache.solr.common.SolrException log
    [junit] SEVERE: org.apache.solr.common.SolrException: Unknown query type 'func'
    [junit] at org.apache.solr.core.SolrCore.getQueryPlugin(SolrCore.java:1474)
    [junit] at org.apache.solr.search.QParser.getParser(QParser.java:286)
    [junit] at org.apache.solr.search.QParser.subQuery(QParser.java:176)
    [junit] at org.apache.solr.search.SolrQueryParser.getFieldQuery(SolrQueryParser.java:142)
    [junit] at org.apache.lucene.queryParser.QueryParser.getFieldQuery(QueryParser.java:754)
    [junit] at org.apache.lucene.queryParser.QueryParser.Term(QueryParser.java:1594)
    [junit] at org.apache.lucene.queryParser.QueryParser.Clause(QueryParser.java:1337)
    [junit] at org.apache.lucene.queryParser.QueryParser.Query(QueryParser.java:1263)
    [junit] at org.apache.lucene.queryParser.QueryParser.TopLevelQuery(QueryParser.java:1252)
    [junit] at org.apache.lucene.queryParser.QueryParser.parse(QueryParser.java:208)
    [junit] at org.apache.solr.search.LuceneQParser.parse(LuceneQParserPlugin.java:73)
    [junit] at org.apache.solr.search.QParser.getQuery(QParser.java:142)
    [junit] at org.apache.solr.handler.component.QueryComponent.prepare(QueryComponent.java:93)
    [junit] at org.apache.solr.handler.component.SearchHandler.handleRequestBody(SearchHandler.java:210)
    [junit] at org.apache.solr.handler.RequestHandlerBase.handleRequest(RequestHandlerBase.java:131)
    [junit] at org.apache.solr.core.SolrCore.execute(SolrCore.java:1325)
    [junit] at org.apache.solr.util.TestHarness.queryAndResponse(TestHarness.java:334)
    [junit] at org.apache.solr.util.TestHarness.query(TestHarness.java:321)
    [junit] at org.apache.solr.util.TestHarness.query(TestHarness.java:307)
    [junit] at org.apache.solr.SolrTestCaseJ4.assertQ(SolrTestCaseJ4.java:317)
    [junit] at org.apache.solr.TestTrie.testTrieDoubleRangeSearch(TestTrie.java:156)
    [junit] at sun.reflect.NativeMethodAccessorImpl.invoke0(Native Method)
    [junit] at sun.reflect.NativeMethodAccessorImpl.invoke(NativeMethodAccessorImpl.java:57)
    [junit] at sun.reflect.DelegatingMethodAccessorImpl.invoke(DelegatingMethodAccessorImpl.java:43)
    [junit] at java.lang.reflect.Method.invoke(Method.java:616)
    [junit] at org.junit.runners.model.FrameworkMethod$1.runReflectiveCall(FrameworkMethod.java:44)
    [junit] at org.junit.internal.runners.model.ReflectiveCallable.run(ReflectiveCallable.java:15)
    [junit] at org.junit.runners.model.FrameworkMethod.invokeExplosively(FrameworkMethod.java:41)
    [junit] at org.junit.internal.runners.statements.InvokeMethod.evaluate(InvokeMethod.java:20)
    [junit] at org.junit.rules.TestWatchman$1.evaluate(TestWatchman.java:48)
    [junit] at org.junit.internal.runners.statements.RunBefores.evaluate(RunBefores.java:28)
    [junit] at org.junit.internal.runners.statements.RunAfters.evaluate(RunAfters.java:31)
    [junit] at org.junit.runners.BlockJUnit4ClassRunner.runChild(BlockJUnit4ClassRunner.java:76)
    [junit] at org.apache.lucene.util.LuceneTestCase$LuceneTestCaseRunner.runChild(LuceneTestCase.java:795)
    [junit] at org.apache.lucene.util.LuceneTestCase$LuceneTestCaseRunner.runChild(LuceneTestCase.java:768)
    [junit] at org.junit.runners.ParentRunner$3.run(ParentRunner.java:193)
    [junit] at org.junit.runners.ParentRunner$1.schedule(ParentRunner.java:52)
    [junit] at org.junit.runners.ParentRunner.runChildren(ParentRunner.java:191)
    [junit] at org.junit.runners.ParentRunner.access$000(ParentRunner.java:42)
    [junit] at org.junit.runners.ParentRunner$2.evaluate(ParentRunner.java:184)
    [junit] at org.junit.internal.runners.statements.RunBefores.evaluate(RunBefores.java:28)
    [junit] at org.junit.internal.runners.statements.RunAfters.evaluate(RunAfters.java:31)
    [junit] at org.junit.runners.ParentRunner.run(ParentRunner.java:236)
    [junit] at junit.framework.JUnit4TestAdapter.run(JUnit4TestAdapter.java:39)
    [junit] at org.apache.tools.ant.taskdefs.optional.junit.JUnitTestRunner.run(JUnitTestRunner.java:421)
    [junit] at org.apache.tools.ant.taskdefs.optional.junit.JUnitTestRunner.launch(JUnitTestRunner.java:912)
    [junit] at org.apache.tools.ant.taskdefs.optional.junit.JUnitTestRunner.main(JUnitTestRunner.java:743)
    [junit]
    [junit] 15.10.2010 7:29:21 org.apache.solr.common.SolrException log
    [junit] SEVERE: org.apache.solr.common.SolrException: Unknown query type 'func'
    [junit] at org.apache.solr.core.SolrCore.getQueryPlugin(SolrCore.java:1474)
    [junit] at org.apache.solr.search.QParser.getParser(QParser.java:286)
    [junit] at org.apache.solr.search.QParser.subQuery(QParser.java:176)
    [junit] at org.apache.solr.search.SolrQueryParser.getFieldQuery(SolrQueryParser.java:142)
    [junit] Testsuite: org.apache.solr.analysis.SnowballPorterFilterFactoryTest
    [junit] at org.apache.lucene.queryParser.QueryParser.getFieldQuery(QueryParser.java:754)
    [junit] Tests run: 3, Failures: 0, Errors: 0, Time elapsed: 0.02 sec
    [junit] at org.apache.lucene.queryParser.QueryParser.Term(QueryParser.java:1594)
    [junit]
    [junit] at org.apache.lucene.queryParser.QueryParser.Clause(QueryParser.java:1337)
    [junit] at org.apache.lucene.queryParser.QueryParser.Query(QueryParser.java:1263)
    [junit] at org.apache.lucene.queryParser.QueryParser.TopLevelQuery(QueryParser.java:1252)
    [junit] at org.apache.lucene.queryParser.QueryParser.parse(QueryParser.java:208)
    [junit] at org.apache.solr.search.LuceneQParser.parse(LuceneQParserPlugin.java:73)
    [junit] at org.apache.solr.search.QParser.getQuery(QParser.java:142)
    [junit] at org.apache.solr.handler.component.QueryComponent.prepare(QueryComponent.java:93)
    [junit] at org.apache.solr.handler.component.SearchHandler.handleRequestBody(SearchHandler.java:210)
    [junit] at org.apache.solr.handler.RequestHandlerBase.handleRequest(RequestHandlerBase.java:131)
    [junit] at org.apache.solr.core.SolrCore.execute(SolrCore.java:1325)
    [junit] at org.apache.solr.util.TestHarness.queryAndResponse(TestHarness.java:334)
    [junit] at org.apache.solr.util.TestHarness.query(TestHarness.java:321)
    [junit] at org.apache.solr.util.TestHarness.query(TestHarness.java:307)
    [junit] at org.apache.solr.SolrTestCaseJ4.assertQ(SolrTestCaseJ4.java:317)
    [junit] at org.apache.solr.TestTrie.testTrieDateRangeSearch(TestTrie.java:202)
    [junit] at sun.reflect.NativeMethodAccessorImpl.invoke0(Native Method)
    [junit] at sun.reflect.NativeMethodAccessorImpl.invoke(NativeMethodAccessorImpl.java:57)
    [junit] at sun.reflect.DelegatingMethodAccessorImpl.invoke(DelegatingMethodAccessorImpl.java:43)
    [junit] at java.lang.reflect.Method.invoke(Method.java:616)
    [junit] at org.junit.runners.model.FrameworkMethod$1.runReflectiveCall(FrameworkMethod.java:44)
    [junit] at org.junit.internal.runners.model.ReflectiveCallable.run(ReflectiveCallable.java:15)
    [junit] at org.junit.runners.model.FrameworkMethod.invokeExplosively(FrameworkMethod.java:41)
    [junit] at org.junit.internal.runners.statements.InvokeMethod.evaluate(InvokeMethod.java:20)
    [junit] at org.junit.rules.TestWatchman$1.evaluate(TestWatchman.java:48)
    [junit] at org.junit.internal.runners.statements.RunBefores.evaluate(RunBefores.java:28)
    [junit] at org.junit.internal.runners.statements.RunAfters.evaluate(RunAfters.java:31)
    [junit] at org.junit.runners.BlockJUnit4ClassRunner.runChild(BlockJUnit4ClassRunner.java:76)
    [junit] at org.apache.lucene.util.LuceneTestCase$LuceneTestCaseRunner.runChild(LuceneTestCase.java:795)
    [junit] at org.apache.lucene.util.LuceneTestCase$LuceneTestCaseRunner.runChild(LuceneTestCase.java:768)
    [junit] at org.junit.runners.ParentRunner$3.run(ParentRunner.java:193)
    [junit] at org.junit.runners.ParentRunner$1.schedule(ParentRunner.java:52)
    [junit] at org.junit.runners.ParentRunner.runChildren(ParentRunner.java:191)
    [junit] at org.junit.runners.ParentRunner.access$000(ParentRunner.java:42)
    [junit] at org.junit.runners.ParentRunner$2.evaluate(ParentRunner.java:184)
    [junit] at org.junit.internal.runners.statements.RunBefores.evaluate(RunBefores.java:28)
    [junit] at org.junit.internal.runners.statements.RunAfters.evaluate(RunAfters.java:31)
    [junit] at org.junit.runners.ParentRunner.run(ParentRunner.java:236)
    [junit] at junit.framework.JUnit4TestAdapter.run(JUnit4TestAdapter.java:39)
    [junit] at org.apache.tools.ant.taskdefs.optional.junit.JUnitTestRunner.run(JUnitTestRunner.java:421)
    [junit] at org.apache.tools.ant.taskdefs.optional.junit.JUnitTestRunner.launch(JUnitTestRunner.java:912)
    [junit] at org.apache.tools.ant.taskdefs.optional.junit.JUnitTestRunner.main(JUnitTestRunner.java:743)
    [junit]
    [junit] ------------- ---------------- ---------------
    [junit] TEST org.apache.solr.TestTrie FAILED
{noformat}

> Unknown query type 'func'
> -------------------------
>
>                 Key: SOLR-2160
>                 URL: https://issues.apache.org/jira/browse/SOLR-2160
>             Project: Solr
>          Issue Type: Test
>          Components: Build
>    Affects Versions: 3.1, 4.0
>         Environment: Hudson
>            Reporter: Robert Muir
>             Fix For: 3.1, 4.0
>
>
> Several test methods in TestTrie failed in hudson, with errors such as this:
> Caused by: org.apache.solr.common.SolrException: Unknown query type 'func'

--
This message is automatically generated by JIRA.
-
You can reply to this email to add a comment to the issue online.


---------------------------------------------------------------------
To unsubscribe, e-mail: [hidden email]
For additional commands, e-mail: [hidden email]

Reply | Threaded
Open this post in threaded view
|

[jira] Commented: (SOLR-2160) Unknown query type 'func'

JIRA jira@apache.org
In reply to this post by JIRA jira@apache.org

    [ https://issues.apache.org/jira/browse/SOLR-2160?page=com.atlassian.jira.plugin.system.issuetabpanels:comment-tabpanel&focusedCommentId=12923445#action_12923445 ]

Yonik Seeley commented on SOLR-2160:
------------------------------------

I'm looping the tests on my ubuntu system now trying to reproduce this (solr tests now only take 2min!)

> Unknown query type 'func'
> -------------------------
>
>                 Key: SOLR-2160
>                 URL: https://issues.apache.org/jira/browse/SOLR-2160
>             Project: Solr
>          Issue Type: Test
>          Components: Build
>    Affects Versions: 3.1, 4.0
>         Environment: Hudson
>            Reporter: Robert Muir
>             Fix For: 3.1, 4.0
>
>
> Several test methods in TestTrie failed in hudson, with errors such as this:
> Caused by: org.apache.solr.common.SolrException: Unknown query type 'func'

--
This message is automatically generated by JIRA.
-
You can reply to this email to add a comment to the issue online.


---------------------------------------------------------------------
To unsubscribe, e-mail: [hidden email]
For additional commands, e-mail: [hidden email]

Reply | Threaded
Open this post in threaded view
|

[jira] Commented: (SOLR-2160) Unknown query type 'func'

JIRA jira@apache.org
In reply to this post by JIRA jira@apache.org

    [ https://issues.apache.org/jira/browse/SOLR-2160?page=com.atlassian.jira.plugin.system.issuetabpanels:comment-tabpanel&focusedCommentId=12923447#action_12923447 ]

Robert Muir commented on SOLR-2160:
-----------------------------------

I too find this test hard to reproduce.

But, I think if we look at hudson logs it is all caused by SolrInfoMBeanTest.

The problem is that now this test only loads up src/java things, so the concern would be that its a real static or similar problem.

I wish we could come up with a better way than SolrInfoMBeanTest to find problems since it makes debugging *very difficult*


> Unknown query type 'func'
> -------------------------
>
>                 Key: SOLR-2160
>                 URL: https://issues.apache.org/jira/browse/SOLR-2160
>             Project: Solr
>          Issue Type: Test
>          Components: Build
>    Affects Versions: 3.1, 4.0
>         Environment: Hudson
>            Reporter: Robert Muir
>             Fix For: 3.1, 4.0
>
>
> Several test methods in TestTrie failed in hudson, with errors such as this:
> Caused by: org.apache.solr.common.SolrException: Unknown query type 'func'

--
This message is automatically generated by JIRA.
-
You can reply to this email to add a comment to the issue online.


---------------------------------------------------------------------
To unsubscribe, e-mail: [hidden email]
For additional commands, e-mail: [hidden email]

Reply | Threaded
Open this post in threaded view
|

[jira] Commented: (SOLR-2160) Unknown query type 'func'

JIRA jira@apache.org
In reply to this post by JIRA jira@apache.org

    [ https://issues.apache.org/jira/browse/SOLR-2160?page=com.atlassian.jira.plugin.system.issuetabpanels:comment-tabpanel&focusedCommentId=12923449#action_12923449 ]

Uwe Schindler commented on SOLR-2160:
-------------------------------------

The problem seems to be one of the solr classes that does some static initialization that depends e.g. on a SolrCore be available. If this class is initialized before (e.g. in SolrMBeanTest) it fails. The SolrMBean test is not the bug its the class that does static initialization. How gets the func QP be enabled? is the infor about it cached in a staic var? Something like that causes this issue.

> Unknown query type 'func'
> -------------------------
>
>                 Key: SOLR-2160
>                 URL: https://issues.apache.org/jira/browse/SOLR-2160
>             Project: Solr
>          Issue Type: Test
>          Components: Build
>    Affects Versions: 3.1, 4.0
>         Environment: Hudson
>            Reporter: Robert Muir
>             Fix For: 3.1, 4.0
>
>
> Several test methods in TestTrie failed in hudson, with errors such as this:
> Caused by: org.apache.solr.common.SolrException: Unknown query type 'func'

--
This message is automatically generated by JIRA.
-
You can reply to this email to add a comment to the issue online.


---------------------------------------------------------------------
To unsubscribe, e-mail: [hidden email]
For additional commands, e-mail: [hidden email]

Reply | Threaded
Open this post in threaded view
|

[jira] Issue Comment Edited: (SOLR-2160) Unknown query type 'func'

JIRA jira@apache.org
In reply to this post by JIRA jira@apache.org

    [ https://issues.apache.org/jira/browse/SOLR-2160?page=com.atlassian.jira.plugin.system.issuetabpanels:comment-tabpanel&focusedCommentId=12923449#action_12923449 ]

Uwe Schindler edited comment on SOLR-2160 at 10/21/10 10:12 AM:
----------------------------------------------------------------

The problem seems to be one of the solr classes that does some static initialization that depends e.g. on a SolrCore be available. If this class is initialized before (e.g. in SolrMBeanTest) and no SolrCore or other part is available, it fails. The SolrMBean test is not the bug, it's the class that does static initialization! How gets the func QP be enabled? Is the info about it cached in a static field? Something like that causes this issue.

      was (Author: thetaphi):
    The problem seems to be one of the solr classes that does some static initialization that depends e.g. on a SolrCore be available. If this class is initialized before (e.g. in SolrMBeanTest) it fails. The SolrMBean test is not the bug its the class that does static initialization. How gets the func QP be enabled? is the infor about it cached in a staic var? Something like that causes this issue.
 

> Unknown query type 'func'
> -------------------------
>
>                 Key: SOLR-2160
>                 URL: https://issues.apache.org/jira/browse/SOLR-2160
>             Project: Solr
>          Issue Type: Test
>          Components: Build
>    Affects Versions: 3.1, 4.0
>         Environment: Hudson
>            Reporter: Robert Muir
>             Fix For: 3.1, 4.0
>
>
> Several test methods in TestTrie failed in hudson, with errors such as this:
> Caused by: org.apache.solr.common.SolrException: Unknown query type 'func'

--
This message is automatically generated by JIRA.
-
You can reply to this email to add a comment to the issue online.


---------------------------------------------------------------------
To unsubscribe, e-mail: [hidden email]
For additional commands, e-mail: [hidden email]

Reply | Threaded
Open this post in threaded view
|

[jira] Commented: (SOLR-2160) Unknown query type 'func'

JIRA jira@apache.org
In reply to this post by JIRA jira@apache.org

    [ https://issues.apache.org/jira/browse/SOLR-2160?page=com.atlassian.jira.plugin.system.issuetabpanels:comment-tabpanel&focusedCommentId=12923455#action_12923455 ]

Yonik Seeley commented on SOLR-2160:
------------------------------------

bq. The SolrMBean test is not the bug

I'd say it's both a bug in some unknown class, and a bug in SolrMBean test.
Assuming you can instantiate random classes in a random order w/o any side effects isn't a valid.

> Unknown query type 'func'
> -------------------------
>
>                 Key: SOLR-2160
>                 URL: https://issues.apache.org/jira/browse/SOLR-2160
>             Project: Solr
>          Issue Type: Test
>          Components: Build
>    Affects Versions: 3.1, 4.0
>         Environment: Hudson
>            Reporter: Robert Muir
>             Fix For: 3.1, 4.0
>
>
> Several test methods in TestTrie failed in hudson, with errors such as this:
> Caused by: org.apache.solr.common.SolrException: Unknown query type 'func'

--
This message is automatically generated by JIRA.
-
You can reply to this email to add a comment to the issue online.


---------------------------------------------------------------------
To unsubscribe, e-mail: [hidden email]
For additional commands, e-mail: [hidden email]

Reply | Threaded
Open this post in threaded view
|

[jira] Commented: (SOLR-2160) Unknown query type 'func'

JIRA jira@apache.org
In reply to this post by JIRA jira@apache.org

    [ https://issues.apache.org/jira/browse/SOLR-2160?page=com.atlassian.jira.plugin.system.issuetabpanels:comment-tabpanel&focusedCommentId=12923461#action_12923461 ]

Uwe Schindler commented on SOLR-2160:
-------------------------------------

Its not instantiating. SolrMBean only loads the classes! So only statics are initialized. And that should be able to be done in random order. Especially could optimizers in the JVM do this (this is even allowed in the JLS). SolrMBean only instantiates classes with default ctor that implement this interface (this is a bug, you are right). But this problem seems to be more a static initializer bug.

To track this, we can temporarily disable the instantiation part of SolrMBean and only do the Class.forName() calls. If it then still fails its a real bug. If it does not fail then, the reason is SolrMBean. In all other cases, the static initializers run by Class.forName() use wrong assumptions!

> Unknown query type 'func'
> -------------------------
>
>                 Key: SOLR-2160
>                 URL: https://issues.apache.org/jira/browse/SOLR-2160
>             Project: Solr
>          Issue Type: Test
>          Components: Build
>    Affects Versions: 3.1, 4.0
>         Environment: Hudson
>            Reporter: Robert Muir
>             Fix For: 3.1, 4.0
>
>
> Several test methods in TestTrie failed in hudson, with errors such as this:
> Caused by: org.apache.solr.common.SolrException: Unknown query type 'func'

--
This message is automatically generated by JIRA.
-
You can reply to this email to add a comment to the issue online.


---------------------------------------------------------------------
To unsubscribe, e-mail: [hidden email]
For additional commands, e-mail: [hidden email]

Reply | Threaded
Open this post in threaded view
|

[jira] Issue Comment Edited: (SOLR-2160) Unknown query type 'func'

JIRA jira@apache.org
In reply to this post by JIRA jira@apache.org

    [ https://issues.apache.org/jira/browse/SOLR-2160?page=com.atlassian.jira.plugin.system.issuetabpanels:comment-tabpanel&focusedCommentId=12923461#action_12923461 ]

Uwe Schindler edited comment on SOLR-2160 at 10/21/10 10:43 AM:
----------------------------------------------------------------

Its not always instantiating. Mostly, SolrMBean only loads the classes! So only statics are initialized. And that should be able to be done in random order. Especially could optimizers in the JVM do this (this is even allowed in the JLS). SolrMBean only instantiates classes with default ctor that implement this interface (this is a bug, you are right). But this problem seems to be more a static initializer bug.

To track this, we can temporarily disable the instantiation part of SolrMBean and only do the Class.forName() calls. If it then still fails its a real bug. If it does not fail then, the reason is SolrMBean. In all other cases, the static initializers run by Class.forName() use wrong assumptions!

      was (Author: thetaphi):
    Its not instantiating. SolrMBean only loads the classes! So only statics are initialized. And that should be able to be done in random order. Especially could optimizers in the JVM do this (this is even allowed in the JLS). SolrMBean only instantiates classes with default ctor that implement this interface (this is a bug, you are right). But this problem seems to be more a static initializer bug.

To track this, we can temporarily disable the instantiation part of SolrMBean and only do the Class.forName() calls. If it then still fails its a real bug. If it does not fail then, the reason is SolrMBean. In all other cases, the static initializers run by Class.forName() use wrong assumptions!
 

> Unknown query type 'func'
> -------------------------
>
>                 Key: SOLR-2160
>                 URL: https://issues.apache.org/jira/browse/SOLR-2160
>             Project: Solr
>          Issue Type: Test
>          Components: Build
>    Affects Versions: 3.1, 4.0
>         Environment: Hudson
>            Reporter: Robert Muir
>             Fix For: 3.1, 4.0
>
>
> Several test methods in TestTrie failed in hudson, with errors such as this:
> Caused by: org.apache.solr.common.SolrException: Unknown query type 'func'

--
This message is automatically generated by JIRA.
-
You can reply to this email to add a comment to the issue online.


---------------------------------------------------------------------
To unsubscribe, e-mail: [hidden email]
For additional commands, e-mail: [hidden email]

Reply | Threaded
Open this post in threaded view
|

[jira] Commented: (SOLR-2160) Unknown query type 'func'

JIRA jira@apache.org
In reply to this post by JIRA jira@apache.org

    [ https://issues.apache.org/jira/browse/SOLR-2160?page=com.atlassian.jira.plugin.system.issuetabpanels:comment-tabpanel&focusedCommentId=12923462#action_12923462 ]

Robert Muir commented on SOLR-2160:
-----------------------------------

bq. Its not instantiating. SolrMBean only loads the classes!

I disagree... unless I'm completely wrong about what Class.newInstance() does!

{noformat}
    for( Class clazz : classes ) {
      if( SolrInfoMBean.class.isAssignableFrom( clazz ) ) {
        try {
          SolrInfoMBean info = (SolrInfoMBean)clazz.newInstance();
         
          //System.out.println( info.getClass() );
          assertNotNull( info.getName() );
{noformat}

> Unknown query type 'func'
> -------------------------
>
>                 Key: SOLR-2160
>                 URL: https://issues.apache.org/jira/browse/SOLR-2160
>             Project: Solr
>          Issue Type: Test
>          Components: Build
>    Affects Versions: 3.1, 4.0
>         Environment: Hudson
>            Reporter: Robert Muir
>             Fix For: 3.1, 4.0
>
>
> Several test methods in TestTrie failed in hudson, with errors such as this:
> Caused by: org.apache.solr.common.SolrException: Unknown query type 'func'

--
This message is automatically generated by JIRA.
-
You can reply to this email to add a comment to the issue online.


---------------------------------------------------------------------
To unsubscribe, e-mail: [hidden email]
For additional commands, e-mail: [hidden email]

Reply | Threaded
Open this post in threaded view
|

[jira] Commented: (SOLR-2160) Unknown query type 'func'

JIRA jira@apache.org
In reply to this post by JIRA jira@apache.org

    [ https://issues.apache.org/jira/browse/SOLR-2160?page=com.atlassian.jira.plugin.system.issuetabpanels:comment-tabpanel&focusedCommentId=12923465#action_12923465 ]

Uwe Schindler commented on SOLR-2160:
-------------------------------------

See above I changed my original comment before you posted your reply - sorry.

It only instantiates few classes (which match the interface). Because of this I suggested at the end, to disable this instantiation temporarily. If it then does not fail, the bug is tracked to the instantiation. If it then also fails, you can be 10% sure that it is caused by static initialization.

Sorry for incomplete comment at the beginning!

> Unknown query type 'func'
> -------------------------
>
>                 Key: SOLR-2160
>                 URL: https://issues.apache.org/jira/browse/SOLR-2160
>             Project: Solr
>          Issue Type: Test
>          Components: Build
>    Affects Versions: 3.1, 4.0
>         Environment: Hudson
>            Reporter: Robert Muir
>             Fix For: 3.1, 4.0
>
>
> Several test methods in TestTrie failed in hudson, with errors such as this:
> Caused by: org.apache.solr.common.SolrException: Unknown query type 'func'

--
This message is automatically generated by JIRA.
-
You can reply to this email to add a comment to the issue online.


---------------------------------------------------------------------
To unsubscribe, e-mail: [hidden email]
For additional commands, e-mail: [hidden email]

Reply | Threaded
Open this post in threaded view
|

[jira] Commented: (SOLR-2160) Unknown query type 'func'

JIRA jira@apache.org
In reply to this post by JIRA jira@apache.org

    [ https://issues.apache.org/jira/browse/SOLR-2160?page=com.atlassian.jira.plugin.system.issuetabpanels:comment-tabpanel&focusedCommentId=12923466#action_12923466 ]

Robert Muir commented on SOLR-2160:
-----------------------------------

bq. Because of this I suggested at the end, to disable this instantiation temporarily.

This is a good idea for debugging. This is how i found it was meddling with
TestReplicationHandler by only doing Class.forName(TestReplicationHandler) back
when SolrInfoMBeanTest meddled with test classes too

the difference with that one was that it was easier to reproduce... this func() one is tricky!


> Unknown query type 'func'
> -------------------------
>
>                 Key: SOLR-2160
>                 URL: https://issues.apache.org/jira/browse/SOLR-2160
>             Project: Solr
>          Issue Type: Test
>          Components: Build
>    Affects Versions: 3.1, 4.0
>         Environment: Hudson
>            Reporter: Robert Muir
>             Fix For: 3.1, 4.0
>
>
> Several test methods in TestTrie failed in hudson, with errors such as this:
> Caused by: org.apache.solr.common.SolrException: Unknown query type 'func'

--
This message is automatically generated by JIRA.
-
You can reply to this email to add a comment to the issue online.


---------------------------------------------------------------------
To unsubscribe, e-mail: [hidden email]
For additional commands, e-mail: [hidden email]

Reply | Threaded
Open this post in threaded view
|

[jira] Commented: (SOLR-2160) Unknown query type 'func'

JIRA jira@apache.org
In reply to this post by JIRA jira@apache.org

    [ https://issues.apache.org/jira/browse/SOLR-2160?page=com.atlassian.jira.plugin.system.issuetabpanels:comment-tabpanel&focusedCommentId=12923808#action_12923808 ]

Simon Willnauer commented on SOLR-2160:
---------------------------------------

FYI - I can reliably reproduce with running SolrInfoBeanTest first inthe same vm
{code}

--- build.xml (revision 1025747)
+++ build.xml (working copy)
@@ -475,7 +475,7 @@
         </fileset>
       </batchtest>
       <batchtest fork="yes" todir="${junit.output.dir}" if="testcase">
-        <fileset dir="src/test" includes="**/${testcase}.java"/>
+        <fileset dir="src/test" includes="**/SolrInfoMBeanTest.java, **/${testcase}.java"/>
       </batchtest>
     </junit>
 
{code}

"ant test -Dtestcase=TestQueryTypes" will then fail and this fixes the problem. Its a hack I know but it might help to find a solution.

{code}

Index: src/test/org/apache/solr/SolrInfoMBeanTest.java
===================================================================
--- src/test/org/apache/solr/SolrInfoMBeanTest.java (revision 1025719)
+++ src/test/org/apache/solr/SolrInfoMBeanTest.java (working copy)
@@ -42,6 +42,7 @@
    * a name, description, etc...
    */
   public void testCallMBeanInfo() throws Exception {
+    Object[] init = org.apache.solr.search.QParserPlugin.standardPlugins;
     List<Class> classes = new ArrayList<Class>();
     classes.addAll(getClassesForPackage(StandardRequestHandler.class.getPackage().getName()));
     classes.addAll(getClassesForPackage(SearchHandler.class.getPackage().getName()));
{code}

> Unknown query type 'func'
> -------------------------
>
>                 Key: SOLR-2160
>                 URL: https://issues.apache.org/jira/browse/SOLR-2160
>             Project: Solr
>          Issue Type: Test
>          Components: Build
>    Affects Versions: 3.1, 4.0
>         Environment: Hudson
>            Reporter: Robert Muir
>             Fix For: 3.1, 4.0
>
>
> Several test methods in TestTrie failed in hudson, with errors such as this:
> Caused by: org.apache.solr.common.SolrException: Unknown query type 'func'

--
This message is automatically generated by JIRA.
-
You can reply to this email to add a comment to the issue online.


---------------------------------------------------------------------
To unsubscribe, e-mail: [hidden email]
For additional commands, e-mail: [hidden email]

Reply | Threaded
Open this post in threaded view
|

[jira] Commented: (SOLR-2160) Unknown query type 'func'

JIRA jira@apache.org
In reply to this post by JIRA jira@apache.org

    [ https://issues.apache.org/jira/browse/SOLR-2160?page=com.atlassian.jira.plugin.system.issuetabpanels:comment-tabpanel&focusedCommentId=12923813#action_12923813 ]

Simon Willnauer commented on SOLR-2160:
---------------------------------------

Could we put @Ignore on the SolrInfoMBeanTest#testCallMBeanInfo() until this is fixed? I mean a stable build would be nice though :)

simon

> Unknown query type 'func'
> -------------------------
>
>                 Key: SOLR-2160
>                 URL: https://issues.apache.org/jira/browse/SOLR-2160
>             Project: Solr
>          Issue Type: Test
>          Components: Build
>    Affects Versions: 3.1, 4.0
>         Environment: Hudson
>            Reporter: Robert Muir
>             Fix For: 3.1, 4.0
>
>
> Several test methods in TestTrie failed in hudson, with errors such as this:
> Caused by: org.apache.solr.common.SolrException: Unknown query type 'func'

--
This message is automatically generated by JIRA.
-
You can reply to this email to add a comment to the issue online.


---------------------------------------------------------------------
To unsubscribe, e-mail: [hidden email]
For additional commands, e-mail: [hidden email]

Reply | Threaded
Open this post in threaded view
|

[jira] Issue Comment Edited: (SOLR-2160) Unknown query type 'func'

JIRA jira@apache.org
In reply to this post by JIRA jira@apache.org

    [ https://issues.apache.org/jira/browse/SOLR-2160?page=com.atlassian.jira.plugin.system.issuetabpanels:comment-tabpanel&focusedCommentId=12923813#action_12923813 ]

Simon Willnauer edited comment on SOLR-2160 at 10/22/10 6:54 AM:
-----------------------------------------------------------------

Could we put @Ignore on the SolrInfoMBeanTest#testCallMBeanInfo() until this is fixed? I mean a stable build would be nice though :) I use @Ignore on the DocValues branch and the build finally succeeds after continuously failing for 10 times

simon

      was (Author: simonw):
    Could we put @Ignore on the SolrInfoMBeanTest#testCallMBeanInfo() until this is fixed? I mean a stable build would be nice though :)

simon
 

> Unknown query type 'func'
> -------------------------
>
>                 Key: SOLR-2160
>                 URL: https://issues.apache.org/jira/browse/SOLR-2160
>             Project: Solr
>          Issue Type: Test
>          Components: Build
>    Affects Versions: 3.1, 4.0
>         Environment: Hudson
>            Reporter: Robert Muir
>             Fix For: 3.1, 4.0
>
>
> Several test methods in TestTrie failed in hudson, with errors such as this:
> Caused by: org.apache.solr.common.SolrException: Unknown query type 'func'

--
This message is automatically generated by JIRA.
-
You can reply to this email to add a comment to the issue online.


---------------------------------------------------------------------
To unsubscribe, e-mail: [hidden email]
For additional commands, e-mail: [hidden email]

Reply | Threaded
Open this post in threaded view
|

[jira] Commented: (SOLR-2160) Unknown query type 'func'

JIRA jira@apache.org
In reply to this post by JIRA jira@apache.org

    [ https://issues.apache.org/jira/browse/SOLR-2160?page=com.atlassian.jira.plugin.system.issuetabpanels:comment-tabpanel&focusedCommentId=12923882#action_12923882 ]

Robert Muir commented on SOLR-2160:
-----------------------------------

Thanks for the reproducable case, Simon.

Unfortunately, I don't think we should @Ignore this, this is a real bug.

if you disable the instantiation itself (and just leave the Class.forName enabled), it still fails...


> Unknown query type 'func'
> -------------------------
>
>                 Key: SOLR-2160
>                 URL: https://issues.apache.org/jira/browse/SOLR-2160
>             Project: Solr
>          Issue Type: Test
>          Components: Build
>    Affects Versions: 3.1, 4.0
>         Environment: Hudson
>            Reporter: Robert Muir
>             Fix For: 3.1, 4.0
>
>
> Several test methods in TestTrie failed in hudson, with errors such as this:
> Caused by: org.apache.solr.common.SolrException: Unknown query type 'func'

--
This message is automatically generated by JIRA.
-
You can reply to this email to add a comment to the issue online.


---------------------------------------------------------------------
To unsubscribe, e-mail: [hidden email]
For additional commands, e-mail: [hidden email]

Reply | Threaded
Open this post in threaded view
|

[jira] Commented: (SOLR-2160) Unknown query type 'func'

JIRA jira@apache.org
In reply to this post by JIRA jira@apache.org

    [ https://issues.apache.org/jira/browse/SOLR-2160?page=com.atlassian.jira.plugin.system.issuetabpanels:comment-tabpanel&focusedCommentId=12924336#action_12924336 ]

Yonik Seeley commented on SOLR-2160:
------------------------------------

Grrr, I can't even run SolrInfoMBeanTest from by IDE.
java.lang.AssertionError: there are at least 10 SolrInfoMBean that should be found in the classpath, found 0


> Unknown query type 'func'
> -------------------------
>
>                 Key: SOLR-2160
>                 URL: https://issues.apache.org/jira/browse/SOLR-2160
>             Project: Solr
>          Issue Type: Test
>          Components: Build
>    Affects Versions: 3.1, 4.0
>         Environment: Hudson
>            Reporter: Robert Muir
>             Fix For: 3.1, 4.0
>
>
> Several test methods in TestTrie failed in hudson, with errors such as this:
> Caused by: org.apache.solr.common.SolrException: Unknown query type 'func'

--
This message is automatically generated by JIRA.
-
You can reply to this email to add a comment to the issue online.


---------------------------------------------------------------------
To unsubscribe, e-mail: [hidden email]
For additional commands, e-mail: [hidden email]

Reply | Threaded
Open this post in threaded view
|

[jira] Commented: (SOLR-2160) Unknown query type 'func'

JIRA jira@apache.org
In reply to this post by JIRA jira@apache.org

    [ https://issues.apache.org/jira/browse/SOLR-2160?page=com.atlassian.jira.plugin.system.issuetabpanels:comment-tabpanel&focusedCommentId=12924345#action_12924345 ]

Uwe Schindler commented on SOLR-2160:
-------------------------------------

bq. Grrr, I can't even run SolrInfoMBeanTest from by IDE. java.lang.AssertionError: there are at least 10 SolrInfoMBean that should be found in the classpath, found 0

Thats because the test only works if the class files are physically on disk and not in JAR file. And IDEs have own classloaders to serve classes directly from their debugger.

> Unknown query type 'func'
> -------------------------
>
>                 Key: SOLR-2160
>                 URL: https://issues.apache.org/jira/browse/SOLR-2160
>             Project: Solr
>          Issue Type: Test
>          Components: Build
>    Affects Versions: 3.1, 4.0
>         Environment: Hudson
>            Reporter: Robert Muir
>             Fix For: 3.1, 4.0
>
>
> Several test methods in TestTrie failed in hudson, with errors such as this:
> Caused by: org.apache.solr.common.SolrException: Unknown query type 'func'

--
This message is automatically generated by JIRA.
-
You can reply to this email to add a comment to the issue online.


---------------------------------------------------------------------
To unsubscribe, e-mail: [hidden email]
For additional commands, e-mail: [hidden email]

12