Apache Hadoop qbt Report: trunk+JDK8 on Linux/aarch

classic Classic list List threaded Threaded
1 message Options
Reply | Threaded
Open this post in threaded view
|

Apache Hadoop qbt Report: trunk+JDK8 on Linux/aarch

Apache Jenkins Server-2
ARM Build Details : https://builds.apache.org/job/Hadoop-qbt-linux-ARM-trunk/61/

============================
CHANGES
============================

[Dec 27, 2019 8:18:10 AM] (aajisaka) HADOOP-16042. Update the link to HadoopJavaVersion (#1784)
[Dec 27, 2019 11:20:15 AM] (vinayakumarb) YARN-10041. Should not use AbstractPath to create unix domain socket
[Dec 27, 2019 1:02:15 PM] (ayushsaxena) HDFS-15081. Typo in RetryCache#waitForCompletion annotation. Contributed


============================
TESTS
============================

There are 23461 total tests of which 11 test(s) failed and 2456 test(s) were skipped.  

============================
FAILED TESTS
============================

11 tests failed.
FAILED:  org.apache.hadoop.yarn.applications.distributedshell.TestDistributedShell.testDSShellWithOpportunisticContainers
FAILED:  org.apache.hadoop.yarn.applications.distributedshell.TestDistributedShell.testDSShellWithEnforceExecutionType
FAILED:  org.apache.hadoop.yarn.server.timelineservice.reader.TestTimelineReaderWebServicesHBaseStorage.org.apache.hadoop.yarn.server.timelineservice.reader.TestTimelineReaderWebServicesHBaseStorage
FAILED:  org.apache.hadoop.yarn.server.timelineservice.storage.TestHBaseTimelineStorageApps.org.apache.hadoop.yarn.server.timelineservice.storage.TestHBaseTimelineStorageApps
FAILED:  org.apache.hadoop.yarn.server.timelineservice.storage.TestHBaseTimelineStorageDomain.org.apache.hadoop.yarn.server.timelineservice.storage.TestHBaseTimelineStorageDomain
FAILED:  org.apache.hadoop.yarn.server.timelineservice.storage.TestHBaseTimelineStorageEntities.org.apache.hadoop.yarn.server.timelineservice.storage.TestHBaseTimelineStorageEntities
FAILED:  org.apache.hadoop.yarn.server.timelineservice.storage.TestHBaseTimelineStorageSchema.org.apache.hadoop.yarn.server.timelineservice.storage.TestHBaseTimelineStorageSchema
FAILED:  org.apache.hadoop.yarn.server.timelineservice.storage.TestTimelineWriterHBaseDown.testTimelineWriterHBaseDown
FAILED:  org.apache.hadoop.yarn.server.timelineservice.storage.flow.TestHBaseStorageFlowActivity.org.apache.hadoop.yarn.server.timelineservice.storage.flow.TestHBaseStorageFlowActivity
FAILED:  org.apache.hadoop.yarn.server.timelineservice.storage.flow.TestHBaseStorageFlowRun.org.apache.hadoop.yarn.server.timelineservice.storage.flow.TestHBaseStorageFlowRun
FAILED:  org.apache.hadoop.yarn.server.timelineservice.storage.flow.TestHBaseStorageFlowRunCompaction.org.apache.hadoop.yarn.server.timelineservice.storage.flow.TestHBaseStorageFlowRunCompaction


Complete test report can be accessed at https://builds.apache.org/job/Hadoop-qbt-linux-ARM-trunk/61/testReport

IN ATTACHMENT COMPRESSED BUILD LOGS.

---------------------------------------------------------------------
To unsubscribe, e-mail: [hidden email]
For additional commands, e-mail: [hidden email]

build.zip (208K) Download Attachment