Apache Hadoop qbt Report: trunk+JDK8 on Linux/aarch

classic Classic list List threaded Threaded
1 message Options
Reply | Threaded
Open this post in threaded view
|

Apache Hadoop qbt Report: trunk+JDK8 on Linux/aarch

Apache Jenkins Server-2
ARM Build Details : https://builds.apache.org/job/Hadoop-qbt-linux-ARM-trunk/86/

============================
CHANGES
============================

[Jan 20, 2020 4:23:41 PM] (stevel) HADOOP-16785. followup to abfs close() fix.
[Jan 21, 2020 1:58:32 AM] (aajisaka) HADOOP-16753. Refactor HAAdmin. Contributed by Xieming Li.
[Jan 21, 2020 9:03:24 AM] (aajisaka) HADOOP-16808. Use forkCount and reuseForks parameters instead of
[Jan 21, 2020 9:22:44 AM] (iwasakims) Remove WARN log when ipc connection interrupted in


============================
TESTS
============================

There are 23562 total tests of which 12 test(s) failed and 2470 test(s) were skipped.  

============================
FAILED TESTS
============================

12 tests failed.
FAILED:  org.apache.hadoop.mapreduce.v2.TestSpeculativeExecutionWithMRApp.testSpeculateSuccessfulWithUpdateEvents[0: TaskEstimator(EstimatorClass class org.apache.hadoop.mapreduce.v2.app.speculate.SimpleExponentialTaskRuntimeEstimator)]
FAILED:  org.apache.hadoop.yarn.applications.distributedshell.TestDistributedShell.testDSShellWithOpportunisticContainers
FAILED:  org.apache.hadoop.yarn.applications.distributedshell.TestDistributedShell.testDSShellWithEnforceExecutionType
FAILED:  org.apache.hadoop.yarn.server.timelineservice.reader.TestTimelineReaderWebServicesHBaseStorage.org.apache.hadoop.yarn.server.timelineservice.reader.TestTimelineReaderWebServicesHBaseStorage
FAILED:  org.apache.hadoop.yarn.server.timelineservice.storage.TestHBaseTimelineStorageApps.org.apache.hadoop.yarn.server.timelineservice.storage.TestHBaseTimelineStorageApps
FAILED:  org.apache.hadoop.yarn.server.timelineservice.storage.TestHBaseTimelineStorageDomain.org.apache.hadoop.yarn.server.timelineservice.storage.TestHBaseTimelineStorageDomain
FAILED:  org.apache.hadoop.yarn.server.timelineservice.storage.TestHBaseTimelineStorageEntities.org.apache.hadoop.yarn.server.timelineservice.storage.TestHBaseTimelineStorageEntities
FAILED:  org.apache.hadoop.yarn.server.timelineservice.storage.TestHBaseTimelineStorageSchema.org.apache.hadoop.yarn.server.timelineservice.storage.TestHBaseTimelineStorageSchema
FAILED:  org.apache.hadoop.yarn.server.timelineservice.storage.TestTimelineWriterHBaseDown.testTimelineWriterHBaseDown
FAILED:  org.apache.hadoop.yarn.server.timelineservice.storage.flow.TestHBaseStorageFlowActivity.org.apache.hadoop.yarn.server.timelineservice.storage.flow.TestHBaseStorageFlowActivity
FAILED:  org.apache.hadoop.yarn.server.timelineservice.storage.flow.TestHBaseStorageFlowRun.org.apache.hadoop.yarn.server.timelineservice.storage.flow.TestHBaseStorageFlowRun
FAILED:  org.apache.hadoop.yarn.server.timelineservice.storage.flow.TestHBaseStorageFlowRunCompaction.org.apache.hadoop.yarn.server.timelineservice.storage.flow.TestHBaseStorageFlowRunCompaction


Complete test report can be accessed at https://builds.apache.org/job/Hadoop-qbt-linux-ARM-trunk/86/testReport

IN ATTACHMENT COMPRESSED BUILD LOGS.

---------------------------------------------------------------------
To unsubscribe, e-mail: [hidden email]
For additional commands, e-mail: [hidden email]

build.zip (216K) Download Attachment