Apache Hadoop qbt Report: trunk+JDK8 on Linux/aarch

classic Classic list List threaded Threaded
1 message Options
Reply | Threaded
Open this post in threaded view
|

Apache Hadoop qbt Report: trunk+JDK8 on Linux/aarch

Apache Jenkins Server-2
ARM Build Details : https://builds.apache.org/job/Hadoop-qbt-linux-ARM-trunk/148/

============================
CHANGES
============================

[Mar 23, 2020 7:43:51 PM] (weichiu) HDFS-15113. Addendum: Missing IBR when NameNode restart if open
[Mar 24, 2020 2:36:14 AM] (github) HDFS-15232. Fix libhdfspp test failures with GCC 7. (#1906)
[Mar 24, 2020 5:41:31 AM] (weichiu) HDFS-15088. RBF: Correct annotation typo of
[Mar 24, 2020 9:45:46 AM] (github) HDFS-15201 SnapshotCounter hits MaxSnapshotID limit (#1870)
[Mar 24, 2020 12:11:18 PM] (stevel) Revert ""HADOOP-16910. ABFS Streams to update FileSystem.Statistics
[Mar 24, 2020 1:05:33 PM] (github) Revert "HADOOP-16054. Update Dockerfile to use Bionic." (#1911)


============================
TESTS
============================

There are 23919 total tests of which 5 test(s) failed and 2504 test(s) were skipped.  

============================
FAILED TESTS
============================

5 tests failed.
FAILED:  org.apache.hadoop.hdfs.server.federation.security.TestRouterSecurityManager.testCreateCredentials
FAILED:  org.apache.hadoop.mapreduce.TestMapreduceConfigFields.testCompareXmlAgainstConfigurationClass
FAILED:  org.apache.hadoop.yarn.csi.client.TestCsiClient.testIdentityService
FAILED:  org.apache.hadoop.yarn.applications.distributedshell.TestDistributedShell.testDSShellWithOpportunisticContainers
FAILED:  org.apache.hadoop.yarn.applications.distributedshell.TestDistributedShell.testDSShellWithEnforceExecutionType


Complete test report can be accessed at https://builds.apache.org/job/Hadoop-qbt-linux-ARM-trunk/148/testReport

IN ATTACHMENT COMPRESSED BUILD LOGS.

---------------------------------------------------------------------
To unsubscribe, e-mail: [hidden email]
For additional commands, e-mail: [hidden email]

build.zip (174K) Download Attachment