Build failed in Hudson: Lucene-3.x #57

classic Classic list List threaded Threaded
3 messages Options
Reply | Threaded
Open this post in threaded view
|

Build failed in Hudson: Lucene-3.x #57

Apache Hudson Server
See <http://hudson.zones.apache.org/hudson/job/Lucene-3.x/57/>

------------------------------------------
[...truncated 7538 lines...]
    [junit] Testsuite: org.apache.lucene.index.TestAddIndexesNoOptimize
    [junit] Tests run: 11, Failures: 0, Errors: 0, Time elapsed: 0.563 sec
    [junit]
    [junit] Testsuite: org.apache.lucene.index.TestAtomicUpdate
    [junit] Tests run: 1, Failures: 0, Errors: 0, Time elapsed: 2.562 sec
    [junit]
    [junit] Testsuite: org.apache.lucene.index.TestBackwardsCompatibility
    [junit] Tests run: 7, Failures: 0, Errors: 0, Time elapsed: 4.821 sec
    [junit]
    [junit] Testsuite: org.apache.lucene.index.TestCheckIndex
    [junit] Tests run: 2, Failures: 0, Errors: 0, Time elapsed: 0.022 sec
    [junit]
    [junit] Testsuite: org.apache.lucene.index.TestCompoundFile
    [junit] Tests run: 10, Failures: 0, Errors: 0, Time elapsed: 2.362 sec
    [junit]
    [junit] Testsuite: org.apache.lucene.index.TestConcurrentMergeScheduler
    [junit] Tests run: 4, Failures: 0, Errors: 0, Time elapsed: 3.703 sec
    [junit]
    [junit] Testsuite: org.apache.lucene.index.TestCrash
    [junit] Tests run: 7, Failures: 0, Errors: 0, Time elapsed: 0.156 sec
    [junit]
    [junit] Testsuite: org.apache.lucene.index.TestDeletionPolicy
    [junit] Tests run: 7, Failures: 0, Errors: 0, Time elapsed: 3.315 sec
    [junit]
    [junit] Testsuite: org.apache.lucene.index.TestDirectoryReader
    [junit] Tests run: 4, Failures: 0, Errors: 0, Time elapsed: 0.5 sec
    [junit]
    [junit] Testsuite: org.apache.lucene.index.TestDoc
    [junit] Tests run: 1, Failures: 0, Errors: 0, Time elapsed: 0.053 sec
    [junit]
    [junit] Testsuite: org.apache.lucene.index.TestDocumentWriter
    [junit] Tests run: 7, Failures: 0, Errors: 0, Time elapsed: 0.069 sec
    [junit]
    [junit] Testsuite: org.apache.lucene.index.TestFieldInfos
    [junit] Tests run: 1, Failures: 0, Errors: 0, Time elapsed: 0.004 sec
    [junit]
    [junit] Testsuite: org.apache.lucene.index.TestFieldsReader
    [junit] Tests run: 7, Failures: 0, Errors: 0, Time elapsed: 8.898 sec
    [junit]
    [junit] ------------- Standard Output ---------------
    [junit] Average Non-lazy time (should be very close to zero): 0 ms for 50 reads
    [junit] Average Lazy Time (should be greater than zero): 3 ms for 50 reads
    [junit] ------------- ---------------- ---------------
    [junit] Testsuite: org.apache.lucene.index.TestFilterIndexReader
    [junit] Tests run: 1, Failures: 0, Errors: 0, Time elapsed: 0.014 sec
    [junit]
    [junit] Testsuite: org.apache.lucene.index.TestIndexFileDeleter
    [junit] Tests run: 1, Failures: 0, Errors: 0, Time elapsed: 0.011 sec
    [junit]
    [junit] Testsuite: org.apache.lucene.index.TestIndexInput
    [junit] Tests run: 2, Failures: 0, Errors: 0, Time elapsed: 0.005 sec
    [junit]
    [junit] Testsuite: org.apache.lucene.index.TestIndexReader
    [junit] Tests run: 37, Failures: 0, Errors: 0, Time elapsed: 6.482 sec
    [junit]
    [junit] ------------- Standard Output ---------------
    [junit] Entry: TermVectorEntry{field='termvector', term='three', frequency=3}
    [junit] Entry: TermVectorEntry{field='termvector', term='two', frequency=2}
    [junit] Entry: TermVectorEntry{field='termvector', term='one', frequency=1}
    [junit] ------------- ---------------- ---------------
    [junit] Testsuite: org.apache.lucene.index.TestIndexReaderClone
    [junit] Tests run: 18, Failures: 0, Errors: 0, Time elapsed: 3.46 sec
    [junit]
    [junit] Testsuite: org.apache.lucene.index.TestIndexReaderCloneNorms
    [junit] Tests run: 2, Failures: 0, Errors: 0, Time elapsed: 0.156 sec
    [junit]
    [junit] Testsuite: org.apache.lucene.index.TestIndexReaderReopen
    [junit] Tests run: 17, Failures: 0, Errors: 0, Time elapsed: 3.79 sec
    [junit]
    [junit] Testsuite: org.apache.lucene.index.TestIndexWriter
    [junit] Tests run: 104, Failures: 0, Errors: 0, Time elapsed: 25.562 sec
    [junit]
    [junit] Testsuite: org.apache.lucene.index.TestIndexWriterDelete
    [junit] Tests run: 13, Failures: 0, Errors: 0, Time elapsed: 0.223 sec
    [junit]
    [junit] Testsuite: org.apache.lucene.index.TestIndexWriterExceptions
    [junit] Tests run: 2, Failures: 0, Errors: 0, Time elapsed: 1.08 sec
    [junit]
    [junit] Testsuite: org.apache.lucene.index.TestIndexWriterLockRelease
    [junit] Tests run: 1, Failures: 0, Errors: 0, Time elapsed: 0.006 sec
    [junit]
    [junit] Testsuite: org.apache.lucene.index.TestIndexWriterMergePolicy
    [junit] Tests run: 6, Failures: 0, Errors: 0, Time elapsed: 0.498 sec
    [junit]
    [junit] Testsuite: org.apache.lucene.index.TestIndexWriterMerging
    [junit] Tests run: 1, Failures: 0, Errors: 0, Time elapsed: 0.157 sec
    [junit]
    [junit] Testsuite: org.apache.lucene.index.TestIndexWriterReader
    [junit] Tests run: 13, Failures: 0, Errors: 0, Time elapsed: 4.27 sec
    [junit]
    [junit] Testsuite: org.apache.lucene.index.TestLazyBug
    [junit] Tests run: 3, Failures: 0, Errors: 0, Time elapsed: 1.721 sec
    [junit]
    [junit] Testsuite: org.apache.lucene.index.TestLazyProxSkipping
    [junit] Tests run: 2, Failures: 0, Errors: 0, Time elapsed: 0.059 sec
    [junit]
    [junit] Testsuite: org.apache.lucene.index.TestMultiLevelSkipList
    [junit] Tests run: 1, Failures: 0, Errors: 0, Time elapsed: 0.157 sec
    [junit]
    [junit] Testsuite: org.apache.lucene.index.TestMultiReader
    [junit] Tests run: 4, Failures: 0, Errors: 0, Time elapsed: 0.29 sec
    [junit]
    [junit] Testsuite: org.apache.lucene.index.TestNRTReaderWithThreads
    [junit] Tests run: 1, Failures: 0, Errors: 0, Time elapsed: 1.092 sec
    [junit]
    [junit] Testsuite: org.apache.lucene.index.TestNorms
    [junit] Tests run: 1, Failures: 0, Errors: 0, Time elapsed: 0.423 sec
    [junit]
    [junit] Testsuite: org.apache.lucene.index.TestOmitTf
    [junit] Tests run: 5, Failures: 0, Errors: 0, Time elapsed: 0.107 sec
    [junit]
    [junit] Testsuite: org.apache.lucene.index.TestParallelReader
    [junit] Tests run: 7, Failures: 0, Errors: 0, Time elapsed: 0.052 sec
    [junit]
    [junit] Testsuite: org.apache.lucene.index.TestParallelReaderEmptyIndex
    [junit] Tests run: 2, Failures: 0, Errors: 0, Time elapsed: 0.012 sec
    [junit]
    [junit] Testsuite: org.apache.lucene.index.TestParallelTermEnum
    [junit] Tests run: 1, Failures: 0, Errors: 0, Time elapsed: 0.006 sec
    [junit]
    [junit] Testsuite: org.apache.lucene.index.TestPayloads
    [junit] Tests run: 4, Failures: 0, Errors: 0, Time elapsed: 0.075 sec
    [junit]
    [junit] Testsuite: org.apache.lucene.index.TestPositionBasedTermVectorMapper
    [junit] Tests run: 1, Failures: 0, Errors: 0, Time elapsed: 0.02 sec
    [junit]
    [junit] Testsuite: org.apache.lucene.index.TestSegmentMerger
    [junit] Tests run: 2, Failures: 0, Errors: 0, Time elapsed: 0.126 sec
    [junit]
    [junit] Testsuite: org.apache.lucene.index.TestSegmentReader
    [junit] Tests run: 7, Failures: 0, Errors: 0, Time elapsed: 0.217 sec
    [junit]
    [junit] Testsuite: org.apache.lucene.index.TestSegmentTermDocs
    [junit] Tests run: 5, Failures: 0, Errors: 0, Time elapsed: 0.168 sec
    [junit]
    [junit] Testsuite: org.apache.lucene.index.TestSegmentTermEnum
    [junit] Tests run: 2, Failures: 0, Errors: 0, Time elapsed: 0.008 sec
    [junit]
    [junit] Testsuite: org.apache.lucene.index.TestStressIndexing
    [junit] Tests run: 1, Failures: 0, Errors: 0, Time elapsed: 2.103 sec
    [junit]
    [junit] Testsuite: org.apache.lucene.index.TestStressIndexing2
    [junit] Tests run: 3, Failures: 0, Errors: 0, Time elapsed: 2.884 sec
    [junit]
    [junit] Testsuite: org.apache.lucene.index.TestTerm
    [junit] Tests run: 1, Failures: 0, Errors: 0, Time elapsed: 0.003 sec
    [junit]
    [junit] Testsuite: org.apache.lucene.index.TestTermVectorsReader
    [junit] Tests run: 6, Failures: 0, Errors: 0, Time elapsed: 0.025 sec
    [junit]
    [junit] Testsuite: org.apache.lucene.index.TestTermdocPerf
    [junit] Tests run: 1, Failures: 0, Errors: 0, Time elapsed: 0.004 sec
    [junit]
    [junit] Testsuite: org.apache.lucene.index.TestThreadedOptimize
    [junit] Tests run: 1, Failures: 0, Errors: 0, Time elapsed: 2.348 sec
    [junit]
    [junit] Testsuite: org.apache.lucene.index.TestTransactionRollback
    [junit] Tests run: 2, Failures: 0, Errors: 0, Time elapsed: 0.058 sec
    [junit]
    [junit] Testsuite: org.apache.lucene.index.TestTransactions
    [junit] Tests run: 1, Failures: 0, Errors: 0, Time elapsed: 0.811 sec
    [junit]
    [junit] Testsuite: org.apache.lucene.index.TestWordlistLoader
    [junit] Tests run: 2, Failures: 0, Errors: 0, Time elapsed: 0.006 sec
    [junit]
    [junit] Testsuite: org.apache.lucene.messages.TestNLS
    [junit] Tests run: 6, Failures: 0, Errors: 0, Time elapsed: 0.036 sec
    [junit]
    [junit] ------------- Standard Error -----------------
    [junit] WARN: Message with key:Q0005E_MESSAGE_NOT_IN_BUNDLE and locale: en not found.
    [junit] ------------- ---------------- ---------------
    [junit] Testsuite: org.apache.lucene.queryParser.TestMultiAnalyzer
    [junit] Tests run: 3, Failures: 0, Errors: 0, Time elapsed: 0.029 sec
    [junit]
    [junit] Testsuite: org.apache.lucene.queryParser.TestMultiFieldQueryParser
    [junit] Tests run: 9, Failures: 0, Errors: 0, Time elapsed: 0.041 sec
    [junit]
    [junit] Testsuite: org.apache.lucene.queryParser.TestQueryParser
    [junit] Tests run: 29, Failures: 0, Errors: 0, Time elapsed: 3.843 sec
    [junit]
    [junit] ------------- Standard Output ---------------
    [junit] Result: (fieldX:xxxxx fieldy:xxxxxxxx)^2.0
    [junit] ------------- ---------------- ---------------
    [junit] Testsuite: org.apache.lucene.search.TestBoolean2
    [junit] Tests run: 11, Failures: 0, Errors: 0, Time elapsed: 23.779 sec
    [junit]
FATAL: command execution failed
hudson.util.IOException2: Failed to join the process
        at hudson.Proc$RemoteProc.join(Proc.java:312)
        at hudson.Launcher$ProcStarter.join(Launcher.java:275)
        at hudson.tasks.CommandInterpreter.perform(CommandInterpreter.java:83)
        at hudson.tasks.CommandInterpreter.perform(CommandInterpreter.java:58)
        at hudson.tasks.BuildStepMonitor$1.perform(BuildStepMonitor.java:19)
        at hudson.model.AbstractBuild$AbstractRunner.perform(AbstractBuild.java:582)
        at hudson.model.Build$RunnerImpl.build(Build.java:165)
        at hudson.model.Build$RunnerImpl.doRun(Build.java:132)
        at hudson.model.AbstractBuild$AbstractRunner.run(AbstractBuild.java:416)
        at hudson.model.Run.run(Run.java:1243)
        at hudson.model.FreeStyleBuild.run(FreeStyleBuild.java:46)
        at hudson.model.ResourceController.execute(ResourceController.java:88)
        at hudson.model.Executor.run(Executor.java:122)
Caused by: java.util.concurrent.ExecutionException: hudson.remoting.RequestAbortedException: java.io.EOFException
        at hudson.remoting.Request$1.get(Request.java:218)
        at hudson.remoting.Request$1.get(Request.java:172)
        at hudson.remoting.FutureAdapter.get(FutureAdapter.java:55)
        at hudson.Proc$RemoteProc.join(Proc.java:304)
        ... 12 more
Caused by: hudson.remoting.RequestAbortedException: java.io.EOFException
        at hudson.remoting.Request.abort(Request.java:257)
        at hudson.remoting.Channel.terminate(Channel.java:598)
        at hudson.remoting.Channel$ReaderThread.run(Channel.java:876)
Caused by: java.io.EOFException
        at java.io.ObjectInputStream$BlockDataInputStream.peekByte(ObjectInputStream.java:2554)
        at java.io.ObjectInputStream.readObject0(ObjectInputStream.java:1297)
        at java.io.ObjectInputStream.readObject(ObjectInputStream.java:351)
        at hudson.remoting.Channel$ReaderThread.run(Channel.java:856)
FATAL: Unable to delete script file /var/tmp/hudson6249699970257326614.sh
hudson.util.IOException2: remote file operation failed: /var/tmp/hudson6249699970257326614.sh at hudson.remoting.Channel@48b9a8:lucene.zones.apache.org (Solaris 10)
        at hudson.FilePath.act(FilePath.java:743)
        at hudson.FilePath.act(FilePath.java:729)
        at hudson.FilePath.delete(FilePath.java:984)
        at hudson.tasks.CommandInterpreter.perform(CommandInterpreter.java:93)
        at hudson.tasks.CommandInterpreter.perform(CommandInterpreter.java:58)
        at hudson.tasks.BuildStepMonitor$1.perform(BuildStepMonitor.java:19)
        at hudson.model.AbstractBuild$AbstractRunner.perform(AbstractBuild.java:582)
        at hudson.model.Build$RunnerImpl.build(Build.java:165)
        at hudson.model.Build$RunnerImpl.doRun(Build.java:132)
        at hudson.model.AbstractBuild$AbstractRunner.run(AbstractBuild.java:416)
        at hudson.model.Run.run(Run.java:1243)
        at hudson.model.FreeStyleBuild.run(FreeStyleBuild.java:46)
        at hudson.model.ResourceController.execute(ResourceController.java:88)
        at hudson.model.Executor.run(Executor.java:122)
Caused by: hudson.remoting.ChannelClosedException: channel is already closed
        at hudson.remoting.Channel.send(Channel.java:412)
        at hudson.remoting.Request.call(Request.java:105)
        at hudson.remoting.Channel.call(Channel.java:551)
        at hudson.FilePath.act(FilePath.java:736)
        ... 13 more
FATAL: channel is already closed
hudson.remoting.ChannelClosedException: channel is already closed
        at hudson.remoting.Channel.send(Channel.java:412)
        at hudson.remoting.Request.call(Request.java:105)
        at hudson.remoting.Channel.call(Channel.java:551)
        at hudson.Launcher$RemoteLauncher.kill(Launcher.java:735)
        at hudson.model.AbstractBuild$AbstractRunner.run(AbstractBuild.java:421)
        at hudson.model.Run.run(Run.java:1243)
        at hudson.model.FreeStyleBuild.run(FreeStyleBuild.java:46)
        at hudson.model.ResourceController.execute(ResourceController.java:88)
        at hudson.model.Executor.run(Executor.java:122)


---------------------------------------------------------------------
To unsubscribe, e-mail: [hidden email]
For additional commands, e-mail: [hidden email]

Reply | Threaded
Open this post in threaded view
|

Build failed in Hudson: Lucene-3.x #58

Apache Hudson Server
See <http://hudson.zones.apache.org/hudson/job/Lucene-3.x/58/changes>

Changes:

[gsingers] LUCENE-1810: added LATENT field selector option. Backported to 3.x

------------------------------------------
[...truncated 4004 lines...]
    [junit] Testsuite: org.apache.lucene.search.TestNumericRangeQuery32
    [junit] Tests run: 27, Failures: 0, Errors: 0, Time elapsed: 31.529 sec
    [junit]
    [junit] Testsuite: org.apache.lucene.search.TestNumericRangeQuery64
    [junit] Tests run: 33, Failures: 0, Errors: 0, Time elapsed: 57.683 sec
    [junit]
    [junit] Testsuite: org.apache.lucene.search.TestParallelMultiSearcher
    [junit] Tests run: 6, Failures: 0, Errors: 0, Time elapsed: 1.764 sec
    [junit]
    [junit] Testsuite: org.apache.lucene.search.TestPhrasePrefixQuery
    [junit] Tests run: 1, Failures: 0, Errors: 0, Time elapsed: 0.005 sec
    [junit]
    [junit] Testsuite: org.apache.lucene.search.TestPhraseQuery
    [junit] Tests run: 17, Failures: 0, Errors: 0, Time elapsed: 7.842 sec
    [junit]
    [junit] Testsuite: org.apache.lucene.search.TestPositionIncrement
    [junit] Tests run: 2, Failures: 0, Errors: 0, Time elapsed: 0.388 sec
    [junit]
    [junit] Testsuite: org.apache.lucene.search.TestPositiveScoresOnlyCollector
    [junit] Tests run: 1, Failures: 0, Errors: 0, Time elapsed: 0.007 sec
    [junit]
    [junit] Testsuite: org.apache.lucene.search.TestPrefixFilter
    [junit] Tests run: 1, Failures: 0, Errors: 0, Time elapsed: 0.006 sec
    [junit]
    [junit] Testsuite: org.apache.lucene.search.TestPrefixInBooleanQuery
    [junit] Tests run: 4, Failures: 0, Errors: 0, Time elapsed: 0.265 sec
    [junit]
    [junit] Testsuite: org.apache.lucene.search.TestPrefixQuery
    [junit] Tests run: 1, Failures: 0, Errors: 0, Time elapsed: 0.005 sec
    [junit]
    [junit] Testsuite: org.apache.lucene.search.TestQueryTermVector
    [junit] Tests run: 1, Failures: 0, Errors: 0, Time elapsed: 0.009 sec
    [junit]
    [junit] Testsuite: org.apache.lucene.search.TestQueryWrapperFilter
    [junit] Tests run: 1, Failures: 0, Errors: 0, Time elapsed: 0.005 sec
    [junit]
    [junit] Testsuite: org.apache.lucene.search.TestScoreCachingWrappingScorer
    [junit] Tests run: 1, Failures: 0, Errors: 0, Time elapsed: 0.005 sec
    [junit]
    [junit] Testsuite: org.apache.lucene.search.TestScorerPerf
    [junit] Tests run: 1, Failures: 0, Errors: 0, Time elapsed: 3.594 sec
    [junit]
    [junit] Testsuite: org.apache.lucene.search.TestSetNorm
    [junit] Tests run: 1, Failures: 0, Errors: 0, Time elapsed: 0.005 sec
    [junit]
    [junit] Testsuite: org.apache.lucene.search.TestSimilarity
    [junit] Tests run: 1, Failures: 0, Errors: 0, Time elapsed: 0.007 sec
    [junit]
    [junit] Testsuite: org.apache.lucene.search.TestSimpleExplanations
    [junit] Tests run: 53, Failures: 0, Errors: 0, Time elapsed: 3.469 sec
    [junit]
    [junit] Testsuite: org.apache.lucene.search.TestSimpleExplanationsOfNonMatches
    [junit] Tests run: 53, Failures: 0, Errors: 0, Time elapsed: 0.538 sec
    [junit]
    [junit] Testsuite: org.apache.lucene.search.TestSloppyPhraseQuery
    [junit] Tests run: 5, Failures: 0, Errors: 0, Time elapsed: 0.257 sec
    [junit]
    [junit] Testsuite: org.apache.lucene.search.TestSort
    [junit] Tests run: 23, Failures: 0, Errors: 0, Time elapsed: 12.301 sec
    [junit]
    [junit] Testsuite: org.apache.lucene.search.TestSpanQueryFilter
    [junit] Tests run: 1, Failures: 0, Errors: 0, Time elapsed: 0.033 sec
    [junit]
    [junit] Testsuite: org.apache.lucene.search.TestTermRangeFilter
    [junit] Tests run: 7, Failures: 0, Errors: 0, Time elapsed: 5.486 sec
    [junit]
    [junit] Testsuite: org.apache.lucene.search.TestTermRangeQuery
    [junit] Tests run: 10, Failures: 0, Errors: 0, Time elapsed: 0.048 sec
    [junit]
    [junit] Testsuite: org.apache.lucene.search.TestTermScorer
    [junit] Tests run: 3, Failures: 0, Errors: 0, Time elapsed: 0.01 sec
    [junit]
    [junit] Testsuite: org.apache.lucene.search.TestTermVectors
    [junit] Tests run: 8, Failures: 0, Errors: 0, Time elapsed: 0.179 sec
    [junit]
    [junit] Testsuite: org.apache.lucene.search.TestThreadSafe
    [junit] Tests run: 1, Failures: 0, Errors: 0, Time elapsed: 22.801 sec
    [junit]
    [junit] Testsuite: org.apache.lucene.search.TestTimeLimitingCollector
    [junit] Tests run: 6, Failures: 0, Errors: 0, Time elapsed: 1.259 sec
    [junit]
    [junit] Testsuite: org.apache.lucene.search.TestTopDocsCollector
    [junit] Tests run: 8, Failures: 0, Errors: 0, Time elapsed: 0.013 sec
    [junit]
    [junit] Testsuite: org.apache.lucene.search.TestTopScoreDocCollector
    [junit] Tests run: 1, Failures: 0, Errors: 0, Time elapsed: 0.005 sec
    [junit]
    [junit] Testsuite: org.apache.lucene.search.TestWildcard
    [junit] Tests run: 7, Failures: 0, Errors: 0, Time elapsed: 0.022 sec
    [junit]
    [junit] Testsuite: org.apache.lucene.search.function.TestCustomScoreQuery
    [junit] Tests run: 6, Failures: 0, Errors: 0, Time elapsed: 21.079 sec
    [junit]
    [junit] Testsuite: org.apache.lucene.search.function.TestDocValues
    [junit] Tests run: 3, Failures: 0, Errors: 0, Time elapsed: 0.01 sec
    [junit]
    [junit] Testsuite: org.apache.lucene.search.function.TestFieldScoreQuery
    [junit] Tests run: 12, Failures: 0, Errors: 0, Time elapsed: 0.219 sec
    [junit]
    [junit] Testsuite: org.apache.lucene.search.function.TestOrdValues
    [junit] Tests run: 6, Failures: 0, Errors: 0, Time elapsed: 0.138 sec
    [junit]
    [junit] Testsuite: org.apache.lucene.search.payloads.TestPayloadNearQuery
    [junit] Tests run: 4, Failures: 0, Errors: 0, Time elapsed: 0.453 sec
    [junit]
    [junit] Testsuite: org.apache.lucene.search.payloads.TestPayloadTermQuery
    [junit] Tests run: 6, Failures: 0, Errors: 0, Time elapsed: 0.924 sec
    [junit]
    [junit] Testsuite: org.apache.lucene.search.spans.TestBasics
    [junit] Tests run: 20, Failures: 0, Errors: 0, Time elapsed: 14.923 sec
    [junit]
    [junit] Testsuite: org.apache.lucene.search.spans.TestFieldMaskingSpanQuery
    [junit] Tests run: 11, Failures: 0, Errors: 0, Time elapsed: 2.758 sec
    [junit]
    [junit] Testsuite: org.apache.lucene.search.spans.TestNearSpansOrdered
    [junit] Tests run: 10, Failures: 0, Errors: 0, Time elapsed: 0.045 sec
    [junit]
    [junit] Testsuite: org.apache.lucene.search.spans.TestPayloadSpans
    [junit] Tests run: 10, Failures: 0, Errors: 0, Time elapsed: 2.056 sec
    [junit]
    [junit] Testsuite: org.apache.lucene.search.spans.TestSpanExplanations
    [junit] Tests run: 31, Failures: 0, Errors: 0, Time elapsed: 1.826 sec
    [junit]
    [junit] Testsuite: org.apache.lucene.search.spans.TestSpanExplanationsOfNonMatches
    [junit] Tests run: 31, Failures: 0, Errors: 0, Time elapsed: 0.065 sec
    [junit]
    [junit] Testsuite: org.apache.lucene.search.spans.TestSpans
    [junit] Tests run: 25, Failures: 0, Errors: 0, Time elapsed: 0.53 sec
    [junit]
    [junit] Testsuite: org.apache.lucene.search.spans.TestSpansAdvanced
    [junit] Tests run: 1, Failures: 0, Errors: 0, Time elapsed: 0.063 sec
    [junit]
    [junit] Testsuite: org.apache.lucene.search.spans.TestSpansAdvanced2
    [junit] Tests run: 4, Failures: 0, Errors: 0, Time elapsed: 0.101 sec
    [junit]
    [junit] Testsuite: org.apache.lucene.store.TestBufferedIndexInput
    [junit] Tests run: 4, Failures: 0, Errors: 0, Time elapsed: 6.078 sec
    [junit]
    [junit] Testsuite: org.apache.lucene.store.TestDirectory
    [junit] Tests run: 7, Failures: 0, Errors: 0, Time elapsed: 0.051 sec
    [junit]
    [junit] Testsuite: org.apache.lucene.store.TestFileSwitchDirectory
    [junit] Tests run: 1, Failures: 0, Errors: 0, Time elapsed: 0.011 sec
    [junit]
    [junit] Testsuite: org.apache.lucene.store.TestHugeRamFile
    [junit] Tests run: 1, Failures: 0, Errors: 0, Time elapsed: 6.688 sec
    [junit]
    [junit] Testsuite: org.apache.lucene.store.TestLock
    [junit] Tests run: 1, Failures: 0, Errors: 0, Time elapsed: 0.015 sec
    [junit]
    [junit] Testsuite: org.apache.lucene.store.TestLockFactory
    [junit] Tests run: 11, Failures: 0, Errors: 0, Time elapsed: 5.399 sec
    [junit]
    [junit] Testsuite: org.apache.lucene.store.TestRAMDirectory
    [junit] Tests run: 4, Failures: 0, Errors: 0, Time elapsed: 1.662 sec
    [junit]
    [junit] Testsuite: org.apache.lucene.store.TestWindowsMMap
    [junit] Tests run: 1, Failures: 0, Errors: 0, Time elapsed: 0.201 sec
    [junit]
    [junit] Testsuite: org.apache.lucene.util.TestArrayUtil
    [junit] Tests run: 4, Failures: 0, Errors: 0, Time elapsed: 0.034 sec
    [junit]
    [junit] Testsuite: org.apache.lucene.util.TestAttributeSource
    [junit] Tests run: 5, Failures: 0, Errors: 0, Time elapsed: 0.006 sec
    [junit]
    [junit] Testsuite: org.apache.lucene.util.TestBitVector
    [junit] Tests run: 7, Failures: 0, Errors: 0, Time elapsed: 6.316 sec
    [junit]
    [junit] Testsuite: org.apache.lucene.util.TestCharacterUtils
    [junit] Tests run: 7, Failures: 0, Errors: 0, Time elapsed: 0.009 sec
    [junit]
    [junit] Testsuite: org.apache.lucene.util.TestCloseableThreadLocal
    [junit] Tests run: 3, Failures: 0, Errors: 0, Time elapsed: 0.006 sec
    [junit]
    [junit] Testsuite: org.apache.lucene.util.TestDoubleBarrelLRUCache
    [junit] Tests run: 2, Failures: 0, Errors: 0, Time elapsed: 1.027 sec
    [junit]
    [junit] Testsuite: org.apache.lucene.util.TestFieldCacheSanityChecker
    [junit] Tests run: 4, Failures: 0, Errors: 0, Time elapsed: 1.204 sec
    [junit]
    [junit] Testsuite: org.apache.lucene.util.TestIndexableBinaryStringTools
    [junit] Tests run: 10, Failures: 0, Errors: 0, Time elapsed: 39.794 sec
    [junit]
    [junit] Testsuite: org.apache.lucene.util.TestNumericUtils
    [junit] Tests run: 8, Failures: 0, Errors: 0, Time elapsed: 0.748 sec
    [junit]
FATAL: command execution failed
hudson.util.IOException2: Failed to join the process
        at hudson.Proc$RemoteProc.join(Proc.java:312)
        at hudson.Launcher$ProcStarter.join(Launcher.java:275)
        at hudson.tasks.CommandInterpreter.perform(CommandInterpreter.java:83)
        at hudson.tasks.CommandInterpreter.perform(CommandInterpreter.java:58)
        at hudson.tasks.BuildStepMonitor$1.perform(BuildStepMonitor.java:19)
        at hudson.model.AbstractBuild$AbstractRunner.perform(AbstractBuild.java:582)
        at hudson.model.Build$RunnerImpl.build(Build.java:165)
        at hudson.model.Build$RunnerImpl.doRun(Build.java:132)
        at hudson.model.AbstractBuild$AbstractRunner.run(AbstractBuild.java:416)
        at hudson.model.Run.run(Run.java:1243)
        at hudson.model.FreeStyleBuild.run(FreeStyleBuild.java:46)
        at hudson.model.ResourceController.execute(ResourceController.java:88)
        at hudson.model.Executor.run(Executor.java:122)
Caused by: java.util.concurrent.ExecutionException: hudson.remoting.RequestAbortedException: java.io.EOFException
        at hudson.remoting.Request$1.get(Request.java:218)
        at hudson.remoting.Request$1.get(Request.java:172)
        at hudson.remoting.FutureAdapter.get(FutureAdapter.java:55)
        at hudson.Proc$RemoteProc.join(Proc.java:304)
        ... 12 more
Caused by: hudson.remoting.RequestAbortedException: java.io.EOFException
        at hudson.remoting.Request.abort(Request.java:257)
        at hudson.remoting.Channel.terminate(Channel.java:598)
        at hudson.remoting.Channel$ReaderThread.run(Channel.java:876)
Caused by: java.io.EOFException
        at java.io.ObjectInputStream$BlockDataInputStream.peekByte(ObjectInputStream.java:2554)
        at java.io.ObjectInputStream.readObject0(ObjectInputStream.java:1297)
        at java.io.ObjectInputStream.readObject(ObjectInputStream.java:351)
        at hudson.remoting.Channel$ReaderThread.run(Channel.java:856)
FATAL: Unable to delete script file /var/tmp/hudson4284741920754972122.sh
hudson.util.IOException2: remote file operation failed: /var/tmp/hudson4284741920754972122.sh at hudson.remoting.Channel@ed6e39:lucene.zones.apache.org (Solaris 10)
        at hudson.FilePath.act(FilePath.java:743)
        at hudson.FilePath.act(FilePath.java:729)
        at hudson.FilePath.delete(FilePath.java:984)
        at hudson.tasks.CommandInterpreter.perform(CommandInterpreter.java:93)
        at hudson.tasks.CommandInterpreter.perform(CommandInterpreter.java:58)
        at hudson.tasks.BuildStepMonitor$1.perform(BuildStepMonitor.java:19)
        at hudson.model.AbstractBuild$AbstractRunner.perform(AbstractBuild.java:582)
        at hudson.model.Build$RunnerImpl.build(Build.java:165)
        at hudson.model.Build$RunnerImpl.doRun(Build.java:132)
        at hudson.model.AbstractBuild$AbstractRunner.run(AbstractBuild.java:416)
        at hudson.model.Run.run(Run.java:1243)
        at hudson.model.FreeStyleBuild.run(FreeStyleBuild.java:46)
        at hudson.model.ResourceController.execute(ResourceController.java:88)
        at hudson.model.Executor.run(Executor.java:122)
Caused by: hudson.remoting.ChannelClosedException: channel is already closed
        at hudson.remoting.Channel.send(Channel.java:412)
        at hudson.remoting.Request.call(Request.java:105)
        at hudson.remoting.Channel.call(Channel.java:551)
        at hudson.FilePath.act(FilePath.java:736)
        ... 13 more
FATAL: channel is already closed
hudson.remoting.ChannelClosedException: channel is already closed
        at hudson.remoting.Channel.send(Channel.java:412)
        at hudson.remoting.Request.call(Request.java:105)
        at hudson.remoting.Channel.call(Channel.java:551)
        at hudson.Launcher$RemoteLauncher.kill(Launcher.java:735)
        at hudson.model.AbstractBuild$AbstractRunner.run(AbstractBuild.java:421)
        at hudson.model.Run.run(Run.java:1243)
        at hudson.model.FreeStyleBuild.run(FreeStyleBuild.java:46)
        at hudson.model.ResourceController.execute(ResourceController.java:88)
        at hudson.model.Executor.run(Executor.java:122)


---------------------------------------------------------------------
To unsubscribe, e-mail: [hidden email]
For additional commands, e-mail: [hidden email]

Reply | Threaded
Open this post in threaded view
|

Hudson build is back to normal : Lucene-3.x #59

Apache Hudson Server
See <http://hudson.zones.apache.org/hudson/job/Lucene-3.x/59/>



---------------------------------------------------------------------
To unsubscribe, e-mail: [hidden email]
For additional commands, e-mail: [hidden email]