Build failed in Hudson: Lucene-3.x #79

classic Classic list List threaded Threaded
10 messages Options
Reply | Threaded
Open this post in threaded view
|

Build failed in Hudson: Lucene-3.x #79

Apache Hudson Server
See <http://hudson.zones.apache.org/hudson/job/Lucene-3.x/79/changes>

Changes:

[mikemccand] LUCENE-2118: trigger new merges when we flush due to merging currently open doc stores

[rmuir] LUCENE-1183: optimize fuzzytermenum a bit, avoid charAt on source string

[koji] SOLR-2030: FVH uses SolrEncoder

[uschindler] Merge from trunk: After adding RANDOM_MULTIPLIER, the statistics in verbose mode were wrong

[koji] LUCENE-2581: FastVectorHighlighter: add Encoder capability

[rmuir] merge all trunk random tests improvements to 3x

[mikemccand] LUCENE-2578: relax another float cmp tolerance

[mikemccand] LUCENE-2578: cutover function query tests to RandomIndexWriter

[shaie] LUCENE-2547: the never ending issue

[mikemccand] remove commented out nocommits

[mikemccand] LUCENE-2574: maybe 3rd time's a charm

[koji] SOLR-2021: Add SolrEncoder plugin to Highlighter

[mikemccand] LUCENE-2574: disable this opto for now

[mikemccand] LUCENE-2574: add missing seek

[rmuir] SOLR-2011: change all uses of java.io.tmpdir -> TEMP_DIR

[rmuir] SOLR-2011: Solr tests now use a tempdir in build/ which is removed by 'ant clean', like lucene

[rmuir] SOLR-2016: use tighter stemming for textTight

[mikemccand] SOLR-2019: force Jetty to use insecure randomness source when running tests

[mikemccand] LUCENE-2579: fix oal.search package.html description of abstract methods

[mikemccand] LUCENE-2579: fix oal.search package.html description of abstract methods

[mikemccand] LUCENE-2580: fix AIOOBE in MultiPhraseQuery

[mikemccand] LUCENE-2580: fix AIOOBE in MultiPhraseQuery

[shaie] Some contrib build.xml didn't import contrib-build.xml

[shaie] LUCENE-2574: Optimize copies between IndexInput and Output

[mikemccand] add randomized test case to test stored fields

[mikemccand] LUCENE-2559: add SegmentReader.reopen

[mikemccand] fix TestIW.testThreadInterruptDeadlock to properly close (abort) its writer

[shaie] LUCENE-2570: Some improvements to _TestUtil and its usage

------------------------------------------
[...truncated 11595 lines...]
      [jar] Building jar: <http://hudson.zones.apache.org/hudson/job/Lucene-3.x/ws/branch_3x/build/lucene-demos-3.1-SNAPSHOT.jar>

war-demo:
      [war] Building war: <http://hudson.zones.apache.org/hudson/job/Lucene-3.x/ws/branch_3x/build/luceneweb.war>

init-dist:
    [mkdir] Created dir: <http://hudson.zones.apache.org/hudson/job/Lucene-3.x/ws/branch_3x/dist>
    [mkdir] Created dir: <http://hudson.zones.apache.org/hudson/job/Lucene-3.x/ws/branch_3x/dist/maven>

changes-to-html:
    [mkdir] Created dir: <http://hudson.zones.apache.org/hudson/job/Lucene-3.x/ws/branch_3x/build/docs/changes>
     [copy] Copying 3 files to <http://hudson.zones.apache.org/hudson/job/Lucene-3.x/ws/branch_3x/build/docs/changes>

package:
     [copy] Copying 1 file to <http://hudson.zones.apache.org/hudson/job/Lucene-3.x/ws/branch_3x/build>

jar-src:
      [jar] Building jar: <http://hudson.zones.apache.org/hudson/job/Lucene-3.x/ws/branch_3x/build/lucene-core-3.1-SNAPSHOT-src.jar>

jar-demo-src:
      [jar] Building jar: <http://hudson.zones.apache.org/hudson/job/Lucene-3.x/ws/branch_3x/build/lucene-demos-3.1-SNAPSHOT-src.jar>

generate-maven-artifacts:
     [copy] Copying 1 file to <http://hudson.zones.apache.org/hudson/job/Lucene-3.x/ws/branch_3x/build>
[artifact:install-provider] Installing provider: org.apache.maven.wagon:wagon-ssh:jar:1.0-beta-2:runtime
[artifact:deploy] Deploying to file://<http://hudson.zones.apache.org/hudson/job/Lucene-3.x/ws/branch_3x/dist/maven>
[artifact:deploy] [INFO] Retrieving previous build number from remote
[artifact:deploy] [INFO] repository metadata for: 'snapshot org.apache.lucene:lucene-parent:3.1-SNAPSHOT' could not be found on repository: remote, so will be created
[artifact:deploy] Uploading: org/apache/lucene/lucene-parent/3.1-SNAPSHOT/lucene-parent-3.1-20100808.233334-1.pom to remote
[artifact:deploy] Uploaded 3K
[artifact:deploy] [INFO] Retrieving previous metadata from remote
[artifact:deploy] [INFO] repository metadata for: 'artifact org.apache.lucene:lucene-parent' could not be found on repository: remote, so will be created
[artifact:deploy] [INFO] Uploading repository metadata for: 'artifact org.apache.lucene:lucene-parent'
[artifact:deploy] [INFO] Retrieving previous metadata from remote
[artifact:deploy] [INFO] repository metadata for: 'snapshot org.apache.lucene:lucene-parent:3.1-SNAPSHOT' could not be found on repository: remote, so will be created
[artifact:deploy] [INFO] Uploading repository metadata for: 'snapshot org.apache.lucene:lucene-parent:3.1-SNAPSHOT'
     [copy] Copying 1 file to <http://hudson.zones.apache.org/hudson/job/Lucene-3.x/ws/branch_3x/build>
[artifact:install-provider] Installing provider: org.apache.maven.wagon:wagon-ssh:jar:1.0-beta-2:runtime
[artifact:pom] Error downloading parent pom org.apache.lucene:lucene-parent::3.1-SNAPSHOT: Missing:
[artifact:pom] ----------
[artifact:pom] 1) org.apache.lucene:lucene-parent:pom:3.1-SNAPSHOT
[artifact:pom]   Path to dependency:
[artifact:pom]   1) unspecified:unspecified:jar:0.0
[artifact:pom]   2) org.apache.lucene:lucene-parent:pom:3.1-SNAPSHOT
[artifact:pom]
[artifact:pom] ----------
[artifact:pom] 1 required artifact is missing.
[artifact:pom]
[artifact:pom] for artifact:
[artifact:pom]   unspecified:unspecified:jar:0.0
[artifact:pom]
[artifact:pom] from the specified remote repositories:
[artifact:pom]   central (http://repo1.maven.org/maven2)
[artifact:deploy] Deploying to file://<http://hudson.zones.apache.org/hudson/job/Lucene-3.x/ws/branch_3x/dist/maven>
[artifact:deploy] [INFO] Retrieving previous build number from remote
[artifact:deploy] [INFO] repository metadata for: 'snapshot org.apache.lucene:lucene-core:3.1-SNAPSHOT' could not be found on repository: remote, so will be created
[artifact:deploy] Uploading: org/apache/lucene/lucene-core/3.1-SNAPSHOT/lucene-core-3.1-20100808.233334-1.jar to remote
[artifact:deploy] Uploaded 1080K
[artifact:deploy] [INFO] Retrieving previous metadata from remote
[artifact:deploy] [INFO] repository metadata for: 'snapshot org.apache.lucene:lucene-core:3.1-SNAPSHOT' could not be found on repository: remote, so will be created
[artifact:deploy] [INFO] Uploading repository metadata for: 'snapshot org.apache.lucene:lucene-core:3.1-SNAPSHOT'
[artifact:deploy] [INFO] Uploading project information for lucene-core 3.1-20100808.233334-1
[artifact:deploy] [INFO] Retrieving previous metadata from remote
[artifact:deploy] [INFO] repository metadata for: 'artifact org.apache.lucene:lucene-core' could not be found on repository: remote, so will be created
[artifact:deploy] [INFO] Uploading repository metadata for: 'artifact org.apache.lucene:lucene-core'
[artifact:deploy] [INFO] Retrieving previous build number from remote
[artifact:deploy] Uploading: org/apache/lucene/lucene-core/3.1-SNAPSHOT/lucene-core-3.1-20100808.233334-1-sources.jar to remote
[artifact:deploy] Uploaded 1007K
[artifact:deploy] [INFO] Retrieving previous build number from remote
[artifact:deploy] Uploading: org/apache/lucene/lucene-core/3.1-SNAPSHOT/lucene-core-3.1-20100808.233334-1-javadoc.jar to remote
[artifact:deploy] Uploaded 2650K
     [copy] Copying 1 file to <http://hudson.zones.apache.org/hudson/job/Lucene-3.x/ws/branch_3x/build>
[artifact:install-provider] Installing provider: org.apache.maven.wagon:wagon-ssh:jar:1.0-beta-2:runtime
[artifact:pom] Error downloading parent pom org.apache.lucene:lucene-parent::3.1-SNAPSHOT: Missing:
[artifact:pom] ----------
[artifact:pom] 1) org.apache.lucene:lucene-parent:pom:3.1-SNAPSHOT
[artifact:pom]   Path to dependency:
[artifact:pom]   1) unspecified:unspecified:jar:0.0
[artifact:pom]   2) org.apache.lucene:lucene-parent:pom:3.1-SNAPSHOT
[artifact:pom]
[artifact:pom] ----------
[artifact:pom] 1 required artifact is missing.
[artifact:pom]
[artifact:pom] for artifact:
[artifact:pom]   unspecified:unspecified:jar:0.0
[artifact:pom]
[artifact:pom] from the specified remote repositories:
[artifact:pom]   central (http://repo1.maven.org/maven2)
[artifact:deploy] Deploying to file://<http://hudson.zones.apache.org/hudson/job/Lucene-3.x/ws/branch_3x/dist/maven>
[artifact:deploy] [INFO] Retrieving previous build number from remote
[artifact:deploy] [INFO] repository metadata for: 'snapshot org.apache.lucene:lucene-demos:3.1-SNAPSHOT' could not be found on repository: remote, so will be created
[artifact:deploy] Uploading: org/apache/lucene/lucene-demos/3.1-SNAPSHOT/lucene-demos-3.1-20100808.233334-1.jar to remote
[artifact:deploy] Uploaded 57K
[artifact:deploy] [INFO] Retrieving previous metadata from remote
[artifact:deploy] [INFO] repository metadata for: 'artifact org.apache.lucene:lucene-demos' could not be found on repository: remote, so will be created
[artifact:deploy] [INFO] Uploading repository metadata for: 'artifact org.apache.lucene:lucene-demos'
[artifact:deploy] [INFO] Retrieving previous metadata from remote
[artifact:deploy] [INFO] repository metadata for: 'snapshot org.apache.lucene:lucene-demos:3.1-SNAPSHOT' could not be found on repository: remote, so will be created
[artifact:deploy] [INFO] Uploading repository metadata for: 'snapshot org.apache.lucene:lucene-demos:3.1-SNAPSHOT'
[artifact:deploy] [INFO] Uploading project information for lucene-demos 3.1-20100808.233334-1
[artifact:deploy] [INFO] Retrieving previous build number from remote
[artifact:deploy] Uploading: org/apache/lucene/lucene-demos/3.1-SNAPSHOT/lucene-demos-3.1-20100808.233334-1-sources.jar to remote
[artifact:deploy] Uploaded 48K
[artifact:deploy] [INFO] Retrieving previous build number from remote
[artifact:deploy] Uploading: org/apache/lucene/lucene-demos/3.1-SNAPSHOT/lucene-demos-3.1-20100808.233334-1-javadoc.jar to remote
[artifact:deploy] Uploaded 115K
     [copy] Copying 1 file to <http://hudson.zones.apache.org/hudson/job/Lucene-3.x/ws/branch_3x/build>
[artifact:install-provider] Installing provider: org.apache.maven.wagon:wagon-ssh:jar:1.0-beta-2:runtime
[artifact:pom] Error downloading parent pom org.apache.lucene:lucene-parent::3.1-SNAPSHOT: Missing:
[artifact:pom] ----------
[artifact:pom] 1) org.apache.lucene:lucene-parent:pom:3.1-SNAPSHOT
[artifact:pom]   Path to dependency:
[artifact:pom]   1) unspecified:unspecified:jar:0.0
[artifact:pom]   2) org.apache.lucene:lucene-parent:pom:3.1-SNAPSHOT
[artifact:pom]
[artifact:pom] ----------
[artifact:pom] 1 required artifact is missing.
[artifact:pom]
[artifact:pom] for artifact:
[artifact:pom]   unspecified:unspecified:jar:0.0
[artifact:pom]
[artifact:pom] from the specified remote repositories:
[artifact:pom]   central (http://repo1.maven.org/maven2)
[artifact:deploy] Deploying to file://<http://hudson.zones.apache.org/hudson/job/Lucene-3.x/ws/branch_3x/dist/maven>
[artifact:deploy] [INFO] Retrieving previous build number from remote
[artifact:deploy] [INFO] repository metadata for: 'snapshot org.apache.lucene:lucene-contrib:3.1-SNAPSHOT' could not be found on repository: remote, so will be created
[artifact:deploy] Uploading: org/apache/lucene/lucene-contrib/3.1-SNAPSHOT/lucene-contrib-3.1-20100808.233334-1.pom to remote
[artifact:deploy] Uploaded 2K
[artifact:deploy] [INFO] Retrieving previous metadata from remote
[artifact:deploy] [INFO] repository metadata for: 'snapshot org.apache.lucene:lucene-contrib:3.1-SNAPSHOT' could not be found on repository: remote, so will be created
[artifact:deploy] [INFO] Uploading repository metadata for: 'snapshot org.apache.lucene:lucene-contrib:3.1-SNAPSHOT'
[artifact:deploy] [INFO] Retrieving previous metadata from remote
[artifact:deploy] [INFO] repository metadata for: 'artifact org.apache.lucene:lucene-contrib' could not be found on repository: remote, so will be created
[artifact:deploy] [INFO] Uploading repository metadata for: 'artifact org.apache.lucene:lucene-contrib'
     [echo] Building analyzers...

common:
     [echo] Building analyzers...

jflex-uptodate-check:

jflex-notice:

common.init:

build-lucene:

init:

clover.setup:

clover.info:

clover:

common.compile-core:

compile-core:

jar-core:
      [jar] Building jar: <http://hudson.zones.apache.org/hudson/job/Lucene-3.x/ws/branch_3x/build/contrib/analyzers/lucene-analyzers-3.1-SNAPSHOT.jar>

default:

smartcn:
     [echo] Building smartcn...

common.init:

build-lucene:

init:

clover.setup:

clover.info:

clover:

compile-core:

jar-core:
      [jar] Building jar: <http://hudson.zones.apache.org/hudson/job/Lucene-3.x/ws/branch_3x/build/contrib/analyzers/lucene-analyzers-3.1-SNAPSHOT.jar>

default:

stempel:
     [echo] Building stempel...

common.init:

build-lucene:

init:

clover.setup:

clover.info:

clover:

compile-core:

jar-core:
      [jar] Building jar: <http://hudson.zones.apache.org/hudson/job/Lucene-3.x/ws/branch_3x/build/contrib/analyzers/lucene-analyzers-3.1-SNAPSHOT.jar>

default:

default:

dist-maven:
     [echo] Building analyzers...

jflex-uptodate-check:

jflex-notice:

common.init:

build-lucene:

init:

clover.setup:

clover.info:

clover:

common.compile-core:

compile-core:

jar-src:

BUILD FAILED
<http://hudson.zones.apache.org/hudson/job/Lucene-3.x/ws/branch_3x/build.xml>:521: The following error occurred while executing this line:
<http://hudson.zones.apache.org/hudson/job/Lucene-3.x/ws/branch_3x/build.xml>:655: The following error occurred while executing this line:
<http://hudson.zones.apache.org/hudson/job/Lucene-3.x/ws/branch_3x/contrib/analyzers/build.xml>:69: The following error occurred while executing this line:
<http://hudson.zones.apache.org/hudson/job/Lucene-3.x/ws/branch_3x/common-build.xml>:594: The following error occurred while executing this line:
<http://hudson.zones.apache.org/hudson/job/Lucene-3.x/ws/branch_3x/common-build.xml>:359: <http://hudson.zones.apache.org/hudson/job/Lucene-3.x/ws/branch_3x/contrib/analyzers/src/java> not found.

Total time: 4 minutes 5 seconds
[TASKS] Skipping publisher since build result is FAILURE
Publishing Javadoc
Archiving artifacts
Recording test results
Publishing Clover coverage report...
No Clover report will be published due to a Build Failure


---------------------------------------------------------------------
To unsubscribe, e-mail: [hidden email]
For additional commands, e-mail: [hidden email]

Reply | Threaded
Open this post in threaded view
|

Build failed in Hudson: Lucene-3.x #80

Apache Hudson Server
See <http://hudson.zones.apache.org/hudson/job/Lucene-3.x/80/changes>

Changes:

[rmuir] extend LuceneTestCase instead of Object here too

[rmuir] SOLR-2002: add support for -Dtestmethod=xxx when running tests

[rmuir] extend LuceneTestCase here instead

[rmuir] SOLR-2002: change tests from TestCase to LuceneTestCase for better coverage

[rmuir] LUCENE-2591: TestNLS fails with ja locale

[rmuir] SOLR-2002: run tests under different timezones and locales

------------------------------------------
[...truncated 11595 lines...]
      [jar] Building jar: <http://hudson.zones.apache.org/hudson/job/Lucene-3.x/ws/branch_3x/build/lucene-demos-3.1-SNAPSHOT.jar>

war-demo:
      [war] Building war: <http://hudson.zones.apache.org/hudson/job/Lucene-3.x/ws/branch_3x/build/luceneweb.war>

init-dist:
    [mkdir] Created dir: <http://hudson.zones.apache.org/hudson/job/Lucene-3.x/ws/branch_3x/dist>
    [mkdir] Created dir: <http://hudson.zones.apache.org/hudson/job/Lucene-3.x/ws/branch_3x/dist/maven>

changes-to-html:
    [mkdir] Created dir: <http://hudson.zones.apache.org/hudson/job/Lucene-3.x/ws/branch_3x/build/docs/changes>
     [copy] Copying 3 files to <http://hudson.zones.apache.org/hudson/job/Lucene-3.x/ws/branch_3x/build/docs/changes>

package:
     [copy] Copying 1 file to <http://hudson.zones.apache.org/hudson/job/Lucene-3.x/ws/branch_3x/build>

jar-src:
      [jar] Building jar: <http://hudson.zones.apache.org/hudson/job/Lucene-3.x/ws/branch_3x/build/lucene-core-3.1-SNAPSHOT-src.jar>

jar-demo-src:
      [jar] Building jar: <http://hudson.zones.apache.org/hudson/job/Lucene-3.x/ws/branch_3x/build/lucene-demos-3.1-SNAPSHOT-src.jar>

generate-maven-artifacts:
     [copy] Copying 1 file to <http://hudson.zones.apache.org/hudson/job/Lucene-3.x/ws/branch_3x/build>
[artifact:install-provider] Installing provider: org.apache.maven.wagon:wagon-ssh:jar:1.0-beta-2:runtime
[artifact:deploy] Deploying to file://<http://hudson.zones.apache.org/hudson/job/Lucene-3.x/ws/branch_3x/dist/maven>
[artifact:deploy] [INFO] Retrieving previous build number from remote
[artifact:deploy] [INFO] repository metadata for: 'snapshot org.apache.lucene:lucene-parent:3.1-SNAPSHOT' could not be found on repository: remote, so will be created
[artifact:deploy] Uploading: org/apache/lucene/lucene-parent/3.1-SNAPSHOT/lucene-parent-3.1-20100809.233127-1.pom to remote
[artifact:deploy] Uploaded 3K
[artifact:deploy] [INFO] Retrieving previous metadata from remote
[artifact:deploy] [INFO] repository metadata for: 'artifact org.apache.lucene:lucene-parent' could not be found on repository: remote, so will be created
[artifact:deploy] [INFO] Uploading repository metadata for: 'artifact org.apache.lucene:lucene-parent'
[artifact:deploy] [INFO] Retrieving previous metadata from remote
[artifact:deploy] [INFO] repository metadata for: 'snapshot org.apache.lucene:lucene-parent:3.1-SNAPSHOT' could not be found on repository: remote, so will be created
[artifact:deploy] [INFO] Uploading repository metadata for: 'snapshot org.apache.lucene:lucene-parent:3.1-SNAPSHOT'
     [copy] Copying 1 file to <http://hudson.zones.apache.org/hudson/job/Lucene-3.x/ws/branch_3x/build>
[artifact:install-provider] Installing provider: org.apache.maven.wagon:wagon-ssh:jar:1.0-beta-2:runtime
[artifact:pom] Error downloading parent pom org.apache.lucene:lucene-parent::3.1-SNAPSHOT: Missing:
[artifact:pom] ----------
[artifact:pom] 1) org.apache.lucene:lucene-parent:pom:3.1-SNAPSHOT
[artifact:pom]   Path to dependency:
[artifact:pom]   1) unspecified:unspecified:jar:0.0
[artifact:pom]   2) org.apache.lucene:lucene-parent:pom:3.1-SNAPSHOT
[artifact:pom]
[artifact:pom] ----------
[artifact:pom] 1 required artifact is missing.
[artifact:pom]
[artifact:pom] for artifact:
[artifact:pom]   unspecified:unspecified:jar:0.0
[artifact:pom]
[artifact:pom] from the specified remote repositories:
[artifact:pom]   central (http://repo1.maven.org/maven2)
[artifact:deploy] Deploying to file://<http://hudson.zones.apache.org/hudson/job/Lucene-3.x/ws/branch_3x/dist/maven>
[artifact:deploy] [INFO] Retrieving previous build number from remote
[artifact:deploy] [INFO] repository metadata for: 'snapshot org.apache.lucene:lucene-core:3.1-SNAPSHOT' could not be found on repository: remote, so will be created
[artifact:deploy] Uploading: org/apache/lucene/lucene-core/3.1-SNAPSHOT/lucene-core-3.1-20100809.233127-1.jar to remote
[artifact:deploy] Uploaded 1080K
[artifact:deploy] [INFO] Retrieving previous metadata from remote
[artifact:deploy] [INFO] repository metadata for: 'snapshot org.apache.lucene:lucene-core:3.1-SNAPSHOT' could not be found on repository: remote, so will be created
[artifact:deploy] [INFO] Uploading repository metadata for: 'snapshot org.apache.lucene:lucene-core:3.1-SNAPSHOT'
[artifact:deploy] [INFO] Uploading project information for lucene-core 3.1-20100809.233127-1
[artifact:deploy] [INFO] Retrieving previous metadata from remote
[artifact:deploy] [INFO] repository metadata for: 'artifact org.apache.lucene:lucene-core' could not be found on repository: remote, so will be created
[artifact:deploy] [INFO] Uploading repository metadata for: 'artifact org.apache.lucene:lucene-core'
[artifact:deploy] [INFO] Retrieving previous build number from remote
[artifact:deploy] Uploading: org/apache/lucene/lucene-core/3.1-SNAPSHOT/lucene-core-3.1-20100809.233127-1-sources.jar to remote
[artifact:deploy] Uploaded 1007K
[artifact:deploy] [INFO] Retrieving previous build number from remote
[artifact:deploy] Uploading: org/apache/lucene/lucene-core/3.1-SNAPSHOT/lucene-core-3.1-20100809.233127-1-javadoc.jar to remote
[artifact:deploy] Uploaded 2650K
     [copy] Copying 1 file to <http://hudson.zones.apache.org/hudson/job/Lucene-3.x/ws/branch_3x/build>
[artifact:install-provider] Installing provider: org.apache.maven.wagon:wagon-ssh:jar:1.0-beta-2:runtime
[artifact:pom] Error downloading parent pom org.apache.lucene:lucene-parent::3.1-SNAPSHOT: Missing:
[artifact:pom] ----------
[artifact:pom] 1) org.apache.lucene:lucene-parent:pom:3.1-SNAPSHOT
[artifact:pom]   Path to dependency:
[artifact:pom]   1) unspecified:unspecified:jar:0.0
[artifact:pom]   2) org.apache.lucene:lucene-parent:pom:3.1-SNAPSHOT
[artifact:pom]
[artifact:pom] ----------
[artifact:pom] 1 required artifact is missing.
[artifact:pom]
[artifact:pom] for artifact:
[artifact:pom]   unspecified:unspecified:jar:0.0
[artifact:pom]
[artifact:pom] from the specified remote repositories:
[artifact:pom]   central (http://repo1.maven.org/maven2)
[artifact:deploy] Deploying to file://<http://hudson.zones.apache.org/hudson/job/Lucene-3.x/ws/branch_3x/dist/maven>
[artifact:deploy] [INFO] Retrieving previous build number from remote
[artifact:deploy] [INFO] repository metadata for: 'snapshot org.apache.lucene:lucene-demos:3.1-SNAPSHOT' could not be found on repository: remote, so will be created
[artifact:deploy] Uploading: org/apache/lucene/lucene-demos/3.1-SNAPSHOT/lucene-demos-3.1-20100809.233127-1.jar to remote
[artifact:deploy] Uploaded 57K
[artifact:deploy] [INFO] Retrieving previous metadata from remote
[artifact:deploy] [INFO] repository metadata for: 'artifact org.apache.lucene:lucene-demos' could not be found on repository: remote, so will be created
[artifact:deploy] [INFO] Uploading repository metadata for: 'artifact org.apache.lucene:lucene-demos'
[artifact:deploy] [INFO] Retrieving previous metadata from remote
[artifact:deploy] [INFO] repository metadata for: 'snapshot org.apache.lucene:lucene-demos:3.1-SNAPSHOT' could not be found on repository: remote, so will be created
[artifact:deploy] [INFO] Uploading repository metadata for: 'snapshot org.apache.lucene:lucene-demos:3.1-SNAPSHOT'
[artifact:deploy] [INFO] Uploading project information for lucene-demos 3.1-20100809.233127-1
[artifact:deploy] [INFO] Retrieving previous build number from remote
[artifact:deploy] Uploading: org/apache/lucene/lucene-demos/3.1-SNAPSHOT/lucene-demos-3.1-20100809.233127-1-sources.jar to remote
[artifact:deploy] Uploaded 48K
[artifact:deploy] [INFO] Retrieving previous build number from remote
[artifact:deploy] Uploading: org/apache/lucene/lucene-demos/3.1-SNAPSHOT/lucene-demos-3.1-20100809.233127-1-javadoc.jar to remote
[artifact:deploy] Uploaded 115K
     [copy] Copying 1 file to <http://hudson.zones.apache.org/hudson/job/Lucene-3.x/ws/branch_3x/build>
[artifact:install-provider] Installing provider: org.apache.maven.wagon:wagon-ssh:jar:1.0-beta-2:runtime
[artifact:pom] Error downloading parent pom org.apache.lucene:lucene-parent::3.1-SNAPSHOT: Missing:
[artifact:pom] ----------
[artifact:pom] 1) org.apache.lucene:lucene-parent:pom:3.1-SNAPSHOT
[artifact:pom]   Path to dependency:
[artifact:pom]   1) unspecified:unspecified:jar:0.0
[artifact:pom]   2) org.apache.lucene:lucene-parent:pom:3.1-SNAPSHOT
[artifact:pom]
[artifact:pom] ----------
[artifact:pom] 1 required artifact is missing.
[artifact:pom]
[artifact:pom] for artifact:
[artifact:pom]   unspecified:unspecified:jar:0.0
[artifact:pom]
[artifact:pom] from the specified remote repositories:
[artifact:pom]   central (http://repo1.maven.org/maven2)
[artifact:deploy] Deploying to file://<http://hudson.zones.apache.org/hudson/job/Lucene-3.x/ws/branch_3x/dist/maven>
[artifact:deploy] [INFO] Retrieving previous build number from remote
[artifact:deploy] [INFO] repository metadata for: 'snapshot org.apache.lucene:lucene-contrib:3.1-SNAPSHOT' could not be found on repository: remote, so will be created
[artifact:deploy] Uploading: org/apache/lucene/lucene-contrib/3.1-SNAPSHOT/lucene-contrib-3.1-20100809.233127-1.pom to remote
[artifact:deploy] Uploaded 2K
[artifact:deploy] [INFO] Retrieving previous metadata from remote
[artifact:deploy] [INFO] repository metadata for: 'snapshot org.apache.lucene:lucene-contrib:3.1-SNAPSHOT' could not be found on repository: remote, so will be created
[artifact:deploy] [INFO] Uploading repository metadata for: 'snapshot org.apache.lucene:lucene-contrib:3.1-SNAPSHOT'
[artifact:deploy] [INFO] Retrieving previous metadata from remote
[artifact:deploy] [INFO] repository metadata for: 'artifact org.apache.lucene:lucene-contrib' could not be found on repository: remote, so will be created
[artifact:deploy] [INFO] Uploading repository metadata for: 'artifact org.apache.lucene:lucene-contrib'
     [echo] Building analyzers...

common:
     [echo] Building analyzers...

jflex-uptodate-check:

jflex-notice:

common.init:

build-lucene:

init:

clover.setup:

clover.info:

clover:

common.compile-core:

compile-core:

jar-core:
      [jar] Building jar: <http://hudson.zones.apache.org/hudson/job/Lucene-3.x/ws/branch_3x/build/contrib/analyzers/lucene-analyzers-3.1-SNAPSHOT.jar>

default:

smartcn:
     [echo] Building smartcn...

common.init:

build-lucene:

init:

clover.setup:

clover.info:

clover:

compile-core:

jar-core:
      [jar] Building jar: <http://hudson.zones.apache.org/hudson/job/Lucene-3.x/ws/branch_3x/build/contrib/analyzers/lucene-analyzers-3.1-SNAPSHOT.jar>

default:

stempel:
     [echo] Building stempel...

common.init:

build-lucene:

init:

clover.setup:

clover.info:

clover:

compile-core:

jar-core:
      [jar] Building jar: <http://hudson.zones.apache.org/hudson/job/Lucene-3.x/ws/branch_3x/build/contrib/analyzers/lucene-analyzers-3.1-SNAPSHOT.jar>

default:

default:

dist-maven:
     [echo] Building analyzers...

jflex-uptodate-check:

jflex-notice:

common.init:

build-lucene:

init:

clover.setup:

clover.info:

clover:

common.compile-core:

compile-core:

jar-src:

BUILD FAILED
<http://hudson.zones.apache.org/hudson/job/Lucene-3.x/ws/branch_3x/build.xml>:521: The following error occurred while executing this line:
<http://hudson.zones.apache.org/hudson/job/Lucene-3.x/ws/branch_3x/build.xml>:655: The following error occurred while executing this line:
<http://hudson.zones.apache.org/hudson/job/Lucene-3.x/ws/branch_3x/contrib/analyzers/build.xml>:69: The following error occurred while executing this line:
<http://hudson.zones.apache.org/hudson/job/Lucene-3.x/ws/branch_3x/common-build.xml>:603: The following error occurred while executing this line:
<http://hudson.zones.apache.org/hudson/job/Lucene-3.x/ws/branch_3x/common-build.xml>:362: <http://hudson.zones.apache.org/hudson/job/Lucene-3.x/ws/branch_3x/contrib/analyzers/src/java> not found.

Total time: 4 minutes 24 seconds
[TASKS] Skipping publisher since build result is FAILURE
Publishing Javadoc
Archiving artifacts
Recording test results
Publishing Clover coverage report...
No Clover report will be published due to a Build Failure


---------------------------------------------------------------------
To unsubscribe, e-mail: [hidden email]
For additional commands, e-mail: [hidden email]

Reply | Threaded
Open this post in threaded view
|

Re: Build failed in Hudson: Lucene-3.x #80

Michael McCandless-2
Same deal w/ this failure, except it was contrib/analyzer's build.xml
on 3x, where <import file="../contrib-build.xml"/> was added.

Mike

On Mon, Aug 9, 2010 at 7:32 PM, Apache Hudson Server
<[hidden email]> wrote:

> See <http://hudson.zones.apache.org/hudson/job/Lucene-3.x/80/changes>
>
> Changes:
>
> [rmuir] extend LuceneTestCase instead of Object here too
>
> [rmuir] SOLR-2002: add support for -Dtestmethod=xxx when running tests
>
> [rmuir] extend LuceneTestCase here instead
>
> [rmuir] SOLR-2002: change tests from TestCase to LuceneTestCase for better coverage
>
> [rmuir] LUCENE-2591: TestNLS fails with ja locale
>
> [rmuir] SOLR-2002: run tests under different timezones and locales
>
> ------------------------------------------
> [...truncated 11595 lines...]
>      [jar] Building jar: <http://hudson.zones.apache.org/hudson/job/Lucene-3.x/ws/branch_3x/build/lucene-demos-3.1-SNAPSHOT.jar>
>
> war-demo:
>      [war] Building war: <http://hudson.zones.apache.org/hudson/job/Lucene-3.x/ws/branch_3x/build/luceneweb.war>
>
> init-dist:
>    [mkdir] Created dir: <http://hudson.zones.apache.org/hudson/job/Lucene-3.x/ws/branch_3x/dist>
>    [mkdir] Created dir: <http://hudson.zones.apache.org/hudson/job/Lucene-3.x/ws/branch_3x/dist/maven>
>
> changes-to-html:
>    [mkdir] Created dir: <http://hudson.zones.apache.org/hudson/job/Lucene-3.x/ws/branch_3x/build/docs/changes>
>     [copy] Copying 3 files to <http://hudson.zones.apache.org/hudson/job/Lucene-3.x/ws/branch_3x/build/docs/changes>
>
> package:
>     [copy] Copying 1 file to <http://hudson.zones.apache.org/hudson/job/Lucene-3.x/ws/branch_3x/build>
>
> jar-src:
>      [jar] Building jar: <http://hudson.zones.apache.org/hudson/job/Lucene-3.x/ws/branch_3x/build/lucene-core-3.1-SNAPSHOT-src.jar>
>
> jar-demo-src:
>      [jar] Building jar: <http://hudson.zones.apache.org/hudson/job/Lucene-3.x/ws/branch_3x/build/lucene-demos-3.1-SNAPSHOT-src.jar>
>
> generate-maven-artifacts:
>     [copy] Copying 1 file to <http://hudson.zones.apache.org/hudson/job/Lucene-3.x/ws/branch_3x/build>
> [artifact:install-provider] Installing provider: org.apache.maven.wagon:wagon-ssh:jar:1.0-beta-2:runtime
> [artifact:deploy] Deploying to file://<http://hudson.zones.apache.org/hudson/job/Lucene-3.x/ws/branch_3x/dist/maven>
> [artifact:deploy] [INFO] Retrieving previous build number from remote
> [artifact:deploy] [INFO] repository metadata for: 'snapshot org.apache.lucene:lucene-parent:3.1-SNAPSHOT' could not be found on repository: remote, so will be created
> [artifact:deploy] Uploading: org/apache/lucene/lucene-parent/3.1-SNAPSHOT/lucene-parent-3.1-20100809.233127-1.pom to remote
> [artifact:deploy] Uploaded 3K
> [artifact:deploy] [INFO] Retrieving previous metadata from remote
> [artifact:deploy] [INFO] repository metadata for: 'artifact org.apache.lucene:lucene-parent' could not be found on repository: remote, so will be created
> [artifact:deploy] [INFO] Uploading repository metadata for: 'artifact org.apache.lucene:lucene-parent'
> [artifact:deploy] [INFO] Retrieving previous metadata from remote
> [artifact:deploy] [INFO] repository metadata for: 'snapshot org.apache.lucene:lucene-parent:3.1-SNAPSHOT' could not be found on repository: remote, so will be created
> [artifact:deploy] [INFO] Uploading repository metadata for: 'snapshot org.apache.lucene:lucene-parent:3.1-SNAPSHOT'
>     [copy] Copying 1 file to <http://hudson.zones.apache.org/hudson/job/Lucene-3.x/ws/branch_3x/build>
> [artifact:install-provider] Installing provider: org.apache.maven.wagon:wagon-ssh:jar:1.0-beta-2:runtime
> [artifact:pom] Error downloading parent pom org.apache.lucene:lucene-parent::3.1-SNAPSHOT: Missing:
> [artifact:pom] ----------
> [artifact:pom] 1) org.apache.lucene:lucene-parent:pom:3.1-SNAPSHOT
> [artifact:pom]   Path to dependency:
> [artifact:pom]          1) unspecified:unspecified:jar:0.0
> [artifact:pom]          2) org.apache.lucene:lucene-parent:pom:3.1-SNAPSHOT
> [artifact:pom]
> [artifact:pom] ----------
> [artifact:pom] 1 required artifact is missing.
> [artifact:pom]
> [artifact:pom] for artifact:
> [artifact:pom]   unspecified:unspecified:jar:0.0
> [artifact:pom]
> [artifact:pom] from the specified remote repositories:
> [artifact:pom]   central (http://repo1.maven.org/maven2)
> [artifact:deploy] Deploying to file://<http://hudson.zones.apache.org/hudson/job/Lucene-3.x/ws/branch_3x/dist/maven>
> [artifact:deploy] [INFO] Retrieving previous build number from remote
> [artifact:deploy] [INFO] repository metadata for: 'snapshot org.apache.lucene:lucene-core:3.1-SNAPSHOT' could not be found on repository: remote, so will be created
> [artifact:deploy] Uploading: org/apache/lucene/lucene-core/3.1-SNAPSHOT/lucene-core-3.1-20100809.233127-1.jar to remote
> [artifact:deploy] Uploaded 1080K
> [artifact:deploy] [INFO] Retrieving previous metadata from remote
> [artifact:deploy] [INFO] repository metadata for: 'snapshot org.apache.lucene:lucene-core:3.1-SNAPSHOT' could not be found on repository: remote, so will be created
> [artifact:deploy] [INFO] Uploading repository metadata for: 'snapshot org.apache.lucene:lucene-core:3.1-SNAPSHOT'
> [artifact:deploy] [INFO] Uploading project information for lucene-core 3.1-20100809.233127-1
> [artifact:deploy] [INFO] Retrieving previous metadata from remote
> [artifact:deploy] [INFO] repository metadata for: 'artifact org.apache.lucene:lucene-core' could not be found on repository: remote, so will be created
> [artifact:deploy] [INFO] Uploading repository metadata for: 'artifact org.apache.lucene:lucene-core'
> [artifact:deploy] [INFO] Retrieving previous build number from remote
> [artifact:deploy] Uploading: org/apache/lucene/lucene-core/3.1-SNAPSHOT/lucene-core-3.1-20100809.233127-1-sources.jar to remote
> [artifact:deploy] Uploaded 1007K
> [artifact:deploy] [INFO] Retrieving previous build number from remote
> [artifact:deploy] Uploading: org/apache/lucene/lucene-core/3.1-SNAPSHOT/lucene-core-3.1-20100809.233127-1-javadoc.jar to remote
> [artifact:deploy] Uploaded 2650K
>     [copy] Copying 1 file to <http://hudson.zones.apache.org/hudson/job/Lucene-3.x/ws/branch_3x/build>
> [artifact:install-provider] Installing provider: org.apache.maven.wagon:wagon-ssh:jar:1.0-beta-2:runtime
> [artifact:pom] Error downloading parent pom org.apache.lucene:lucene-parent::3.1-SNAPSHOT: Missing:
> [artifact:pom] ----------
> [artifact:pom] 1) org.apache.lucene:lucene-parent:pom:3.1-SNAPSHOT
> [artifact:pom]   Path to dependency:
> [artifact:pom]          1) unspecified:unspecified:jar:0.0
> [artifact:pom]          2) org.apache.lucene:lucene-parent:pom:3.1-SNAPSHOT
> [artifact:pom]
> [artifact:pom] ----------
> [artifact:pom] 1 required artifact is missing.
> [artifact:pom]
> [artifact:pom] for artifact:
> [artifact:pom]   unspecified:unspecified:jar:0.0
> [artifact:pom]
> [artifact:pom] from the specified remote repositories:
> [artifact:pom]   central (http://repo1.maven.org/maven2)
> [artifact:deploy] Deploying to file://<http://hudson.zones.apache.org/hudson/job/Lucene-3.x/ws/branch_3x/dist/maven>
> [artifact:deploy] [INFO] Retrieving previous build number from remote
> [artifact:deploy] [INFO] repository metadata for: 'snapshot org.apache.lucene:lucene-demos:3.1-SNAPSHOT' could not be found on repository: remote, so will be created
> [artifact:deploy] Uploading: org/apache/lucene/lucene-demos/3.1-SNAPSHOT/lucene-demos-3.1-20100809.233127-1.jar to remote
> [artifact:deploy] Uploaded 57K
> [artifact:deploy] [INFO] Retrieving previous metadata from remote
> [artifact:deploy] [INFO] repository metadata for: 'artifact org.apache.lucene:lucene-demos' could not be found on repository: remote, so will be created
> [artifact:deploy] [INFO] Uploading repository metadata for: 'artifact org.apache.lucene:lucene-demos'
> [artifact:deploy] [INFO] Retrieving previous metadata from remote
> [artifact:deploy] [INFO] repository metadata for: 'snapshot org.apache.lucene:lucene-demos:3.1-SNAPSHOT' could not be found on repository: remote, so will be created
> [artifact:deploy] [INFO] Uploading repository metadata for: 'snapshot org.apache.lucene:lucene-demos:3.1-SNAPSHOT'
> [artifact:deploy] [INFO] Uploading project information for lucene-demos 3.1-20100809.233127-1
> [artifact:deploy] [INFO] Retrieving previous build number from remote
> [artifact:deploy] Uploading: org/apache/lucene/lucene-demos/3.1-SNAPSHOT/lucene-demos-3.1-20100809.233127-1-sources.jar to remote
> [artifact:deploy] Uploaded 48K
> [artifact:deploy] [INFO] Retrieving previous build number from remote
> [artifact:deploy] Uploading: org/apache/lucene/lucene-demos/3.1-SNAPSHOT/lucene-demos-3.1-20100809.233127-1-javadoc.jar to remote
> [artifact:deploy] Uploaded 115K
>     [copy] Copying 1 file to <http://hudson.zones.apache.org/hudson/job/Lucene-3.x/ws/branch_3x/build>
> [artifact:install-provider] Installing provider: org.apache.maven.wagon:wagon-ssh:jar:1.0-beta-2:runtime
> [artifact:pom] Error downloading parent pom org.apache.lucene:lucene-parent::3.1-SNAPSHOT: Missing:
> [artifact:pom] ----------
> [artifact:pom] 1) org.apache.lucene:lucene-parent:pom:3.1-SNAPSHOT
> [artifact:pom]   Path to dependency:
> [artifact:pom]          1) unspecified:unspecified:jar:0.0
> [artifact:pom]          2) org.apache.lucene:lucene-parent:pom:3.1-SNAPSHOT
> [artifact:pom]
> [artifact:pom] ----------
> [artifact:pom] 1 required artifact is missing.
> [artifact:pom]
> [artifact:pom] for artifact:
> [artifact:pom]   unspecified:unspecified:jar:0.0
> [artifact:pom]
> [artifact:pom] from the specified remote repositories:
> [artifact:pom]   central (http://repo1.maven.org/maven2)
> [artifact:deploy] Deploying to file://<http://hudson.zones.apache.org/hudson/job/Lucene-3.x/ws/branch_3x/dist/maven>
> [artifact:deploy] [INFO] Retrieving previous build number from remote
> [artifact:deploy] [INFO] repository metadata for: 'snapshot org.apache.lucene:lucene-contrib:3.1-SNAPSHOT' could not be found on repository: remote, so will be created
> [artifact:deploy] Uploading: org/apache/lucene/lucene-contrib/3.1-SNAPSHOT/lucene-contrib-3.1-20100809.233127-1.pom to remote
> [artifact:deploy] Uploaded 2K
> [artifact:deploy] [INFO] Retrieving previous metadata from remote
> [artifact:deploy] [INFO] repository metadata for: 'snapshot org.apache.lucene:lucene-contrib:3.1-SNAPSHOT' could not be found on repository: remote, so will be created
> [artifact:deploy] [INFO] Uploading repository metadata for: 'snapshot org.apache.lucene:lucene-contrib:3.1-SNAPSHOT'
> [artifact:deploy] [INFO] Retrieving previous metadata from remote
> [artifact:deploy] [INFO] repository metadata for: 'artifact org.apache.lucene:lucene-contrib' could not be found on repository: remote, so will be created
> [artifact:deploy] [INFO] Uploading repository metadata for: 'artifact org.apache.lucene:lucene-contrib'
>     [echo] Building analyzers...
>
> common:
>     [echo] Building analyzers...
>
> jflex-uptodate-check:
>
> jflex-notice:
>
> common.init:
>
> build-lucene:
>
> init:
>
> clover.setup:
>
> clover.info:
>
> clover:
>
> common.compile-core:
>
> compile-core:
>
> jar-core:
>      [jar] Building jar: <http://hudson.zones.apache.org/hudson/job/Lucene-3.x/ws/branch_3x/build/contrib/analyzers/lucene-analyzers-3.1-SNAPSHOT.jar>
>
> default:
>
> smartcn:
>     [echo] Building smartcn...
>
> common.init:
>
> build-lucene:
>
> init:
>
> clover.setup:
>
> clover.info:
>
> clover:
>
> compile-core:
>
> jar-core:
>      [jar] Building jar: <http://hudson.zones.apache.org/hudson/job/Lucene-3.x/ws/branch_3x/build/contrib/analyzers/lucene-analyzers-3.1-SNAPSHOT.jar>
>
> default:
>
> stempel:
>     [echo] Building stempel...
>
> common.init:
>
> build-lucene:
>
> init:
>
> clover.setup:
>
> clover.info:
>
> clover:
>
> compile-core:
>
> jar-core:
>      [jar] Building jar: <http://hudson.zones.apache.org/hudson/job/Lucene-3.x/ws/branch_3x/build/contrib/analyzers/lucene-analyzers-3.1-SNAPSHOT.jar>
>
> default:
>
> default:
>
> dist-maven:
>     [echo] Building analyzers...
>
> jflex-uptodate-check:
>
> jflex-notice:
>
> common.init:
>
> build-lucene:
>
> init:
>
> clover.setup:
>
> clover.info:
>
> clover:
>
> common.compile-core:
>
> compile-core:
>
> jar-src:
>
> BUILD FAILED
> <http://hudson.zones.apache.org/hudson/job/Lucene-3.x/ws/branch_3x/build.xml>:521: The following error occurred while executing this line:
> <http://hudson.zones.apache.org/hudson/job/Lucene-3.x/ws/branch_3x/build.xml>:655: The following error occurred while executing this line:
> <http://hudson.zones.apache.org/hudson/job/Lucene-3.x/ws/branch_3x/contrib/analyzers/build.xml>:69: The following error occurred while executing this line:
> <http://hudson.zones.apache.org/hudson/job/Lucene-3.x/ws/branch_3x/common-build.xml>:603: The following error occurred while executing this line:
> <http://hudson.zones.apache.org/hudson/job/Lucene-3.x/ws/branch_3x/common-build.xml>:362: <http://hudson.zones.apache.org/hudson/job/Lucene-3.x/ws/branch_3x/contrib/analyzers/src/java> not found.
>
> Total time: 4 minutes 24 seconds
> [TASKS] Skipping publisher since build result is FAILURE
> Publishing Javadoc
> Archiving artifacts
> Recording test results
> Publishing Clover coverage report...
> No Clover report will be published due to a Build Failure
>
>
> ---------------------------------------------------------------------
> To unsubscribe, e-mail: [hidden email]
> For additional commands, e-mail: [hidden email]
>
>

---------------------------------------------------------------------
To unsubscribe, e-mail: [hidden email]
For additional commands, e-mail: [hidden email]

Reply | Threaded
Open this post in threaded view
|

Re: Build failed in Hudson: Lucene-3.x #80

Shai Erera
Hmm ... I've made these changes a while ago because if you ran "ant jar" from the analyzers contrib directory, nothing happened. I thought that's a mistake, but perhaps it's not, since analyzers has 3 sub-dirs, each import contrib-build.xml. I guess same goes for 'db'. After I've noticed that (few days ago), I didn't think it's a problem to leave it that way. So if you run "ant jar" from analyzers, you get all 3 of them in one .jar, which might be convenient.

I did that few weeks ago - why does the build fail suddenly?

So should I revert it? If so, I'll keep that import commented out w/ some explanation (can you help w/ the explanation?) so that we don't repeat the same mistake in the future.

Shai

On Tue, Aug 10, 2010 at 12:16 PM, Michael McCandless <[hidden email]> wrote:
Same deal w/ this failure, except it was contrib/analyzer's build.xml
on 3x, where <import file="../contrib-build.xml"/> was added.

Mike

On Mon, Aug 9, 2010 at 7:32 PM, Apache Hudson Server
<[hidden email]> wrote:
> See <http://hudson.zones.apache.org/hudson/job/Lucene-3.x/80/changes>
>
> Changes:
>
> [rmuir] extend LuceneTestCase instead of Object here too
>
> [rmuir] SOLR-2002: add support for -Dtestmethod=xxx when running tests
>
> [rmuir] extend LuceneTestCase here instead
>
> [rmuir] SOLR-2002: change tests from TestCase to LuceneTestCase for better coverage
>
> [rmuir] LUCENE-2591: TestNLS fails with ja locale
>
> [rmuir] SOLR-2002: run tests under different timezones and locales
>
> ------------------------------------------
> [...truncated 11595 lines...]
>      [jar] Building jar: <http://hudson.zones.apache.org/hudson/job/Lucene-3.x/ws/branch_3x/build/lucene-demos-3.1-SNAPSHOT.jar>
>
> war-demo:
>      [war] Building war: <http://hudson.zones.apache.org/hudson/job/Lucene-3.x/ws/branch_3x/build/luceneweb.war>
>
> init-dist:
>    [mkdir] Created dir: <http://hudson.zones.apache.org/hudson/job/Lucene-3.x/ws/branch_3x/dist>
>    [mkdir] Created dir: <http://hudson.zones.apache.org/hudson/job/Lucene-3.x/ws/branch_3x/dist/maven>
>
> changes-to-html:
>    [mkdir] Created dir: <http://hudson.zones.apache.org/hudson/job/Lucene-3.x/ws/branch_3x/build/docs/changes>
>     [copy] Copying 3 files to <http://hudson.zones.apache.org/hudson/job/Lucene-3.x/ws/branch_3x/build/docs/changes>
>
> package:
>     [copy] Copying 1 file to <http://hudson.zones.apache.org/hudson/job/Lucene-3.x/ws/branch_3x/build>
>
> jar-src:
>      [jar] Building jar: <http://hudson.zones.apache.org/hudson/job/Lucene-3.x/ws/branch_3x/build/lucene-core-3.1-SNAPSHOT-src.jar>
>
> jar-demo-src:
>      [jar] Building jar: <http://hudson.zones.apache.org/hudson/job/Lucene-3.x/ws/branch_3x/build/lucene-demos-3.1-SNAPSHOT-src.jar>
>
> generate-maven-artifacts:
>     [copy] Copying 1 file to <http://hudson.zones.apache.org/hudson/job/Lucene-3.x/ws/branch_3x/build>
> [artifact:install-provider] Installing provider: org.apache.maven.wagon:wagon-ssh:jar:1.0-beta-2:runtime
> [artifact:deploy] Deploying to file://<http://hudson.zones.apache.org/hudson/job/Lucene-3.x/ws/branch_3x/dist/maven>
> [artifact:deploy] [INFO] Retrieving previous build number from remote
> [artifact:deploy] [INFO] repository metadata for: 'snapshot org.apache.lucene:lucene-parent:3.1-SNAPSHOT' could not be found on repository: remote, so will be created
> [artifact:deploy] Uploading: org/apache/lucene/lucene-parent/3.1-SNAPSHOT/lucene-parent-3.1-20100809.233127-1.pom to remote
> [artifact:deploy] Uploaded 3K
> [artifact:deploy] [INFO] Retrieving previous metadata from remote
> [artifact:deploy] [INFO] repository metadata for: 'artifact org.apache.lucene:lucene-parent' could not be found on repository: remote, so will be created
> [artifact:deploy] [INFO] Uploading repository metadata for: 'artifact org.apache.lucene:lucene-parent'
> [artifact:deploy] [INFO] Retrieving previous metadata from remote
> [artifact:deploy] [INFO] repository metadata for: 'snapshot org.apache.lucene:lucene-parent:3.1-SNAPSHOT' could not be found on repository: remote, so will be created
> [artifact:deploy] [INFO] Uploading repository metadata for: 'snapshot org.apache.lucene:lucene-parent:3.1-SNAPSHOT'
>     [copy] Copying 1 file to <http://hudson.zones.apache.org/hudson/job/Lucene-3.x/ws/branch_3x/build>
> [artifact:install-provider] Installing provider: org.apache.maven.wagon:wagon-ssh:jar:1.0-beta-2:runtime
> [artifact:pom] Error downloading parent pom org.apache.lucene:lucene-parent::3.1-SNAPSHOT: Missing:
> [artifact:pom] ----------
> [artifact:pom] 1) org.apache.lucene:lucene-parent:pom:3.1-SNAPSHOT
> [artifact:pom]   Path to dependency:
> [artifact:pom]          1) unspecified:unspecified:jar:0.0
> [artifact:pom]          2) org.apache.lucene:lucene-parent:pom:3.1-SNAPSHOT
> [artifact:pom]
> [artifact:pom] ----------
> [artifact:pom] 1 required artifact is missing.
> [artifact:pom]
> [artifact:pom] for artifact:
> [artifact:pom]   unspecified:unspecified:jar:0.0
> [artifact:pom]
> [artifact:pom] from the specified remote repositories:
> [artifact:pom]   central (http://repo1.maven.org/maven2)
> [artifact:deploy] Deploying to file://<http://hudson.zones.apache.org/hudson/job/Lucene-3.x/ws/branch_3x/dist/maven>
> [artifact:deploy] [INFO] Retrieving previous build number from remote
> [artifact:deploy] [INFO] repository metadata for: 'snapshot org.apache.lucene:lucene-core:3.1-SNAPSHOT' could not be found on repository: remote, so will be created
> [artifact:deploy] Uploading: org/apache/lucene/lucene-core/3.1-SNAPSHOT/lucene-core-3.1-20100809.233127-1.jar to remote
> [artifact:deploy] Uploaded 1080K
> [artifact:deploy] [INFO] Retrieving previous metadata from remote
> [artifact:deploy] [INFO] repository metadata for: 'snapshot org.apache.lucene:lucene-core:3.1-SNAPSHOT' could not be found on repository: remote, so will be created
> [artifact:deploy] [INFO] Uploading repository metadata for: 'snapshot org.apache.lucene:lucene-core:3.1-SNAPSHOT'
> [artifact:deploy] [INFO] Uploading project information for lucene-core 3.1-20100809.233127-1
> [artifact:deploy] [INFO] Retrieving previous metadata from remote
> [artifact:deploy] [INFO] repository metadata for: 'artifact org.apache.lucene:lucene-core' could not be found on repository: remote, so will be created
> [artifact:deploy] [INFO] Uploading repository metadata for: 'artifact org.apache.lucene:lucene-core'
> [artifact:deploy] [INFO] Retrieving previous build number from remote
> [artifact:deploy] Uploading: org/apache/lucene/lucene-core/3.1-SNAPSHOT/lucene-core-3.1-20100809.233127-1-sources.jar to remote
> [artifact:deploy] Uploaded 1007K
> [artifact:deploy] [INFO] Retrieving previous build number from remote
> [artifact:deploy] Uploading: org/apache/lucene/lucene-core/3.1-SNAPSHOT/lucene-core-3.1-20100809.233127-1-javadoc.jar to remote
> [artifact:deploy] Uploaded 2650K
>     [copy] Copying 1 file to <http://hudson.zones.apache.org/hudson/job/Lucene-3.x/ws/branch_3x/build>
> [artifact:install-provider] Installing provider: org.apache.maven.wagon:wagon-ssh:jar:1.0-beta-2:runtime
> [artifact:pom] Error downloading parent pom org.apache.lucene:lucene-parent::3.1-SNAPSHOT: Missing:
> [artifact:pom] ----------
> [artifact:pom] 1) org.apache.lucene:lucene-parent:pom:3.1-SNAPSHOT
> [artifact:pom]   Path to dependency:
> [artifact:pom]          1) unspecified:unspecified:jar:0.0
> [artifact:pom]          2) org.apache.lucene:lucene-parent:pom:3.1-SNAPSHOT
> [artifact:pom]
> [artifact:pom] ----------
> [artifact:pom] 1 required artifact is missing.
> [artifact:pom]
> [artifact:pom] for artifact:
> [artifact:pom]   unspecified:unspecified:jar:0.0
> [artifact:pom]
> [artifact:pom] from the specified remote repositories:
> [artifact:pom]   central (http://repo1.maven.org/maven2)
> [artifact:deploy] Deploying to file://<http://hudson.zones.apache.org/hudson/job/Lucene-3.x/ws/branch_3x/dist/maven>
> [artifact:deploy] [INFO] Retrieving previous build number from remote
> [artifact:deploy] [INFO] repository metadata for: 'snapshot org.apache.lucene:lucene-demos:3.1-SNAPSHOT' could not be found on repository: remote, so will be created
> [artifact:deploy] Uploading: org/apache/lucene/lucene-demos/3.1-SNAPSHOT/lucene-demos-3.1-20100809.233127-1.jar to remote
> [artifact:deploy] Uploaded 57K
> [artifact:deploy] [INFO] Retrieving previous metadata from remote
> [artifact:deploy] [INFO] repository metadata for: 'artifact org.apache.lucene:lucene-demos' could not be found on repository: remote, so will be created
> [artifact:deploy] [INFO] Uploading repository metadata for: 'artifact org.apache.lucene:lucene-demos'
> [artifact:deploy] [INFO] Retrieving previous metadata from remote
> [artifact:deploy] [INFO] repository metadata for: 'snapshot org.apache.lucene:lucene-demos:3.1-SNAPSHOT' could not be found on repository: remote, so will be created
> [artifact:deploy] [INFO] Uploading repository metadata for: 'snapshot org.apache.lucene:lucene-demos:3.1-SNAPSHOT'
> [artifact:deploy] [INFO] Uploading project information for lucene-demos 3.1-20100809.233127-1
> [artifact:deploy] [INFO] Retrieving previous build number from remote
> [artifact:deploy] Uploading: org/apache/lucene/lucene-demos/3.1-SNAPSHOT/lucene-demos-3.1-20100809.233127-1-sources.jar to remote
> [artifact:deploy] Uploaded 48K
> [artifact:deploy] [INFO] Retrieving previous build number from remote
> [artifact:deploy] Uploading: org/apache/lucene/lucene-demos/3.1-SNAPSHOT/lucene-demos-3.1-20100809.233127-1-javadoc.jar to remote
> [artifact:deploy] Uploaded 115K
>     [copy] Copying 1 file to <http://hudson.zones.apache.org/hudson/job/Lucene-3.x/ws/branch_3x/build>
> [artifact:install-provider] Installing provider: org.apache.maven.wagon:wagon-ssh:jar:1.0-beta-2:runtime
> [artifact:pom] Error downloading parent pom org.apache.lucene:lucene-parent::3.1-SNAPSHOT: Missing:
> [artifact:pom] ----------
> [artifact:pom] 1) org.apache.lucene:lucene-parent:pom:3.1-SNAPSHOT
> [artifact:pom]   Path to dependency:
> [artifact:pom]          1) unspecified:unspecified:jar:0.0
> [artifact:pom]          2) org.apache.lucene:lucene-parent:pom:3.1-SNAPSHOT
> [artifact:pom]
> [artifact:pom] ----------
> [artifact:pom] 1 required artifact is missing.
> [artifact:pom]
> [artifact:pom] for artifact:
> [artifact:pom]   unspecified:unspecified:jar:0.0
> [artifact:pom]
> [artifact:pom] from the specified remote repositories:
> [artifact:pom]   central (http://repo1.maven.org/maven2)
> [artifact:deploy] Deploying to file://<http://hudson.zones.apache.org/hudson/job/Lucene-3.x/ws/branch_3x/dist/maven>
> [artifact:deploy] [INFO] Retrieving previous build number from remote
> [artifact:deploy] [INFO] repository metadata for: 'snapshot org.apache.lucene:lucene-contrib:3.1-SNAPSHOT' could not be found on repository: remote, so will be created
> [artifact:deploy] Uploading: org/apache/lucene/lucene-contrib/3.1-SNAPSHOT/lucene-contrib-3.1-20100809.233127-1.pom to remote
> [artifact:deploy] Uploaded 2K
> [artifact:deploy] [INFO] Retrieving previous metadata from remote
> [artifact:deploy] [INFO] repository metadata for: 'snapshot org.apache.lucene:lucene-contrib:3.1-SNAPSHOT' could not be found on repository: remote, so will be created
> [artifact:deploy] [INFO] Uploading repository metadata for: 'snapshot org.apache.lucene:lucene-contrib:3.1-SNAPSHOT'
> [artifact:deploy] [INFO] Retrieving previous metadata from remote
> [artifact:deploy] [INFO] repository metadata for: 'artifact org.apache.lucene:lucene-contrib' could not be found on repository: remote, so will be created
> [artifact:deploy] [INFO] Uploading repository metadata for: 'artifact org.apache.lucene:lucene-contrib'
>     [echo] Building analyzers...
>
> common:
>     [echo] Building analyzers...
>
> jflex-uptodate-check:
>
> jflex-notice:
>
> common.init:
>
> build-lucene:
>
> init:
>
> clover.setup:
>
> clover.info:
>
> clover:
>
> common.compile-core:
>
> compile-core:
>
> jar-core:
>      [jar] Building jar: <http://hudson.zones.apache.org/hudson/job/Lucene-3.x/ws/branch_3x/build/contrib/analyzers/lucene-analyzers-3.1-SNAPSHOT.jar>
>
> default:
>
> smartcn:
>     [echo] Building smartcn...
>
> common.init:
>
> build-lucene:
>
> init:
>
> clover.setup:
>
> clover.info:
>
> clover:
>
> compile-core:
>
> jar-core:
>      [jar] Building jar: <http://hudson.zones.apache.org/hudson/job/Lucene-3.x/ws/branch_3x/build/contrib/analyzers/lucene-analyzers-3.1-SNAPSHOT.jar>
>
> default:
>
> stempel:
>     [echo] Building stempel...
>
> common.init:
>
> build-lucene:
>
> init:
>
> clover.setup:
>
> clover.info:
>
> clover:
>
> compile-core:
>
> jar-core:
>      [jar] Building jar: <http://hudson.zones.apache.org/hudson/job/Lucene-3.x/ws/branch_3x/build/contrib/analyzers/lucene-analyzers-3.1-SNAPSHOT.jar>
>
> default:
>
> default:
>
> dist-maven:
>     [echo] Building analyzers...
>
> jflex-uptodate-check:
>
> jflex-notice:
>
> common.init:
>
> build-lucene:
>
> init:
>
> clover.setup:
>
> clover.info:
>
> clover:
>
> common.compile-core:
>
> compile-core:
>
> jar-src:
>
> BUILD FAILED
> <http://hudson.zones.apache.org/hudson/job/Lucene-3.x/ws/branch_3x/build.xml>:521: The following error occurred while executing this line:
> <http://hudson.zones.apache.org/hudson/job/Lucene-3.x/ws/branch_3x/build.xml>:655: The following error occurred while executing this line:
> <http://hudson.zones.apache.org/hudson/job/Lucene-3.x/ws/branch_3x/contrib/analyzers/build.xml>:69: The following error occurred while executing this line:
> <http://hudson.zones.apache.org/hudson/job/Lucene-3.x/ws/branch_3x/common-build.xml>:603: The following error occurred while executing this line:
> <http://hudson.zones.apache.org/hudson/job/Lucene-3.x/ws/branch_3x/common-build.xml>:362: <http://hudson.zones.apache.org/hudson/job/Lucene-3.x/ws/branch_3x/contrib/analyzers/src/java> not found.
>
> Total time: 4 minutes 24 seconds
> [TASKS] Skipping publisher since build result is FAILURE
> Publishing Javadoc
> Archiving artifacts
> Recording test results
> Publishing Clover coverage report...
> No Clover report will be published due to a Build Failure
>
>
> ---------------------------------------------------------------------
> To unsubscribe, e-mail: [hidden email]
> For additional commands, e-mail: [hidden email]
>
>

---------------------------------------------------------------------
To unsubscribe, e-mail: [hidden email]
For additional commands, e-mail: [hidden email]


Reply | Threaded
Open this post in threaded view
|

RE: Build failed in Hudson: Lucene-3.x #80

Uwe Schindler

Because hudson was dead since your commit J

 

The problem is that these build.xml files simply delegate the targets. If you import contrib.buil.xml you get wrongly defined properties and tasks that are not overridden correctly. Db and analyzers contrib (and the module in trunk) should simply delegate.

 

If I call ant inside db it builds everything correct!

 

-----

Uwe Schindler

H.-H.-Meier-Allee 63, D-28213 Bremen

http://www.thetaphi.de

eMail: [hidden email]

 

From: Shai Erera [mailto:[hidden email]]
Sent: Tuesday, August 10, 2010 12:05 PM
To: [hidden email]
Subject: Re: Build failed in Hudson: Lucene-3.x #80

 

Hmm ... I've made these changes a while ago because if you ran "ant jar" from the analyzers contrib directory, nothing happened. I thought that's a mistake, but perhaps it's not, since analyzers has 3 sub-dirs, each import contrib-build.xml. I guess same goes for 'db'. After I've noticed that (few days ago), I didn't think it's a problem to leave it that way. So if you run "ant jar" from analyzers, you get all 3 of them in one .jar, which might be convenient.

I did that few weeks ago - why does the build fail suddenly?

So should I revert it? If so, I'll keep that import commented out w/ some explanation (can you help w/ the explanation?) so that we don't repeat the same mistake in the future.

Shai

On Tue, Aug 10, 2010 at 12:16 PM, Michael McCandless <[hidden email]> wrote:

Same deal w/ this failure, except it was contrib/analyzer's build.xml
on 3x, where <import file="../contrib-build.xml"/> was added.

Mike

On Mon, Aug 9, 2010 at 7:32 PM, Apache Hudson Server
<[hidden email]> wrote:


> See <http://hudson.zones.apache.org/hudson/job/Lucene-3.x/80/changes>
>
> Changes:
>
> [rmuir] extend LuceneTestCase instead of Object here too
>
> [rmuir] SOLR-2002: add support for -Dtestmethod=xxx when running tests
>
> [rmuir] extend LuceneTestCase here instead
>
> [rmuir] SOLR-2002: change tests from TestCase to LuceneTestCase for better coverage
>
> [rmuir] LUCENE-2591: TestNLS fails with ja locale
>
> [rmuir] SOLR-2002: run tests under different timezones and locales
>
> ------------------------------------------
> [...truncated 11595 lines...]
>      [jar] Building jar: <http://hudson.zones.apache.org/hudson/job/Lucene-3.x/ws/branch_3x/build/lucene-demos-3.1-SNAPSHOT.jar>
>
> war-demo:
>      [war] Building war: <http://hudson.zones.apache.org/hudson/job/Lucene-3.x/ws/branch_3x/build/luceneweb.war>
>
> init-dist:
>    [mkdir] Created dir: <http://hudson.zones.apache.org/hudson/job/Lucene-3.x/ws/branch_3x/dist>
>    [mkdir] Created dir: <http://hudson.zones.apache.org/hudson/job/Lucene-3.x/ws/branch_3x/dist/maven>
>
> changes-to-html:
>    [mkdir] Created dir: <http://hudson.zones.apache.org/hudson/job/Lucene-3.x/ws/branch_3x/build/docs/changes>
>     [copy] Copying 3 files to <http://hudson.zones.apache.org/hudson/job/Lucene-3.x/ws/branch_3x/build/docs/changes>
>
> package:
>     [copy] Copying 1 file to <http://hudson.zones.apache.org/hudson/job/Lucene-3.x/ws/branch_3x/build>
>
> jar-src:
>      [jar] Building jar: <http://hudson.zones.apache.org/hudson/job/Lucene-3.x/ws/branch_3x/build/lucene-core-3.1-SNAPSHOT-src.jar>
>
> jar-demo-src:
>      [jar] Building jar: <http://hudson.zones.apache.org/hudson/job/Lucene-3.x/ws/branch_3x/build/lucene-demos-3.1-SNAPSHOT-src.jar>
>
> generate-maven-artifacts:
>     [copy] Copying 1 file to <http://hudson.zones.apache.org/hudson/job/Lucene-3.x/ws/branch_3x/build>
> [artifact:install-provider] Installing provider: org.apache.maven.wagon:wagon-ssh:jar:1.0-beta-2:runtime
> [artifact:deploy] Deploying to file://<http://hudson.zones.apache.org/hudson/job/Lucene-3.x/ws/branch_3x/dist/maven>
> [artifact:deploy] [INFO] Retrieving previous build number from remote
> [artifact:deploy] [INFO] repository metadata for: 'snapshot org.apache.lucene:lucene-parent:3.1-SNAPSHOT' could not be found on repository: remote, so will be created
> [artifact:deploy] Uploading: org/apache/lucene/lucene-parent/3.1-SNAPSHOT/lucene-parent-3.1-20100809.233127-1.pom to remote
> [artifact:deploy] Uploaded 3K
> [artifact:deploy] [INFO] Retrieving previous metadata from remote
> [artifact:deploy] [INFO] repository metadata for: 'artifact org.apache.lucene:lucene-parent' could not be found on repository: remote, so will be created
> [artifact:deploy] [INFO] Uploading repository metadata for: 'artifact org.apache.lucene:lucene-parent'
> [artifact:deploy] [INFO] Retrieving previous metadata from remote
> [artifact:deploy] [INFO] repository metadata for: 'snapshot org.apache.lucene:lucene-parent:3.1-SNAPSHOT' could not be found on repository: remote, so will be created
> [artifact:deploy] [INFO] Uploading repository metadata for: 'snapshot org.apache.lucene:lucene-parent:3.1-SNAPSHOT'
>     [copy] Copying 1 file to <http://hudson.zones.apache.org/hudson/job/Lucene-3.x/ws/branch_3x/build>
> [artifact:install-provider] Installing provider: org.apache.maven.wagon:wagon-ssh:jar:1.0-beta-2:runtime
> [artifact:pom] Error downloading parent pom org.apache.lucene:lucene-parent::3.1-SNAPSHOT: Missing:
> [artifact:pom] ----------
> [artifact:pom] 1) org.apache.lucene:lucene-parent:pom:3.1-SNAPSHOT
> [artifact:pom]   Path to dependency:
> [artifact:pom]          1) unspecified:unspecified:jar:0.0
> [artifact:pom]          2) org.apache.lucene:lucene-parent:pom:3.1-SNAPSHOT
> [artifact:pom]
> [artifact:pom] ----------
> [artifact:pom] 1 required artifact is missing.
> [artifact:pom]
> [artifact:pom] for artifact:
> [artifact:pom]   unspecified:unspecified:jar:0.0
> [artifact:pom]
> [artifact:pom] from the specified remote repositories:
> [artifact:pom]   central (http://repo1.maven.org/maven2)
> [artifact:deploy] Deploying to file://<http://hudson.zones.apache.org/hudson/job/Lucene-3.x/ws/branch_3x/dist/maven>
> [artifact:deploy] [INFO] Retrieving previous build number from remote
> [artifact:deploy] [INFO] repository metadata for: 'snapshot org.apache.lucene:lucene-core:3.1-SNAPSHOT' could not be found on repository: remote, so will be created
> [artifact:deploy] Uploading: org/apache/lucene/lucene-core/3.1-SNAPSHOT/lucene-core-3.1-20100809.233127-1.jar to remote
> [artifact:deploy] Uploaded 1080K
> [artifact:deploy] [INFO] Retrieving previous metadata from remote
> [artifact:deploy] [INFO] repository metadata for: 'snapshot org.apache.lucene:lucene-core:3.1-SNAPSHOT' could not be found on repository: remote, so will be created
> [artifact:deploy] [INFO] Uploading repository metadata for: 'snapshot org.apache.lucene:lucene-core:3.1-SNAPSHOT'
> [artifact:deploy] [INFO] Uploading project information for lucene-core 3.1-20100809.233127-1
> [artifact:deploy] [INFO] Retrieving previous metadata from remote
> [artifact:deploy] [INFO] repository metadata for: 'artifact org.apache.lucene:lucene-core' could not be found on repository: remote, so will be created
> [artifact:deploy] [INFO] Uploading repository metadata for: 'artifact org.apache.lucene:lucene-core'
> [artifact:deploy] [INFO] Retrieving previous build number from remote
> [artifact:deploy] Uploading: org/apache/lucene/lucene-core/3.1-SNAPSHOT/lucene-core-3.1-20100809.233127-1-sources.jar to remote
> [artifact:deploy] Uploaded 1007K
> [artifact:deploy] [INFO] Retrieving previous build number from remote
> [artifact:deploy] Uploading: org/apache/lucene/lucene-core/3.1-SNAPSHOT/lucene-core-3.1-20100809.233127-1-javadoc.jar to remote
> [artifact:deploy] Uploaded 2650K
>     [copy] Copying 1 file to <http://hudson.zones.apache.org/hudson/job/Lucene-3.x/ws/branch_3x/build>
> [artifact:install-provider] Installing provider: org.apache.maven.wagon:wagon-ssh:jar:1.0-beta-2:runtime
> [artifact:pom] Error downloading parent pom org.apache.lucene:lucene-parent::3.1-SNAPSHOT: Missing:
> [artifact:pom] ----------
> [artifact:pom] 1) org.apache.lucene:lucene-parent:pom:3.1-SNAPSHOT
> [artifact:pom]   Path to dependency:
> [artifact:pom]          1) unspecified:unspecified:jar:0.0
> [artifact:pom]          2) org.apache.lucene:lucene-parent:pom:3.1-SNAPSHOT
> [artifact:pom]
> [artifact:pom] ----------
> [artifact:pom] 1 required artifact is missing.
> [artifact:pom]
> [artifact:pom] for artifact:
> [artifact:pom]   unspecified:unspecified:jar:0.0
> [artifact:pom]
> [artifact:pom] from the specified remote repositories:
> [artifact:pom]   central (http://repo1.maven.org/maven2)
> [artifact:deploy] Deploying to file://<http://hudson.zones.apache.org/hudson/job/Lucene-3.x/ws/branch_3x/dist/maven>
> [artifact:deploy] [INFO] Retrieving previous build number from remote
> [artifact:deploy] [INFO] repository metadata for: 'snapshot org.apache.lucene:lucene-demos:3.1-SNAPSHOT' could not be found on repository: remote, so will be created
> [artifact:deploy] Uploading: org/apache/lucene/lucene-demos/3.1-SNAPSHOT/lucene-demos-3.1-20100809.233127-1.jar to remote
> [artifact:deploy] Uploaded 57K
> [artifact:deploy] [INFO] Retrieving previous metadata from remote
> [artifact:deploy] [INFO] repository metadata for: 'artifact org.apache.lucene:lucene-demos' could not be found on repository: remote, so will be created
> [artifact:deploy] [INFO] Uploading repository metadata for: 'artifact org.apache.lucene:lucene-demos'
> [artifact:deploy] [INFO] Retrieving previous metadata from remote
> [artifact:deploy] [INFO] repository metadata for: 'snapshot org.apache.lucene:lucene-demos:3.1-SNAPSHOT' could not be found on repository: remote, so will be created
> [artifact:deploy] [INFO] Uploading repository metadata for: 'snapshot org.apache.lucene:lucene-demos:3.1-SNAPSHOT'
> [artifact:deploy] [INFO] Uploading project information for lucene-demos 3.1-20100809.233127-1
> [artifact:deploy] [INFO] Retrieving previous build number from remote
> [artifact:deploy] Uploading: org/apache/lucene/lucene-demos/3.1-SNAPSHOT/lucene-demos-3.1-20100809.233127-1-sources.jar to remote
> [artifact:deploy] Uploaded 48K
> [artifact:deploy] [INFO] Retrieving previous build number from remote
> [artifact:deploy] Uploading: org/apache/lucene/lucene-demos/3.1-SNAPSHOT/lucene-demos-3.1-20100809.233127-1-javadoc.jar to remote
> [artifact:deploy] Uploaded 115K
>     [copy] Copying 1 file to <http://hudson.zones.apache.org/hudson/job/Lucene-3.x/ws/branch_3x/build>
> [artifact:install-provider] Installing provider: org.apache.maven.wagon:wagon-ssh:jar:1.0-beta-2:runtime
> [artifact:pom] Error downloading parent pom org.apache.lucene:lucene-parent::3.1-SNAPSHOT: Missing:
> [artifact:pom] ----------
> [artifact:pom] 1) org.apache.lucene:lucene-parent:pom:3.1-SNAPSHOT
> [artifact:pom]   Path to dependency:
> [artifact:pom]          1) unspecified:unspecified:jar:0.0
> [artifact:pom]          2) org.apache.lucene:lucene-parent:pom:3.1-SNAPSHOT
> [artifact:pom]
> [artifact:pom] ----------
> [artifact:pom] 1 required artifact is missing.
> [artifact:pom]
> [artifact:pom] for artifact:
> [artifact:pom]   unspecified:unspecified:jar:0.0
> [artifact:pom]
> [artifact:pom] from the specified remote repositories:
> [artifact:pom]   central (http://repo1.maven.org/maven2)
> [artifact:deploy] Deploying to file://<http://hudson.zones.apache.org/hudson/job/Lucene-3.x/ws/branch_3x/dist/maven>
> [artifact:deploy] [INFO] Retrieving previous build number from remote
> [artifact:deploy] [INFO] repository metadata for: 'snapshot org.apache.lucene:lucene-contrib:3.1-SNAPSHOT' could not be found on repository: remote, so will be created
> [artifact:deploy] Uploading: org/apache/lucene/lucene-contrib/3.1-SNAPSHOT/lucene-contrib-3.1-20100809.233127-1.pom to remote
> [artifact:deploy] Uploaded 2K
> [artifact:deploy] [INFO] Retrieving previous metadata from remote
> [artifact:deploy] [INFO] repository metadata for: 'snapshot org.apache.lucene:lucene-contrib:3.1-SNAPSHOT' could not be found on repository: remote, so will be created
> [artifact:deploy] [INFO] Uploading repository metadata for: 'snapshot org.apache.lucene:lucene-contrib:3.1-SNAPSHOT'
> [artifact:deploy] [INFO] Retrieving previous metadata from remote
> [artifact:deploy] [INFO] repository metadata for: 'artifact org.apache.lucene:lucene-contrib' could not be found on repository: remote, so will be created
> [artifact:deploy] [INFO] Uploading repository metadata for: 'artifact org.apache.lucene:lucene-contrib'
>     [echo] Building analyzers...
>
> common:
>     [echo] Building analyzers...
>
> jflex-uptodate-check:
>
> jflex-notice:
>
> common.init:
>
> build-lucene:
>
> init:
>
> clover.setup:
>
> clover.info:
>
> clover:
>
> common.compile-core:
>
> compile-core:
>
> jar-core:
>      [jar] Building jar: <http://hudson.zones.apache.org/hudson/job/Lucene-3.x/ws/branch_3x/build/contrib/analyzers/lucene-analyzers-3.1-SNAPSHOT.jar>
>
> default:
>
> smartcn:
>     [echo] Building smartcn...
>
> common.init:
>
> build-lucene:
>
> init:
>
> clover.setup:
>
> clover.info:
>
> clover:
>
> compile-core:
>
> jar-core:
>      [jar] Building jar: <http://hudson.zones.apache.org/hudson/job/Lucene-3.x/ws/branch_3x/build/contrib/analyzers/lucene-analyzers-3.1-SNAPSHOT.jar>
>
> default:
>
> stempel:
>     [echo] Building stempel...
>
> common.init:
>
> build-lucene:
>
> init:
>
> clover.setup:
>
> clover.info:
>
> clover:
>
> compile-core:
>
> jar-core:
>      [jar] Building jar: <http://hudson.zones.apache.org/hudson/job/Lucene-3.x/ws/branch_3x/build/contrib/analyzers/lucene-analyzers-3.1-SNAPSHOT.jar>
>
> default:
>
> default:
>
> dist-maven:
>     [echo] Building analyzers...
>
> jflex-uptodate-check:
>
> jflex-notice:
>
> common.init:
>
> build-lucene:
>
> init:
>
> clover.setup:
>
> clover.info:
>
> clover:
>
> common.compile-core:
>
> compile-core:
>
> jar-src:
>
> BUILD FAILED
> <http://hudson.zones.apache.org/hudson/job/Lucene-3.x/ws/branch_3x/build.xml>:521: The following error occurred while executing this line:
> <http://hudson.zones.apache.org/hudson/job/Lucene-3.x/ws/branch_3x/build.xml>:655: The following error occurred while executing this line:
> <http://hudson.zones.apache.org/hudson/job/Lucene-3.x/ws/branch_3x/contrib/analyzers/build.xml>:69: The following error occurred while executing this line:
> <http://hudson.zones.apache.org/hudson/job/Lucene-3.x/ws/branch_3x/common-build.xml>:603: The following error occurred while executing this line:
> <http://hudson.zones.apache.org/hudson/job/Lucene-3.x/ws/branch_3x/common-build.xml>:362: <http://hudson.zones.apache.org/hudson/job/Lucene-3.x/ws/branch_3x/contrib/analyzers/src/java> not found.
>
> Total time: 4 minutes 24 seconds
> [TASKS] Skipping publisher since build result is FAILURE
> Publishing Javadoc
> Archiving artifacts
> Recording test results
> Publishing Clover coverage report...
> No Clover report will be published due to a Build Failure
>
>
> ---------------------------------------------------------------------
> To unsubscribe, e-mail: [hidden email]
> For additional commands, e-mail: [hidden email]
>
>

---------------------------------------------------------------------
To unsubscribe, e-mail: [hidden email]
For additional commands, e-mail: [hidden email]

 

Reply | Threaded
Open this post in threaded view
|

Re: Build failed in Hudson: Lucene-3.x #80

Shai Erera
I understand that.

BTW, I upped and ran the following:

Ran "ant jar" from both contrib/analyzers and contrib/db, and got the following:
-------------------------------
Buildfile: build.xml

BUILD FAILED
Target "jar" does not exist in the project "analyzers".
Total time: 0 seconds
--------------------------------
And,
--------------------------------
Buildfile: build.xml

BUILD FAILED
Target "jar" does not exist in the project "db".

Total time: 0 seconds
--------------------------------

So you cannot really run "ant jar" from these directories. It'd be great if their build.xml declared a "jar" target and delegated to its subs properly, rather than me running it from each of them. We can do that w/ or w/o importing from contrib-build.xml

Shai

On Tue, Aug 10, 2010 at 1:09 PM, Uwe Schindler <[hidden email]> wrote:

Because hudson was dead since your commit J

 

The problem is that these build.xml files simply delegate the targets. If you import contrib.buil.xml you get wrongly defined properties and tasks that are not overridden correctly. Db and analyzers contrib (and the module in trunk) should simply delegate.

 

If I call ant inside db it builds everything correct!

 

-----

Uwe Schindler

H.-H.-Meier-Allee 63, D-28213 Bremen

http://www.thetaphi.de

eMail: [hidden email]

 

From: Shai Erera [mailto:[hidden email]]
Sent: Tuesday, August 10, 2010 12:05 PM
To: [hidden email]
Subject: Re: Build failed in Hudson: Lucene-3.x #80

 

Hmm ... I've made these changes a while ago because if you ran "ant jar" from the analyzers contrib directory, nothing happened. I thought that's a mistake, but perhaps it's not, since analyzers has 3 sub-dirs, each import contrib-build.xml. I guess same goes for 'db'. After I've noticed that (few days ago), I didn't think it's a problem to leave it that way. So if you run "ant jar" from analyzers, you get all 3 of them in one .jar, which might be convenient.

I did that few weeks ago - why does the build fail suddenly?

So should I revert it? If so, I'll keep that import commented out w/ some explanation (can you help w/ the explanation?) so that we don't repeat the same mistake in the future.

Shai

On Tue, Aug 10, 2010 at 12:16 PM, Michael McCandless <[hidden email]> wrote:

Same deal w/ this failure, except it was contrib/analyzer's build.xml
on 3x, where <import file="../contrib-build.xml"/> was added.

Mike

On Mon, Aug 9, 2010 at 7:32 PM, Apache Hudson Server
<[hidden email]> wrote:
> See <http://hudson.zones.apache.org/hudson/job/Lucene-3.x/80/changes>
>
> Changes:
>
> [rmuir] extend LuceneTestCase instead of Object here too
>
> [rmuir] SOLR-2002: add support for -Dtestmethod=xxx when running tests
>
> [rmuir] extend LuceneTestCase here instead
>
> [rmuir] SOLR-2002: change tests from TestCase to LuceneTestCase for better coverage
>
> [rmuir] LUCENE-2591: TestNLS fails with ja locale
>
> [rmuir] SOLR-2002: run tests under different timezones and locales
>
> ------------------------------------------
> [...truncated 11595 lines...]
>      [jar] Building jar: <http://hudson.zones.apache.org/hudson/job/Lucene-3.x/ws/branch_3x/build/lucene-demos-3.1-SNAPSHOT.jar>
>
> war-demo:
>      [war] Building war: <http://hudson.zones.apache.org/hudson/job/Lucene-3.x/ws/branch_3x/build/luceneweb.war>
>
> init-dist:
>    [mkdir] Created dir: <http://hudson.zones.apache.org/hudson/job/Lucene-3.x/ws/branch_3x/dist>
>    [mkdir] Created dir: <http://hudson.zones.apache.org/hudson/job/Lucene-3.x/ws/branch_3x/dist/maven>
>
> changes-to-html:
>    [mkdir] Created dir: <http://hudson.zones.apache.org/hudson/job/Lucene-3.x/ws/branch_3x/build/docs/changes>
>     [copy] Copying 3 files to <http://hudson.zones.apache.org/hudson/job/Lucene-3.x/ws/branch_3x/build/docs/changes>
>
> package:
>     [copy] Copying 1 file to <http://hudson.zones.apache.org/hudson/job/Lucene-3.x/ws/branch_3x/build>
>
> jar-src:
>      [jar] Building jar: <http://hudson.zones.apache.org/hudson/job/Lucene-3.x/ws/branch_3x/build/lucene-core-3.1-SNAPSHOT-src.jar>
>
> jar-demo-src:
>      [jar] Building jar: <http://hudson.zones.apache.org/hudson/job/Lucene-3.x/ws/branch_3x/build/lucene-demos-3.1-SNAPSHOT-src.jar>
>
> generate-maven-artifacts:
>     [copy] Copying 1 file to <http://hudson.zones.apache.org/hudson/job/Lucene-3.x/ws/branch_3x/build>
> [artifact:install-provider] Installing provider: org.apache.maven.wagon:wagon-ssh:jar:1.0-beta-2:runtime
> [artifact:deploy] Deploying to file://<http://hudson.zones.apache.org/hudson/job/Lucene-3.x/ws/branch_3x/dist/maven>
> [artifact:deploy] [INFO] Retrieving previous build number from remote
> [artifact:deploy] [INFO] repository metadata for: 'snapshot org.apache.lucene:lucene-parent:3.1-SNAPSHOT' could not be found on repository: remote, so will be created
> [artifact:deploy] Uploading: org/apache/lucene/lucene-parent/3.1-SNAPSHOT/lucene-parent-3.1-20100809.233127-1.pom to remote
> [artifact:deploy] Uploaded 3K
> [artifact:deploy] [INFO] Retrieving previous metadata from remote
> [artifact:deploy] [INFO] repository metadata for: 'artifact org.apache.lucene:lucene-parent' could not be found on repository: remote, so will be created
> [artifact:deploy] [INFO] Uploading repository metadata for: 'artifact org.apache.lucene:lucene-parent'
> [artifact:deploy] [INFO] Retrieving previous metadata from remote
> [artifact:deploy] [INFO] repository metadata for: 'snapshot org.apache.lucene:lucene-parent:3.1-SNAPSHOT' could not be found on repository: remote, so will be created
> [artifact:deploy] [INFO] Uploading repository metadata for: 'snapshot org.apache.lucene:lucene-parent:3.1-SNAPSHOT'
>     [copy] Copying 1 file to <http://hudson.zones.apache.org/hudson/job/Lucene-3.x/ws/branch_3x/build>
> [artifact:install-provider] Installing provider: org.apache.maven.wagon:wagon-ssh:jar:1.0-beta-2:runtime
> [artifact:pom] Error downloading parent pom org.apache.lucene:lucene-parent::3.1-SNAPSHOT: Missing:
> [artifact:pom] ----------
> [artifact:pom] 1) org.apache.lucene:lucene-parent:pom:3.1-SNAPSHOT
> [artifact:pom]   Path to dependency:
> [artifact:pom]          1) unspecified:unspecified:jar:0.0
> [artifact:pom]          2) org.apache.lucene:lucene-parent:pom:3.1-SNAPSHOT
> [artifact:pom]
> [artifact:pom] ----------
> [artifact:pom] 1 required artifact is missing.
> [artifact:pom]
> [artifact:pom] for artifact:
> [artifact:pom]   unspecified:unspecified:jar:0.0
> [artifact:pom]
> [artifact:pom] from the specified remote repositories:
> [artifact:pom]   central (http://repo1.maven.org/maven2)
> [artifact:deploy] Deploying to file://<http://hudson.zones.apache.org/hudson/job/Lucene-3.x/ws/branch_3x/dist/maven>
> [artifact:deploy] [INFO] Retrieving previous build number from remote
> [artifact:deploy] [INFO] repository metadata for: 'snapshot org.apache.lucene:lucene-core:3.1-SNAPSHOT' could not be found on repository: remote, so will be created
> [artifact:deploy] Uploading: org/apache/lucene/lucene-core/3.1-SNAPSHOT/lucene-core-3.1-20100809.233127-1.jar to remote
> [artifact:deploy] Uploaded 1080K
> [artifact:deploy] [INFO] Retrieving previous metadata from remote
> [artifact:deploy] [INFO] repository metadata for: 'snapshot org.apache.lucene:lucene-core:3.1-SNAPSHOT' could not be found on repository: remote, so will be created
> [artifact:deploy] [INFO] Uploading repository metadata for: 'snapshot org.apache.lucene:lucene-core:3.1-SNAPSHOT'
> [artifact:deploy] [INFO] Uploading project information for lucene-core 3.1-20100809.233127-1
> [artifact:deploy] [INFO] Retrieving previous metadata from remote
> [artifact:deploy] [INFO] repository metadata for: 'artifact org.apache.lucene:lucene-core' could not be found on repository: remote, so will be created
> [artifact:deploy] [INFO] Uploading repository metadata for: 'artifact org.apache.lucene:lucene-core'
> [artifact:deploy] [INFO] Retrieving previous build number from remote
> [artifact:deploy] Uploading: org/apache/lucene/lucene-core/3.1-SNAPSHOT/lucene-core-3.1-20100809.233127-1-sources.jar to remote
> [artifact:deploy] Uploaded 1007K
> [artifact:deploy] [INFO] Retrieving previous build number from remote
> [artifact:deploy] Uploading: org/apache/lucene/lucene-core/3.1-SNAPSHOT/lucene-core-3.1-20100809.233127-1-javadoc.jar to remote
> [artifact:deploy] Uploaded 2650K
>     [copy] Copying 1 file to <http://hudson.zones.apache.org/hudson/job/Lucene-3.x/ws/branch_3x/build>
> [artifact:install-provider] Installing provider: org.apache.maven.wagon:wagon-ssh:jar:1.0-beta-2:runtime
> [artifact:pom] Error downloading parent pom org.apache.lucene:lucene-parent::3.1-SNAPSHOT: Missing:
> [artifact:pom] ----------
> [artifact:pom] 1) org.apache.lucene:lucene-parent:pom:3.1-SNAPSHOT
> [artifact:pom]   Path to dependency:
> [artifact:pom]          1) unspecified:unspecified:jar:0.0
> [artifact:pom]          2) org.apache.lucene:lucene-parent:pom:3.1-SNAPSHOT
> [artifact:pom]
> [artifact:pom] ----------
> [artifact:pom] 1 required artifact is missing.
> [artifact:pom]
> [artifact:pom] for artifact:
> [artifact:pom]   unspecified:unspecified:jar:0.0
> [artifact:pom]
> [artifact:pom] from the specified remote repositories:
> [artifact:pom]   central (http://repo1.maven.org/maven2)
> [artifact:deploy] Deploying to file://<http://hudson.zones.apache.org/hudson/job/Lucene-3.x/ws/branch_3x/dist/maven>
> [artifact:deploy] [INFO] Retrieving previous build number from remote
> [artifact:deploy] [INFO] repository metadata for: 'snapshot org.apache.lucene:lucene-demos:3.1-SNAPSHOT' could not be found on repository: remote, so will be created
> [artifact:deploy] Uploading: org/apache/lucene/lucene-demos/3.1-SNAPSHOT/lucene-demos-3.1-20100809.233127-1.jar to remote
> [artifact:deploy] Uploaded 57K
> [artifact:deploy] [INFO] Retrieving previous metadata from remote
> [artifact:deploy] [INFO] repository metadata for: 'artifact org.apache.lucene:lucene-demos' could not be found on repository: remote, so will be created
> [artifact:deploy] [INFO] Uploading repository metadata for: 'artifact org.apache.lucene:lucene-demos'
> [artifact:deploy] [INFO] Retrieving previous metadata from remote
> [artifact:deploy] [INFO] repository metadata for: 'snapshot org.apache.lucene:lucene-demos:3.1-SNAPSHOT' could not be found on repository: remote, so will be created
> [artifact:deploy] [INFO] Uploading repository metadata for: 'snapshot org.apache.lucene:lucene-demos:3.1-SNAPSHOT'
> [artifact:deploy] [INFO] Uploading project information for lucene-demos 3.1-20100809.233127-1
> [artifact:deploy] [INFO] Retrieving previous build number from remote
> [artifact:deploy] Uploading: org/apache/lucene/lucene-demos/3.1-SNAPSHOT/lucene-demos-3.1-20100809.233127-1-sources.jar to remote
> [artifact:deploy] Uploaded 48K
> [artifact:deploy] [INFO] Retrieving previous build number from remote
> [artifact:deploy] Uploading: org/apache/lucene/lucene-demos/3.1-SNAPSHOT/lucene-demos-3.1-20100809.233127-1-javadoc.jar to remote
> [artifact:deploy] Uploaded 115K
>     [copy] Copying 1 file to <http://hudson.zones.apache.org/hudson/job/Lucene-3.x/ws/branch_3x/build>
> [artifact:install-provider] Installing provider: org.apache.maven.wagon:wagon-ssh:jar:1.0-beta-2:runtime
> [artifact:pom] Error downloading parent pom org.apache.lucene:lucene-parent::3.1-SNAPSHOT: Missing:
> [artifact:pom] ----------
> [artifact:pom] 1) org.apache.lucene:lucene-parent:pom:3.1-SNAPSHOT
> [artifact:pom]   Path to dependency:
> [artifact:pom]          1) unspecified:unspecified:jar:0.0
> [artifact:pom]          2) org.apache.lucene:lucene-parent:pom:3.1-SNAPSHOT
> [artifact:pom]
> [artifact:pom] ----------
> [artifact:pom] 1 required artifact is missing.
> [artifact:pom]
> [artifact:pom] for artifact:
> [artifact:pom]   unspecified:unspecified:jar:0.0
> [artifact:pom]
> [artifact:pom] from the specified remote repositories:
> [artifact:pom]   central (http://repo1.maven.org/maven2)
> [artifact:deploy] Deploying to file://<http://hudson.zones.apache.org/hudson/job/Lucene-3.x/ws/branch_3x/dist/maven>
> [artifact:deploy] [INFO] Retrieving previous build number from remote
> [artifact:deploy] [INFO] repository metadata for: 'snapshot org.apache.lucene:lucene-contrib:3.1-SNAPSHOT' could not be found on repository: remote, so will be created
> [artifact:deploy] Uploading: org/apache/lucene/lucene-contrib/3.1-SNAPSHOT/lucene-contrib-3.1-20100809.233127-1.pom to remote
> [artifact:deploy] Uploaded 2K
> [artifact:deploy] [INFO] Retrieving previous metadata from remote
> [artifact:deploy] [INFO] repository metadata for: 'snapshot org.apache.lucene:lucene-contrib:3.1-SNAPSHOT' could not be found on repository: remote, so will be created
> [artifact:deploy] [INFO] Uploading repository metadata for: 'snapshot org.apache.lucene:lucene-contrib:3.1-SNAPSHOT'
> [artifact:deploy] [INFO] Retrieving previous metadata from remote
> [artifact:deploy] [INFO] repository metadata for: 'artifact org.apache.lucene:lucene-contrib' could not be found on repository: remote, so will be created
> [artifact:deploy] [INFO] Uploading repository metadata for: 'artifact org.apache.lucene:lucene-contrib'
>     [echo] Building analyzers...
>
> common:
>     [echo] Building analyzers...
>


> jflex-uptodate-check:
>
> jflex-notice:
>
> common.init:
>
> build-lucene:
>
> init:
>
> clover.setup:
>
> clover.info:
>
> clover:
>
> common.compile-core:
>
> compile-core:
>
> jar-core:
>      [jar] Building jar: <http://hudson.zones.apache.org/hudson/job/Lucene-3.x/ws/branch_3x/build/contrib/analyzers/lucene-analyzers-3.1-SNAPSHOT.jar>
>

> default:
>
> smartcn:
>     [echo] Building smartcn...
>
> common.init:
>
> build-lucene:
>
> init:
>
> clover.setup:
>
> clover.info:
>
> clover:
>
> compile-core:
>
> jar-core:
>      [jar] Building jar: <http://hudson.zones.apache.org/hudson/job/Lucene-3.x/ws/branch_3x/build/contrib/analyzers/lucene-analyzers-3.1-SNAPSHOT.jar>
>

> default:
>
> stempel:
>     [echo] Building stempel...
>
> common.init:
>
> build-lucene:
>
> init:
>
> clover.setup:
>
> clover.info:
>
> clover:
>
> compile-core:
>
> jar-core:
>      [jar] Building jar: <http://hudson.zones.apache.org/hudson/job/Lucene-3.x/ws/branch_3x/build/contrib/analyzers/lucene-analyzers-3.1-SNAPSHOT.jar>
>

> default:
>
> default:
>
> dist-maven:
>     [echo] Building analyzers...
>
> jflex-uptodate-check:
>
> jflex-notice:
>
> common.init:
>
> build-lucene:

>
> init:
>
> clover.setup:
>
> clover.info:
>
> clover:
>
> common.compile-core:
>
> compile-core:
>
> jar-src:
>
> BUILD FAILED
> <http://hudson.zones.apache.org/hudson/job/Lucene-3.x/ws/branch_3x/build.xml>:521: The following error occurred while executing this line:
> <http://hudson.zones.apache.org/hudson/job/Lucene-3.x/ws/branch_3x/build.xml>:655: The following error occurred while executing this line:
> <http://hudson.zones.apache.org/hudson/job/Lucene-3.x/ws/branch_3x/contrib/analyzers/build.xml>:69: The following error occurred while executing this line:
> <http://hudson.zones.apache.org/hudson/job/Lucene-3.x/ws/branch_3x/common-build.xml>:603: The following error occurred while executing this line:
> <http://hudson.zones.apache.org/hudson/job/Lucene-3.x/ws/branch_3x/common-build.xml>:362: <http://hudson.zones.apache.org/hudson/job/Lucene-3.x/ws/branch_3x/contrib/analyzers/src/java> not found.
>
> Total time: 4 minutes 24 seconds
> [TASKS] Skipping publisher since build result is FAILURE
> Publishing Javadoc
> Archiving artifacts
> Recording test results
> Publishing Clover coverage report...
> No Clover report will be published due to a Build Failure
>
>
> ---------------------------------------------------------------------
> To unsubscribe, e-mail: [hidden email]
> For additional commands, e-mail: [hidden email]
>
>

---------------------------------------------------------------------
To unsubscribe, e-mail: [hidden email]
For additional commands, e-mail: [hidden email]

 


Reply | Threaded
Open this post in threaded view
|

RE: Build failed in Hudson: Lucene-3.x #80

Uwe Schindler

Ah,

 

jar is not delegated. To make this work you have top copypaste in build.xml and delegate to the subdirs (like the other targets). But “ant jar” is not really needed for development puposes here. I would keep it as it is for now.

 

Uwe

 

-----

Uwe Schindler

H.-H.-Meier-Allee 63, D-28213 Bremen

http://www.thetaphi.de

eMail: [hidden email]

 

From: Shai Erera [mailto:[hidden email]]
Sent: Tuesday, August 10, 2010 12:18 PM
To: [hidden email]
Subject: Re: Build failed in Hudson: Lucene-3.x #80

 

I understand that.

BTW, I upped and ran the following:

Ran "ant jar" from both contrib/analyzers and contrib/db, and got the following:
-------------------------------
Buildfile: build.xml

BUILD FAILED
Target "jar" does not exist in the project "analyzers".
Total time: 0 seconds
--------------------------------
And,
--------------------------------
Buildfile: build.xml

BUILD FAILED
Target "jar" does not exist in the project "db".

Total time: 0 seconds
--------------------------------

So you cannot really run "ant jar" from these directories. It'd be great if their build.xml declared a "jar" target and delegated to its subs properly, rather than me running it from each of them. We can do that w/ or w/o importing from contrib-build.xml

Shai

On Tue, Aug 10, 2010 at 1:09 PM, Uwe Schindler <[hidden email]> wrote:

Because hudson was dead since your commit J

 

The problem is that these build.xml files simply delegate the targets. If you import contrib.buil.xml you get wrongly defined properties and tasks that are not overridden correctly. Db and analyzers contrib (and the module in trunk) should simply delegate.

 

If I call ant inside db it builds everything correct!

 

-----

Uwe Schindler

H.-H.-Meier-Allee 63, D-28213 Bremen

http://www.thetaphi.de

eMail: [hidden email]

 

From: Shai Erera [mailto:[hidden email]]
Sent: Tuesday, August 10, 2010 12:05 PM
To: [hidden email]
Subject: Re: Build failed in Hudson: Lucene-3.x #80

 

Hmm ... I've made these changes a while ago because if you ran "ant jar" from the analyzers contrib directory, nothing happened. I thought that's a mistake, but perhaps it's not, since analyzers has 3 sub-dirs, each import contrib-build.xml. I guess same goes for 'db'. After I've noticed that (few days ago), I didn't think it's a problem to leave it that way. So if you run "ant jar" from analyzers, you get all 3 of them in one .jar, which might be convenient.

I did that few weeks ago - why does the build fail suddenly?

So should I revert it? If so, I'll keep that import commented out w/ some explanation (can you help w/ the explanation?) so that we don't repeat the same mistake in the future.

Shai

On Tue, Aug 10, 2010 at 12:16 PM, Michael McCandless <[hidden email]> wrote:

Same deal w/ this failure, except it was contrib/analyzer's build.xml
on 3x, where <import file="../contrib-build.xml"/> was added.

Mike

On Mon, Aug 9, 2010 at 7:32 PM, Apache Hudson Server
<[hidden email]> wrote:


> See <http://hudson.zones.apache.org/hudson/job/Lucene-3.x/80/changes>
>
> Changes:
>
> [rmuir] extend LuceneTestCase instead of Object here too
>
> [rmuir] SOLR-2002: add support for -Dtestmethod=xxx when running tests
>
> [rmuir] extend LuceneTestCase here instead
>
> [rmuir] SOLR-2002: change tests from TestCase to LuceneTestCase for better coverage
>
> [rmuir] LUCENE-2591: TestNLS fails with ja locale
>
> [rmuir] SOLR-2002: run tests under different timezones and locales
>
> ------------------------------------------
> [...truncated 11595 lines...]
>      [jar] Building jar: <http://hudson.zones.apache.org/hudson/job/Lucene-3.x/ws/branch_3x/build/lucene-demos-3.1-SNAPSHOT.jar>
>
> war-demo:
>      [war] Building war: <http://hudson.zones.apache.org/hudson/job/Lucene-3.x/ws/branch_3x/build/luceneweb.war>
>
> init-dist:
>    [mkdir] Created dir: <http://hudson.zones.apache.org/hudson/job/Lucene-3.x/ws/branch_3x/dist>
>    [mkdir] Created dir: <http://hudson.zones.apache.org/hudson/job/Lucene-3.x/ws/branch_3x/dist/maven>
>
> changes-to-html:
>    [mkdir] Created dir: <http://hudson.zones.apache.org/hudson/job/Lucene-3.x/ws/branch_3x/build/docs/changes>
>     [copy] Copying 3 files to <http://hudson.zones.apache.org/hudson/job/Lucene-3.x/ws/branch_3x/build/docs/changes>
>
> package:
>     [copy] Copying 1 file to <http://hudson.zones.apache.org/hudson/job/Lucene-3.x/ws/branch_3x/build>
>
> jar-src:
>      [jar] Building jar: <http://hudson.zones.apache.org/hudson/job/Lucene-3.x/ws/branch_3x/build/lucene-core-3.1-SNAPSHOT-src.jar>
>
> jar-demo-src:
>      [jar] Building jar: <http://hudson.zones.apache.org/hudson/job/Lucene-3.x/ws/branch_3x/build/lucene-demos-3.1-SNAPSHOT-src.jar>
>
> generate-maven-artifacts:
>     [copy] Copying 1 file to <http://hudson.zones.apache.org/hudson/job/Lucene-3.x/ws/branch_3x/build>
> [artifact:install-provider] Installing provider: org.apache.maven.wagon:wagon-ssh:jar:1.0-beta-2:runtime
> [artifact:deploy] Deploying to file://<http://hudson.zones.apache.org/hudson/job/Lucene-3.x/ws/branch_3x/dist/maven>
> [artifact:deploy] [INFO] Retrieving previous build number from remote
> [artifact:deploy] [INFO] repository metadata for: 'snapshot org.apache.lucene:lucene-parent:3.1-SNAPSHOT' could not be found on repository: remote, so will be created
> [artifact:deploy] Uploading: org/apache/lucene/lucene-parent/3.1-SNAPSHOT/lucene-parent-3.1-20100809.233127-1.pom to remote
> [artifact:deploy] Uploaded 3K
> [artifact:deploy] [INFO] Retrieving previous metadata from remote
> [artifact:deploy] [INFO] repository metadata for: 'artifact org.apache.lucene:lucene-parent' could not be found on repository: remote, so will be created
> [artifact:deploy] [INFO] Uploading repository metadata for: 'artifact org.apache.lucene:lucene-parent'
> [artifact:deploy] [INFO] Retrieving previous metadata from remote
> [artifact:deploy] [INFO] repository metadata for: 'snapshot org.apache.lucene:lucene-parent:3.1-SNAPSHOT' could not be found on repository: remote, so will be created
> [artifact:deploy] [INFO] Uploading repository metadata for: 'snapshot org.apache.lucene:lucene-parent:3.1-SNAPSHOT'
>     [copy] Copying 1 file to <http://hudson.zones.apache.org/hudson/job/Lucene-3.x/ws/branch_3x/build>
> [artifact:install-provider] Installing provider: org.apache.maven.wagon:wagon-ssh:jar:1.0-beta-2:runtime
> [artifact:pom] Error downloading parent pom org.apache.lucene:lucene-parent::3.1-SNAPSHOT: Missing:
> [artifact:pom] ----------
> [artifact:pom] 1) org.apache.lucene:lucene-parent:pom:3.1-SNAPSHOT
> [artifact:pom]   Path to dependency:
> [artifact:pom]          1) unspecified:unspecified:jar:0.0
> [artifact:pom]          2) org.apache.lucene:lucene-parent:pom:3.1-SNAPSHOT
> [artifact:pom]
> [artifact:pom] ----------
> [artifact:pom] 1 required artifact is missing.
> [artifact:pom]
> [artifact:pom] for artifact:
> [artifact:pom]   unspecified:unspecified:jar:0.0
> [artifact:pom]
> [artifact:pom] from the specified remote repositories:
> [artifact:pom]   central (http://repo1.maven.org/maven2)
> [artifact:deploy] Deploying to file://<http://hudson.zones.apache.org/hudson/job/Lucene-3.x/ws/branch_3x/dist/maven>
> [artifact:deploy] [INFO] Retrieving previous build number from remote
> [artifact:deploy] [INFO] repository metadata for: 'snapshot org.apache.lucene:lucene-core:3.1-SNAPSHOT' could not be found on repository: remote, so will be created
> [artifact:deploy] Uploading: org/apache/lucene/lucene-core/3.1-SNAPSHOT/lucene-core-3.1-20100809.233127-1.jar to remote
> [artifact:deploy] Uploaded 1080K
> [artifact:deploy] [INFO] Retrieving previous metadata from remote
> [artifact:deploy] [INFO] repository metadata for: 'snapshot org.apache.lucene:lucene-core:3.1-SNAPSHOT' could not be found on repository: remote, so will be created
> [artifact:deploy] [INFO] Uploading repository metadata for: 'snapshot org.apache.lucene:lucene-core:3.1-SNAPSHOT'
> [artifact:deploy] [INFO] Uploading project information for lucene-core 3.1-20100809.233127-1
> [artifact:deploy] [INFO] Retrieving previous metadata from remote
> [artifact:deploy] [INFO] repository metadata for: 'artifact org.apache.lucene:lucene-core' could not be found on repository: remote, so will be created
> [artifact:deploy] [INFO] Uploading repository metadata for: 'artifact org.apache.lucene:lucene-core'
> [artifact:deploy] [INFO] Retrieving previous build number from remote
> [artifact:deploy] Uploading: org/apache/lucene/lucene-core/3.1-SNAPSHOT/lucene-core-3.1-20100809.233127-1-sources.jar to remote
> [artifact:deploy] Uploaded 1007K
> [artifact:deploy] [INFO] Retrieving previous build number from remote
> [artifact:deploy] Uploading: org/apache/lucene/lucene-core/3.1-SNAPSHOT/lucene-core-3.1-20100809.233127-1-javadoc.jar to remote
> [artifact:deploy] Uploaded 2650K
>     [copy] Copying 1 file to <http://hudson.zones.apache.org/hudson/job/Lucene-3.x/ws/branch_3x/build>
> [artifact:install-provider] Installing provider: org.apache.maven.wagon:wagon-ssh:jar:1.0-beta-2:runtime
> [artifact:pom] Error downloading parent pom org.apache.lucene:lucene-parent::3.1-SNAPSHOT: Missing:
> [artifact:pom] ----------
> [artifact:pom] 1) org.apache.lucene:lucene-parent:pom:3.1-SNAPSHOT
> [artifact:pom]   Path to dependency:
> [artifact:pom]          1) unspecified:unspecified:jar:0.0
> [artifact:pom]          2) org.apache.lucene:lucene-parent:pom:3.1-SNAPSHOT
> [artifact:pom]
> [artifact:pom] ----------
> [artifact:pom] 1 required artifact is missing.
> [artifact:pom]
> [artifact:pom] for artifact:
> [artifact:pom]   unspecified:unspecified:jar:0.0
> [artifact:pom]
> [artifact:pom] from the specified remote repositories:
> [artifact:pom]   central (http://repo1.maven.org/maven2)
> [artifact:deploy] Deploying to file://<http://hudson.zones.apache.org/hudson/job/Lucene-3.x/ws/branch_3x/dist/maven>
> [artifact:deploy] [INFO] Retrieving previous build number from remote
> [artifact:deploy] [INFO] repository metadata for: 'snapshot org.apache.lucene:lucene-demos:3.1-SNAPSHOT' could not be found on repository: remote, so will be created
> [artifact:deploy] Uploading: org/apache/lucene/lucene-demos/3.1-SNAPSHOT/lucene-demos-3.1-20100809.233127-1.jar to remote
> [artifact:deploy] Uploaded 57K
> [artifact:deploy] [INFO] Retrieving previous metadata from remote
> [artifact:deploy] [INFO] repository metadata for: 'artifact org.apache.lucene:lucene-demos' could not be found on repository: remote, so will be created
> [artifact:deploy] [INFO] Uploading repository metadata for: 'artifact org.apache.lucene:lucene-demos'
> [artifact:deploy] [INFO] Retrieving previous metadata from remote
> [artifact:deploy] [INFO] repository metadata for: 'snapshot org.apache.lucene:lucene-demos:3.1-SNAPSHOT' could not be found on repository: remote, so will be created
> [artifact:deploy] [INFO] Uploading repository metadata for: 'snapshot org.apache.lucene:lucene-demos:3.1-SNAPSHOT'
> [artifact:deploy] [INFO] Uploading project information for lucene-demos 3.1-20100809.233127-1
> [artifact:deploy] [INFO] Retrieving previous build number from remote
> [artifact:deploy] Uploading: org/apache/lucene/lucene-demos/3.1-SNAPSHOT/lucene-demos-3.1-20100809.233127-1-sources.jar to remote
> [artifact:deploy] Uploaded 48K
> [artifact:deploy] [INFO] Retrieving previous build number from remote
> [artifact:deploy] Uploading: org/apache/lucene/lucene-demos/3.1-SNAPSHOT/lucene-demos-3.1-20100809.233127-1-javadoc.jar to remote
> [artifact:deploy] Uploaded 115K
>     [copy] Copying 1 file to <http://hudson.zones.apache.org/hudson/job/Lucene-3.x/ws/branch_3x/build>
> [artifact:install-provider] Installing provider: org.apache.maven.wagon:wagon-ssh:jar:1.0-beta-2:runtime
> [artifact:pom] Error downloading parent pom org.apache.lucene:lucene-parent::3.1-SNAPSHOT: Missing:
> [artifact:pom] ----------
> [artifact:pom] 1) org.apache.lucene:lucene-parent:pom:3.1-SNAPSHOT
> [artifact:pom]   Path to dependency:
> [artifact:pom]          1) unspecified:unspecified:jar:0.0
> [artifact:pom]          2) org.apache.lucene:lucene-parent:pom:3.1-SNAPSHOT
> [artifact:pom]
> [artifact:pom] ----------
> [artifact:pom] 1 required artifact is missing.
> [artifact:pom]
> [artifact:pom] for artifact:
> [artifact:pom]   unspecified:unspecified:jar:0.0
> [artifact:pom]
> [artifact:pom] from the specified remote repositories:
> [artifact:pom]   central (http://repo1.maven.org/maven2)
> [artifact:deploy] Deploying to file://<http://hudson.zones.apache.org/hudson/job/Lucene-3.x/ws/branch_3x/dist/maven>
> [artifact:deploy] [INFO] Retrieving previous build number from remote
> [artifact:deploy] [INFO] repository metadata for: 'snapshot org.apache.lucene:lucene-contrib:3.1-SNAPSHOT' could not be found on repository: remote, so will be created
> [artifact:deploy] Uploading: org/apache/lucene/lucene-contrib/3.1-SNAPSHOT/lucene-contrib-3.1-20100809.233127-1.pom to remote
> [artifact:deploy] Uploaded 2K
> [artifact:deploy] [INFO] Retrieving previous metadata from remote
> [artifact:deploy] [INFO] repository metadata for: 'snapshot org.apache.lucene:lucene-contrib:3.1-SNAPSHOT' could not be found on repository: remote, so will be created
> [artifact:deploy] [INFO] Uploading repository metadata for: 'snapshot org.apache.lucene:lucene-contrib:3.1-SNAPSHOT'
> [artifact:deploy] [INFO] Retrieving previous metadata from remote
> [artifact:deploy] [INFO] repository metadata for: 'artifact org.apache.lucene:lucene-contrib' could not be found on repository: remote, so will be created
> [artifact:deploy] [INFO] Uploading repository metadata for: 'artifact org.apache.lucene:lucene-contrib'
>     [echo] Building analyzers...
>
> common:
>     [echo] Building analyzers...
>
> jflex-uptodate-check:
>
> jflex-notice:
>
> common.init:
>
> build-lucene:
>
> init:
>
> clover.setup:
>
> clover.info:
>
> clover:
>
> common.compile-core:
>
> compile-core:
>
> jar-core:
>      [jar] Building jar: <http://hudson.zones.apache.org/hudson/job/Lucene-3.x/ws/branch_3x/build/contrib/analyzers/lucene-analyzers-3.1-SNAPSHOT.jar>
>
> default:
>
> smartcn:
>     [echo] Building smartcn...
>
> common.init:
>
> build-lucene:
>
> init:
>
> clover.setup:
>
> clover.info:
>
> clover:
>
> compile-core:
>
> jar-core:
>      [jar] Building jar: <http://hudson.zones.apache.org/hudson/job/Lucene-3.x/ws/branch_3x/build/contrib/analyzers/lucene-analyzers-3.1-SNAPSHOT.jar>
>
> default:
>
> stempel:
>     [echo] Building stempel...
>
> common.init:
>
> build-lucene:
>
> init:
>
> clover.setup:
>
> clover.info:
>
> clover:
>
> compile-core:
>
> jar-core:
>      [jar] Building jar: <http://hudson.zones.apache.org/hudson/job/Lucene-3.x/ws/branch_3x/build/contrib/analyzers/lucene-analyzers-3.1-SNAPSHOT.jar>
>
> default:
>
> default:
>
> dist-maven:
>     [echo] Building analyzers...
>
> jflex-uptodate-check:
>
> jflex-notice:
>
> common.init:
>
> build-lucene:
>
> init:
>
> clover.setup:
>
> clover.info:
>
> clover:
>
> common.compile-core:
>
> compile-core:
>
> jar-src:
>
> BUILD FAILED
> <http://hudson.zones.apache.org/hudson/job/Lucene-3.x/ws/branch_3x/build.xml>:521: The following error occurred while executing this line:
> <http://hudson.zones.apache.org/hudson/job/Lucene-3.x/ws/branch_3x/build.xml>:655: The following error occurred while executing this line:
> <http://hudson.zones.apache.org/hudson/job/Lucene-3.x/ws/branch_3x/contrib/analyzers/build.xml>:69: The following error occurred while executing this line:
> <http://hudson.zones.apache.org/hudson/job/Lucene-3.x/ws/branch_3x/common-build.xml>:603: The following error occurred while executing this line:
> <http://hudson.zones.apache.org/hudson/job/Lucene-3.x/ws/branch_3x/common-build.xml>:362: <http://hudson.zones.apache.org/hudson/job/Lucene-3.x/ws/branch_3x/contrib/analyzers/src/java> not found.
>
> Total time: 4 minutes 24 seconds
> [TASKS] Skipping publisher since build result is FAILURE
> Publishing Javadoc
> Archiving artifacts
> Recording test results
> Publishing Clover coverage report...
> No Clover report will be published due to a Build Failure
>
>
> ---------------------------------------------------------------------
> To unsubscribe, e-mail: [hidden email]
> For additional commands, e-mail: [hidden email]
>
>

---------------------------------------------------------------------
To unsubscribe, e-mail: [hidden email]
For additional commands, e-mail: [hidden email]

 

 

Reply | Threaded
Open this post in threaded view
|

Re: Build failed in Hudson: Lucene-3.x #80

Shai Erera
ok, works for me.

Sorry for the mess, it seemed like a naive change :-).

Shai

On Tue, Aug 10, 2010 at 1:22 PM, Uwe Schindler <[hidden email]> wrote:

Ah,

 

jar is not delegated. To make this work you have top copypaste in build.xml and delegate to the subdirs (like the other targets). But “ant jar” is not really needed for development puposes here. I would keep it as it is for now.

 

Uwe

 

-----

Uwe Schindler

H.-H.-Meier-Allee 63, D-28213 Bremen

http://www.thetaphi.de

eMail: [hidden email]

 

From: Shai Erera [mailto:[hidden email]]
Sent: Tuesday, August 10, 2010 12:18 PM


To: [hidden email]
Subject: Re: Build failed in Hudson: Lucene-3.x #80

 

I understand that.

BTW, I upped and ran the following:

Ran "ant jar" from both contrib/analyzers and contrib/db, and got the following:
-------------------------------
Buildfile: build.xml

BUILD FAILED
Target "jar" does not exist in the project "analyzers".
Total time: 0 seconds
--------------------------------
And,
--------------------------------
Buildfile: build.xml

BUILD FAILED
Target "jar" does not exist in the project "db".

Total time: 0 seconds
--------------------------------

So you cannot really run "ant jar" from these directories. It'd be great if their build.xml declared a "jar" target and delegated to its subs properly, rather than me running it from each of them. We can do that w/ or w/o importing from contrib-build.xml

Shai

On Tue, Aug 10, 2010 at 1:09 PM, Uwe Schindler <[hidden email]> wrote:

Because hudson was dead since your commit J

 

The problem is that these build.xml files simply delegate the targets. If you import contrib.buil.xml you get wrongly defined properties and tasks that are not overridden correctly. Db and analyzers contrib (and the module in trunk) should simply delegate.

 

If I call ant inside db it builds everything correct!

 

-----

Uwe Schindler

H.-H.-Meier-Allee 63, D-28213 Bremen

http://www.thetaphi.de

eMail: [hidden email]

 

From: Shai Erera [mailto:[hidden email]]
Sent: Tuesday, August 10, 2010 12:05 PM
To: [hidden email]
Subject: Re: Build failed in Hudson: Lucene-3.x #80

 

Hmm ... I've made these changes a while ago because if you ran "ant jar" from the analyzers contrib directory, nothing happened. I thought that's a mistake, but perhaps it's not, since analyzers has 3 sub-dirs, each import contrib-build.xml. I guess same goes for 'db'. After I've noticed that (few days ago), I didn't think it's a problem to leave it that way. So if you run "ant jar" from analyzers, you get all 3 of them in one .jar, which might be convenient.

I did that few weeks ago - why does the build fail suddenly?

So should I revert it? If so, I'll keep that import commented out w/ some explanation (can you help w/ the explanation?) so that we don't repeat the same mistake in the future.

Shai

On Tue, Aug 10, 2010 at 12:16 PM, Michael McCandless <[hidden email]> wrote:

Same deal w/ this failure, except it was contrib/analyzer's build.xml
on 3x, where <import file="../contrib-build.xml"/> was added.

Mike

On Mon, Aug 9, 2010 at 7:32 PM, Apache Hudson Server
<[hidden email]> wrote:
> See <http://hudson.zones.apache.org/hudson/job/Lucene-3.x/80/changes>
>
> Changes:
>
> [rmuir] extend LuceneTestCase instead of Object here too
>
> [rmuir] SOLR-2002: add support for -Dtestmethod=xxx when running tests
>
> [rmuir] extend LuceneTestCase here instead
>
> [rmuir] SOLR-2002: change tests from TestCase to LuceneTestCase for better coverage
>
> [rmuir] LUCENE-2591: TestNLS fails with ja locale
>
> [rmuir] SOLR-2002: run tests under different timezones and locales
>
> ------------------------------------------
> [...truncated 11595 lines...]
>      [jar] Building jar: <http://hudson.zones.apache.org/hudson/job/Lucene-3.x/ws/branch_3x/build/lucene-demos-3.1-SNAPSHOT.jar>
>
> war-demo:
>      [war] Building war: <http://hudson.zones.apache.org/hudson/job/Lucene-3.x/ws/branch_3x/build/luceneweb.war>
>
> init-dist:
>    [mkdir] Created dir: <http://hudson.zones.apache.org/hudson/job/Lucene-3.x/ws/branch_3x/dist>
>    [mkdir] Created dir: <http://hudson.zones.apache.org/hudson/job/Lucene-3.x/ws/branch_3x/dist/maven>
>
> changes-to-html:
>    [mkdir] Created dir: <http://hudson.zones.apache.org/hudson/job/Lucene-3.x/ws/branch_3x/build/docs/changes>
>     [copy] Copying 3 files to <http://hudson.zones.apache.org/hudson/job/Lucene-3.x/ws/branch_3x/build/docs/changes>
>
> package:
>     [copy] Copying 1 file to <http://hudson.zones.apache.org/hudson/job/Lucene-3.x/ws/branch_3x/build>
>
> jar-src:
>      [jar] Building jar: <http://hudson.zones.apache.org/hudson/job/Lucene-3.x/ws/branch_3x/build/lucene-core-3.1-SNAPSHOT-src.jar>
>
> jar-demo-src:
>      [jar] Building jar: <http://hudson.zones.apache.org/hudson/job/Lucene-3.x/ws/branch_3x/build/lucene-demos-3.1-SNAPSHOT-src.jar>
>
> generate-maven-artifacts:
>     [copy] Copying 1 file to <http://hudson.zones.apache.org/hudson/job/Lucene-3.x/ws/branch_3x/build>
> [artifact:install-provider] Installing provider: org.apache.maven.wagon:wagon-ssh:jar:1.0-beta-2:runtime
> [artifact:deploy] Deploying to file://<http://hudson.zones.apache.org/hudson/job/Lucene-3.x/ws/branch_3x/dist/maven>
> [artifact:deploy] [INFO] Retrieving previous build number from remote
> [artifact:deploy] [INFO] repository metadata for: 'snapshot org.apache.lucene:lucene-parent:3.1-SNAPSHOT' could not be found on repository: remote, so will be created
> [artifact:deploy] Uploading: org/apache/lucene/lucene-parent/3.1-SNAPSHOT/lucene-parent-3.1-20100809.233127-1.pom to remote
> [artifact:deploy] Uploaded 3K
> [artifact:deploy] [INFO] Retrieving previous metadata from remote
> [artifact:deploy] [INFO] repository metadata for: 'artifact org.apache.lucene:lucene-parent' could not be found on repository: remote, so will be created
> [artifact:deploy] [INFO] Uploading repository metadata for: 'artifact org.apache.lucene:lucene-parent'
> [artifact:deploy] [INFO] Retrieving previous metadata from remote
> [artifact:deploy] [INFO] repository metadata for: 'snapshot org.apache.lucene:lucene-parent:3.1-SNAPSHOT' could not be found on repository: remote, so will be created
> [artifact:deploy] [INFO] Uploading repository metadata for: 'snapshot org.apache.lucene:lucene-parent:3.1-SNAPSHOT'
>     [copy] Copying 1 file to <http://hudson.zones.apache.org/hudson/job/Lucene-3.x/ws/branch_3x/build>
> [artifact:install-provider] Installing provider: org.apache.maven.wagon:wagon-ssh:jar:1.0-beta-2:runtime
> [artifact:pom] Error downloading parent pom org.apache.lucene:lucene-parent::3.1-SNAPSHOT: Missing:
> [artifact:pom] ----------
> [artifact:pom] 1) org.apache.lucene:lucene-parent:pom:3.1-SNAPSHOT
> [artifact:pom]   Path to dependency:
> [artifact:pom]          1) unspecified:unspecified:jar:0.0
> [artifact:pom]          2) org.apache.lucene:lucene-parent:pom:3.1-SNAPSHOT
> [artifact:pom]
> [artifact:pom] ----------
> [artifact:pom] 1 required artifact is missing.
> [artifact:pom]
> [artifact:pom] for artifact:
> [artifact:pom]   unspecified:unspecified:jar:0.0
> [artifact:pom]
> [artifact:pom] from the specified remote repositories:
> [artifact:pom]   central (http://repo1.maven.org/maven2)
> [artifact:deploy] Deploying to file://<http://hudson.zones.apache.org/hudson/job/Lucene-3.x/ws/branch_3x/dist/maven>
> [artifact:deploy] [INFO] Retrieving previous build number from remote
> [artifact:deploy] [INFO] repository metadata for: 'snapshot org.apache.lucene:lucene-core:3.1-SNAPSHOT' could not be found on repository: remote, so will be created
> [artifact:deploy] Uploading: org/apache/lucene/lucene-core/3.1-SNAPSHOT/lucene-core-3.1-20100809.233127-1.jar to remote
> [artifact:deploy] Uploaded 1080K
> [artifact:deploy] [INFO] Retrieving previous metadata from remote
> [artifact:deploy] [INFO] repository metadata for: 'snapshot org.apache.lucene:lucene-core:3.1-SNAPSHOT' could not be found on repository: remote, so will be created
> [artifact:deploy] [INFO] Uploading repository metadata for: 'snapshot org.apache.lucene:lucene-core:3.1-SNAPSHOT'
> [artifact:deploy] [INFO] Uploading project information for lucene-core 3.1-20100809.233127-1
> [artifact:deploy] [INFO] Retrieving previous metadata from remote
> [artifact:deploy] [INFO] repository metadata for: 'artifact org.apache.lucene:lucene-core' could not be found on repository: remote, so will be created
> [artifact:deploy] [INFO] Uploading repository metadata for: 'artifact org.apache.lucene:lucene-core'
> [artifact:deploy] [INFO] Retrieving previous build number from remote
> [artifact:deploy] Uploading: org/apache/lucene/lucene-core/3.1-SNAPSHOT/lucene-core-3.1-20100809.233127-1-sources.jar to remote
> [artifact:deploy] Uploaded 1007K
> [artifact:deploy] [INFO] Retrieving previous build number from remote
> [artifact:deploy] Uploading: org/apache/lucene/lucene-core/3.1-SNAPSHOT/lucene-core-3.1-20100809.233127-1-javadoc.jar to remote
> [artifact:deploy] Uploaded 2650K
>     [copy] Copying 1 file to <http://hudson.zones.apache.org/hudson/job/Lucene-3.x/ws/branch_3x/build>
> [artifact:install-provider] Installing provider: org.apache.maven.wagon:wagon-ssh:jar:1.0-beta-2:runtime
> [artifact:pom] Error downloading parent pom org.apache.lucene:lucene-parent::3.1-SNAPSHOT: Missing:
> [artifact:pom] ----------
> [artifact:pom] 1) org.apache.lucene:lucene-parent:pom:3.1-SNAPSHOT
> [artifact:pom]   Path to dependency:
> [artifact:pom]          1) unspecified:unspecified:jar:0.0
> [artifact:pom]          2) org.apache.lucene:lucene-parent:pom:3.1-SNAPSHOT
> [artifact:pom]
> [artifact:pom] ----------
> [artifact:pom] 1 required artifact is missing.
> [artifact:pom]
> [artifact:pom] for artifact:
> [artifact:pom]   unspecified:unspecified:jar:0.0
> [artifact:pom]
> [artifact:pom] from the specified remote repositories:
> [artifact:pom]   central (http://repo1.maven.org/maven2)
> [artifact:deploy] Deploying to file://<http://hudson.zones.apache.org/hudson/job/Lucene-3.x/ws/branch_3x/dist/maven>
> [artifact:deploy] [INFO] Retrieving previous build number from remote
> [artifact:deploy] [INFO] repository metadata for: 'snapshot org.apache.lucene:lucene-demos:3.1-SNAPSHOT' could not be found on repository: remote, so will be created
> [artifact:deploy] Uploading: org/apache/lucene/lucene-demos/3.1-SNAPSHOT/lucene-demos-3.1-20100809.233127-1.jar to remote
> [artifact:deploy] Uploaded 57K
> [artifact:deploy] [INFO] Retrieving previous metadata from remote
> [artifact:deploy] [INFO] repository metadata for: 'artifact org.apache.lucene:lucene-demos' could not be found on repository: remote, so will be created
> [artifact:deploy] [INFO] Uploading repository metadata for: 'artifact org.apache.lucene:lucene-demos'
> [artifact:deploy] [INFO] Retrieving previous metadata from remote
> [artifact:deploy] [INFO] repository metadata for: 'snapshot org.apache.lucene:lucene-demos:3.1-SNAPSHOT' could not be found on repository: remote, so will be created
> [artifact:deploy] [INFO] Uploading repository metadata for: 'snapshot org.apache.lucene:lucene-demos:3.1-SNAPSHOT'
> [artifact:deploy] [INFO] Uploading project information for lucene-demos 3.1-20100809.233127-1
> [artifact:deploy] [INFO] Retrieving previous build number from remote
> [artifact:deploy] Uploading: org/apache/lucene/lucene-demos/3.1-SNAPSHOT/lucene-demos-3.1-20100809.233127-1-sources.jar to remote
> [artifact:deploy] Uploaded 48K
> [artifact:deploy] [INFO] Retrieving previous build number from remote
> [artifact:deploy] Uploading: org/apache/lucene/lucene-demos/3.1-SNAPSHOT/lucene-demos-3.1-20100809.233127-1-javadoc.jar to remote
> [artifact:deploy] Uploaded 115K
>     [copy] Copying 1 file to <http://hudson.zones.apache.org/hudson/job/Lucene-3.x/ws/branch_3x/build>
> [artifact:install-provider] Installing provider: org.apache.maven.wagon:wagon-ssh:jar:1.0-beta-2:runtime
> [artifact:pom] Error downloading parent pom org.apache.lucene:lucene-parent::3.1-SNAPSHOT: Missing:
> [artifact:pom] ----------
> [artifact:pom] 1) org.apache.lucene:lucene-parent:pom:3.1-SNAPSHOT
> [artifact:pom]   Path to dependency:
> [artifact:pom]          1) unspecified:unspecified:jar:0.0
> [artifact:pom]          2) org.apache.lucene:lucene-parent:pom:3.1-SNAPSHOT
> [artifact:pom]
> [artifact:pom] ----------
> [artifact:pom] 1 required artifact is missing.
> [artifact:pom]
> [artifact:pom] for artifact:
> [artifact:pom]   unspecified:unspecified:jar:0.0
> [artifact:pom]
> [artifact:pom] from the specified remote repositories:
> [artifact:pom]   central (http://repo1.maven.org/maven2)
> [artifact:deploy] Deploying to file://<http://hudson.zones.apache.org/hudson/job/Lucene-3.x/ws/branch_3x/dist/maven>
> [artifact:deploy] [INFO] Retrieving previous build number from remote
> [artifact:deploy] [INFO] repository metadata for: 'snapshot org.apache.lucene:lucene-contrib:3.1-SNAPSHOT' could not be found on repository: remote, so will be created
> [artifact:deploy] Uploading: org/apache/lucene/lucene-contrib/3.1-SNAPSHOT/lucene-contrib-3.1-20100809.233127-1.pom to remote
> [artifact:deploy] Uploaded 2K
> [artifact:deploy] [INFO] Retrieving previous metadata from remote
> [artifact:deploy] [INFO] repository metadata for: 'snapshot org.apache.lucene:lucene-contrib:3.1-SNAPSHOT' could not be found on repository: remote, so will be created
> [artifact:deploy] [INFO] Uploading repository metadata for: 'snapshot org.apache.lucene:lucene-contrib:3.1-SNAPSHOT'
> [artifact:deploy] [INFO] Retrieving previous metadata from remote
> [artifact:deploy] [INFO] repository metadata for: 'artifact org.apache.lucene:lucene-contrib' could not be found on repository: remote, so will be created
> [artifact:deploy] [INFO] Uploading repository metadata for: 'artifact org.apache.lucene:lucene-contrib'
>     [echo] Building analyzers...
>
> common:
>     [echo] Building analyzers...
>


> jflex-uptodate-check:
>
> jflex-notice:
>
> common.init:
>
> build-lucene:
>
> init:
>
> clover.setup:
>
> clover.info:
>
> clover:
>
> common.compile-core:
>
> compile-core:
>
> jar-core:
>      [jar] Building jar: <http://hudson.zones.apache.org/hudson/job/Lucene-3.x/ws/branch_3x/build/contrib/analyzers/lucene-analyzers-3.1-SNAPSHOT.jar>
>

> default:
>
> smartcn:
>     [echo] Building smartcn...
>
> common.init:
>
> build-lucene:
>
> init:
>
> clover.setup:
>
> clover.info:
>
> clover:
>
> compile-core:
>
> jar-core:
>      [jar] Building jar: <http://hudson.zones.apache.org/hudson/job/Lucene-3.x/ws/branch_3x/build/contrib/analyzers/lucene-analyzers-3.1-SNAPSHOT.jar>
>

> default:
>
> stempel:
>     [echo] Building stempel...
>
> common.init:
>
> build-lucene:
>
> init:
>
> clover.setup:
>
> clover.info:
>
> clover:
>
> compile-core:
>
> jar-core:
>      [jar] Building jar: <http://hudson.zones.apache.org/hudson/job/Lucene-3.x/ws/branch_3x/build/contrib/analyzers/lucene-analyzers-3.1-SNAPSHOT.jar>
>

> default:
>
> default:
>
> dist-maven:
>     [echo] Building analyzers...
>
> jflex-uptodate-check:
>
> jflex-notice:
>
> common.init:
>
> build-lucene:

>
> init:
>
> clover.setup:
>
> clover.info:
>
> clover:
>
> common.compile-core:
>
> compile-core:
>
> jar-src:
>
> BUILD FAILED
> <http://hudson.zones.apache.org/hudson/job/Lucene-3.x/ws/branch_3x/build.xml>:521: The following error occurred while executing this line:
> <http://hudson.zones.apache.org/hudson/job/Lucene-3.x/ws/branch_3x/build.xml>:655: The following error occurred while executing this line:
> <http://hudson.zones.apache.org/hudson/job/Lucene-3.x/ws/branch_3x/contrib/analyzers/build.xml>:69: The following error occurred while executing this line:
> <http://hudson.zones.apache.org/hudson/job/Lucene-3.x/ws/branch_3x/common-build.xml>:603: The following error occurred while executing this line:
> <http://hudson.zones.apache.org/hudson/job/Lucene-3.x/ws/branch_3x/common-build.xml>:362: <http://hudson.zones.apache.org/hudson/job/Lucene-3.x/ws/branch_3x/contrib/analyzers/src/java> not found.
>
> Total time: 4 minutes 24 seconds
> [TASKS] Skipping publisher since build result is FAILURE
> Publishing Javadoc
> Archiving artifacts
> Recording test results
> Publishing Clover coverage report...
> No Clover report will be published due to a Build Failure
>
>
> ---------------------------------------------------------------------
> To unsubscribe, e-mail: [hidden email]
> For additional commands, e-mail: [hidden email]
>
>

---------------------------------------------------------------------
To unsubscribe, e-mail: [hidden email]
For additional commands, e-mail: [hidden email]

 

 


Reply | Threaded
Open this post in threaded view
|

RE: Build failed in Hudson: Lucene-3.x #80

Uwe Schindler

I am currently investigating ANT docs, if there is the possibility to simply delegate *all* not defined ant target to somewhere else. Something like <target name=”*”>

 

[it looks like Uwe did too much XSLT the last days, he was thinking too much about XSL template priorities and XPath matchers *g*, maybe there is a simple ANT solution to do the same like in XSL]

 

Uwe

 

-----

Uwe Schindler

H.-H.-Meier-Allee 63, D-28213 Bremen

http://www.thetaphi.de

eMail: [hidden email]

 

From: Shai Erera [mailto:[hidden email]]
Sent: Tuesday, August 10, 2010 12:25 PM
To: [hidden email]
Subject: Re: Build failed in Hudson: Lucene-3.x #80

 

ok, works for me.

Sorry for the mess, it seemed like a naive change :-).

Shai

On Tue, Aug 10, 2010 at 1:22 PM, Uwe Schindler <[hidden email]> wrote:

Ah,

 

jar is not delegated. To make this work you have top copypaste in build.xml and delegate to the subdirs (like the other targets). But “ant jar” is not really needed for development puposes here. I would keep it as it is for now.

 

Uwe

 

-----

Uwe Schindler

H.-H.-Meier-Allee 63, D-28213 Bremen

http://www.thetaphi.de

eMail: [hidden email]

 

From: Shai Erera [mailto:[hidden email]]
Sent: Tuesday, August 10, 2010 12:18 PM


To: [hidden email]
Subject: Re: Build failed in Hudson: Lucene-3.x #80

 

I understand that.

BTW, I upped and ran the following:

Ran "ant jar" from both contrib/analyzers and contrib/db, and got the following:
-------------------------------
Buildfile: build.xml

BUILD FAILED
Target "jar" does not exist in the project "analyzers".
Total time: 0 seconds
--------------------------------
And,
--------------------------------
Buildfile: build.xml

BUILD FAILED
Target "jar" does not exist in the project "db".

Total time: 0 seconds
--------------------------------

So you cannot really run "ant jar" from these directories. It'd be great if their build.xml declared a "jar" target and delegated to its subs properly, rather than me running it from each of them. We can do that w/ or w/o importing from contrib-build.xml

Shai

On Tue, Aug 10, 2010 at 1:09 PM, Uwe Schindler <[hidden email]> wrote:

Because hudson was dead since your commit J

 

The problem is that these build.xml files simply delegate the targets. If you import contrib.buil.xml you get wrongly defined properties and tasks that are not overridden correctly. Db and analyzers contrib (and the module in trunk) should simply delegate.

 

If I call ant inside db it builds everything correct!

 

-----

Uwe Schindler

H.-H.-Meier-Allee 63, D-28213 Bremen

http://www.thetaphi.de

eMail: [hidden email]

 

From: Shai Erera [mailto:[hidden email]]
Sent: Tuesday, August 10, 2010 12:05 PM
To: [hidden email]
Subject: Re: Build failed in Hudson: Lucene-3.x #80

 

Hmm ... I've made these changes a while ago because if you ran "ant jar" from the analyzers contrib directory, nothing happened. I thought that's a mistake, but perhaps it's not, since analyzers has 3 sub-dirs, each import contrib-build.xml. I guess same goes for 'db'. After I've noticed that (few days ago), I didn't think it's a problem to leave it that way. So if you run "ant jar" from analyzers, you get all 3 of them in one .jar, which might be convenient.

I did that few weeks ago - why does the build fail suddenly?

So should I revert it? If so, I'll keep that import commented out w/ some explanation (can you help w/ the explanation?) so that we don't repeat the same mistake in the future.

Shai

On Tue, Aug 10, 2010 at 12:16 PM, Michael McCandless <[hidden email]> wrote:

Same deal w/ this failure, except it was contrib/analyzer's build.xml
on 3x, where <import file="../contrib-build.xml"/> was added.

Mike

On Mon, Aug 9, 2010 at 7:32 PM, Apache Hudson Server
<[hidden email]> wrote:


> See <http://hudson.zones.apache.org/hudson/job/Lucene-3.x/80/changes>
>
> Changes:
>
> [rmuir] extend LuceneTestCase instead of Object here too
>
> [rmuir] SOLR-2002: add support for -Dtestmethod=xxx when running tests
>
> [rmuir] extend LuceneTestCase here instead
>
> [rmuir] SOLR-2002: change tests from TestCase to LuceneTestCase for better coverage
>
> [rmuir] LUCENE-2591: TestNLS fails with ja locale
>
> [rmuir] SOLR-2002: run tests under different timezones and locales
>
> ------------------------------------------
> [...truncated 11595 lines...]
>      [jar] Building jar: <http://hudson.zones.apache.org/hudson/job/Lucene-3.x/ws/branch_3x/build/lucene-demos-3.1-SNAPSHOT.jar>
>
> war-demo:
>      [war] Building war: <http://hudson.zones.apache.org/hudson/job/Lucene-3.x/ws/branch_3x/build/luceneweb.war>
>
> init-dist:
>    [mkdir] Created dir: <http://hudson.zones.apache.org/hudson/job/Lucene-3.x/ws/branch_3x/dist>
>    [mkdir] Created dir: <http://hudson.zones.apache.org/hudson/job/Lucene-3.x/ws/branch_3x/dist/maven>
>
> changes-to-html:
>    [mkdir] Created dir: <http://hudson.zones.apache.org/hudson/job/Lucene-3.x/ws/branch_3x/build/docs/changes>
>     [copy] Copying 3 files to <http://hudson.zones.apache.org/hudson/job/Lucene-3.x/ws/branch_3x/build/docs/changes>
>
> package:
>     [copy] Copying 1 file to <http://hudson.zones.apache.org/hudson/job/Lucene-3.x/ws/branch_3x/build>
>
> jar-src:
>      [jar] Building jar: <http://hudson.zones.apache.org/hudson/job/Lucene-3.x/ws/branch_3x/build/lucene-core-3.1-SNAPSHOT-src.jar>
>
> jar-demo-src:
>      [jar] Building jar: <http://hudson.zones.apache.org/hudson/job/Lucene-3.x/ws/branch_3x/build/lucene-demos-3.1-SNAPSHOT-src.jar>
>
> generate-maven-artifacts:
>     [copy] Copying 1 file to <http://hudson.zones.apache.org/hudson/job/Lucene-3.x/ws/branch_3x/build>
> [artifact:install-provider] Installing provider: org.apache.maven.wagon:wagon-ssh:jar:1.0-beta-2:runtime
> [artifact:deploy] Deploying to file://<http://hudson.zones.apache.org/hudson/job/Lucene-3.x/ws/branch_3x/dist/maven>
> [artifact:deploy] [INFO] Retrieving previous build number from remote
> [artifact:deploy] [INFO] repository metadata for: 'snapshot org.apache.lucene:lucene-parent:3.1-SNAPSHOT' could not be found on repository: remote, so will be created
> [artifact:deploy] Uploading: org/apache/lucene/lucene-parent/3.1-SNAPSHOT/lucene-parent-3.1-20100809.233127-1.pom to remote
> [artifact:deploy] Uploaded 3K
> [artifact:deploy] [INFO] Retrieving previous metadata from remote
> [artifact:deploy] [INFO] repository metadata for: 'artifact org.apache.lucene:lucene-parent' could not be found on repository: remote, so will be created
> [artifact:deploy] [INFO] Uploading repository metadata for: 'artifact org.apache.lucene:lucene-parent'
> [artifact:deploy] [INFO] Retrieving previous metadata from remote
> [artifact:deploy] [INFO] repository metadata for: 'snapshot org.apache.lucene:lucene-parent:3.1-SNAPSHOT' could not be found on repository: remote, so will be created
> [artifact:deploy] [INFO] Uploading repository metadata for: 'snapshot org.apache.lucene:lucene-parent:3.1-SNAPSHOT'
>     [copy] Copying 1 file to <http://hudson.zones.apache.org/hudson/job/Lucene-3.x/ws/branch_3x/build>
> [artifact:install-provider] Installing provider: org.apache.maven.wagon:wagon-ssh:jar:1.0-beta-2:runtime
> [artifact:pom] Error downloading parent pom org.apache.lucene:lucene-parent::3.1-SNAPSHOT: Missing:
> [artifact:pom] ----------
> [artifact:pom] 1) org.apache.lucene:lucene-parent:pom:3.1-SNAPSHOT
> [artifact:pom]   Path to dependency:
> [artifact:pom]          1) unspecified:unspecified:jar:0.0
> [artifact:pom]          2) org.apache.lucene:lucene-parent:pom:3.1-SNAPSHOT
> [artifact:pom]
> [artifact:pom] ----------
> [artifact:pom] 1 required artifact is missing.
> [artifact:pom]
> [artifact:pom] for artifact:
> [artifact:pom]   unspecified:unspecified:jar:0.0
> [artifact:pom]
> [artifact:pom] from the specified remote repositories:
> [artifact:pom]   central (http://repo1.maven.org/maven2)
> [artifact:deploy] Deploying to file://<http://hudson.zones.apache.org/hudson/job/Lucene-3.x/ws/branch_3x/dist/maven>
> [artifact:deploy] [INFO] Retrieving previous build number from remote
> [artifact:deploy] [INFO] repository metadata for: 'snapshot org.apache.lucene:lucene-core:3.1-SNAPSHOT' could not be found on repository: remote, so will be created
> [artifact:deploy] Uploading: org/apache/lucene/lucene-core/3.1-SNAPSHOT/lucene-core-3.1-20100809.233127-1.jar to remote
> [artifact:deploy] Uploaded 1080K
> [artifact:deploy] [INFO] Retrieving previous metadata from remote
> [artifact:deploy] [INFO] repository metadata for: 'snapshot org.apache.lucene:lucene-core:3.1-SNAPSHOT' could not be found on repository: remote, so will be created
> [artifact:deploy] [INFO] Uploading repository metadata for: 'snapshot org.apache.lucene:lucene-core:3.1-SNAPSHOT'
> [artifact:deploy] [INFO] Uploading project information for lucene-core 3.1-20100809.233127-1
> [artifact:deploy] [INFO] Retrieving previous metadata from remote
> [artifact:deploy] [INFO] repository metadata for: 'artifact org.apache.lucene:lucene-core' could not be found on repository: remote, so will be created
> [artifact:deploy] [INFO] Uploading repository metadata for: 'artifact org.apache.lucene:lucene-core'
> [artifact:deploy] [INFO] Retrieving previous build number from remote
> [artifact:deploy] Uploading: org/apache/lucene/lucene-core/3.1-SNAPSHOT/lucene-core-3.1-20100809.233127-1-sources.jar to remote
> [artifact:deploy] Uploaded 1007K
> [artifact:deploy] [INFO] Retrieving previous build number from remote
> [artifact:deploy] Uploading: org/apache/lucene/lucene-core/3.1-SNAPSHOT/lucene-core-3.1-20100809.233127-1-javadoc.jar to remote
> [artifact:deploy] Uploaded 2650K
>     [copy] Copying 1 file to <http://hudson.zones.apache.org/hudson/job/Lucene-3.x/ws/branch_3x/build>
> [artifact:install-provider] Installing provider: org.apache.maven.wagon:wagon-ssh:jar:1.0-beta-2:runtime
> [artifact:pom] Error downloading parent pom org.apache.lucene:lucene-parent::3.1-SNAPSHOT: Missing:
> [artifact:pom] ----------
> [artifact:pom] 1) org.apache.lucene:lucene-parent:pom:3.1-SNAPSHOT
> [artifact:pom]   Path to dependency:
> [artifact:pom]          1) unspecified:unspecified:jar:0.0
> [artifact:pom]          2) org.apache.lucene:lucene-parent:pom:3.1-SNAPSHOT
> [artifact:pom]
> [artifact:pom] ----------
> [artifact:pom] 1 required artifact is missing.
> [artifact:pom]
> [artifact:pom] for artifact:
> [artifact:pom]   unspecified:unspecified:jar:0.0
> [artifact:pom]
> [artifact:pom] from the specified remote repositories:
> [artifact:pom]   central (http://repo1.maven.org/maven2)
> [artifact:deploy] Deploying to file://<http://hudson.zones.apache.org/hudson/job/Lucene-3.x/ws/branch_3x/dist/maven>
> [artifact:deploy] [INFO] Retrieving previous build number from remote
> [artifact:deploy] [INFO] repository metadata for: 'snapshot org.apache.lucene:lucene-demos:3.1-SNAPSHOT' could not be found on repository: remote, so will be created
> [artifact:deploy] Uploading: org/apache/lucene/lucene-demos/3.1-SNAPSHOT/lucene-demos-3.1-20100809.233127-1.jar to remote
> [artifact:deploy] Uploaded 57K
> [artifact:deploy] [INFO] Retrieving previous metadata from remote
> [artifact:deploy] [INFO] repository metadata for: 'artifact org.apache.lucene:lucene-demos' could not be found on repository: remote, so will be created
> [artifact:deploy] [INFO] Uploading repository metadata for: 'artifact org.apache.lucene:lucene-demos'
> [artifact:deploy] [INFO] Retrieving previous metadata from remote
> [artifact:deploy] [INFO] repository metadata for: 'snapshot org.apache.lucene:lucene-demos:3.1-SNAPSHOT' could not be found on repository: remote, so will be created
> [artifact:deploy] [INFO] Uploading repository metadata for: 'snapshot org.apache.lucene:lucene-demos:3.1-SNAPSHOT'
> [artifact:deploy] [INFO] Uploading project information for lucene-demos 3.1-20100809.233127-1
> [artifact:deploy] [INFO] Retrieving previous build number from remote
> [artifact:deploy] Uploading: org/apache/lucene/lucene-demos/3.1-SNAPSHOT/lucene-demos-3.1-20100809.233127-1-sources.jar to remote
> [artifact:deploy] Uploaded 48K
> [artifact:deploy] [INFO] Retrieving previous build number from remote
> [artifact:deploy] Uploading: org/apache/lucene/lucene-demos/3.1-SNAPSHOT/lucene-demos-3.1-20100809.233127-1-javadoc.jar to remote
> [artifact:deploy] Uploaded 115K
>     [copy] Copying 1 file to <http://hudson.zones.apache.org/hudson/job/Lucene-3.x/ws/branch_3x/build>
> [artifact:install-provider] Installing provider: org.apache.maven.wagon:wagon-ssh:jar:1.0-beta-2:runtime
> [artifact:pom] Error downloading parent pom org.apache.lucene:lucene-parent::3.1-SNAPSHOT: Missing:
> [artifact:pom] ----------
> [artifact:pom] 1) org.apache.lucene:lucene-parent:pom:3.1-SNAPSHOT
> [artifact:pom]   Path to dependency:
> [artifact:pom]          1) unspecified:unspecified:jar:0.0
> [artifact:pom]          2) org.apache.lucene:lucene-parent:pom:3.1-SNAPSHOT
> [artifact:pom]
> [artifact:pom] ----------
> [artifact:pom] 1 required artifact is missing.
> [artifact:pom]
> [artifact:pom] for artifact:
> [artifact:pom]   unspecified:unspecified:jar:0.0
> [artifact:pom]
> [artifact:pom] from the specified remote repositories:
> [artifact:pom]   central (http://repo1.maven.org/maven2)
> [artifact:deploy] Deploying to file://<http://hudson.zones.apache.org/hudson/job/Lucene-3.x/ws/branch_3x/dist/maven>
> [artifact:deploy] [INFO] Retrieving previous build number from remote
> [artifact:deploy] [INFO] repository metadata for: 'snapshot org.apache.lucene:lucene-contrib:3.1-SNAPSHOT' could not be found on repository: remote, so will be created
> [artifact:deploy] Uploading: org/apache/lucene/lucene-contrib/3.1-SNAPSHOT/lucene-contrib-3.1-20100809.233127-1.pom to remote
> [artifact:deploy] Uploaded 2K
> [artifact:deploy] [INFO] Retrieving previous metadata from remote
> [artifact:deploy] [INFO] repository metadata for: 'snapshot org.apache.lucene:lucene-contrib:3.1-SNAPSHOT' could not be found on repository: remote, so will be created
> [artifact:deploy] [INFO] Uploading repository metadata for: 'snapshot org.apache.lucene:lucene-contrib:3.1-SNAPSHOT'
> [artifact:deploy] [INFO] Retrieving previous metadata from remote
> [artifact:deploy] [INFO] repository metadata for: 'artifact org.apache.lucene:lucene-contrib' could not be found on repository: remote, so will be created
> [artifact:deploy] [INFO] Uploading repository metadata for: 'artifact org.apache.lucene:lucene-contrib'
>     [echo] Building analyzers...
>
> common:
>     [echo] Building analyzers...
>
> jflex-uptodate-check:
>
> jflex-notice:
>
> common.init:
>
> build-lucene:
>
> init:
>
> clover.setup:
>
> clover.info:
>
> clover:
>
> common.compile-core:
>
> compile-core:
>
> jar-core:
>      [jar] Building jar: <http://hudson.zones.apache.org/hudson/job/Lucene-3.x/ws/branch_3x/build/contrib/analyzers/lucene-analyzers-3.1-SNAPSHOT.jar>
>
> default:
>
> smartcn:
>     [echo] Building smartcn...
>
> common.init:
>
> build-lucene:
>
> init:
>
> clover.setup:
>
> clover.info:
>
> clover:
>
> compile-core:
>
> jar-core:
>      [jar] Building jar: <http://hudson.zones.apache.org/hudson/job/Lucene-3.x/ws/branch_3x/build/contrib/analyzers/lucene-analyzers-3.1-SNAPSHOT.jar>
>
> default:
>
> stempel:
>     [echo] Building stempel...
>
> common.init:
>
> build-lucene:
>
> init:
>
> clover.setup:
>
> clover.info:
>
> clover:
>
> compile-core:
>
> jar-core:
>      [jar] Building jar: <http://hudson.zones.apache.org/hudson/job/Lucene-3.x/ws/branch_3x/build/contrib/analyzers/lucene-analyzers-3.1-SNAPSHOT.jar>
>
> default:
>
> default:
>
> dist-maven:
>     [echo] Building analyzers...
>
> jflex-uptodate-check:
>
> jflex-notice:
>
> common.init:
>
> build-lucene:
>
> init:
>
> clover.setup:
>
> clover.info:
>
> clover:
>
> common.compile-core:
>
> compile-core:
>
> jar-src:
>
> BUILD FAILED
> <http://hudson.zones.apache.org/hudson/job/Lucene-3.x/ws/branch_3x/build.xml>:521: The following error occurred while executing this line:
> <http://hudson.zones.apache.org/hudson/job/Lucene-3.x/ws/branch_3x/build.xml>:655: The following error occurred while executing this line:
> <http://hudson.zones.apache.org/hudson/job/Lucene-3.x/ws/branch_3x/contrib/analyzers/build.xml>:69: The following error occurred while executing this line:
> <http://hudson.zones.apache.org/hudson/job/Lucene-3.x/ws/branch_3x/common-build.xml>:603: The following error occurred while executing this line:
> <http://hudson.zones.apache.org/hudson/job/Lucene-3.x/ws/branch_3x/common-build.xml>:362: <http://hudson.zones.apache.org/hudson/job/Lucene-3.x/ws/branch_3x/contrib/analyzers/src/java> not found.
>
> Total time: 4 minutes 24 seconds
> [TASKS] Skipping publisher since build result is FAILURE
> Publishing Javadoc
> Archiving artifacts
> Recording test results
> Publishing Clover coverage report...
> No Clover report will be published due to a Build Failure
>
>
> ---------------------------------------------------------------------
> To unsubscribe, e-mail: [hidden email]
> For additional commands, e-mail: [hidden email]
>
>

---------------------------------------------------------------------
To unsubscribe, e-mail: [hidden email]
For additional commands, e-mail: [hidden email]

 

 

 

Reply | Threaded
Open this post in threaded view
|

Hudson build is back to normal : Lucene-3.x #81

Apache Hudson Server
In reply to this post by Apache Hudson Server
See <http://hudson.zones.apache.org/hudson/job/Lucene-3.x/81/changes>



---------------------------------------------------------------------
To unsubscribe, e-mail: [hidden email]
For additional commands, e-mail: [hidden email]