Build failed in Hudson: Lucene-Solr-tests-only-3.x #116

classic Classic list List threaded Threaded
3 messages Options
Reply | Threaded
Open this post in threaded view
|

Build failed in Hudson: Lucene-Solr-tests-only-3.x #116

Apache Jenkins Server
See <https://hudson.apache.org/hudson/job/Lucene-Solr-tests-only-3.x/116/changes>

Changes:

[yonik] merge trunk 1023106

------------------------------------------
[...truncated 9058 lines...]
    [junit] Testsuite: org.apache.solr.spelling.suggest.SuggesterTest
    [junit] Tests run: 2, Failures: 0, Errors: 0, Time elapsed: 0.293 sec
    [junit]
    [junit] Testsuite: org.apache.solr.update.processor.UpdateRequestProcessorFactoryTest
    [junit] Tests run: 1, Failures: 0, Errors: 0, Time elapsed: 0.816 sec
    [junit]
    [junit] Testsuite: org.apache.solr.util.SolrPluginUtilsTest
    [junit] Tests run: 7, Failures: 0, Errors: 0, Time elapsed: 0.941 sec
    [junit]
    [junit] Testsuite: org.apache.solr.search.function.TestFunctionQuery
    [junit] Tests run: 7, Failures: 0, Errors: 0, Time elapsed: 3.633 sec
    [junit]
    [junit] ------------- Standard Error -----------------
    [junit] ?? ????????, ???? ?:??:?? ??????? org.apache.solr.SolrTestCaseJ4 assertQ
    [junit] SEVERE: REQUEST FAILED: fl=*,score&q={!func}10+wow+dude+ignore_exception
    [junit] ------------- ---------------- ---------------
    [junit] Testsuite: org.apache.solr.update.AutoCommitTest
    [junit] Tests run: 1, Failures: 0, Errors: 0, Time elapsed: 4.776 sec
    [junit]
    [junit] Testsuite: org.apache.solr.util.TestUtils
    [junit] Tests run: 3, Failures: 0, Errors: 0, Time elapsed: 0.011 sec
    [junit]
    [junit] Testsuite: org.apache.solr.servlet.CacheHeaderTest
    [junit] Tests run: 5, Failures: 0, Errors: 0, Time elapsed: 1.714 sec
    [junit]
    [junit] Testsuite: org.apache.solr.update.TestIndexingPerformance
    [junit] Tests run: 1, Failures: 0, Errors: 0, Time elapsed: 1.722 sec
    [junit]
    [junit] ------------- Standard Output ---------------
    [junit] includeDoc=true doc=[text, simple, text, test, text, how now brown cow, text, what's that?, text, radical!, text, what's all this about, anyway?, text, just how fast is this text indexing?]
    [junit] iter=1000 time=704 throughput=1420
    [junit] ------------- ---------------- ---------------
    [junit] Testsuite: org.apache.solr.util.DateMathParserTest
    [junit] Tests run: 7, Failures: 0, Errors: 0, Time elapsed: 0.093 sec
    [junit]
    [junit] Testsuite: org.apache.solr.request.SimpleFacetsTest
    [junit] Tests run: 7, Failures: 0, Errors: 0, Time elapsed: 6.233 sec
    [junit]
    [junit] Testsuite: org.apache.solr.velocity.VelocityResponseWriterTest
    [junit] Tests run: 1, Failures: 0, Errors: 0, Time elapsed: 1.037 sec
    [junit]
    [junit] Testsuite: org.apache.solr.schema.CopyFieldTest
    [junit] Tests run: 6, Failures: 0, Errors: 0, Time elapsed: 0.7 sec
    [junit]
    [junit] Testsuite: org.apache.solr.search.QueryParsingTest
    [junit] Tests run: 2, Failures: 0, Errors: 0, Time elapsed: 1.105 sec
    [junit]
    [junit] Testsuite: org.apache.solr.handler.component.DistributedSpellCheckComponentTest
    [junit] Tests run: 1, Failures: 0, Errors: 0, Time elapsed: 15.104 sec
    [junit]
    [junit] Testsuite: org.apache.solr.schema.LegacyDateFieldTest
    [junit] Tests run: 4, Failures: 0, Errors: 0, Time elapsed: 0.026 sec
    [junit]
    [junit] Testsuite: org.apache.solr.handler.component.DistributedTermsComponentTest
    [junit] Tests run: 1, Failures: 0, Errors: 0, Time elapsed: 14.294 sec
    [junit]
    [junit] Testsuite: org.apache.solr.schema.PolyFieldTest
    [junit] Tests run: 4, Failures: 0, Errors: 0, Time elapsed: 1.657 sec
    [junit]
    [junit] Testsuite: org.apache.solr.response.TestCSVResponseWriter
    [junit] Tests run: 1, Failures: 0, Errors: 0, Time elapsed: 1.317 sec
    [junit]
    [junit] Testsuite: org.apache.solr.search.function.SortByFunctionTest
    [junit] Tests run: 1, Failures: 0, Errors: 0, Time elapsed: 1.273 sec
    [junit]
    [junit] Testsuite: org.apache.solr.schema.TestBinaryField
    [junit] Tests run: 1, Failures: 0, Errors: 0, Time elapsed: 0.505 sec
    [junit]
    [junit] Testsuite: org.apache.solr.TestDistributedSearch
    [junit] Tests run: 1, Failures: 0, Errors: 0, Time elapsed: 36.147 sec
    [junit]
    [junit] Testsuite: org.apache.solr.analysis.TestCollationKeyFilterFactory
    [junit] Tests run: 5, Failures: 0, Errors: 0, Time elapsed: 0.176 sec
    [junit]
    [junit] Testsuite: org.apache.solr.analysis.TestDutchStemFilterFactory
    [junit] Tests run: 1, Failures: 0, Errors: 0, Time elapsed: 0.024 sec
    [junit]
    [junit] Testsuite: org.apache.solr.analysis.TestHindiFilters
    [junit] Tests run: 4, Failures: 0, Errors: 0, Time elapsed: 0.041 sec
    [junit]
    [junit] Testsuite: org.apache.solr.analysis.TestItalianLightStemFilterFactory
    [junit] Tests run: 1, Failures: 0, Errors: 0, Time elapsed: 0.013 sec
    [junit]
    [junit] Testsuite: org.apache.solr.analysis.TestKeepWordFilter
    [junit] Tests run: 1, Failures: 0, Errors: 0, Time elapsed: 0.013 sec
    [junit]
    [junit] Testsuite: org.apache.solr.analysis.TestShingleFilterFactory
    [junit] Tests run: 13, Failures: 0, Errors: 0, Time elapsed: 0.033 sec
    [junit]
    [junit] Testsuite: org.apache.solr.analysis.TestStandardFactories
    [junit] Tests run: 9, Failures: 0, Errors: 0, Time elapsed: 0.03 sec
    [junit]
    [junit] Testsuite: org.apache.solr.analysis.TestSynonymFilter
    [junit] Tests run: 7, Failures: 0, Errors: 0, Time elapsed: 0.036 sec
    [junit]
    [junit] Testsuite: org.apache.solr.analysis.TestTrimFilter
    [junit] Tests run: 1, Failures: 0, Errors: 0, Time elapsed: 0.015 sec
    [junit]
    [junit] Testsuite: org.apache.solr.servlet.SolrRequestParserTest
    [junit] Tests run: 4, Failures: 0, Errors: 0, Time elapsed: 1.001 sec
    [junit]
    [junit] Testsuite: org.apache.solr.search.TestExtendedDismaxParser
    [junit] Tests run: 1, Failures: 0, Errors: 0, Time elapsed: 0.973 sec
    [junit]
    [junit] Testsuite: org.apache.solr.search.TestSearchPerf
    [junit] Tests run: 1, Failures: 0, Errors: 0, Time elapsed: 0.384 sec
    [junit]
    [junit] Testsuite: org.apache.solr.update.DirectUpdateHandlerOptimizeTest
    [junit] Tests run: 1, Failures: 0, Errors: 0, Time elapsed: 1.073 sec
    [junit]
    [junit] Testsuite: org.apache.solr.util.ArraysUtilsTest
    [junit] Tests run: 1, Failures: 0, Errors: 0, Time elapsed: 0.012 sec
    [junit]
    [junit] Testsuite: org.apache.solr.client.solrj.TestBatchUpdate
    [junit] Tests run: 3, Failures: 0, Errors: 0, Time elapsed: 1.542 sec
    [junit]
    [junit] Testsuite: org.apache.solr.client.solrj.beans.TestDocumentObjectBinder
    [junit] Tests run: 4, Failures: 0, Errors: 0, Time elapsed: 0.033 sec
    [junit]
    [junit] Testsuite: org.apache.solr.servlet.NoCacheHeaderTest
    [junit] Tests run: 3, Failures: 0, Errors: 0, Time elapsed: 0.955 sec
    [junit]
    [junit] Testsuite: org.apache.solr.client.solrj.embedded.MergeIndexesEmbeddedTest
    [junit] Tests run: 1, Failures: 0, Errors: 0, Time elapsed: 0.366 sec
    [junit]
    [junit] Testsuite: org.apache.solr.common.util.TestHash
    [junit] Tests run: 2, Failures: 0, Errors: 0, Time elapsed: 0.073 sec
    [junit]
    [junit] Testsuite: org.apache.solr.common.util.TestNamedListCodec
    [junit] Tests run: 4, Failures: 0, Errors: 0, Time elapsed: 0.278 sec
    [junit]
    [junit] Testsuite: org.apache.solr.core.RAMDirectoryFactoryTest
    [junit] Tests run: 2, Failures: 0, Errors: 0, Time elapsed: 0.007 sec
    [junit]
    [junit] Testsuite: org.apache.solr.core.SOLR749Test
    [junit] Tests run: 1, Failures: 0, Errors: 0, Time elapsed: 0.472 sec
    [junit]
    [junit] Tests FAILED
    [junit] Testsuite: org.apache.solr.core.TestJmxIntegration
    [junit] Tests run: 2, Failures: 0, Errors: 0, Time elapsed: 1.056 sec
    [junit]
    [junit] Testsuite: org.apache.solr.handler.TestReplicationHandler
    [junit] Tests run: 7, Failures: 0, Errors: 0, Time elapsed: 34.261 sec
    [junit]
    [junit] ------------- Standard Error -----------------
    [junit] 16-10-2010 12:13:53 AM org.apache.solr.handler.SnapPuller fetchLatestIndex
    [junit] GRAVE: Master at: http://localhost:17793/solr/replication is not available. Index fetch failed. Exception: The host did not accept the connection within timeout of 5000 ms
    [junit] ------------- ---------------- ---------------
    [junit] Testsuite: org.apache.solr.handler.AnalysisRequestHandlerTest
    [junit] Tests run: 1, Failures: 0, Errors: 0, Time elapsed: 0.691 sec
    [junit]
    [junit] Testsuite: org.apache.solr.handler.component.SpellCheckComponentTest
    [junit] Tests run: 8, Failures: 0, Errors: 0, Time elapsed: 1.108 sec
    [junit]
    [junit] Testsuite: org.apache.solr.handler.component.StatsComponentTest
    [junit] Tests run: 1, Failures: 0, Errors: 0, Time elapsed: 3.554 sec
    [junit]
    [junit] ------------- Standard Error -----------------
    [junit] 15/10/2010 09:13:58 ? org.apache.solr.handler.SnapPuller fetchLatestIndex
    [junit] SEVERE: Master at: http://localhost:17793/solr/replication is not available. Index fetch failed. Exception: The host did not accept the connection within timeout of 5000 ms
    [junit] ------------- ---------------- ---------------
    [junit] Testsuite: org.apache.solr.highlight.FastVectorHighlighterTest
    [junit] Tests run: 2, Failures: 0, Errors: 0, Time elapsed: 0.634 sec
    [junit]
    [junit] ------------- Standard Error -----------------
    [junit] 16.10.2010 08:13:59 org.apache.solr.handler.SnapPuller fetchLatestIndex
    [junit] SCHWERWIEGEND: Master at: http://localhost:17834/solr/replication is not available. Index fetch failed. Exception: The host did not accept the connection within timeout of 5000 ms
    [junit] ------------- ---------------- ---------------
    [junit] Testsuite: org.apache.solr.request.JSONWriterTest
    [junit] Tests run: 3, Failures: 0, Errors: 0, Time elapsed: 0.487 sec
    [junit]
    [junit] Testsuite: org.apache.solr.schema.RequiredFieldsTest
    [junit] Tests run: 3, Failures: 0, Errors: 0, Time elapsed: 0.563 sec
    [junit]
    [junit] ------------- Standard Error -----------------
    [junit] 16-oct-2010 4:14:00 org.apache.solr.schema.IndexSchema readSchema
    [junit] GRAVE: uniqueKey should not be multivalued
    [junit] ------------- ---------------- ---------------
    [junit] Testsuite: org.apache.solr.search.TestFastLRUCache
    [junit] Tests run: 2, Failures: 0, Errors: 0, Time elapsed: 0.008 sec
    [junit]
    [junit] Testsuite: org.apache.solr.search.TestIndexSearcher
    [junit] Tests run: 1, Failures: 0, Errors: 0, Time elapsed: 0.403 sec
    [junit]
    [junit] Testsuite: org.apache.solr.spelling.SpellingQueryConverterTest
    [junit] Tests run: 4, Failures: 0, Errors: 0, Time elapsed: 0.012 sec
    [junit]
    [junit] Testsuite: org.apache.solr.request.TestFaceting
    [junit] Tests run: 3, Failures: 0, Errors: 0, Time elapsed: 5.023 sec
    [junit]
    [junit] Testsuite: org.apache.solr.schema.DateFieldTest
    [junit] Tests run: 6, Failures: 0, Errors: 0, Time elapsed: 0.017 sec
    [junit]
    [junit] Testsuite: org.apache.solr.search.TestSolrQueryParser
    [junit] Tests run: 1, Failures: 0, Errors: 0, Time elapsed: 0.58 sec
    [junit]
    [junit] Testsuite: org.apache.solr.update.processor.SignatureUpdateProcessorFactoryTest
    [junit] Tests run: 2, Failures: 0, Errors: 0, Time elapsed: 1.69 sec
    [junit]
    [junit] Testsuite: org.apache.solr.util.TestOpenBitSet
    [junit] Tests run: 3, Failures: 0, Errors: 0, Time elapsed: 0.486 sec
    [junit]
    [junit] ------------- Standard Error -----------------
    [junit] 16.okt.2010 06:14:03 org.apache.solr.handler.SnapPuller fetchLatestIndex
    [junit] SEVERE: Master at: http://localhost:17793/solr/replication is not available. Index fetch failed. Exception: The host did not accept the connection within timeout of 5000 ms
    [junit] ------------- ---------------- ---------------
    [junit] Testsuite: org.apache.solr.search.TestSort
    [junit] Tests run: 1, Failures: 0, Errors: 0, Time elapsed: 1.283 sec
    [junit]
    [junit] Testsuite: org.apache.solr.spelling.FileBasedSpellCheckerTest
    [junit] Tests run: 3, Failures: 0, Errors: 0, Time elapsed: 0.51 sec
    [junit]
    [junit] Testsuite: org.apache.solr.update.DirectUpdateHandlerTest
    [junit] Tests run: 7, Failures: 0, Errors: 0, Time elapsed: 2.044 sec
    [junit]
    [junit] Testsuite: org.apache.solr.util.PrimUtilsTest
    [junit] Tests run: 1, Failures: 0, Errors: 0, Time elapsed: 0.015 sec
    [junit]
    [junit] Testsuite: org.apache.solr.search.TestRangeQuery
    [junit] Tests run: 2, Failures: 0, Errors: 0, Time elapsed: 21.813 sec
    [junit]
    [junit] Testsuite: org.apache.solr.spelling.IndexBasedSpellCheckerTest
    [junit] Tests run: 5, Failures: 0, Errors: 0, Time elapsed: 0.543 sec
    [junit]
    [junit] Testsuite: org.apache.solr.update.DocumentBuilderTest
    [junit] Tests run: 3, Failures: 0, Errors: 0, Time elapsed: 0.396 sec
    [junit]
    [junit] Testsuite: org.apache.solr.util.TestNumberUtils
    [junit] Tests run: 1, Failures: 0, Errors: 0, Time elapsed: 0.196 sec
    [junit]

BUILD FAILED
/usr<https://hudson.apache.org/hudson/job/Lucene-Solr-tests-only-3.x/ws/checkout/build.xml>:27: The following error occurred while executing this line:
/usr<https://hudson.apache.org/hudson/job/Lucene-Solr-tests-only-3.x/ws/checkout/solr/build.xml>:387:
The following error occurred while executing this line:
/usr<https://hudson.apache.org/hudson/job/Lucene-Solr-tests-only-3.x/ws/checkout/solr/build.xml>:481: Tests failed!
The following error occurred while executing this line:
/usr<https://hudson.apache.org/hudson/job/Lucene-Solr-tests-only-3.x/ws/checkout/solr/build.xml>:481: Tests failed!
The following error occurred while executing this line:
/usr<https://hudson.apache.org/hudson/job/Lucene-Solr-tests-only-3.x/ws/checkout/solr/build.xml>:481: Tests failed!
The following error occurred while executing this line:
/usr<https://hudson.apache.org/hudson/job/Lucene-Solr-tests-only-3.x/ws/checkout/solr/build.xml>:481: Tests failed!
The following error occurred while executing this line:
/usr<https://hudson.apache.org/hudson/job/Lucene-Solr-tests-only-3.x/ws/checkout/solr/build.xml>:481: Tests failed!
The following error occurred while executing this line:
/usr<https://hudson.apache.org/hudson/job/Lucene-Solr-tests-only-3.x/ws/checkout/solr/build.xml>:481: Tests failed!

Total time: 4 minutes 44 seconds
Recording test results


---------------------------------------------------------------------
To unsubscribe, e-mail: [hidden email]
For additional commands, e-mail: [hidden email]

Reply | Threaded
Open this post in threaded view
|

Build failed in Hudson: Lucene-Solr-tests-only-3.x #117

Apache Jenkins Server
See <https://hudson.apache.org/hudson/job/Lucene-Solr-tests-only-3.x/117/changes>

Changes:

[yonik] merge trunk 1023040

[yonik] merge trunk 1022989

------------------------------------------
[...truncated 2878 lines...]
    [javac]     p.add("rows",10);
    [javac]          ^
    [javac] /usr<https://hudson.apache.org/hudson/job/Lucene-Solr-tests-only-3.x/ws/checkout/solr/src/test/org/apache/solr/common/util/TestNamedListCodec.java>:51: warning: [unchecked] unchecked call to add(java.lang.String,T) as a member of the raw type org.apache.solr.common.util.NamedList
    [javac]     p.add("start",0);
    [javac]          ^
    [javac] /usr<https://hudson.apache.org/hudson/job/Lucene-Solr-tests-only-3.x/ws/checkout/solr/src/test/org/apache/solr/common/util/TestNamedListCodec.java>:52: warning: [unchecked] unchecked call to add(java.lang.String,T) as a member of the raw type org.apache.solr.common.util.NamedList
    [javac]     p.add("indent","on");
    [javac]          ^
    [javac] /usr<https://hudson.apache.org/hudson/job/Lucene-Solr-tests-only-3.x/ws/checkout/solr/src/test/org/apache/solr/common/util/TestNamedListCodec.java>:53: warning: [unchecked] unchecked call to add(java.lang.String,T) as a member of the raw type org.apache.solr.common.util.NamedList
    [javac]     p.add("q","ipod");
    [javac]          ^
    [javac] /usr<https://hudson.apache.org/hudson/job/Lucene-Solr-tests-only-3.x/ws/checkout/solr/src/test/org/apache/solr/common/util/TestNamedListCodec.java>:57: warning: [unchecked] unchecked call to add(java.lang.String,T) as a member of the raw type org.apache.solr.common.util.NamedList
    [javac]     nl.add("response", list );
    [javac]           ^
    [javac] /usr<https://hudson.apache.org/hudson/job/Lucene-Solr-tests-only-3.x/ws/checkout/solr/src/test/org/apache/solr/common/util/TestNamedListCodec.java>:76: warning: [unchecked] unchecked call to add(java.lang.String,T) as a member of the raw type org.apache.solr.common.util.NamedList
    [javac]     nl.add("zzz",doc);
    [javac]           ^
    [javac] /usr<https://hudson.apache.org/hudson/job/Lucene-Solr-tests-only-3.x/ws/checkout/solr/src/test/org/apache/solr/common/util/TestNamedListCodec.java>:107: warning: [unchecked] unchecked call to add(E) as a member of the raw type java.util.List
    [javac]     list.add(doc);
    [javac]             ^
    [javac] /usr<https://hudson.apache.org/hudson/job/Lucene-Solr-tests-only-3.x/ws/checkout/solr/src/test/org/apache/solr/common/util/TestNamedListCodec.java>:114: warning: [unchecked] unchecked call to add(E) as a member of the raw type java.util.List
    [javac]     list.add(doc);
    [javac]             ^
    [javac] /usr<https://hudson.apache.org/hudson/job/Lucene-Solr-tests-only-3.x/ws/checkout/solr/src/test/org/apache/solr/common/util/TestNamedListCodec.java>:116: warning: [unchecked] unchecked call to add(java.lang.String,T) as a member of the raw type org.apache.solr.common.util.NamedList
    [javac]     nl.add("zzz",list.iterator());
    [javac]           ^
    [javac] /usr<https://hudson.apache.org/hudson/job/Lucene-Solr-tests-only-3.x/ws/checkout/solr/src/test/org/apache/solr/common/util/TestNamedListCodec.java>:136: warning: [unchecked] unchecked call to add(java.lang.String,T) as a member of the raw type org.apache.solr.common.util.NamedList
    [javac]     r.add("keys", map.keySet());
    [javac]          ^
    [javac] /usr<https://hudson.apache.org/hudson/job/Lucene-Solr-tests-only-3.x/ws/checkout/solr/src/test/org/apache/solr/common/util/TestNamedListCodec.java>:137: warning: [unchecked] unchecked call to add(java.lang.String,T) as a member of the raw type org.apache.solr.common.util.NamedList
    [javac]     r.add("more", "less");
    [javac]          ^
    [javac] /usr<https://hudson.apache.org/hudson/job/Lucene-Solr-tests-only-3.x/ws/checkout/solr/src/test/org/apache/solr/common/util/TestNamedListCodec.java>:138: warning: [unchecked] unchecked call to add(java.lang.String,T) as a member of the raw type org.apache.solr.common.util.NamedList
    [javac]     r.add("values", map.values());
    [javac]          ^
    [javac] /usr<https://hudson.apache.org/hudson/job/Lucene-Solr-tests-only-3.x/ws/checkout/solr/src/test/org/apache/solr/common/util/TestNamedListCodec.java>:139: warning: [unchecked] unchecked call to add(java.lang.String,T) as a member of the raw type org.apache.solr.common.util.NamedList
    [javac]     r.add("finally", "the end");
    [javac]          ^
    [javac] /usr<https://hudson.apache.org/hudson/job/Lucene-Solr-tests-only-3.x/ws/checkout/solr/src/test/org/apache/solr/common/util/TestNamedListCodec.java>:188: warning: [unchecked] unchecked call to add(java.lang.String,T) as a member of the raw type org.apache.solr.common.util.NamedList
    [javac]       nl.add(rStr(2), makeRandom(lev-1));
    [javac]             ^
    [javac] /usr<https://hudson.apache.org/hudson/job/Lucene-Solr-tests-only-3.x/ws/checkout/solr/src/test/org/apache/solr/common/util/TestNamedListCodec.java>:197: warning: [unchecked] unchecked call to add(E) as a member of the raw type java.util.ArrayList
    [javac]       lst.add(makeRandom(lev-1));
    [javac]              ^
    [javac] /usr<https://hudson.apache.org/hudson/job/Lucene-Solr-tests-only-3.x/ws/checkout/solr/src/test/org/apache/solr/core/IndexReaderFactoryTest.java>:43: package AlternateIndexReaderTest does not exist
    [javac]     assertTrue("readerFactory is not an instanceof " + AlternateIndexReaderTest.TestIndexReaderFactory.class, readerFactory instanceof StandardIndexReaderFactory);
    [javac]                                                                                ^
    [javac] /usr<https://hudson.apache.org/hudson/job/Lucene-Solr-tests-only-3.x/ws/checkout/solr/src/test/org/apache/solr/core/TestJmxIntegration.java>:63: warning: [unchecked] unchecked conversion
    [javac] found   : java.util.ArrayList
    [javac] required: java.util.List<javax.management.MBeanServer>
    [javac]     List<MBeanServer> servers = MBeanServerFactory.findMBeanServer(null);
    [javac]                                                                   ^
    [javac] /usr<https://hudson.apache.org/hudson/job/Lucene-Solr-tests-only-3.x/ws/checkout/solr/src/test/org/apache/solr/core/TestJmxIntegration.java>:71: warning: [unchecked] unchecked conversion
    [javac] found   : java.util.Set
    [javac] required: java.util.Set<javax.management.ObjectInstance>
    [javac]     Set<ObjectInstance> objects = mbeanServer.queryMBeans(null, null);
    [javac]                                                          ^
    [javac] /usr<https://hudson.apache.org/hudson/job/Lucene-Solr-tests-only-3.x/ws/checkout/solr/src/test/org/apache/solr/core/TestJmxIntegration.java>:85: warning: [unchecked] unchecked conversion
    [javac] found   : java.util.ArrayList
    [javac] required: java.util.List<javax.management.MBeanServer>
    [javac]     List<MBeanServer> servers = MBeanServerFactory.findMBeanServer(null);
    [javac]                                                                   ^
    [javac] /usr<https://hudson.apache.org/hudson/job/Lucene-Solr-tests-only-3.x/ws/checkout/solr/src/test/org/apache/solr/core/TestJmxMonitoredMap.java>:103: warning: [unchecked] unchecked conversion
    [javac] found   : java.util.Set
    [javac] required: java.util.Set<javax.management.ObjectInstance>
    [javac]     Set<ObjectInstance> objects = mbeanServer.queryMBeans(null, Query.match(
    [javac]                                                          ^
    [javac] /usr<https://hudson.apache.org/hudson/job/Lucene-Solr-tests-only-3.x/ws/checkout/solr/src/test/org/apache/solr/core/TestJmxMonitoredMap.java>:109: warning: [unchecked] unchecked conversion
    [javac] found   : java.util.Set
    [javac] required: java.util.Set<javax.management.ObjectInstance>
    [javac]     objects = mbeanServer.queryMBeans(null, Query.match(Query.attr("name"),
    [javac]                                      ^
    [javac] /usr<https://hudson.apache.org/hudson/job/Lucene-Solr-tests-only-3.x/ws/checkout/solr/src/test/org/apache/solr/core/TestJmxMonitoredMap.java>:116: warning: [unchecked] unchecked conversion
    [javac] found   : java.util.Set
    [javac] required: java.util.Set<javax.management.ObjectInstance>
    [javac]     objects = mbeanServer.queryMBeans(null, Query.match(Query.attr("name"),
    [javac]                                      ^
    [javac] /usr<https://hudson.apache.org/hudson/job/Lucene-Solr-tests-only-3.x/ws/checkout/solr/src/test/org/apache/solr/core/TestJmxMonitoredMap.java>:122: warning: [unchecked] unchecked conversion
    [javac] found   : java.util.Set
    [javac] required: java.util.Set<javax.management.ObjectInstance>
    [javac]     objects = mbeanServer.queryMBeans(null, Query.match(Query.attr("name"),
    [javac]                                      ^
    [javac] /usr<https://hudson.apache.org/hudson/job/Lucene-Solr-tests-only-3.x/ws/checkout/solr/src/test/org/apache/solr/handler/AnalysisRequestHandlerTest.java>:59: warning: [unchecked] unchecked cast
    [javac] found   : java.lang.Object
    [javac] required: org.apache.solr.common.util.NamedList<org.apache.solr.common.util.NamedList<org.apache.solr.common.util.NamedList<java.lang.Object>>>
    [javac]     NamedList<NamedList<NamedList<Object>>> theTokens = (NamedList<NamedList<NamedList<Object>>>) result.get("12345");
    [javac]                                                                                                             ^
    [javac] /usr<https://hudson.apache.org/hudson/job/Lucene-Solr-tests-only-3.x/ws/checkout/solr/src/test/org/apache/solr/handler/AnalysisRequestHandlerTest.java>:87: warning: [unchecked] unchecked cast
    [javac] found   : java.lang.Object
    [javac] required: org.apache.solr.common.util.NamedList<org.apache.solr.common.util.NamedList<org.apache.solr.common.util.NamedList<java.lang.Object>>>
    [javac]     theTokens = (NamedList<NamedList<NamedList<Object>>>) result.get("12346");
    [javac]                                                                     ^
    [javac] /usr<https://hudson.apache.org/hudson/job/Lucene-Solr-tests-only-3.x/ws/checkout/solr/src/test/org/apache/solr/handler/DocumentAnalysisRequestHandlerTest.java>:128: warning: [unchecked] unchecked cast
    [javac] found   : java.lang.Object
    [javac] required: org.apache.solr.common.util.NamedList<org.apache.solr.common.util.NamedList<org.apache.solr.common.util.NamedList<java.lang.Object>>>
    [javac]     NamedList<NamedList<NamedList<Object>>> documentResult = (NamedList<NamedList<NamedList<Object>>>) result.get("1");
    [javac]                                                                                                                  ^
    [javac] /usr<https://hudson.apache.org/hudson/job/Lucene-Solr-tests-only-3.x/ws/checkout/solr/src/test/org/apache/solr/handler/DocumentAnalysisRequestHandlerTest.java>:164: warning: [unchecked] unchecked cast
    [javac] found   : java.lang.Object
    [javac] required: java.util.List<org.apache.solr.common.util.NamedList>
    [javac]     tokenList = (List<NamedList>) queryResult.get("org.apache.lucene.analysis.WhitespaceTokenizer");
    [javac]                                                  ^
    [javac] /usr<https://hudson.apache.org/hudson/job/Lucene-Solr-tests-only-3.x/ws/checkout/solr/src/test/org/apache/solr/handler/DocumentAnalysisRequestHandlerTest.java>:170: warning: [unchecked] unchecked cast
    [javac] found   : java.lang.Object
    [javac] required: org.apache.solr.common.util.NamedList<java.util.List<org.apache.solr.common.util.NamedList>>
    [javac]     valueResult = (NamedList<List<NamedList>>) indexResult.get("Jumping Jack");
    [javac]                                                               ^
    [javac] /usr<https://hudson.apache.org/hudson/job/Lucene-Solr-tests-only-3.x/ws/checkout/solr/src/test/org/apache/solr/handler/DocumentAnalysisRequestHandlerTest.java>:180: warning: [unchecked] unchecked cast
    [javac] found   : java.lang.Object
    [javac] required: java.util.List<org.apache.solr.common.util.NamedList>
    [javac]     tokenList = (List<NamedList>) queryResult.get("org.apache.lucene.analysis.standard.StandardTokenizer");
    [javac]                                                  ^
    [javac] /usr<https://hudson.apache.org/hudson/job/Lucene-Solr-tests-only-3.x/ws/checkout/solr/src/test/org/apache/solr/handler/DocumentAnalysisRequestHandlerTest.java>:184: warning: [unchecked] unchecked cast
    [javac] found   : java.lang.Object
    [javac] required: java.util.List<org.apache.solr.common.util.NamedList>
    [javac]     tokenList = (List<NamedList>) queryResult.get("org.apache.lucene.analysis.standard.StandardFilter");
    [javac]                                                  ^
    [javac] /usr<https://hudson.apache.org/hudson/job/Lucene-Solr-tests-only-3.x/ws/checkout/solr/src/test/org/apache/solr/handler/DocumentAnalysisRequestHandlerTest.java>:188: warning: [unchecked] unchecked cast
    [javac] found   : java.lang.Object
    [javac] required: java.util.List<org.apache.solr.common.util.NamedList>
    [javac]     tokenList = (List<NamedList>) queryResult.get("org.apache.lucene.analysis.LowerCaseFilter");
    [javac]                                                  ^
    [javac] /usr<https://hudson.apache.org/hudson/job/Lucene-Solr-tests-only-3.x/ws/checkout/solr/src/test/org/apache/solr/handler/DocumentAnalysisRequestHandlerTest.java>:192: warning: [unchecked] unchecked cast
    [javac] found   : java.lang.Object
    [javac] required: java.util.List<org.apache.solr.common.util.NamedList>
    [javac]     tokenList = (List<NamedList>) queryResult.get("org.apache.lucene.analysis.StopFilter");
    [javac]                                                  ^
    [javac] /usr<https://hudson.apache.org/hudson/job/Lucene-Solr-tests-only-3.x/ws/checkout/solr/src/test/org/apache/solr/handler/DocumentAnalysisRequestHandlerTest.java>:196: warning: [unchecked] unchecked cast
    [javac] found   : java.lang.Object
    [javac] required: java.util.List<org.apache.solr.common.util.NamedList>
    [javac]     tokenList = (List<NamedList>) queryResult.get("org.apache.lucene.analysis.PorterStemFilter");
    [javac]                                                  ^
    [javac] /usr<https://hudson.apache.org/hudson/job/Lucene-Solr-tests-only-3.x/ws/checkout/solr/src/test/org/apache/solr/handler/DocumentAnalysisRequestHandlerTest.java>:202: warning: [unchecked] unchecked cast
    [javac] found   : java.lang.Object
    [javac] required: org.apache.solr.common.util.NamedList<java.util.List<org.apache.solr.common.util.NamedList>>
    [javac]     valueResult = (NamedList<List<NamedList>>) indexResult.get("The Fox Jumped Over The Dogs");
    [javac]                                                               ^
    [javac] /usr<https://hudson.apache.org/hudson/job/Lucene-Solr-tests-only-3.x/ws/checkout/solr/src/test/org/apache/solr/handler/FieldAnalysisRequestHandlerTest.java>:121: warning: [unchecked] unchecked conversion
    [javac] found   : org.apache.solr.common.util.NamedList
    [javac] required: org.apache.solr.common.util.NamedList<org.apache.solr.common.util.NamedList>
    [javac]     NamedList<NamedList> fieldTypes = result.get("field_types");
    [javac]                                                 ^
    [javac] /usr<https://hudson.apache.org/hudson/job/Lucene-Solr-tests-only-3.x/ws/checkout/solr/src/test/org/apache/solr/handler/FieldAnalysisRequestHandlerTest.java>:123: warning: [unchecked] unchecked conversion
    [javac] found   : org.apache.solr.common.util.NamedList
    [javac] required: org.apache.solr.common.util.NamedList<org.apache.solr.common.util.NamedList>
    [javac]     NamedList<NamedList> textType = fieldTypes.get("text");
    [javac]                                                   ^
    [javac] /usr<https://hudson.apache.org/hudson/job/Lucene-Solr-tests-only-3.x/ws/checkout/solr/src/test/org/apache/solr/handler/FieldAnalysisRequestHandlerTest.java>:126: warning: [unchecked] unchecked conversion
    [javac] found   : org.apache.solr.common.util.NamedList
    [javac] required: org.apache.solr.common.util.NamedList<java.util.List<org.apache.solr.common.util.NamedList>>
    [javac]     NamedList<List<NamedList>> indexPart = textType.get("index");
    [javac]                                                        ^
    [javac] /usr<https://hudson.apache.org/hudson/job/Lucene-Solr-tests-only-3.x/ws/checkout/solr/src/test/org/apache/solr/handler/FieldAnalysisRequestHandlerTest.java>:191: warning: [unchecked] unchecked conversion
    [javac] found   : org.apache.solr.common.util.NamedList
    [javac] required: org.apache.solr.common.util.NamedList<java.util.List<org.apache.solr.common.util.NamedList>>
    [javac]     NamedList<List<NamedList>> queryPart = textType.get("query");
    [javac]                                                        ^
    [javac] /usr<https://hudson.apache.org/hudson/job/Lucene-Solr-tests-only-3.x/ws/checkout/solr/src/test/org/apache/solr/handler/FieldAnalysisRequestHandlerTest.java>:220: warning: [unchecked] unchecked conversion
    [javac] found   : org.apache.solr.common.util.NamedList
    [javac] required: org.apache.solr.common.util.NamedList<org.apache.solr.common.util.NamedList>
    [javac]     NamedList<NamedList> nameTextType = fieldTypes.get("nametext");
    [javac]                                                       ^
    [javac] /usr<https://hudson.apache.org/hudson/job/Lucene-Solr-tests-only-3.x/ws/checkout/solr/src/test/org/apache/solr/handler/FieldAnalysisRequestHandlerTest.java>:223: warning: [unchecked] unchecked conversion
    [javac] found   : org.apache.solr.common.util.NamedList
    [javac] required: org.apache.solr.common.util.NamedList<java.util.List<org.apache.solr.common.util.NamedList>>
    [javac]     indexPart = nameTextType.get("index");
    [javac]                                 ^
    [javac] /usr<https://hudson.apache.org/hudson/job/Lucene-Solr-tests-only-3.x/ws/checkout/solr/src/test/org/apache/solr/handler/FieldAnalysisRequestHandlerTest.java>:240: warning: [unchecked] unchecked conversion
    [javac] found   : org.apache.solr.common.util.NamedList
    [javac] required: org.apache.solr.common.util.NamedList<java.util.List<org.apache.solr.common.util.NamedList>>
    [javac]     queryPart = nameTextType.get("query");
    [javac]                                 ^
    [javac] /usr<https://hudson.apache.org/hudson/job/Lucene-Solr-tests-only-3.x/ws/checkout/solr/src/test/org/apache/solr/handler/FieldAnalysisRequestHandlerTest.java>:246: warning: [unchecked] unchecked conversion
    [javac] found   : org.apache.solr.common.util.NamedList
    [javac] required: org.apache.solr.common.util.NamedList<org.apache.solr.common.util.NamedList>
    [javac]     NamedList<NamedList> fieldNames = result.get("field_names");
    [javac]                                                 ^
    [javac] /usr<https://hudson.apache.org/hudson/job/Lucene-Solr-tests-only-3.x/ws/checkout/solr/src/test/org/apache/solr/handler/FieldAnalysisRequestHandlerTest.java>:249: warning: [unchecked] unchecked conversion
    [javac] found   : org.apache.solr.common.util.NamedList
    [javac] required: org.apache.solr.common.util.NamedList<org.apache.solr.common.util.NamedList>
    [javac]     NamedList<NamedList> whitetok = fieldNames.get("whitetok");
    [javac]                                                   ^
    [javac] /usr<https://hudson.apache.org/hudson/job/Lucene-Solr-tests-only-3.x/ws/checkout/solr/src/test/org/apache/solr/handler/FieldAnalysisRequestHandlerTest.java>:252: warning: [unchecked] unchecked conversion
    [javac] found   : org.apache.solr.common.util.NamedList
    [javac] required: org.apache.solr.common.util.NamedList<java.util.List<org.apache.solr.common.util.NamedList>>
    [javac]     indexPart = whitetok.get("index");
    [javac]                             ^
    [javac] /usr<https://hudson.apache.org/hudson/job/Lucene-Solr-tests-only-3.x/ws/checkout/solr/src/test/org/apache/solr/handler/FieldAnalysisRequestHandlerTest.java>:269: warning: [unchecked] unchecked conversion
    [javac] found   : org.apache.solr.common.util.NamedList
    [javac] required: org.apache.solr.common.util.NamedList<java.util.List<org.apache.solr.common.util.NamedList>>
    [javac]     queryPart = whitetok.get("query");
    [javac]                             ^
    [javac] /usr<https://hudson.apache.org/hudson/job/Lucene-Solr-tests-only-3.x/ws/checkout/solr/src/test/org/apache/solr/handler/FieldAnalysisRequestHandlerTest.java>:278: warning: [unchecked] unchecked conversion
    [javac] found   : org.apache.solr.common.util.NamedList
    [javac] required: org.apache.solr.common.util.NamedList<org.apache.solr.common.util.NamedList>
    [javac]     NamedList<NamedList> keywordtok = fieldNames.get("keywordtok");
    [javac]                                                     ^
    [javac] /usr<https://hudson.apache.org/hudson/job/Lucene-Solr-tests-only-3.x/ws/checkout/solr/src/test/org/apache/solr/handler/FieldAnalysisRequestHandlerTest.java>:281: warning: [unchecked] unchecked conversion
    [javac] found   : org.apache.solr.common.util.NamedList
    [javac] required: org.apache.solr.common.util.NamedList<java.util.List<org.apache.solr.common.util.NamedList>>
    [javac]     indexPart = keywordtok.get("index");
    [javac]                               ^
    [javac] /usr<https://hudson.apache.org/hudson/job/Lucene-Solr-tests-only-3.x/ws/checkout/solr/src/test/org/apache/solr/handler/FieldAnalysisRequestHandlerTest.java>:289: warning: [unchecked] unchecked conversion
    [javac] found   : org.apache.solr.common.util.NamedList
    [javac] required: org.apache.solr.common.util.NamedList<java.util.List<org.apache.solr.common.util.NamedList>>
    [javac]     queryPart = keywordtok.get("query");
    [javac]                               ^
    [javac] /usr<https://hudson.apache.org/hudson/job/Lucene-Solr-tests-only-3.x/ws/checkout/solr/src/test/org/apache/solr/handler/FieldAnalysisRequestHandlerTest.java>:310: warning: [unchecked] unchecked conversion
    [javac] found   : org.apache.solr.common.util.NamedList
    [javac] required: org.apache.solr.common.util.NamedList<org.apache.solr.common.util.NamedList>
    [javac]     NamedList<NamedList> fieldTypes = result.get("field_types");
    [javac]                                                 ^
    [javac] /usr<https://hudson.apache.org/hudson/job/Lucene-Solr-tests-only-3.x/ws/checkout/solr/src/test/org/apache/solr/handler/FieldAnalysisRequestHandlerTest.java>:312: warning: [unchecked] unchecked conversion
    [javac] found   : org.apache.solr.common.util.NamedList
    [javac] required: org.apache.solr.common.util.NamedList<org.apache.solr.common.util.NamedList>
    [javac]     NamedList<NamedList> textType = fieldTypes.get("charfilthtmlmap");
    [javac]                                                   ^
    [javac] /usr<https://hudson.apache.org/hudson/job/Lucene-Solr-tests-only-3.x/ws/checkout/solr/src/test/org/apache/solr/handler/FieldAnalysisRequestHandlerTest.java>:321: warning: [unchecked] unchecked cast
    [javac] found   : java.lang.Object
    [javac] required: java.util.List<org.apache.solr.common.util.NamedList>
    [javac]     List<NamedList> tokenList = (List<NamedList>)indexPart.get("org.apache.lucene.analysis.WhitespaceTokenizer");
    [javac]                                                               ^
    [javac] /usr<https://hudson.apache.org/hudson/job/Lucene-Solr-tests-only-3.x/ws/checkout/solr/src/test/org/apache/solr/handler/component/SpellCheckComponentTest.java>:143: warning: [unchecked] unchecked call to add(java.lang.String,T) as a member of the raw type org.apache.solr.common.util.NamedList
    [javac]     spellchecker.add(AbstractLuceneSpellChecker.DICTIONARY_NAME, "default");
    [javac]                     ^
    [javac] /usr<https://hudson.apache.org/hudson/job/Lucene-Solr-tests-only-3.x/ws/checkout/solr/src/test/org/apache/solr/handler/component/SpellCheckComponentTest.java>:144: warning: [unchecked] unchecked call to add(java.lang.String,T) as a member of the raw type org.apache.solr.common.util.NamedList
    [javac]     spellchecker.add(AbstractLuceneSpellChecker.FIELD, "lowerfilt");
    [javac]                     ^
    [javac] /usr<https://hudson.apache.org/hudson/job/Lucene-Solr-tests-only-3.x/ws/checkout/solr/src/test/org/apache/solr/handler/component/SpellCheckComponentTest.java>:145: warning: [unchecked] unchecked call to add(java.lang.String,T) as a member of the raw type org.apache.solr.common.util.NamedList
    [javac]     spellchecker.add(AbstractLuceneSpellChecker.INDEX_DIR, "spellchecker1");
    [javac]                     ^
    [javac] /usr<https://hudson.apache.org/hudson/job/Lucene-Solr-tests-only-3.x/ws/checkout/solr/src/test/org/apache/solr/handler/component/SpellCheckComponentTest.java>:146: warning: [unchecked] unchecked call to add(java.lang.String,T) as a member of the raw type org.apache.solr.common.util.NamedList
    [javac]     args.add("spellchecker", spellchecker);
    [javac]             ^
    [javac] /usr<https://hudson.apache.org/hudson/job/Lucene-Solr-tests-only-3.x/ws/checkout/solr/src/test/org/apache/solr/handler/component/SpellCheckComponentTest.java>:159: warning: [unchecked] unchecked call to ArrayList(java.util.Collection<? extends E>) as a member of the raw type java.util.ArrayList
    [javac]     rb.components = new ArrayList(h.getCore().getSearchComponents().values());
    [javac]                     ^
    [javac] Note: Some input files use or override a deprecated API.
    [javac] Note: Recompile with -Xlint:deprecation for details.
    [javac] Note: Some input files additionally use unchecked or unsafe operations.
    [javac] 1 error
    [javac] 100 warnings

BUILD FAILED
/usr<https://hudson.apache.org/hudson/job/Lucene-Solr-tests-only-3.x/ws/checkout/solr/build.xml>:363: The following error occurred while executing this line:
/usr<https://hudson.apache.org/hudson/job/Lucene-Solr-tests-only-3.x/ws/checkout/solr/common-build.xml>:256: Compile failed; see the compiler error output for details.

Total time: 12 seconds
Recording test results


---------------------------------------------------------------------
To unsubscribe, e-mail: [hidden email]
For additional commands, e-mail: [hidden email]

Reply | Threaded
Open this post in threaded view
|

Hudson build is back to normal : Lucene-Solr-tests-only-3.x #118

Apache Jenkins Server
See <https://hudson.apache.org/hudson/job/Lucene-Solr-tests-only-3.x/118/changes>



---------------------------------------------------------------------
To unsubscribe, e-mail: [hidden email]
For additional commands, e-mail: [hidden email]