Build failed in Hudson: Lucene-Solr-tests-only-trunk #108

classic Classic list List threaded Threaded
9 messages Options
Reply | Threaded
Open this post in threaded view
|

Build failed in Hudson: Lucene-Solr-tests-only-trunk #108

Apache Jenkins Server
See <https://hudson.apache.org/hudson/job/Lucene-Solr-tests-only-trunk/108/changes>

Changes:

[yonik] tests: fix resource leaks and simplify

------------------------------------------
[...truncated 9241 lines...]
    [junit] ------------- ---------------- ---------------
    [junit] Testsuite: org.apache.solr.handler.dataimport.TestEvaluatorBag
    [junit] Tests run: 5, Failures: 0, Errors: 0, Time elapsed: 0.022 sec
    [junit]
    [junit] Testsuite: org.apache.solr.handler.dataimport.TestFieldReader
    [junit] Tests run: 1, Failures: 0, Errors: 0, Time elapsed: 0.018 sec
    [junit]
    [junit] Testsuite: org.apache.solr.handler.dataimport.TestFileListEntityProcessor
    [junit] Testcase: testNTOT(org.apache.solr.handler.dataimport.TestFileListEntityProcessor): Caused an ERROR
    [junit] Invalid expression for date
    [junit] org.apache.solr.handler.dataimport.DataImportHandlerException: Invalid expression for date
    [junit] at org.apache.solr.handler.dataimport.FileListEntityProcessor.getDate(FileListEntityProcessor.java:167)
    [junit] at org.apache.solr.handler.dataimport.FileListEntityProcessor.nextRow(FileListEntityProcessor.java:204)
    [junit] at org.apache.solr.handler.dataimport.TestFileListEntityProcessor.getFiles(TestFileListEntityProcessor.java:124)
    [junit] at org.apache.solr.handler.dataimport.TestFileListEntityProcessor.testNTOT(TestFileListEntityProcessor.java:163)
    [junit] at org.apache.lucene.util.LuceneTestCase$LuceneTestCaseRunner.runChild(LuceneTestCase.java:795)
    [junit] at org.apache.lucene.util.LuceneTestCase$LuceneTestCaseRunner.runChild(LuceneTestCase.java:768)
    [junit] Caused by: java.text.ParseException: Unparseable date: "2010-10-16 00:44:31"
    [junit] at java.text.DateFormat.parse(DateFormat.java:354)
    [junit] at org.apache.solr.handler.dataimport.FileListEntityProcessor.getDate(FileListEntityProcessor.java:165)
    [junit]
    [junit]
    [junit] Tests run: 4, Failures: 0, Errors: 1, Time elapsed: 0.026 sec
    [junit]
    [junit] ------------- Standard Output ---------------
    [junit] NOTE: reproduce with: ant test -Dtestcase=TestFileListEntityProcessor -Dtestmethod=testNTOT -Dtests.seed=-8027869081104081378:-7049435144535689629
    [junit] NOTE: test params are: codec=MockFixedIntBlock(blockSize=1488), locale=zh, timezone=Asia/Dhaka
    [junit] ------------- ---------------- ---------------
    [junit] TEST org.apache.solr.handler.dataimport.TestFileListEntityProcessor FAILED
    [junit] Testsuite: org.apache.solr.handler.dataimport.TestJdbcDataSource
    [junit] Tests run: 3, Failures: 0, Errors: 0, Time elapsed: 0.073 sec
    [junit]
    [junit] Testsuite: org.apache.solr.handler.dataimport.TestLineEntityProcessor
    [junit] Tests run: 4, Failures: 0, Errors: 0, Time elapsed: 0.018 sec
    [junit]
    [junit] Testsuite: org.apache.solr.handler.dataimport.TestNumberFormatTransformer
    [junit] Tests run: 9, Failures: 0, Errors: 0, Time elapsed: 0.028 sec
    [junit]
    [junit] Testsuite: org.apache.solr.handler.dataimport.TestPlainTextEntityProcessor
    [junit] Tests run: 1, Failures: 0, Errors: 0, Time elapsed: 0.021 sec
    [junit]
    [junit] Testsuite: org.apache.solr.handler.dataimport.TestRegexTransformer
    [junit] Tests run: 5, Failures: 0, Errors: 0, Time elapsed: 0.017 sec
    [junit]
    [junit] Testsuite: org.apache.solr.handler.dataimport.TestScriptTransformer
    [junit] Tests run: 0, Failures: 0, Errors: 0, Time elapsed: 0.011 sec
    [junit]
    [junit] Testsuite: org.apache.solr.handler.dataimport.TestSqlEntityProcessor
    [junit] Tests run: 4, Failures: 0, Errors: 0, Time elapsed: 0.032 sec
    [junit]
    [junit]  xml response was: <?xml version="1.0" encoding="UTF-8"?>
    [junit] <response>
    [junit] <lst name="responseHeader"><int name="status">0</int><int name="QTime">2</int><lst name="params"><str name="start">0</str><str name="q">id:5</str><str name="qt">standard</str><str name="rows">20</str><str name="version">2.2</str></lst></lst><result name="response" numFound="0" start="0"/>
    [junit] </response>
    [junit]
    [junit]  request was: start=0&q=id:5&qt=standard&rows=20&version=2.2)
    [junit] Testsuite: org.apache.solr.handler.dataimport.TestSqlEntityProcessor2
    [junit] Testcase: testLastIndexTime(org.apache.solr.handler.dataimport.TestSqlEntityProcessor2): FAILED
    [junit] query failed XPath: //*[@numFound='1']
    [junit]  xml response was: <?xml version="1.0" encoding="UTF-8"?>
    [junit] <response>
    [junit] <lst name="responseHeader"><int name="status">0</int><int name="QTime">2</int><lst name="params"><str name="start">0</str><str name="q">id:5</str><str name="qt">standard</str><str name="rows">20</str><str name="version">2.2</str></lst></lst><result name="response" numFound="0" start="0"/>
    [junit] </response>
    [junit]
    [junit]  request was: start=0&q=id:5&qt=standard&rows=20&version=2.2
    [junit] junit.framework.AssertionFailedError: query failed XPath: //*[@numFound='1']
    [junit]  xml response was: <?xml version="1.0" encoding="UTF-8"?>
    [junit] <response>
    [junit] <lst name="responseHeader"><int name="status">0</int><int name="QTime">2</int><lst name="params"><str name="start">0</str><str name="q">id:5</str><str name="qt">standard</str><str name="rows">20</str><str name="version">2.2</str></lst></lst><result name="response" numFound="0" start="0"/>
    [junit] </response>
    [junit]
    [junit]  request was: start=0&q=id:5&qt=standard&rows=20&version=2.2
    [junit] at org.apache.lucene.util.LuceneTestCase$LuceneTestCaseRunner.runChild(LuceneTestCase.java:795)
    [junit] at org.apache.lucene.util.LuceneTestCase$LuceneTestCaseRunner.runChild(LuceneTestCase.java:768)
    [junit]  xml response was: <?xml version="1.0" encoding="UTF-8"?>
    [junit] <response>
    [junit] <lst name="responseHeader"><int name="status">0</int><int name="QTime">2</int><lst name="params"><str name="start">0</str><str name="q">id:5</str><str name="qt">standard</str><str name="rows">20</str><str name="version">2.2</str></lst></lst><result name="response" numFound="0" start="0"/>
    [junit] </response>
    [junit]
    [junit]  request was: start=0&q=id:5&qt=standard&rows=20&version=2.2
    [junit] at org.apache.solr.SolrTestCaseJ4.assertQ(SolrTestCaseJ4.java:331)
    [junit] at org.apache.solr.SolrTestCaseJ4.assertQ(SolrTestCaseJ4.java:310)
    [junit] at org.apache.solr.handler.dataimport.TestSqlEntityProcessor2.testLastIndexTime(TestSqlEntityProcessor2.java:211)
    [junit]
    [junit]
    [junit] Tests run: 7, Failures: 1, Errors: 0, Time elapsed: 0.779 sec
    [junit]
    [junit] ------------- Standard Output ---------------
    [junit] NOTE: reproduce with: ant test -Dtestcase=TestSqlEntityProcessor2 -Dtestmethod=testLastIndexTime -Dtests.seed=3117566154381214031:-108631550122211442
    [junit] NOTE: test params are: codec=PreFlex, locale=ar_AE, timezone=Atlantic/Bermuda
    [junit] ------------- ---------------- ---------------
    [junit] ------------- Standard Error -----------------
    [junit] 15/10/2010 11:45:22 ? org.apache.solr.handler.dataimport.JdbcDataSource finalize
    [junit] SEVERE: JdbcDataSource was not closed prior to finalize(), indicates a bug -- POSSIBLE RESOURCE LEAK!!!
    [junit] 15/10/2010 11:45:22 ? org.apache.solr.handler.dataimport.JdbcDataSource finalize
    [junit] SEVERE: JdbcDataSource was not closed prior to finalize(), indicates a bug -- POSSIBLE RESOURCE LEAK!!!
    [junit] 15/10/2010 11:45:22 ? org.apache.solr.handler.dataimport.JdbcDataSource finalize
    [junit] SEVERE: JdbcDataSource was not closed prior to finalize(), indicates a bug -- POSSIBLE RESOURCE LEAK!!!
    [junit] 15/10/2010 11:45:22 ? org.apache.solr.handler.dataimport.DocBuilder buildDocument
    [junit] SEVERE: Exception while processing: x document : SolrInputDocument[{}]
    [junit] org.apache.solr.handler.dataimport.DataImportHandlerException: java.text.ParseException: Unparseable date: "1970-01-01 10:00:00"
    [junit] at org.apache.solr.handler.dataimport.DataImportHandlerException.wrapAndThrow(DataImportHandlerException.java:64)
    [junit] at org.apache.solr.handler.dataimport.TestSqlEntityProcessor2$DateFormatValidatingEvaluator.evaluate(TestSqlEntityProcessor2.java:228)
    [junit] at org.apache.solr.handler.dataimport.EvaluatorBag$5.get(EvaluatorBag.java:218)
    [junit] at org.apache.solr.handler.dataimport.EvaluatorBag$5.get(EvaluatorBag.java:205)
    [junit] at org.apache.solr.handler.dataimport.VariableResolverImpl.resolve(VariableResolverImpl.java:116)
    [junit] at org.apache.solr.handler.dataimport.TemplateString.fillTokens(TemplateString.java:81)
    [junit] at org.apache.solr.handler.dataimport.TemplateString.replaceTokens(TemplateString.java:75)
    [junit] at org.apache.solr.handler.dataimport.VariableResolverImpl.replaceTokens(VariableResolverImpl.java:95)
    [junit] at org.apache.solr.handler.dataimport.ContextImpl.replaceTokens(ContextImpl.java:235)
    [junit] at org.apache.solr.handler.dataimport.SqlEntityProcessor.nextRow(SqlEntityProcessor.java:71)
    [junit] at org.apache.solr.handler.dataimport.EntityProcessorWrapper.nextRow(EntityProcessorWrapper.java:233)
    [junit] at org.apache.solr.handler.dataimport.DocBuilder.buildDocument(DocBuilder.java:579)
    [junit] at org.apache.solr.handler.dataimport.DocBuilder.doFullDump(DocBuilder.java:260)
    [junit] at org.apache.solr.handler.dataimport.DocBuilder.execute(DocBuilder.java:184)
    [junit] at org.apache.solr.handler.dataimport.DataImporter.doFullImport(DataImporter.java:334)
    [junit] at org.apache.solr.handler.dataimport.DataImporter.runCmd(DataImporter.java:392)
    [junit] at org.apache.solr.handler.dataimport.DataImportHandler.handleRequestBody(DataImportHandler.java:203)
    [junit] at org.apache.solr.handler.RequestHandlerBase.handleRequest(RequestHandlerBase.java:131)
    [junit] at org.apache.solr.core.SolrCore.execute(SolrCore.java:1325)
    [junit] at org.apache.solr.util.TestHarness.queryAndResponse(TestHarness.java:339)
    [junit] at org.apache.solr.util.TestHarness.query(TestHarness.java:322)
    [junit] at org.apache.solr.handler.dataimport.AbstractDataImportHandlerTestCase.runFullImport(AbstractDataImportHandlerTestCase.java:81)
    [junit] at org.apache.solr.handler.dataimport.TestSqlEntityProcessor2.testLastIndexTime(TestSqlEntityProcessor2.java:210)
    [junit] at sun.reflect.NativeMethodAccessorImpl.invoke0(Native Method)
    [junit] at sun.reflect.NativeMethodAccessorImpl.invoke(NativeMethodAccessorImpl.java:57)
    [junit] at sun.reflect.DelegatingMethodAccessorImpl.invoke(DelegatingMethodAccessorImpl.java:43)
    [junit] at java.lang.reflect.Method.invoke(Method.java:616)
    [junit] at org.junit.runners.model.FrameworkMethod$1.runReflectiveCall(FrameworkMethod.java:44)
    [junit] at org.junit.internal.runners.model.ReflectiveCallable.run(ReflectiveCallable.java:15)
    [junit] at org.junit.runners.model.FrameworkMethod.invokeExplosively(FrameworkMethod.java:41)
    [junit] at org.junit.internal.runners.statements.InvokeMethod.evaluate(InvokeMethod.java:20)
    [junit] at org.junit.rules.TestWatchman$1.evaluate(TestWatchman.java:48)
    [junit] at org.junit.internal.runners.statements.RunBefores.evaluate(RunBefores.java:28)
    [junit] at org.junit.internal.runners.statements.RunAfters.evaluate(RunAfters.java:31)
    [junit] at org.junit.runners.BlockJUnit4ClassRunner.runChild(BlockJUnit4ClassRunner.java:76)
    [junit] at org.apache.lucene.util.LuceneTestCase$LuceneTestCaseRunner.runChild(LuceneTestCase.java:795)
    [junit] at org.apache.lucene.util.LuceneTestCase$LuceneTestCaseRunner.runChild(LuceneTestCase.java:768)
    [junit] at org.junit.runners.ParentRunner$3.run(ParentRunner.java:193)
    [junit] at org.junit.runners.ParentRunner$1.schedule(ParentRunner.java:52)
    [junit] at org.junit.runners.ParentRunner.runChildren(ParentRunner.java:191)
    [junit] at org.junit.runners.ParentRunner.access$000(ParentRunner.java:42)
    [junit] at org.junit.runners.ParentRunner$2.evaluate(ParentRunner.java:184)
    [junit] at org.junit.internal.runners.statements.RunBefores.evaluate(RunBefores.java:28)
    [junit] at org.junit.internal.runners.statements.RunAfters.evaluate(RunAfters.java:31)
    [junit] at org.junit.runners.ParentRunner.run(ParentRunner.java:236)
    [junit] at junit.framework.JUnit4TestAdapter.run(JUnit4TestAdapter.java:39)
    [junit] at org.apache.tools.ant.taskdefs.optional.junit.JUnitTestRunner.run(JUnitTestRunner.java:421)
    [junit] at org.apache.tools.ant.taskdefs.optional.junit.JUnitTestRunner.launch(JUnitTestRunner.java:912)
    [junit] at org.apache.tools.ant.taskdefs.optional.junit.JUnitTestRunner.main(JUnitTestRunner.java:743)
    [junit] Caused by: java.text.ParseException: Unparseable date: "1970-01-01 10:00:00"
    [junit] at java.text.DateFormat.parse(DateFormat.java:354)
    [junit] at org.apache.solr.handler.dataimport.TestSqlEntityProcessor2$DateFormatValidatingEvaluator.evaluate(TestSqlEntityProcessor2.java:226)
    [junit] ... 47 more
    [junit] 15/10/2010 11:45:22 ? org.apache.solr.handler.dataimport.DataImporter doFullImport
    [junit] SEVERE: Full Import failed
    [junit] org.apache.solr.handler.dataimport.DataImportHandlerException: java.text.ParseException: Unparseable date: "1970-01-01 10:00:00"
    [junit] at org.apache.solr.handler.dataimport.DataImportHandlerException.wrapAndThrow(DataImportHandlerException.java:64)
    [junit] at org.apache.solr.handler.dataimport.TestSqlEntityProcessor2$DateFormatValidatingEvaluator.evaluate(TestSqlEntityProcessor2.java:228)
    [junit] at org.apache.solr.handler.dataimport.EvaluatorBag$5.get(EvaluatorBag.java:218)
    [junit] at org.apache.solr.handler.dataimport.EvaluatorBag$5.get(EvaluatorBag.java:205)
    [junit] at org.apache.solr.handler.dataimport.VariableResolverImpl.resolve(VariableResolverImpl.java:116)
    [junit] at org.apache.solr.handler.dataimport.TemplateString.fillTokens(TemplateString.java:81)
    [junit] at org.apache.solr.handler.dataimport.TemplateString.replaceTokens(TemplateString.java:75)
    [junit] at org.apache.solr.handler.dataimport.VariableResolverImpl.replaceTokens(VariableResolverImpl.java:95)
    [junit] at org.apache.solr.handler.dataimport.ContextImpl.replaceTokens(ContextImpl.java:235)
    [junit] at org.apache.solr.handler.dataimport.SqlEntityProcessor.nextRow(SqlEntityProcessor.java:71)
    [junit] at org.apache.solr.handler.dataimport.EntityProcessorWrapper.nextRow(EntityProcessorWrapper.java:233)
    [junit] at org.apache.solr.handler.dataimport.DocBuilder.buildDocument(DocBuilder.java:579)
    [junit] at org.apache.solr.handler.dataimport.DocBuilder.doFullDump(DocBuilder.java:260)
    [junit] at org.apache.solr.handler.dataimport.DocBuilder.execute(DocBuilder.java:184)
    [junit] at org.apache.solr.handler.dataimport.DataImporter.doFullImport(DataImporter.java:334)
    [junit] at org.apache.solr.handler.dataimport.DataImporter.runCmd(DataImporter.java:392)
    [junit] at org.apache.solr.handler.dataimport.DataImportHandler.handleRequestBody(DataImportHandler.java:203)
    [junit] at org.apache.solr.handler.RequestHandlerBase.handleRequest(RequestHandlerBase.java:131)
    [junit] at org.apache.solr.core.SolrCore.execute(SolrCore.java:1325)
    [junit] at org.apache.solr.util.TestHarness.queryAndResponse(TestHarness.java:339)
    [junit] at org.apache.solr.util.TestHarness.query(TestHarness.java:322)
    [junit] at org.apache.solr.handler.dataimport.AbstractDataImportHandlerTestCase.runFullImport(AbstractDataImportHandlerTestCase.java:81)
    [junit] at org.apache.solr.handler.dataimport.TestSqlEntityProcessor2.testLastIndexTime(TestSqlEntityProcessor2.java:210)
    [junit] at sun.reflect.NativeMethodAccessorImpl.invoke0(Native Method)
    [junit] at sun.reflect.NativeMethodAccessorImpl.invoke(NativeMethodAccessorImpl.java:57)
    [junit] at sun.reflect.DelegatingMethodAccessorImpl.invoke(DelegatingMethodAccessorImpl.java:43)
    [junit] at java.lang.reflect.Method.invoke(Method.java:616)
    [junit] at org.junit.runners.model.FrameworkMethod$1.runReflectiveCall(FrameworkMethod.java:44)
    [junit] at org.junit.internal.runners.model.ReflectiveCallable.run(ReflectiveCallable.java:15)
    [junit] at org.junit.runners.model.FrameworkMethod.invokeExplosively(FrameworkMethod.java:41)
    [junit] at org.junit.internal.runners.statements.InvokeMethod.evaluate(InvokeMethod.java:20)
    [junit] at org.junit.rules.TestWatchman$1.evaluate(TestWatchman.java:48)
    [junit] at org.junit.internal.runners.statements.RunBefores.evaluate(RunBefores.java:28)
    [junit] at org.junit.internal.runners.statements.RunAfters.evaluate(RunAfters.java:31)
    [junit] at org.junit.runners.BlockJUnit4ClassRunner.runChild(BlockJUnit4ClassRunner.java:76)
    [junit] at org.apache.lucene.util.LuceneTestCase$LuceneTestCaseRunner.runChild(LuceneTestCase.java:795)
    [junit] at org.apache.lucene.util.LuceneTestCase$LuceneTestCaseRunner.runChild(LuceneTestCase.java:768)
    [junit] at org.junit.runners.ParentRunner$3.run(ParentRunner.java:193)
    [junit] at org.junit.runners.ParentRunner$1.schedule(ParentRunner.java:52)
    [junit] at org.junit.runners.ParentRunner.runChildren(ParentRunner.java:191)
    [junit] at org.junit.runners.ParentRunner.access$000(ParentRunner.java:42)
    [junit] at org.junit.runners.ParentRunner$2.evaluate(ParentRunner.java:184)
    [junit] at org.junit.internal.runners.statements.RunBefores.evaluate(RunBefores.java:28)
    [junit] at org.junit.internal.runners.statements.RunAfters.evaluate(RunAfters.java:31)
    [junit] at org.junit.runners.ParentRunner.run(ParentRunner.java:236)
    [junit] at junit.framework.JUnit4TestAdapter.run(JUnit4TestAdapter.java:39)
    [junit] at org.apache.tools.ant.taskdefs.optional.junit.JUnitTestRunner.run(JUnitTestRunner.java:421)
    [junit] at org.apache.tools.ant.taskdefs.optional.junit.JUnitTestRunner.launch(JUnitTestRunner.java:912)
    [junit] at org.apache.tools.ant.taskdefs.optional.junit.JUnitTestRunner.main(JUnitTestRunner.java:743)
    [junit] Caused by: java.text.ParseException: Unparseable date: "1970-01-01 10:00:00"
    [junit] at java.text.DateFormat.parse(DateFormat.java:354)
    [junit] at org.apache.solr.handler.dataimport.TestSqlEntityProcessor2$DateFormatValidatingEvaluator.evaluate(TestSqlEntityProcessor2.java:226)
    [junit] ... 47 more
    [junit] ------------- ---------------- ---------------
    [junit] TEST org.apache.solr.handler.dataimport.TestSqlEntityProcessor2 FAILED
    [junit] Testsuite: org.apache.solr.handler.dataimport.TestSqlEntityProcessorDelta
    [junit] Tests run: 8, Failures: 0, Errors: 0, Time elapsed: 0.917 sec
    [junit]
    [junit] Testsuite: org.apache.solr.handler.dataimport.TestSqlEntityProcessorDelta2
    [junit] Tests run: 8, Failures: 0, Errors: 0, Time elapsed: 0.959 sec
    [junit]
    [junit] Testsuite: org.apache.solr.handler.dataimport.TestTemplateString
    [junit] Tests run: 1, Failures: 0, Errors: 0, Time elapsed: 0.008 sec
    [junit]
    [junit] Testsuite: org.apache.solr.handler.dataimport.TestTemplateTransformer
    [junit] Tests run: 1, Failures: 0, Errors: 0, Time elapsed: 0.013 sec
    [junit]
    [junit] Testsuite: org.apache.solr.handler.dataimport.TestThreaded
    [junit] Tests run: 1, Failures: 0, Errors: 0, Time elapsed: 0.39 sec
    [junit]
    [junit] Testsuite: org.apache.solr.handler.dataimport.TestURLDataSource
    [junit] Tests run: 1, Failures: 0, Errors: 0, Time elapsed: 0.015 sec
    [junit]
    [junit] Testsuite: org.apache.solr.handler.dataimport.TestVariableResolver
    [junit] Tests run: 9, Failures: 0, Errors: 0, Time elapsed: 0.019 sec
    [junit]
    [junit] Testsuite: org.apache.solr.handler.dataimport.TestXPathEntityProcessor
    [junit] Tests run: 8, Failures: 0, Errors: 0, Time elapsed: 0.554 sec
    [junit]
    [junit] Testsuite: org.apache.solr.handler.dataimport.TestXPathRecordReader
    [junit] Tests run: 21, Failures: 0, Errors: 0, Time elapsed: 0.043 sec
    [junit]
    [junit] Tests FAILED

BUILD FAILED
/usr<https://hudson.apache.org/hudson/job/Lucene-Solr-tests-only-trunk/ws/checkout/build.xml>:23: The following error occurred while executing this line:
/usr<https://hudson.apache.org/hudson/job/Lucene-Solr-tests-only-trunk/ws/checkout/solr/common-build.xml>:462: The following error occurred while executing this line:
/usr<https://hudson.apache.org/hudson/job/Lucene-Solr-tests-only-trunk/ws/checkout/solr/common-build.xml>:319: The following error occurred while executing this line:
/usr<https://hudson.apache.org/hudson/job/Lucene-Solr-tests-only-trunk/ws/checkout/solr/contrib/dataimporthandler/build.xml>:192: Tests failed!

Total time: 20 minutes 31 seconds
Recording test results


---------------------------------------------------------------------
To unsubscribe, e-mail: [hidden email]
For additional commands, e-mail: [hidden email]

Reply | Threaded
Open this post in threaded view
|

Build failed in Hudson: Lucene-Solr-tests-only-trunk #109

Apache Jenkins Server
See <https://hudson.apache.org/hudson/job/Lucene-Solr-tests-only-trunk/109/changes>

Changes:

[uschindler] Add Simon also to changes! (LUCENE-2690: MultiTermQuery boolean rewrites per segment)

[rmuir] SOLR-2163: SolrRequestParserTest.testStreamURL test failure

[uschindler] LUCENE-2690: MultiTermQuery boolean rewrites per segment

------------------------------------------
[...truncated 9269 lines...]
    [junit] ------------- ---------------- ---------------
    [junit] Testsuite: org.apache.solr.handler.dataimport.TestEvaluatorBag
    [junit] Tests run: 5, Failures: 0, Errors: 0, Time elapsed: 0.023 sec
    [junit]
    [junit] Testsuite: org.apache.solr.handler.dataimport.TestFieldReader
    [junit] Tests run: 1, Failures: 0, Errors: 0, Time elapsed: 0.019 sec
    [junit]
    [junit] Testsuite: org.apache.solr.handler.dataimport.TestFileListEntityProcessor
    [junit] Testcase: testNTOT(org.apache.solr.handler.dataimport.TestFileListEntityProcessor): Caused an ERROR
    [junit] Invalid expression for date
    [junit] org.apache.solr.handler.dataimport.DataImportHandlerException: Invalid expression for date
    [junit] at org.apache.solr.handler.dataimport.FileListEntityProcessor.getDate(FileListEntityProcessor.java:167)
    [junit] at org.apache.solr.handler.dataimport.FileListEntityProcessor.nextRow(FileListEntityProcessor.java:204)
    [junit] at org.apache.solr.handler.dataimport.TestFileListEntityProcessor.getFiles(TestFileListEntityProcessor.java:124)
    [junit] at org.apache.solr.handler.dataimport.TestFileListEntityProcessor.testNTOT(TestFileListEntityProcessor.java:163)
    [junit] at org.apache.lucene.util.LuceneTestCase$LuceneTestCaseRunner.runChild(LuceneTestCase.java:795)
    [junit] at org.apache.lucene.util.LuceneTestCase$LuceneTestCaseRunner.runChild(LuceneTestCase.java:768)
    [junit] Caused by: java.text.ParseException: Unparseable date: "2010-10-15 13:03:05"
    [junit] at java.text.DateFormat.parse(DateFormat.java:354)
    [junit] at org.apache.solr.handler.dataimport.FileListEntityProcessor.getDate(FileListEntityProcessor.java:165)
    [junit]
    [junit]
    [junit] Tests run: 4, Failures: 0, Errors: 1, Time elapsed: 0.029 sec
    [junit]
    [junit] ------------- Standard Output ---------------
    [junit] NOTE: reproduce with: ant test -Dtestcase=TestFileListEntityProcessor -Dtestmethod=testNTOT -Dtests.seed=-930056598562290334:-3742518057033771579
    [junit] NOTE: test params are: codec=Pulsing(freqCutoff=7), locale=zh_SG, timezone=America/Maceio
    [junit] ------------- ---------------- ---------------
    [junit] TEST org.apache.solr.handler.dataimport.TestFileListEntityProcessor FAILED
    [junit] Testsuite: org.apache.solr.handler.dataimport.TestJdbcDataSource
    [junit] Tests run: 3, Failures: 0, Errors: 0, Time elapsed: 0.071 sec
    [junit]
    [junit] Testsuite: org.apache.solr.handler.dataimport.TestLineEntityProcessor
    [junit] Tests run: 4, Failures: 0, Errors: 0, Time elapsed: 0.017 sec
    [junit]
    [junit] Testsuite: org.apache.solr.handler.dataimport.TestNumberFormatTransformer
    [junit] Tests run: 9, Failures: 0, Errors: 0, Time elapsed: 0.027 sec
    [junit]
    [junit] Testsuite: org.apache.solr.handler.dataimport.TestPlainTextEntityProcessor
    [junit] Tests run: 1, Failures: 0, Errors: 0, Time elapsed: 0.019 sec
    [junit]
    [junit] Testsuite: org.apache.solr.handler.dataimport.TestRegexTransformer
    [junit] Tests run: 5, Failures: 0, Errors: 0, Time elapsed: 0.016 sec
    [junit]
    [junit] Testsuite: org.apache.solr.handler.dataimport.TestScriptTransformer
    [junit] Tests run: 0, Failures: 0, Errors: 0, Time elapsed: 0.011 sec
    [junit]
    [junit] Testsuite: org.apache.solr.handler.dataimport.TestSqlEntityProcessor
    [junit] Tests run: 4, Failures: 0, Errors: 0, Time elapsed: 0.018 sec
    [junit]
    [junit]  xml response was: <?xml version="1.0" encoding="UTF-8"?>
    [junit] <response>
    [junit] <lst name="responseHeader"><int name="status">0</int><int name="QTime">2</int><lst name="params"><str name="start">0</str><str name="q">id:5</str><str name="qt">standard</str><str name="rows">20</str><str name="version">2.2</str></lst></lst><result name="response" numFound="0" start="0"/>
    [junit] </response>
    [junit]
    [junit]  request was: start=0&q=id:5&qt=standard&rows=20&version=2.2)
    [junit] Testsuite: org.apache.solr.handler.dataimport.TestSqlEntityProcessor2
    [junit] Testcase: testLastIndexTime(org.apache.solr.handler.dataimport.TestSqlEntityProcessor2): FAILED
    [junit] query failed XPath: //*[@numFound='1']
    [junit]  xml response was: <?xml version="1.0" encoding="UTF-8"?>
    [junit] <response>
    [junit] <lst name="responseHeader"><int name="status">0</int><int name="QTime">2</int><lst name="params"><str name="start">0</str><str name="q">id:5</str><str name="qt">standard</str><str name="rows">20</str><str name="version">2.2</str></lst></lst><result name="response" numFound="0" start="0"/>
    [junit] </response>
    [junit]
    [junit]  request was: start=0&q=id:5&qt=standard&rows=20&version=2.2
    [junit] junit.framework.AssertionFailedError: query failed XPath: //*[@numFound='1']
    [junit]  xml response was: <?xml version="1.0" encoding="UTF-8"?>
    [junit] <response>
    [junit] <lst name="responseHeader"><int name="status">0</int><int name="QTime">2</int><lst name="params"><str name="start">0</str><str name="q">id:5</str><str name="qt">standard</str><str name="rows">20</str><str name="version">2.2</str></lst></lst><result name="response" numFound="0" start="0"/>
    [junit] </response>
    [junit]
    [junit]  request was: start=0&q=id:5&qt=standard&rows=20&version=2.2
    [junit] at org.apache.lucene.util.LuceneTestCase$LuceneTestCaseRunner.runChild(LuceneTestCase.java:795)
    [junit] at org.apache.lucene.util.LuceneTestCase$LuceneTestCaseRunner.runChild(LuceneTestCase.java:768)
    [junit]  xml response was: <?xml version="1.0" encoding="UTF-8"?>
    [junit] <response>
    [junit] <lst name="responseHeader"><int name="status">0</int><int name="QTime">2</int><lst name="params"><str name="start">0</str><str name="q">id:5</str><str name="qt">standard</str><str name="rows">20</str><str name="version">2.2</str></lst></lst><result name="response" numFound="0" start="0"/>
    [junit] </response>
    [junit]
    [junit]  request was: start=0&q=id:5&qt=standard&rows=20&version=2.2
    [junit] at org.apache.solr.SolrTestCaseJ4.assertQ(SolrTestCaseJ4.java:331)
    [junit] at org.apache.solr.SolrTestCaseJ4.assertQ(SolrTestCaseJ4.java:310)
    [junit] at org.apache.solr.handler.dataimport.TestSqlEntityProcessor2.testLastIndexTime(TestSqlEntityProcessor2.java:211)
    [junit]
    [junit]
    [junit] Tests run: 7, Failures: 1, Errors: 0, Time elapsed: 0.837 sec
    [junit]
    [junit] ------------- Standard Output ---------------
    [junit] NOTE: reproduce with: ant test -Dtestcase=TestSqlEntityProcessor2 -Dtestmethod=testLastIndexTime -Dtests.seed=450650854128864896:637926046479878687
    [junit] NOTE: test params are: codec=MockSep, locale=ar_SA, timezone=Europe/Simferopol
    [junit] ------------- ---------------- ---------------
    [junit] ------------- Standard Error -----------------
    [junit] 15/10/2010 06:03:56 ? org.apache.solr.handler.dataimport.JdbcDataSource finalize
    [junit] SEVERE: JdbcDataSource was not closed prior to finalize(), indicates a bug -- POSSIBLE RESOURCE LEAK!!!
    [junit] 15/10/2010 06:03:56 ? org.apache.solr.handler.dataimport.JdbcDataSource finalize
    [junit] SEVERE: JdbcDataSource was not closed prior to finalize(), indicates a bug -- POSSIBLE RESOURCE LEAK!!!
    [junit] 15/10/2010 06:03:56 ? org.apache.solr.handler.dataimport.JdbcDataSource finalize
    [junit] SEVERE: JdbcDataSource was not closed prior to finalize(), indicates a bug -- POSSIBLE RESOURCE LEAK!!!
    [junit] 15/10/2010 06:03:56 ? org.apache.solr.handler.dataimport.DocBuilder buildDocument
    [junit] SEVERE: Exception while processing: x document : SolrInputDocument[{}]
    [junit] org.apache.solr.handler.dataimport.DataImportHandlerException: java.text.ParseException: Unparseable date: "1969-12-31 22:00:00"
    [junit] at org.apache.solr.handler.dataimport.DataImportHandlerException.wrapAndThrow(DataImportHandlerException.java:64)
    [junit] at org.apache.solr.handler.dataimport.TestSqlEntityProcessor2$DateFormatValidatingEvaluator.evaluate(TestSqlEntityProcessor2.java:228)
    [junit] at org.apache.solr.handler.dataimport.EvaluatorBag$5.get(EvaluatorBag.java:218)
    [junit] at org.apache.solr.handler.dataimport.EvaluatorBag$5.get(EvaluatorBag.java:205)
    [junit] at org.apache.solr.handler.dataimport.VariableResolverImpl.resolve(VariableResolverImpl.java:116)
    [junit] at org.apache.solr.handler.dataimport.TemplateString.fillTokens(TemplateString.java:81)
    [junit] at org.apache.solr.handler.dataimport.TemplateString.replaceTokens(TemplateString.java:75)
    [junit] at org.apache.solr.handler.dataimport.VariableResolverImpl.replaceTokens(VariableResolverImpl.java:95)
    [junit] at org.apache.solr.handler.dataimport.ContextImpl.replaceTokens(ContextImpl.java:235)
    [junit] at org.apache.solr.handler.dataimport.SqlEntityProcessor.nextRow(SqlEntityProcessor.java:71)
    [junit] at org.apache.solr.handler.dataimport.EntityProcessorWrapper.nextRow(EntityProcessorWrapper.java:233)
    [junit] at org.apache.solr.handler.dataimport.DocBuilder.buildDocument(DocBuilder.java:579)
    [junit] at org.apache.solr.handler.dataimport.DocBuilder.doFullDump(DocBuilder.java:260)
    [junit] at org.apache.solr.handler.dataimport.DocBuilder.execute(DocBuilder.java:184)
    [junit] at org.apache.solr.handler.dataimport.DataImporter.doFullImport(DataImporter.java:334)
    [junit] at org.apache.solr.handler.dataimport.DataImporter.runCmd(DataImporter.java:392)
    [junit] at org.apache.solr.handler.dataimport.DataImportHandler.handleRequestBody(DataImportHandler.java:203)
    [junit] at org.apache.solr.handler.RequestHandlerBase.handleRequest(RequestHandlerBase.java:131)
    [junit] at org.apache.solr.core.SolrCore.execute(SolrCore.java:1325)
    [junit] at org.apache.solr.util.TestHarness.queryAndResponse(TestHarness.java:339)
    [junit] at org.apache.solr.util.TestHarness.query(TestHarness.java:322)
    [junit] at org.apache.solr.handler.dataimport.AbstractDataImportHandlerTestCase.runFullImport(AbstractDataImportHandlerTestCase.java:81)
    [junit] at org.apache.solr.handler.dataimport.TestSqlEntityProcessor2.testLastIndexTime(TestSqlEntityProcessor2.java:210)
    [junit] at sun.reflect.NativeMethodAccessorImpl.invoke0(Native Method)
    [junit] at sun.reflect.NativeMethodAccessorImpl.invoke(NativeMethodAccessorImpl.java:57)
    [junit] at sun.reflect.DelegatingMethodAccessorImpl.invoke(DelegatingMethodAccessorImpl.java:43)
    [junit] at java.lang.reflect.Method.invoke(Method.java:616)
    [junit] at org.junit.runners.model.FrameworkMethod$1.runReflectiveCall(FrameworkMethod.java:44)
    [junit] at org.junit.internal.runners.model.ReflectiveCallable.run(ReflectiveCallable.java:15)
    [junit] at org.junit.runners.model.FrameworkMethod.invokeExplosively(FrameworkMethod.java:41)
    [junit] at org.junit.internal.runners.statements.InvokeMethod.evaluate(InvokeMethod.java:20)
    [junit] at org.junit.rules.TestWatchman$1.evaluate(TestWatchman.java:48)
    [junit] at org.junit.internal.runners.statements.RunBefores.evaluate(RunBefores.java:28)
    [junit] at org.junit.internal.runners.statements.RunAfters.evaluate(RunAfters.java:31)
    [junit] at org.junit.runners.BlockJUnit4ClassRunner.runChild(BlockJUnit4ClassRunner.java:76)
    [junit] at org.apache.lucene.util.LuceneTestCase$LuceneTestCaseRunner.runChild(LuceneTestCase.java:795)
    [junit] at org.apache.lucene.util.LuceneTestCase$LuceneTestCaseRunner.runChild(LuceneTestCase.java:768)
    [junit] at org.junit.runners.ParentRunner$3.run(ParentRunner.java:193)
    [junit] at org.junit.runners.ParentRunner$1.schedule(ParentRunner.java:52)
    [junit] at org.junit.runners.ParentRunner.runChildren(ParentRunner.java:191)
    [junit] at org.junit.runners.ParentRunner.access$000(ParentRunner.java:42)
    [junit] at org.junit.runners.ParentRunner$2.evaluate(ParentRunner.java:184)
    [junit] at org.junit.internal.runners.statements.RunBefores.evaluate(RunBefores.java:28)
    [junit] at org.junit.internal.runners.statements.RunAfters.evaluate(RunAfters.java:31)
    [junit] at org.junit.runners.ParentRunner.run(ParentRunner.java:236)
    [junit] at junit.framework.JUnit4TestAdapter.run(JUnit4TestAdapter.java:39)
    [junit] at org.apache.tools.ant.taskdefs.optional.junit.JUnitTestRunner.run(JUnitTestRunner.java:421)
    [junit] at org.apache.tools.ant.taskdefs.optional.junit.JUnitTestRunner.launch(JUnitTestRunner.java:912)
    [junit] at org.apache.tools.ant.taskdefs.optional.junit.JUnitTestRunner.main(JUnitTestRunner.java:743)
    [junit] Caused by: java.text.ParseException: Unparseable date: "1969-12-31 22:00:00"
    [junit] at java.text.DateFormat.parse(DateFormat.java:354)
    [junit] at org.apache.solr.handler.dataimport.TestSqlEntityProcessor2$DateFormatValidatingEvaluator.evaluate(TestSqlEntityProcessor2.java:226)
    [junit] ... 47 more
    [junit] 15/10/2010 06:03:56 ? org.apache.solr.handler.dataimport.DataImporter doFullImport
    [junit] SEVERE: Full Import failed
    [junit] org.apache.solr.handler.dataimport.DataImportHandlerException: java.text.ParseException: Unparseable date: "1969-12-31 22:00:00"
    [junit] at org.apache.solr.handler.dataimport.DataImportHandlerException.wrapAndThrow(DataImportHandlerException.java:64)
    [junit] at org.apache.solr.handler.dataimport.TestSqlEntityProcessor2$DateFormatValidatingEvaluator.evaluate(TestSqlEntityProcessor2.java:228)
    [junit] at org.apache.solr.handler.dataimport.EvaluatorBag$5.get(EvaluatorBag.java:218)
    [junit] at org.apache.solr.handler.dataimport.EvaluatorBag$5.get(EvaluatorBag.java:205)
    [junit] at org.apache.solr.handler.dataimport.VariableResolverImpl.resolve(VariableResolverImpl.java:116)
    [junit] at org.apache.solr.handler.dataimport.TemplateString.fillTokens(TemplateString.java:81)
    [junit] at org.apache.solr.handler.dataimport.TemplateString.replaceTokens(TemplateString.java:75)
    [junit] at org.apache.solr.handler.dataimport.VariableResolverImpl.replaceTokens(VariableResolverImpl.java:95)
    [junit] at org.apache.solr.handler.dataimport.ContextImpl.replaceTokens(ContextImpl.java:235)
    [junit] at org.apache.solr.handler.dataimport.SqlEntityProcessor.nextRow(SqlEntityProcessor.java:71)
    [junit] at org.apache.solr.handler.dataimport.EntityProcessorWrapper.nextRow(EntityProcessorWrapper.java:233)
    [junit] at org.apache.solr.handler.dataimport.DocBuilder.buildDocument(DocBuilder.java:579)
    [junit] at org.apache.solr.handler.dataimport.DocBuilder.doFullDump(DocBuilder.java:260)
    [junit] at org.apache.solr.handler.dataimport.DocBuilder.execute(DocBuilder.java:184)
    [junit] at org.apache.solr.handler.dataimport.DataImporter.doFullImport(DataImporter.java:334)
    [junit] at org.apache.solr.handler.dataimport.DataImporter.runCmd(DataImporter.java:392)
    [junit] at org.apache.solr.handler.dataimport.DataImportHandler.handleRequestBody(DataImportHandler.java:203)
    [junit] at org.apache.solr.handler.RequestHandlerBase.handleRequest(RequestHandlerBase.java:131)
    [junit] at org.apache.solr.core.SolrCore.execute(SolrCore.java:1325)
    [junit] at org.apache.solr.util.TestHarness.queryAndResponse(TestHarness.java:339)
    [junit] at org.apache.solr.util.TestHarness.query(TestHarness.java:322)
    [junit] at org.apache.solr.handler.dataimport.AbstractDataImportHandlerTestCase.runFullImport(AbstractDataImportHandlerTestCase.java:81)
    [junit] at org.apache.solr.handler.dataimport.TestSqlEntityProcessor2.testLastIndexTime(TestSqlEntityProcessor2.java:210)
    [junit] at sun.reflect.NativeMethodAccessorImpl.invoke0(Native Method)
    [junit] at sun.reflect.NativeMethodAccessorImpl.invoke(NativeMethodAccessorImpl.java:57)
    [junit] at sun.reflect.DelegatingMethodAccessorImpl.invoke(DelegatingMethodAccessorImpl.java:43)
    [junit] at java.lang.reflect.Method.invoke(Method.java:616)
    [junit] at org.junit.runners.model.FrameworkMethod$1.runReflectiveCall(FrameworkMethod.java:44)
    [junit] at org.junit.internal.runners.model.ReflectiveCallable.run(ReflectiveCallable.java:15)
    [junit] at org.junit.runners.model.FrameworkMethod.invokeExplosively(FrameworkMethod.java:41)
    [junit] at org.junit.internal.runners.statements.InvokeMethod.evaluate(InvokeMethod.java:20)
    [junit] at org.junit.rules.TestWatchman$1.evaluate(TestWatchman.java:48)
    [junit] at org.junit.internal.runners.statements.RunBefores.evaluate(RunBefores.java:28)
    [junit] at org.junit.internal.runners.statements.RunAfters.evaluate(RunAfters.java:31)
    [junit] at org.junit.runners.BlockJUnit4ClassRunner.runChild(BlockJUnit4ClassRunner.java:76)
    [junit] at org.apache.lucene.util.LuceneTestCase$LuceneTestCaseRunner.runChild(LuceneTestCase.java:795)
    [junit] at org.apache.lucene.util.LuceneTestCase$LuceneTestCaseRunner.runChild(LuceneTestCase.java:768)
    [junit] at org.junit.runners.ParentRunner$3.run(ParentRunner.java:193)
    [junit] at org.junit.runners.ParentRunner$1.schedule(ParentRunner.java:52)
    [junit] at org.junit.runners.ParentRunner.runChildren(ParentRunner.java:191)
    [junit] at org.junit.runners.ParentRunner.access$000(ParentRunner.java:42)
    [junit] at org.junit.runners.ParentRunner$2.evaluate(ParentRunner.java:184)
    [junit] at org.junit.internal.runners.statements.RunBefores.evaluate(RunBefores.java:28)
    [junit] at org.junit.internal.runners.statements.RunAfters.evaluate(RunAfters.java:31)
    [junit] at org.junit.runners.ParentRunner.run(ParentRunner.java:236)
    [junit] at junit.framework.JUnit4TestAdapter.run(JUnit4TestAdapter.java:39)
    [junit] at org.apache.tools.ant.taskdefs.optional.junit.JUnitTestRunner.run(JUnitTestRunner.java:421)
    [junit] at org.apache.tools.ant.taskdefs.optional.junit.JUnitTestRunner.launch(JUnitTestRunner.java:912)
    [junit] at org.apache.tools.ant.taskdefs.optional.junit.JUnitTestRunner.main(JUnitTestRunner.java:743)
    [junit] Caused by: java.text.ParseException: Unparseable date: "1969-12-31 22:00:00"
    [junit] at java.text.DateFormat.parse(DateFormat.java:354)
    [junit] at org.apache.solr.handler.dataimport.TestSqlEntityProcessor2$DateFormatValidatingEvaluator.evaluate(TestSqlEntityProcessor2.java:226)
    [junit] ... 47 more
    [junit] ------------- ---------------- ---------------
    [junit] TEST org.apache.solr.handler.dataimport.TestSqlEntityProcessor2 FAILED
    [junit] Testsuite: org.apache.solr.handler.dataimport.TestSqlEntityProcessorDelta
    [junit] Tests run: 8, Failures: 0, Errors: 0, Time elapsed: 1.152 sec
    [junit]
    [junit] Testsuite: org.apache.solr.handler.dataimport.TestSqlEntityProcessorDelta2
    [junit] Tests run: 8, Failures: 0, Errors: 0, Time elapsed: 1.013 sec
    [junit]
    [junit] Testsuite: org.apache.solr.handler.dataimport.TestTemplateString
    [junit] Tests run: 1, Failures: 0, Errors: 0, Time elapsed: 0.013 sec
    [junit]
    [junit] Testsuite: org.apache.solr.handler.dataimport.TestTemplateTransformer
    [junit] Tests run: 1, Failures: 0, Errors: 0, Time elapsed: 0.02 sec
    [junit]
    [junit] Testsuite: org.apache.solr.handler.dataimport.TestThreaded
    [junit] Tests run: 1, Failures: 0, Errors: 0, Time elapsed: 0.339 sec
    [junit]
    [junit] Testsuite: org.apache.solr.handler.dataimport.TestURLDataSource
    [junit] Tests run: 1, Failures: 0, Errors: 0, Time elapsed: 0.008 sec
    [junit]
    [junit] Testsuite: org.apache.solr.handler.dataimport.TestVariableResolver
    [junit] Tests run: 9, Failures: 0, Errors: 0, Time elapsed: 0.019 sec
    [junit]
    [junit] Testsuite: org.apache.solr.handler.dataimport.TestXPathEntityProcessor
    [junit] Tests run: 8, Failures: 0, Errors: 0, Time elapsed: 0.525 sec
    [junit]
    [junit] Testsuite: org.apache.solr.handler.dataimport.TestXPathRecordReader
    [junit] Tests run: 21, Failures: 0, Errors: 0, Time elapsed: 0.046 sec
    [junit]
    [junit] Tests FAILED

BUILD FAILED
/usr<https://hudson.apache.org/hudson/job/Lucene-Solr-tests-only-trunk/ws/checkout/build.xml>:23: The following error occurred while executing this line:
/usr<https://hudson.apache.org/hudson/job/Lucene-Solr-tests-only-trunk/ws/checkout/solr/common-build.xml>:462: The following error occurred while executing this line:
/usr<https://hudson.apache.org/hudson/job/Lucene-Solr-tests-only-trunk/ws/checkout/solr/common-build.xml>:319: The following error occurred while executing this line:
/usr<https://hudson.apache.org/hudson/job/Lucene-Solr-tests-only-trunk/ws/checkout/solr/contrib/dataimporthandler/build.xml>:192: Tests failed!

Total time: 9 minutes 2 seconds
Recording test results


---------------------------------------------------------------------
To unsubscribe, e-mail: [hidden email]
For additional commands, e-mail: [hidden email]

Reply | Threaded
Open this post in threaded view
|

Build failed in Hudson: Lucene-Solr-tests-only-trunk #110

Apache Jenkins Server
See <https://hudson.apache.org/hudson/job/Lucene-Solr-tests-only-trunk/110/changes>

Changes:

[yonik] tests: fix resource leaks and simplify

------------------------------------------
[...truncated 9242 lines...]
    [junit] ------------- ---------------- ---------------
    [junit] Testsuite: org.apache.solr.handler.dataimport.TestEvaluatorBag
    [junit] Tests run: 5, Failures: 0, Errors: 0, Time elapsed: 0.021 sec
    [junit]
    [junit] Testsuite: org.apache.solr.handler.dataimport.TestFieldReader
    [junit] Tests run: 1, Failures: 0, Errors: 0, Time elapsed: 0.43 sec
    [junit]
    [junit] Testsuite: org.apache.solr.handler.dataimport.TestFileListEntityProcessor
    [junit] Testcase: testNTOT(org.apache.solr.handler.dataimport.TestFileListEntityProcessor): Caused an ERROR
    [junit] Invalid expression for date
    [junit] org.apache.solr.handler.dataimport.DataImportHandlerException: Invalid expression for date
    [junit] at org.apache.solr.handler.dataimport.FileListEntityProcessor.getDate(FileListEntityProcessor.java:167)
    [junit] at org.apache.solr.handler.dataimport.FileListEntityProcessor.nextRow(FileListEntityProcessor.java:204)
    [junit] at org.apache.solr.handler.dataimport.TestFileListEntityProcessor.getFiles(TestFileListEntityProcessor.java:124)
    [junit] at org.apache.solr.handler.dataimport.TestFileListEntityProcessor.testNTOT(TestFileListEntityProcessor.java:163)
    [junit] at org.apache.lucene.util.LuceneTestCase$LuceneTestCaseRunner.runChild(LuceneTestCase.java:795)
    [junit] at org.apache.lucene.util.LuceneTestCase$LuceneTestCaseRunner.runChild(LuceneTestCase.java:768)
    [junit] Caused by: java.text.ParseException: Unparseable date: "2010-10-15 11:32:39"
    [junit] at java.text.DateFormat.parse(DateFormat.java:354)
    [junit] at org.apache.solr.handler.dataimport.FileListEntityProcessor.getDate(FileListEntityProcessor.java:165)
    [junit]
    [junit]
    [junit] Tests run: 4, Failures: 0, Errors: 1, Time elapsed: 0.025 sec
    [junit]
    [junit] ------------- Standard Output ---------------
    [junit] NOTE: reproduce with: ant test -Dtestcase=TestFileListEntityProcessor -Dtestmethod=testNTOT -Dtests.seed=6209640820067196282:376190092445154578
    [junit] NOTE: test params are: codec=PreFlex, locale=es, timezone=Pacific/Kosrae
    [junit] ------------- ---------------- ---------------
    [junit] TEST org.apache.solr.handler.dataimport.TestFileListEntityProcessor FAILED
    [junit] Testsuite: org.apache.solr.handler.dataimport.TestJdbcDataSource
    [junit] Tests run: 3, Failures: 0, Errors: 0, Time elapsed: 0.071 sec
    [junit]
    [junit] Testsuite: org.apache.solr.handler.dataimport.TestLineEntityProcessor
    [junit] Tests run: 4, Failures: 0, Errors: 0, Time elapsed: 0.015 sec
    [junit]
    [junit] Testsuite: org.apache.solr.handler.dataimport.TestNumberFormatTransformer
    [junit] Tests run: 9, Failures: 0, Errors: 0, Time elapsed: 0.523 sec
    [junit]
    [junit] Testsuite: org.apache.solr.handler.dataimport.TestPlainTextEntityProcessor
    [junit] Tests run: 1, Failures: 0, Errors: 0, Time elapsed: 0.019 sec
    [junit]
    [junit] Testsuite: org.apache.solr.handler.dataimport.TestRegexTransformer
    [junit] Tests run: 5, Failures: 0, Errors: 0, Time elapsed: 0.017 sec
    [junit]
    [junit] Testsuite: org.apache.solr.handler.dataimport.TestScriptTransformer
    [junit] Tests run: 0, Failures: 0, Errors: 0, Time elapsed: 0.01 sec
    [junit]
    [junit] Testsuite: org.apache.solr.handler.dataimport.TestSqlEntityProcessor
    [junit] Tests run: 4, Failures: 0, Errors: 0, Time elapsed: 1.275 sec
    [junit]
    [junit]  xml response was: <?xml version="1.0" encoding="UTF-8"?>
    [junit] <response>
    [junit] <lst name="responseHeader"><int name="status">0</int><int name="QTime">3</int><lst name="params"><str name="start">0</str><str name="q">id:5</str><str name="qt">standard</str><str name="rows">20</str><str name="version">2.2</str></lst></lst><result name="response" numFound="0" start="0"/>
    [junit] </response>
    [junit]
    [junit]  request was: start=0&q=id:5&qt=standard&rows=20&version=2.2)
    [junit] Testsuite: org.apache.solr.handler.dataimport.TestSqlEntityProcessor2
    [junit] Testcase: testLastIndexTime(org.apache.solr.handler.dataimport.TestSqlEntityProcessor2): FAILED
    [junit] query failed XPath: //*[@numFound='1']
    [junit]  xml response was: <?xml version="1.0" encoding="UTF-8"?>
    [junit] <response>
    [junit] <lst name="responseHeader"><int name="status">0</int><int name="QTime">3</int><lst name="params"><str name="start">0</str><str name="q">id:5</str><str name="qt">standard</str><str name="rows">20</str><str name="version">2.2</str></lst></lst><result name="response" numFound="0" start="0"/>
    [junit] </response>
    [junit]
    [junit]  request was: start=0&q=id:5&qt=standard&rows=20&version=2.2
    [junit] junit.framework.AssertionFailedError: query failed XPath: //*[@numFound='1']
    [junit]  xml response was: <?xml version="1.0" encoding="UTF-8"?>
    [junit] <response>
    [junit] <lst name="responseHeader"><int name="status">0</int><int name="QTime">3</int><lst name="params"><str name="start">0</str><str name="q">id:5</str><str name="qt">standard</str><str name="rows">20</str><str name="version">2.2</str></lst></lst><result name="response" numFound="0" start="0"/>
    [junit] </response>
    [junit]
    [junit]  request was: start=0&q=id:5&qt=standard&rows=20&version=2.2
    [junit] at org.apache.lucene.util.LuceneTestCase$LuceneTestCaseRunner.runChild(LuceneTestCase.java:795)
    [junit] at org.apache.lucene.util.LuceneTestCase$LuceneTestCaseRunner.runChild(LuceneTestCase.java:768)
    [junit]  xml response was: <?xml version="1.0" encoding="UTF-8"?>
    [junit] <response>
    [junit] <lst name="responseHeader"><int name="status">0</int><int name="QTime">3</int><lst name="params"><str name="start">0</str><str name="q">id:5</str><str name="qt">standard</str><str name="rows">20</str><str name="version">2.2</str></lst></lst><result name="response" numFound="0" start="0"/>
    [junit] </response>
    [junit]
    [junit]  request was: start=0&q=id:5&qt=standard&rows=20&version=2.2
    [junit] at org.apache.solr.SolrTestCaseJ4.assertQ(SolrTestCaseJ4.java:331)
    [junit] at org.apache.solr.SolrTestCaseJ4.assertQ(SolrTestCaseJ4.java:310)
    [junit] at org.apache.solr.handler.dataimport.TestSqlEntityProcessor2.testLastIndexTime(TestSqlEntityProcessor2.java:211)
    [junit]
    [junit]
    [junit] Tests run: 7, Failures: 1, Errors: 0, Time elapsed: 0.804 sec
    [junit]
    [junit] ------------- Standard Output ---------------
    [junit] NOTE: reproduce with: ant test -Dtestcase=TestSqlEntityProcessor2 -Dtestmethod=testLastIndexTime -Dtests.seed=727895375894580248:1833645722407387841
    [junit] NOTE: test params are: codec=MockFixedIntBlock(blockSize=9), locale=ar_TN, timezone=Pacific/Saipan
    [junit] ------------- ---------------- ---------------
    [junit] ------------- Standard Error -----------------
    [junit] 16/10/2010 01:33:32 ? org.apache.solr.handler.dataimport.JdbcDataSource finalize
    [junit] SEVERE: JdbcDataSource was not closed prior to finalize(), indicates a bug -- POSSIBLE RESOURCE LEAK!!!
    [junit] 16/10/2010 01:33:32 ? org.apache.solr.handler.dataimport.JdbcDataSource finalize
    [junit] SEVERE: JdbcDataSource was not closed prior to finalize(), indicates a bug -- POSSIBLE RESOURCE LEAK!!!
    [junit] 16/10/2010 01:33:32 ? org.apache.solr.handler.dataimport.JdbcDataSource finalize
    [junit] SEVERE: JdbcDataSource was not closed prior to finalize(), indicates a bug -- POSSIBLE RESOURCE LEAK!!!
    [junit] 16/10/2010 01:33:32 ? org.apache.solr.handler.dataimport.DocBuilder buildDocument
    [junit] SEVERE: Exception while processing: x document : SolrInputDocument[{}]
    [junit] org.apache.solr.handler.dataimport.DataImportHandlerException: java.text.ParseException: Unparseable date: "1969-12-31 19:00:00"
    [junit] at org.apache.solr.handler.dataimport.DataImportHandlerException.wrapAndThrow(DataImportHandlerException.java:64)
    [junit] at org.apache.solr.handler.dataimport.TestSqlEntityProcessor2$DateFormatValidatingEvaluator.evaluate(TestSqlEntityProcessor2.java:228)
    [junit] at org.apache.solr.handler.dataimport.EvaluatorBag$5.get(EvaluatorBag.java:218)
    [junit] at org.apache.solr.handler.dataimport.EvaluatorBag$5.get(EvaluatorBag.java:205)
    [junit] at org.apache.solr.handler.dataimport.VariableResolverImpl.resolve(VariableResolverImpl.java:116)
    [junit] at org.apache.solr.handler.dataimport.TemplateString.fillTokens(TemplateString.java:81)
    [junit] at org.apache.solr.handler.dataimport.TemplateString.replaceTokens(TemplateString.java:75)
    [junit] at org.apache.solr.handler.dataimport.VariableResolverImpl.replaceTokens(VariableResolverImpl.java:95)
    [junit] at org.apache.solr.handler.dataimport.ContextImpl.replaceTokens(ContextImpl.java:235)
    [junit] at org.apache.solr.handler.dataimport.SqlEntityProcessor.nextRow(SqlEntityProcessor.java:71)
    [junit] at org.apache.solr.handler.dataimport.EntityProcessorWrapper.nextRow(EntityProcessorWrapper.java:233)
    [junit] at org.apache.solr.handler.dataimport.DocBuilder.buildDocument(DocBuilder.java:579)
    [junit] at org.apache.solr.handler.dataimport.DocBuilder.doFullDump(DocBuilder.java:260)
    [junit] at org.apache.solr.handler.dataimport.DocBuilder.execute(DocBuilder.java:184)
    [junit] at org.apache.solr.handler.dataimport.DataImporter.doFullImport(DataImporter.java:334)
    [junit] at org.apache.solr.handler.dataimport.DataImporter.runCmd(DataImporter.java:392)
    [junit] at org.apache.solr.handler.dataimport.DataImportHandler.handleRequestBody(DataImportHandler.java:203)
    [junit] at org.apache.solr.handler.RequestHandlerBase.handleRequest(RequestHandlerBase.java:131)
    [junit] at org.apache.solr.core.SolrCore.execute(SolrCore.java:1325)
    [junit] at org.apache.solr.util.TestHarness.queryAndResponse(TestHarness.java:339)
    [junit] at org.apache.solr.util.TestHarness.query(TestHarness.java:322)
    [junit] at org.apache.solr.handler.dataimport.AbstractDataImportHandlerTestCase.runFullImport(AbstractDataImportHandlerTestCase.java:81)
    [junit] at org.apache.solr.handler.dataimport.TestSqlEntityProcessor2.testLastIndexTime(TestSqlEntityProcessor2.java:210)
    [junit] at sun.reflect.NativeMethodAccessorImpl.invoke0(Native Method)
    [junit] at sun.reflect.NativeMethodAccessorImpl.invoke(NativeMethodAccessorImpl.java:57)
    [junit] at sun.reflect.DelegatingMethodAccessorImpl.invoke(DelegatingMethodAccessorImpl.java:43)
    [junit] at java.lang.reflect.Method.invoke(Method.java:616)
    [junit] at org.junit.runners.model.FrameworkMethod$1.runReflectiveCall(FrameworkMethod.java:44)
    [junit] at org.junit.internal.runners.model.ReflectiveCallable.run(ReflectiveCallable.java:15)
    [junit] at org.junit.runners.model.FrameworkMethod.invokeExplosively(FrameworkMethod.java:41)
    [junit] at org.junit.internal.runners.statements.InvokeMethod.evaluate(InvokeMethod.java:20)
    [junit] at org.junit.rules.TestWatchman$1.evaluate(TestWatchman.java:48)
    [junit] at org.junit.internal.runners.statements.RunBefores.evaluate(RunBefores.java:28)
    [junit] at org.junit.internal.runners.statements.RunAfters.evaluate(RunAfters.java:31)
    [junit] at org.junit.runners.BlockJUnit4ClassRunner.runChild(BlockJUnit4ClassRunner.java:76)
    [junit] at org.apache.lucene.util.LuceneTestCase$LuceneTestCaseRunner.runChild(LuceneTestCase.java:795)
    [junit] at org.apache.lucene.util.LuceneTestCase$LuceneTestCaseRunner.runChild(LuceneTestCase.java:768)
    [junit] at org.junit.runners.ParentRunner$3.run(ParentRunner.java:193)
    [junit] at org.junit.runners.ParentRunner$1.schedule(ParentRunner.java:52)
    [junit] at org.junit.runners.ParentRunner.runChildren(ParentRunner.java:191)
    [junit] at org.junit.runners.ParentRunner.access$000(ParentRunner.java:42)
    [junit] at org.junit.runners.ParentRunner$2.evaluate(ParentRunner.java:184)
    [junit] at org.junit.internal.runners.statements.RunBefores.evaluate(RunBefores.java:28)
    [junit] at org.junit.internal.runners.statements.RunAfters.evaluate(RunAfters.java:31)
    [junit] at org.junit.runners.ParentRunner.run(ParentRunner.java:236)
    [junit] at junit.framework.JUnit4TestAdapter.run(JUnit4TestAdapter.java:39)
    [junit] at org.apache.tools.ant.taskdefs.optional.junit.JUnitTestRunner.run(JUnitTestRunner.java:421)
    [junit] at org.apache.tools.ant.taskdefs.optional.junit.JUnitTestRunner.launch(JUnitTestRunner.java:912)
    [junit] at org.apache.tools.ant.taskdefs.optional.junit.JUnitTestRunner.main(JUnitTestRunner.java:743)
    [junit] Caused by: java.text.ParseException: Unparseable date: "1969-12-31 19:00:00"
    [junit] at java.text.DateFormat.parse(DateFormat.java:354)
    [junit] at org.apache.solr.handler.dataimport.TestSqlEntityProcessor2$DateFormatValidatingEvaluator.evaluate(TestSqlEntityProcessor2.java:226)
    [junit] ... 47 more
    [junit] 16/10/2010 01:33:32 ? org.apache.solr.handler.dataimport.DataImporter doFullImport
    [junit] SEVERE: Full Import failed
    [junit] org.apache.solr.handler.dataimport.DataImportHandlerException: java.text.ParseException: Unparseable date: "1969-12-31 19:00:00"
    [junit] at org.apache.solr.handler.dataimport.DataImportHandlerException.wrapAndThrow(DataImportHandlerException.java:64)
    [junit] at org.apache.solr.handler.dataimport.TestSqlEntityProcessor2$DateFormatValidatingEvaluator.evaluate(TestSqlEntityProcessor2.java:228)
    [junit] at org.apache.solr.handler.dataimport.EvaluatorBag$5.get(EvaluatorBag.java:218)
    [junit] at org.apache.solr.handler.dataimport.EvaluatorBag$5.get(EvaluatorBag.java:205)
    [junit] at org.apache.solr.handler.dataimport.VariableResolverImpl.resolve(VariableResolverImpl.java:116)
    [junit] at org.apache.solr.handler.dataimport.TemplateString.fillTokens(TemplateString.java:81)
    [junit] at org.apache.solr.handler.dataimport.TemplateString.replaceTokens(TemplateString.java:75)
    [junit] at org.apache.solr.handler.dataimport.VariableResolverImpl.replaceTokens(VariableResolverImpl.java:95)
    [junit] at org.apache.solr.handler.dataimport.ContextImpl.replaceTokens(ContextImpl.java:235)
    [junit] at org.apache.solr.handler.dataimport.SqlEntityProcessor.nextRow(SqlEntityProcessor.java:71)
    [junit] at org.apache.solr.handler.dataimport.EntityProcessorWrapper.nextRow(EntityProcessorWrapper.java:233)
    [junit] at org.apache.solr.handler.dataimport.DocBuilder.buildDocument(DocBuilder.java:579)
    [junit] at org.apache.solr.handler.dataimport.DocBuilder.doFullDump(DocBuilder.java:260)
    [junit] at org.apache.solr.handler.dataimport.DocBuilder.execute(DocBuilder.java:184)
    [junit] at org.apache.solr.handler.dataimport.DataImporter.doFullImport(DataImporter.java:334)
    [junit] at org.apache.solr.handler.dataimport.DataImporter.runCmd(DataImporter.java:392)
    [junit] at org.apache.solr.handler.dataimport.DataImportHandler.handleRequestBody(DataImportHandler.java:203)
    [junit] at org.apache.solr.handler.RequestHandlerBase.handleRequest(RequestHandlerBase.java:131)
    [junit] at org.apache.solr.core.SolrCore.execute(SolrCore.java:1325)
    [junit] at org.apache.solr.util.TestHarness.queryAndResponse(TestHarness.java:339)
    [junit] at org.apache.solr.util.TestHarness.query(TestHarness.java:322)
    [junit] at org.apache.solr.handler.dataimport.AbstractDataImportHandlerTestCase.runFullImport(AbstractDataImportHandlerTestCase.java:81)
    [junit] at org.apache.solr.handler.dataimport.TestSqlEntityProcessor2.testLastIndexTime(TestSqlEntityProcessor2.java:210)
    [junit] at sun.reflect.NativeMethodAccessorImpl.invoke0(Native Method)
    [junit] at sun.reflect.NativeMethodAccessorImpl.invoke(NativeMethodAccessorImpl.java:57)
    [junit] at sun.reflect.DelegatingMethodAccessorImpl.invoke(DelegatingMethodAccessorImpl.java:43)
    [junit] at java.lang.reflect.Method.invoke(Method.java:616)
    [junit] at org.junit.runners.model.FrameworkMethod$1.runReflectiveCall(FrameworkMethod.java:44)
    [junit] at org.junit.internal.runners.model.ReflectiveCallable.run(ReflectiveCallable.java:15)
    [junit] at org.junit.runners.model.FrameworkMethod.invokeExplosively(FrameworkMethod.java:41)
    [junit] at org.junit.internal.runners.statements.InvokeMethod.evaluate(InvokeMethod.java:20)
    [junit] at org.junit.rules.TestWatchman$1.evaluate(TestWatchman.java:48)
    [junit] at org.junit.internal.runners.statements.RunBefores.evaluate(RunBefores.java:28)
    [junit] at org.junit.internal.runners.statements.RunAfters.evaluate(RunAfters.java:31)
    [junit] at org.junit.runners.BlockJUnit4ClassRunner.runChild(BlockJUnit4ClassRunner.java:76)
    [junit] at org.apache.lucene.util.LuceneTestCase$LuceneTestCaseRunner.runChild(LuceneTestCase.java:795)
    [junit] at org.apache.lucene.util.LuceneTestCase$LuceneTestCaseRunner.runChild(LuceneTestCase.java:768)
    [junit] at org.junit.runners.ParentRunner$3.run(ParentRunner.java:193)
    [junit] at org.junit.runners.ParentRunner$1.schedule(ParentRunner.java:52)
    [junit] at org.junit.runners.ParentRunner.runChildren(ParentRunner.java:191)
    [junit] at org.junit.runners.ParentRunner.access$000(ParentRunner.java:42)
    [junit] at org.junit.runners.ParentRunner$2.evaluate(ParentRunner.java:184)
    [junit] at org.junit.internal.runners.statements.RunBefores.evaluate(RunBefores.java:28)
    [junit] at org.junit.internal.runners.statements.RunAfters.evaluate(RunAfters.java:31)
    [junit] at org.junit.runners.ParentRunner.run(ParentRunner.java:236)
    [junit] at junit.framework.JUnit4TestAdapter.run(JUnit4TestAdapter.java:39)
    [junit] at org.apache.tools.ant.taskdefs.optional.junit.JUnitTestRunner.run(JUnitTestRunner.java:421)
    [junit] at org.apache.tools.ant.taskdefs.optional.junit.JUnitTestRunner.launch(JUnitTestRunner.java:912)
    [junit] at org.apache.tools.ant.taskdefs.optional.junit.JUnitTestRunner.main(JUnitTestRunner.java:743)
    [junit] Caused by: java.text.ParseException: Unparseable date: "1969-12-31 19:00:00"
    [junit] at java.text.DateFormat.parse(DateFormat.java:354)
    [junit] at org.apache.solr.handler.dataimport.TestSqlEntityProcessor2$DateFormatValidatingEvaluator.evaluate(TestSqlEntityProcessor2.java:226)
    [junit] ... 47 more
    [junit] ------------- ---------------- ---------------
    [junit] TEST org.apache.solr.handler.dataimport.TestSqlEntityProcessor2 FAILED
    [junit] Testsuite: org.apache.solr.handler.dataimport.TestSqlEntityProcessorDelta
    [junit] Tests run: 8, Failures: 0, Errors: 0, Time elapsed: 1.141 sec
    [junit]
    [junit] Testsuite: org.apache.solr.handler.dataimport.TestSqlEntityProcessorDelta2
    [junit] Tests run: 8, Failures: 0, Errors: 0, Time elapsed: 1.203 sec
    [junit]
    [junit] Testsuite: org.apache.solr.handler.dataimport.TestTemplateString
    [junit] Tests run: 1, Failures: 0, Errors: 0, Time elapsed: 0.008 sec
    [junit]
    [junit] Testsuite: org.apache.solr.handler.dataimport.TestTemplateTransformer
    [junit] Tests run: 1, Failures: 0, Errors: 0, Time elapsed: 0.008 sec
    [junit]
    [junit] Testsuite: org.apache.solr.handler.dataimport.TestThreaded
    [junit] Tests run: 1, Failures: 0, Errors: 0, Time elapsed: 0.339 sec
    [junit]
    [junit] Testsuite: org.apache.solr.handler.dataimport.TestURLDataSource
    [junit] Tests run: 1, Failures: 0, Errors: 0, Time elapsed: 0.01 sec
    [junit]
    [junit] Testsuite: org.apache.solr.handler.dataimport.TestVariableResolver
    [junit] Tests run: 9, Failures: 0, Errors: 0, Time elapsed: 0.029 sec
    [junit]
    [junit] Testsuite: org.apache.solr.handler.dataimport.TestXPathEntityProcessor
    [junit] Tests run: 8, Failures: 0, Errors: 0, Time elapsed: 0.543 sec
    [junit]
    [junit] Testsuite: org.apache.solr.handler.dataimport.TestXPathRecordReader
    [junit] Tests run: 21, Failures: 0, Errors: 0, Time elapsed: 0.043 sec
    [junit]
    [junit] Tests FAILED

BUILD FAILED
/usr<https://hudson.apache.org/hudson/job/Lucene-Solr-tests-only-trunk/ws/checkout/build.xml>:23: The following error occurred while executing this line:
/usr<https://hudson.apache.org/hudson/job/Lucene-Solr-tests-only-trunk/ws/checkout/solr/common-build.xml>:462: The following error occurred while executing this line:
/usr<https://hudson.apache.org/hudson/job/Lucene-Solr-tests-only-trunk/ws/checkout/solr/common-build.xml>:319: The following error occurred while executing this line:
/usr<https://hudson.apache.org/hudson/job/Lucene-Solr-tests-only-trunk/ws/checkout/solr/contrib/dataimporthandler/build.xml>:192: Tests failed!

Total time: 8 minutes 29 seconds
Recording test results


---------------------------------------------------------------------
To unsubscribe, e-mail: [hidden email]
For additional commands, e-mail: [hidden email]

Reply | Threaded
Open this post in threaded view
|

Build failed in Hudson: Lucene-Solr-tests-only-trunk #111

Apache Jenkins Server
See <https://hudson.apache.org/hudson/job/Lucene-Solr-tests-only-trunk/111/>

------------------------------------------
[...truncated 2499 lines...]
    [junit]
    [junit] Testsuite: org.apache.lucene.search.TestFuzzyQuery
    [junit] Tests run: 8, Failures: 0, Errors: 0, Time elapsed: 0.27 sec
    [junit]
    [junit] Testsuite: org.apache.lucene.search.TestMultiSearcherRanking
    [junit] Tests run: 7, Failures: 0, Errors: 0, Time elapsed: 0.136 sec
    [junit]
    [junit] Testsuite: org.apache.lucene.search.TestParallelMultiSearcher
    [junit] Tests run: 6, Failures: 0, Errors: 0, Time elapsed: 0.133 sec
    [junit]
    [junit] Testsuite: org.apache.lucene.search.TestScorerPerf
    [junit] Tests run: 1, Failures: 0, Errors: 0, Time elapsed: 0.857 sec
    [junit]
    [junit] Testsuite: org.apache.lucene.util.TestBytesRefHash
    [junit] Tests run: 7, Failures: 0, Errors: 0, Time elapsed: 1.575 sec
    [junit]
    [junit] Testsuite: org.apache.lucene.util.TestPriorityQueue
    [junit] Tests run: 4, Failures: 0, Errors: 0, Time elapsed: 0.049 sec
    [junit]
    [junit] Testsuite: org.apache.lucene.util.TestSmallFloat
    [junit] Tests run: 2, Failures: 0, Errors: 0, Time elapsed: 0.052 sec
    [junit]
    [junit] Testsuite: org.apache.lucene.search.TestSimpleExplanationsOfNonMatches
    [junit] Tests run: 53, Failures: 0, Errors: 0, Time elapsed: 0.246 sec
    [junit]
    [junit] Testsuite: org.apache.lucene.util.automaton.TestBasicOperations
    [junit] Tests run: 6, Failures: 0, Errors: 0, Time elapsed: 0.25 sec
    [junit]
    [junit] Testsuite: org.apache.lucene.search.TestSloppyPhraseQuery
    [junit] Tests run: 5, Failures: 0, Errors: 0, Time elapsed: 1.475 sec
    [junit]
    [junit] Testsuite: org.apache.lucene.search.function.TestFieldScoreQuery
    [junit] Tests run: 12, Failures: 0, Errors: 0, Time elapsed: 0.737 sec
    [junit]
    [junit] Testsuite: org.apache.lucene.search.TestThreadSafe
    [junit] Testcase: testLazyLoadThreadSafety(org.apache.lucene.search.TestThreadSafe): Caused an ERROR
    [junit] unable to create new native thread
    [junit] java.lang.OutOfMemoryError: unable to create new native thread
    [junit] at java.lang.Thread.start0(Native Method)
    [junit] at java.lang.Thread.start(Thread.java:614)
    [junit] at org.apache.lucene.search.TestThreadSafe.doTest(TestThreadSafe.java:129)
    [junit] at org.apache.lucene.search.TestThreadSafe.testLazyLoadThreadSafety(TestThreadSafe.java:148)
    [junit] at org.apache.lucene.util.LuceneTestCase$LuceneTestCaseRunner.runChild(LuceneTestCase.java:795)
    [junit] at org.apache.lucene.util.LuceneTestCase$LuceneTestCaseRunner.runChild(LuceneTestCase.java:768)
    [junit]
    [junit]
    [junit] Tests run: 1, Failures: 0, Errors: 1, Time elapsed: 4.422 sec
    [junit]
    [junit] ------------- Standard Output ---------------
    [junit] NOTE: reproduce with: ant test -Dtestcase=TestThreadSafe -Dtestmethod=testLazyLoadThreadSafety -Dtests.seed=-5018064003292055043:2699191472664600284
    [junit] NOTE: test params are: codec=Standard, locale=mt, timezone=Etc/GMT-6
    [junit] ------------- ---------------- ---------------
    [junit] TEST org.apache.lucene.search.TestThreadSafe FAILED
    [junit] Testsuite: org.apache.lucene.search.TestPrefixRandom
    [junit] Tests run: 1, Failures: 0, Errors: 0, Time elapsed: 5.988 sec
    [junit]
    [junit] Testsuite: org.apache.lucene.search.TestQueryTermVector
    [junit] Tests run: 1, Failures: 0, Errors: 0, Time elapsed: 0.012 sec
    [junit]
    [junit] Testsuite: org.apache.lucene.search.payloads.TestPayloadTermQuery
    [junit] Tests run: 6, Failures: 0, Errors: 0, Time elapsed: 0.962 sec
    [junit]
    [junit] Testsuite: org.apache.lucene.search.TestRegexpQuery
    [junit] Tests run: 7, Failures: 0, Errors: 0, Time elapsed: 0.062 sec
    [junit]
    [junit] Testsuite: org.apache.lucene.search.spans.TestSpansAdvanced2
    [junit] Tests run: 4, Failures: 0, Errors: 0, Time elapsed: 0.145 sec
    [junit]
    [junit] Testsuite: org.apache.lucene.search.TestTermVectors
    [junit] Tests run: 8, Failures: 0, Errors: 0, Time elapsed: 0.744 sec
    [junit]
    [junit] Testsuite: org.apache.lucene.search.spans.TestSpanExplanations
    [junit] Tests run: 31, Failures: 0, Errors: 0, Time elapsed: 1.815 sec
    [junit]
    [junit] Testsuite: org.apache.lucene.store.TestMultiMMap
    [junit] Tests run: 1, Failures: 0, Errors: 0, Time elapsed: 0.762 sec
    [junit]
    [junit] Testsuite: org.apache.lucene.util.TestCloseableThreadLocal
    [junit] Tests run: 3, Failures: 0, Errors: 0, Time elapsed: 0.006 sec
    [junit]
    [junit] Testsuite: org.apache.lucene.store.TestBufferedIndexInput
    [junit] Tests run: 4, Failures: 0, Errors: 0, Time elapsed: 1.877 sec
    [junit]
    [junit] Testsuite: org.apache.lucene.store.TestWindowsMMap
    [junit] Tests run: 1, Failures: 0, Errors: 0, Time elapsed: 0.117 sec
    [junit]
    [junit] Testsuite: org.apache.lucene.util.TestAttributeSource
    [junit] Tests run: 5, Failures: 0, Errors: 0, Time elapsed: 0.008 sec
    [junit]
    [junit] Testsuite: org.apache.lucene.util.TestDoubleBarrelLRUCache
    [junit] Tests run: 2, Failures: 0, Errors: 0, Time elapsed: 1.044 sec
    [junit]
    [junit] Testsuite: org.apache.lucene.search.TestTimeLimitingCollector
    [junit] Tests run: 6, Failures: 0, Errors: 0, Time elapsed: 4.724 sec
    [junit]
    [junit] Testsuite: org.apache.lucene.search.TestMultiValuedNumericRangeQuery
    [junit] Tests run: 1, Failures: 0, Errors: 0, Time elapsed: 12.942 sec
    [junit]
    [junit] Testsuite: org.apache.lucene.util.TestStringIntern
    [junit] Tests run: 1, Failures: 0, Errors: 0, Time elapsed: 4.671 sec
    [junit]
    [junit] Testsuite: org.apache.lucene.util.TestVirtualMethod
    [junit] Tests run: 2, Failures: 0, Errors: 0, Time elapsed: 0.028 sec
    [junit]
    [junit] Testsuite: org.apache.lucene.util.automaton.TestDeterminism
    [junit] Tests run: 1, Failures: 0, Errors: 0, Time elapsed: 0.509 sec
    [junit]
    [junit] Testsuite: org.apache.lucene.search.TestWildcardRandom
    [junit] Tests run: 1, Failures: 0, Errors: 0, Time elapsed: 5.721 sec
    [junit]
    [junit] Testsuite: org.apache.lucene.search.spans.TestSpanExplanationsOfNonMatches
    [junit] Tests run: 31, Failures: 0, Errors: 0, Time elapsed: 0.096 sec
    [junit]
    [junit] Testsuite: org.apache.lucene.search.spans.TestSpansAdvanced
    [junit] Tests run: 1, Failures: 0, Errors: 0, Time elapsed: 0.122 sec
    [junit]
    [junit] Testsuite: org.apache.lucene.util.TestNumericUtils
    [junit] Tests run: 10, Failures: 0, Errors: 0, Time elapsed: 14.35 sec
    [junit]
    [junit] Testsuite: org.apache.lucene.util.TestStringHelper
    [junit] Tests run: 1, Failures: 0, Errors: 0, Time elapsed: 0.01 sec
    [junit]
    [junit] Tests FAILED
    [junit] Testsuite: org.apache.lucene.store.TestHugeRamFile
    [junit] Tests run: 1, Failures: 0, Errors: 0, Time elapsed: 6.452 sec
    [junit]
    [junit] Testsuite: org.apache.lucene.util.TestFieldCacheSanityChecker
    [junit] Tests run: 4, Failures: 0, Errors: 0, Time elapsed: 0.295 sec
    [junit]
    [junit] Testsuite: org.apache.lucene.util.TestRecyclingByteBlockAllocator
    [junit] Tests run: 3, Failures: 0, Errors: 0, Time elapsed: 0.119 sec
    [junit]
    [junit] Testsuite: org.apache.lucene.util.automaton.TestUTF32ToUTF8
    [junit] Tests run: 5, Failures: 0, Errors: 0, Time elapsed: 1.755 sec
    [junit]
    [junit] Testsuite: org.apache.lucene.search.TestNumericRangeQuery32
    [junit] Tests run: 27, Failures: 0, Errors: 0, Time elapsed: 29.011 sec
    [junit]
    [junit] Testsuite: org.apache.lucene.search.TestQueryWrapperFilter
    [junit] Tests run: 1, Failures: 0, Errors: 0, Time elapsed: 0.053 sec
    [junit]
    [junit] Testsuite: org.apache.lucene.search.TestRegexpRandom2
    [junit] Tests run: 1, Failures: 0, Errors: 0, Time elapsed: 7.635 sec
    [junit]
    [junit] Testsuite: org.apache.lucene.search.TestSubScorerFreqs
    [junit] Tests run: 3, Failures: 0, Errors: 0, Time elapsed: 0.04 sec
    [junit]
    [junit] Testsuite: org.apache.lucene.search.TestTopScoreDocCollector
    [junit] Tests run: 1, Failures: 0, Errors: 0, Time elapsed: 0.013 sec
    [junit]
    [junit] Testsuite: org.apache.lucene.search.function.TestOrdValues
    [junit] Tests run: 6, Failures: 0, Errors: 0, Time elapsed: 0.118 sec
    [junit]
    [junit] Testsuite: org.apache.lucene.search.spans.TestSpans
    [junit] Tests run: 25, Failures: 0, Errors: 0, Time elapsed: 0.659 sec
    [junit]
    [junit] Testsuite: org.apache.lucene.store.TestLockFactory
    [junit] Tests run: 11, Failures: 0, Errors: 0, Time elapsed: 4.051 sec
    [junit]
    [junit] Testsuite: org.apache.lucene.util.TestArrayUtil
    [junit] Tests run: 5, Failures: 0, Errors: 0, Time elapsed: 0.026 sec
    [junit]
    [junit] Testsuite: org.apache.lucene.util.TestOpenBitSet
    [junit] Tests run: 5, Failures: 0, Errors: 0, Time elapsed: 2.292 sec
    [junit]
    [junit] Testsuite: org.apache.lucene.util.TestRamUsageEstimator
    [junit] Tests run: 1, Failures: 0, Errors: 0, Time elapsed: 0.018 sec
    [junit]
    [junit] Testsuite: org.apache.lucene.util.TestSortedVIntList
    [junit] Tests run: 19, Failures: 0, Errors: 0, Time elapsed: 0.018 sec
    [junit]
    [junit] Testsuite: org.apache.lucene.index.TestIndexWriter
    [junit] Tests run: 116, Failures: 0, Errors: 0, Time elapsed: 114.794 sec
    [junit]
    [junit] Testsuite: org.apache.lucene.index.TestIndexWriterReader
    [junit] Tests run: 16, Failures: 0, Errors: 0, Time elapsed: 4.194 sec
    [junit]
    [junit] Testsuite: org.apache.lucene.index.TestMultiFields
    [junit] Tests run: 2, Failures: 0, Errors: 0, Time elapsed: 0.273 sec
    [junit]
    [junit] Testsuite: org.apache.lucene.index.TestNewestSegment
    [junit] Tests run: 1, Failures: 0, Errors: 0, Time elapsed: 0.011 sec
    [junit]
    [junit] Testsuite: org.apache.lucene.index.TestTermVectorsReader
    [junit] Tests run: 6, Failures: 0, Errors: 0, Time elapsed: 0.036 sec
    [junit]
    [junit] Testsuite: org.apache.lucene.search.MultiCollectorTest
    [junit] Tests run: 3, Failures: 0, Errors: 0, Time elapsed: 0.008 sec
    [junit]
    [junit] Testsuite: org.apache.lucene.search.TestBooleanScorer
    [junit] Tests run: 2, Failures: 0, Errors: 0, Time elapsed: 0.024 sec
    [junit]
    [junit] Testsuite: org.apache.lucene.search.TestFieldCache
    [junit] Tests run: 3, Failures: 0, Errors: 0, Time elapsed: 1.384 sec
    [junit]
    [junit] Testsuite: org.apache.lucene.search.TestFilteredSearch
    [junit] Tests run: 1, Failures: 0, Errors: 0, Time elapsed: 0.013 sec
    [junit]
    [junit] Testsuite: org.apache.lucene.search.TestMultiThreadTermVectors
    [junit] Tests run: 1, Failures: 0, Errors: 0, Time elapsed: 0.517 sec
    [junit]
    [junit] Testsuite: org.apache.lucene.search.TestPhrasePrefixQuery
    [junit] Tests run: 1, Failures: 0, Errors: 0, Time elapsed: 0.015 sec
    [junit]
    [junit] Testsuite: org.apache.lucene.search.TestPrefixQuery
    [junit] Tests run: 1, Failures: 0, Errors: 0, Time elapsed: 0.023 sec
    [junit]
    [junit] Testsuite: org.apache.lucene.search.TestRegexpRandom
    [junit] Tests run: 1, Failures: 0, Errors: 0, Time elapsed: 13.383 sec
    [junit]
    [junit] Testsuite: org.apache.lucene.search.TestSimpleExplanations
    [junit] Tests run: 53, Failures: 0, Errors: 0, Time elapsed: 2.792 sec
    [junit]
    [junit] Testsuite: org.apache.lucene.search.function.TestCustomScoreQuery
    [junit] Tests run: 6, Failures: 0, Errors: 0, Time elapsed: 4.404 sec
    [junit]
    [junit] Testsuite: org.apache.lucene.search.spans.TestFieldMaskingSpanQuery
    [junit] Tests run: 11, Failures: 0, Errors: 0, Time elapsed: 0.651 sec
    [junit]
    [junit] Testsuite: org.apache.lucene.search.spans.TestSpanFirstQuery
    [junit] Tests run: 1, Failures: 0, Errors: 0, Time elapsed: 0.011 sec
    [junit]
    [junit] Testsuite: org.apache.lucene.store.TestCopyBytes
    [junit] Tests run: 1, Failures: 0, Errors: 0, Time elapsed: 0.625 sec
    [junit]
    [junit] Testsuite: org.apache.lucene.util.TestBitVector
    [junit] Tests run: 7, Failures: 0, Errors: 0, Time elapsed: 0.526 sec
    [junit]
    [junit] Testsuite: org.apache.lucene.util.TestIndexableBinaryStringTools
    [junit] Tests run: 10, Failures: 0, Errors: 0, Time elapsed: 4.56 sec
    [junit]
    [junit] Testsuite: org.apache.lucene.util.automaton.TestDeterminizeLexicon
    [junit] Tests run: 1, Failures: 0, Errors: 0, Time elapsed: 4.054 sec
    [junit]

BUILD FAILED
/usr<https://hudson.apache.org/hudson/job/Lucene-Solr-tests-only-trunk/ws/checkout/build.xml>:23: The following error occurred while executing this line:
/usr<https://hudson.apache.org/hudson/job/Lucene-Solr-tests-only-trunk/ws/checkout/lucene/common-build.xml>:521:
The following error occurred while executing this line:
/usr<https://hudson.apache.org/hudson/job/Lucene-Solr-tests-only-trunk/ws/checkout/lucene/common-build.xml>:505: Tests failed!
The following error occurred while executing this line:
/usr<https://hudson.apache.org/hudson/job/Lucene-Solr-tests-only-trunk/ws/checkout/lucene/common-build.xml>:505: Tests failed!
The following error occurred while executing this line:
/usr<https://hudson.apache.org/hudson/job/Lucene-Solr-tests-only-trunk/ws/checkout/lucene/common-build.xml>:505: Tests failed!
The following error occurred while executing this line:
/usr<https://hudson.apache.org/hudson/job/Lucene-Solr-tests-only-trunk/ws/checkout/lucene/common-build.xml>:505: Tests failed!

Total time: 2 minutes 48 seconds
Recording test results


---------------------------------------------------------------------
To unsubscribe, e-mail: [hidden email]
For additional commands, e-mail: [hidden email]

Reply | Threaded
Open this post in threaded view
|

Build failed in Hudson: Lucene-Solr-tests-only-trunk #112

Apache Jenkins Server
See <https://hudson.apache.org/hudson/job/Lucene-Solr-tests-only-trunk/112/changes>

Changes:

[yonik] tests: simplify test, use minimal config

------------------------------------------
[...truncated 7850 lines...]
    [junit]
    [junit] Testsuite: org.apache.solr.search.TestExtendedDismaxParser
    [junit] Tests run: 1, Failures: 0, Errors: 0, Time elapsed: 0.853 sec
    [junit]
    [junit] Testsuite: org.apache.solr.search.function.TestFunctionQuery
    [junit] Tests run: 7, Failures: 0, Errors: 0, Time elapsed: 1.923 sec
    [junit]
    [junit] Testsuite: org.apache.solr.core.TestLegacyMergeSchedulerPolicyConfig
    [junit] Tests run: 1, Failures: 0, Errors: 0, Time elapsed: 0.611 sec
    [junit]
    [junit] ------------- Standard Error -----------------
    [junit] 15/10/2010 01:30:53 ? org.apache.solr.update.SolrIndexWriter finalize
    [junit] SEVERE: SolrIndexWriter was not closed prior to finalize(), indicates a bug -- POSSIBLE RESOURCE LEAK!!!
    [junit] ------------- ---------------- ---------------
    [junit] Testsuite: org.apache.solr.spelling.suggest.SuggesterTest
    [junit] Tests run: 2, Failures: 0, Errors: 0, Time elapsed: 0.187 sec
    [junit]
    [junit] Testsuite: org.apache.solr.servlet.CacheHeaderTest
    [junit] Tests run: 5, Failures: 0, Errors: 0, Time elapsed: 0.816 sec
    [junit]
    [junit] Testsuite: org.apache.solr.handler.FieldAnalysisRequestHandlerTest
    [junit] Tests run: 3, Failures: 0, Errors: 0, Time elapsed: 0.519 sec
    [junit]
    [junit] ------------- Standard Error -----------------
    [junit] 15/10/2010 08:30:54 AM org.apache.solr.update.SolrIndexWriter finalize
    [junit] GRAVE: SolrIndexWriter was not closed prior to finalize(), indicates a bug -- POSSIBLE RESOURCE LEAK!!!
    [junit] ------------- ---------------- ---------------
    [junit] Testsuite: org.apache.solr.update.DocumentBuilderTest
    [junit] Tests run: 3, Failures: 0, Errors: 0, Time elapsed: 0.571 sec
    [junit]
    [junit] Testsuite: org.apache.solr.spelling.DirectSolrSpellCheckerTest
    [junit] Tests run: 1, Failures: 0, Errors: 0, Time elapsed: 0.709 sec
    [junit]
    [junit] Testsuite: org.apache.solr.handler.component.SpellCheckComponentTest
    [junit] Tests run: 8, Failures: 0, Errors: 0, Time elapsed: 1.02 sec
    [junit]
    [junit] Testsuite: org.apache.solr.util.SolrPluginUtilsTest
    [junit] Tests run: 7, Failures: 0, Errors: 0, Time elapsed: 0.957 sec
    [junit]
    [junit] Tests FAILED
    [junit] Testsuite: org.apache.solr.update.processor.SignatureUpdateProcessorFactoryTest
    [junit] Tests run: 4, Failures: 0, Errors: 0, Time elapsed: 1.971 sec
    [junit]
    [junit] Testsuite: org.apache.solr.util.PrimUtilsTest
    [junit] Tests run: 2, Failures: 0, Errors: 0, Time elapsed: 0.042 sec
    [junit]
    [junit] Testsuite: org.apache.solr.handler.component.StatsComponentTest
    [junit] Tests run: 1, Failures: 0, Errors: 0, Time elapsed: 3.076 sec
    [junit]
    [junit] Testsuite: org.apache.solr.schema.TestBinaryField
    [junit] Tests run: 1, Failures: 0, Errors: 0, Time elapsed: 0.397 sec
    [junit]
    [junit] Testsuite: org.apache.solr.search.TestLRUCache
    [junit] Tests run: 3, Failures: 0, Errors: 0, Time elapsed: 0.01 sec
    [junit]
    [junit] Testsuite: org.apache.solr.search.TestSort
    [junit] Tests run: 1, Failures: 0, Errors: 0, Time elapsed: 1.797 sec
    [junit]
    [junit] Testsuite: org.apache.solr.spelling.IndexBasedSpellCheckerTest
    [junit] Tests run: 5, Failures: 0, Errors: 0, Time elapsed: 0.593 sec
    [junit]
    [junit] Testsuite: org.apache.solr.update.AutoCommitTest
    [junit] Tests run: 1, Failures: 0, Errors: 0, Time elapsed: 4.261 sec
    [junit]
    [junit] Testsuite: org.apache.solr.util.DateMathParserTest
    [junit] Tests run: 7, Failures: 0, Errors: 0, Time elapsed: 0.482 sec
    [junit]
    [junit] Testsuite: org.apache.solr.handler.TestReplicationHandler
    [junit] Tests run: 7, Failures: 0, Errors: 0, Time elapsed: 25.906 sec
    [junit]
    [junit] ------------- Standard Error -----------------
    [junit] 15/10/2010 04:31:15 ? org.apache.solr.handler.SnapPuller fetchLatestIndex
    [junit] SEVERE: Master at: http://localhost:63723/solr/replication is not available. Index fetch failed. Exception: The host did not accept the connection within timeout of 5000 ms
    [junit] ------------- ---------------- ---------------
    [junit] Testsuite: org.apache.solr.handler.component.QueryElevationComponentTest
    [junit] Tests run: 3, Failures: 0, Errors: 0, Time elapsed: 0.905 sec
    [junit]
    [junit] Testsuite: org.apache.solr.request.TestWriterPerf
    [junit] Tests run: 1, Failures: 0, Errors: 0, Time elapsed: 0.695 sec
    [junit]
    [junit] ------------- Standard Error -----------------
    [junit] 2010.15.10 08:31:16 org.apache.solr.common.util.ConcurrentLRUCache finalize
    [junit] SEVERE: ConcurrentLRUCache was not destroyed prior to finalize(), indicates a bug -- POSSIBLE RESOURCE LEAK!!!
    [junit] 2010.15.10 08:31:16 org.apache.solr.common.util.ConcurrentLRUCache finalize
    [junit] SEVERE: ConcurrentLRUCache was not destroyed prior to finalize(), indicates a bug -- POSSIBLE RESOURCE LEAK!!!
    [junit] ------------- ---------------- ---------------
    [junit] Testsuite: org.apache.solr.schema.CopyFieldTest
    [junit] Tests run: 6, Failures: 0, Errors: 0, Time elapsed: 0.647 sec
    [junit]
    [junit] Testsuite: org.apache.solr.schema.NumericFieldsTest
    [junit] Tests run: 1, Failures: 0, Errors: 0, Time elapsed: 0.517 sec
    [junit]
    [junit] Testsuite: org.apache.solr.search.TestRangeQuery
    [junit] Tests run: 2, Failures: 0, Errors: 0, Time elapsed: 10.839 sec
    [junit]
    [junit] ------------- Standard Error -----------------
    [junit] 2010. 10. 15 ?? 6:31:19 org.apache.solr.handler.SnapPuller fetchLatestIndex
    [junit] ??: Master at: http://localhost:63733/solr/replication is not available. Index fetch failed. Exception: The host did not accept the connection within timeout of 5000 ms
    [junit] 2010. 10. 15 ?? 6:31:20 org.apache.solr.handler.SnapPuller fetchLatestIndex
    [junit] ??: Master at: http://localhost:63723/solr/replication is not available. Index fetch failed. Exception: The host did not accept the connection within timeout of 5000 ms
    [junit] 2010. 10. 15 ?? 6:31:25 org.apache.solr.handler.SnapPuller fetchLatestIndex
    [junit] ??: Master at: http://localhost:63723/solr/replication is not available. Index fetch failed. Exception: The host did not accept the connection within timeout of 5000 ms
    [junit] ------------- ---------------- ---------------
    [junit] Testsuite: org.apache.solr.search.function.SortByFunctionTest
    [junit] Tests run: 2, Failures: 0, Errors: 0, Time elapsed: 1.065 sec
    [junit]
    [junit] Testsuite: org.apache.solr.servlet.DirectSolrConnectionTest
    [junit] Tests run: 2, Failures: 0, Errors: 0, Time elapsed: 0.283 sec
    [junit]
    [junit] ------------- Standard Error -----------------
    [junit] 15/Out/2010 13:31:30 org.apache.solr.handler.SnapPuller fetchLatestIndex
    [junit] SEVERE: Master at: http://localhost:63723/solr/replication is not available. Index fetch failed. Exception: The host did not accept the connection within timeout of 5000 ms
    [junit] ------------- ---------------- ---------------
    [junit] Testsuite: org.apache.solr.spelling.SpellingQueryConverterTest
    [junit] Tests run: 4, Failures: 0, Errors: 0, Time elapsed: 0.039 sec
    [junit]
    [junit] Testsuite: org.apache.solr.update.processor.UpdateRequestProcessorFactoryTest
    [junit] Tests run: 1, Failures: 0, Errors: 0, Time elapsed: 0.387 sec
    [junit]
    [junit] Testsuite: org.apache.solr.TestDistributedSearch
    [junit] Tests run: 1, Failures: 0, Errors: 0, Time elapsed: 100.615 sec
    [junit]
    [junit] Testsuite: org.apache.solr.analysis.TestCzechStemFilterFactory
    [junit] Tests run: 1, Failures: 0, Errors: 0, Time elapsed: 0.04 sec
    [junit]
    [junit] Testsuite: org.apache.solr.analysis.TestDelimitedPayloadTokenFilterFactory
    [junit] Tests run: 2, Failures: 0, Errors: 0, Time elapsed: 0.028 sec
    [junit]
    [junit] Testsuite: org.apache.solr.analysis.TestEnglishMinimalStemFilterFactory
    [junit] Tests run: 1, Failures: 0, Errors: 0, Time elapsed: 0.013 sec
    [junit]
    [junit] Testsuite: org.apache.solr.analysis.TestHindiFilters
    [junit] Tests run: 4, Failures: 0, Errors: 0, Time elapsed: 0.031 sec
    [junit]
    [junit] Testsuite: org.apache.solr.analysis.TestPortugueseLightStemFilterFactory
    [junit] Tests run: 1, Failures: 0, Errors: 0, Time elapsed: 0.033 sec
    [junit]
    [junit] Testsuite: org.apache.solr.analysis.TestReverseStringFilterFactory
    [junit] Tests run: 1, Failures: 0, Errors: 0, Time elapsed: 0.01 sec
    [junit]
    [junit] Testsuite: org.apache.solr.analysis.TestRussianFilters
    [junit] Tests run: 3, Failures: 0, Errors: 0, Time elapsed: 0.022 sec
    [junit]
    [junit] Testsuite: org.apache.solr.analysis.TestWikipediaTokenizerFactory
    [junit] Tests run: 1, Failures: 0, Errors: 0, Time elapsed: 0.017 sec
    [junit]
    [junit] Testsuite: org.apache.solr.client.solrj.embedded.LargeVolumeEmbeddedTest
    [junit] Tests run: 1, Failures: 0, Errors: 0, Time elapsed: 1.015 sec
    [junit]
    [junit] Testsuite: org.apache.solr.client.solrj.request.TestUpdateRequestCodec
    [junit] Tests run: 2, Failures: 0, Errors: 0, Time elapsed: 0.021 sec
    [junit]
    [junit] Testsuite: org.apache.solr.client.solrj.response.QueryResponseTest
    [junit] Tests run: 1, Failures: 0, Errors: 0, Time elapsed: 0.039 sec
    [junit]
    [junit] Testsuite: org.apache.solr.handler.component.DistributedSpellCheckComponentTest
    [junit] Tests run: 1, Failures: 0, Errors: 0, Time elapsed: 86.38 sec
    [junit]
    [junit] Testsuite: org.apache.solr.highlight.HighlighterTest
    [junit] Tests run: 23, Failures: 0, Errors: 0, Time elapsed: 2.834 sec
    [junit]
    [junit] Testsuite: org.apache.solr.request.TestFaceting
    [junit] Tests run: 3, Failures: 0, Errors: 0, Time elapsed: 5.93 sec
    [junit]
    [junit] Testsuite: org.apache.solr.schema.NotRequiredUniqueKeyTest
    [junit] Tests run: 1, Failures: 0, Errors: 0, Time elapsed: 0.202 sec
    [junit]
    [junit] Testsuite: org.apache.solr.search.TestDocSet
    [junit] Tests run: 2, Failures: 0, Errors: 0, Time elapsed: 0.591 sec
    [junit]
    [junit] Testsuite: org.apache.solr.search.TestSolrQueryParser
    [junit] Tests run: 1, Failures: 0, Errors: 0, Time elapsed: 0.686 sec
    [junit]
    [junit] Testsuite: org.apache.solr.spelling.FileBasedSpellCheckerTest
    [junit] Tests run: 3, Failures: 0, Errors: 0, Time elapsed: 0.722 sec
    [junit]
    [junit] Testsuite: org.apache.solr.cloud.BasicZkTest
    [junit] Tests run: 1, Failures: 0, Errors: 0, Time elapsed: 12.112 sec
    [junit]
    [junit] Testsuite: org.apache.solr.common.params.SolrParamTest
    [junit] Tests run: 1, Failures: 0, Errors: 0, Time elapsed: 0.022 sec
    [junit]
    [junit] Testsuite: org.apache.solr.common.util.DOMUtilTest
    [junit] Tests run: 1, Failures: 0, Errors: 0, Time elapsed: 0.043 sec
    [junit]
    [junit] Testsuite: org.apache.solr.update.TestIndexingPerformance
    [junit] Tests run: 1, Failures: 0, Errors: 0, Time elapsed: 0.871 sec
    [junit]
    [junit] Testsuite: org.apache.solr.core.TestQuerySenderListener
    [junit] Tests run: 2, Failures: 0, Errors: 0, Time elapsed: 0.655 sec
    [junit]
    [junit] Testsuite: org.apache.solr.util.TestNumberUtils
    [junit] Tests run: 1, Failures: 0, Errors: 0, Time elapsed: 0.725 sec
    [junit]
    [junit] Testsuite: org.apache.solr.core.TestSolrDeletionPolicy2
    [junit] Tests run: 1, Failures: 0, Errors: 0, Time elapsed: 0.609 sec
    [junit]
    [junit] Testsuite: org.apache.solr.handler.DocumentAnalysisRequestHandlerTest
    [junit] Tests run: 2, Failures: 0, Errors: 0, Time elapsed: 0.678 sec
    [junit]
    [junit] Testsuite: org.apache.solr.handler.MoreLikeThisHandlerTest
    [junit] Tests run: 1, Failures: 0, Errors: 0, Time elapsed: 0.714 sec
    [junit]
    [junit] Testsuite: org.apache.solr.handler.component.DistributedTermsComponentTest
    [junit] Tests run: 1, Failures: 0, Errors: 0, Time elapsed: 6.44 sec
    [junit]
    [junit] Testsuite: org.apache.solr.schema.IndexSchemaTest
    [junit] Tests run: 5, Failures: 0, Errors: 0, Time elapsed: 0.735 sec
    [junit]
    [junit] Testsuite: org.apache.solr.schema.PolyFieldTest
    [junit] Tests run: 4, Failures: 0, Errors: 0, Time elapsed: 1.366 sec
    [junit]
    [junit] Testsuite: org.apache.solr.search.TestQueryUtils
    [junit] Tests run: 1, Failures: 0, Errors: 0, Time elapsed: 0.566 sec
    [junit]
    [junit] Testsuite: org.apache.solr.search.function.distance.DistanceFunctionTest
    [junit] Tests run: 3, Failures: 0, Errors: 0, Time elapsed: 0.793 sec
    [junit]
    [junit] Testsuite: org.apache.solr.servlet.SolrRequestParserTest
    [junit] Tests run: 4, Failures: 0, Errors: 0, Time elapsed: 0.679 sec
    [junit]
    [junit] Testsuite: org.apache.solr.spelling.SpellPossibilityIteratorTest
    [junit] Tests run: 1, Failures: 0, Errors: 0, Time elapsed: 0.01 sec
    [junit]
    [junit] Testsuite: org.apache.solr.update.DirectUpdateHandlerTest
    [junit] Tests run: 7, Failures: 0, Errors: 0, Time elapsed: 2.318 sec
    [junit]
    [junit] Testsuite: org.apache.solr.velocity.VelocityResponseWriterTest
    [junit] Tests run: 1, Failures: 0, Errors: 0, Time elapsed: 0.771 sec
    [junit]

BUILD FAILED
/usr<https://hudson.apache.org/hudson/job/Lucene-Solr-tests-only-trunk/ws/checkout/build.xml>:23: The following error occurred while executing this line:
/usr<https://hudson.apache.org/hudson/job/Lucene-Solr-tests-only-trunk/ws/checkout/solr/build.xml>:386:
The following error occurred while executing this line:
/usr<https://hudson.apache.org/hudson/job/Lucene-Solr-tests-only-trunk/ws/checkout/solr/build.xml>:482: Tests failed!
The following error occurred while executing this line:
/usr<https://hudson.apache.org/hudson/job/Lucene-Solr-tests-only-trunk/ws/checkout/solr/build.xml>:482: Tests failed!
The following error occurred while executing this line:
/usr<https://hudson.apache.org/hudson/job/Lucene-Solr-tests-only-trunk/ws/checkout/solr/build.xml>:482: Tests failed!
The following error occurred while executing this line:
/usr<https://hudson.apache.org/hudson/job/Lucene-Solr-tests-only-trunk/ws/checkout/solr/build.xml>:482: Tests failed!
The following error occurred while executing this line:
/usr<https://hudson.apache.org/hudson/job/Lucene-Solr-tests-only-trunk/ws/checkout/solr/build.xml>:482: Tests failed!
The following error occurred while executing this line:
/usr<https://hudson.apache.org/hudson/job/Lucene-Solr-tests-only-trunk/ws/checkout/solr/build.xml>:482: Tests failed!

Total time: 7 minutes 40 seconds
Recording test results


---------------------------------------------------------------------
To unsubscribe, e-mail: [hidden email]
For additional commands, e-mail: [hidden email]

Reply | Threaded
Open this post in threaded view
|

Build failed in Hudson: Lucene-Solr-tests-only-trunk #113

Apache Jenkins Server
See <https://hudson.apache.org/hudson/job/Lucene-Solr-tests-only-trunk/113/changes>

Changes:

[rmuir] LUCENE-2708: when a test Assume fails, display information

[mikemccand] LUCENE-2705: drop number of simultaneous threads from 100 to 10

[yonik] tests: log failure to better correlate where it happened

------------------------------------------
[...truncated 7858 lines...]
    [junit]
    [junit] ------------- Standard Error -----------------
    [junit] 2010.10.15 11:03:17 org.apache.solr.update.SolrIndexWriter finalize
    [junit] SEVERE: SolrIndexWriter was not closed prior to finalize(), indicates a bug -- POSSIBLE RESOURCE LEAK!!!
    [junit] ------------- ---------------- ---------------
    [junit] Testsuite: org.apache.solr.search.SpatialFilterTest
    [junit] Tests run: 3, Failures: 0, Errors: 0, Time elapsed: 0.963 sec
    [junit]
    [junit] Testsuite: org.apache.solr.search.function.TestFunctionQuery
    [junit] Tests run: 7, Failures: 0, Errors: 0, Time elapsed: 1.928 sec
    [junit]
    [junit] ------------- Standard Error -----------------
    [junit] 16.10.2010 1:03:18 org.apache.solr.SolrTestCaseJ4 assertQ
    [junit] SEVERE: REQUEST FAILED: fl=*,score&q={!func}10+wow+dude+ignore_exception
    [junit] ------------- ---------------- ---------------
    [junit] Testsuite: org.apache.solr.handler.FieldAnalysisRequestHandlerTest
    [junit] Tests run: 3, Failures: 0, Errors: 0, Time elapsed: 0.717 sec
    [junit]
    [junit] ------------- Standard Error -----------------
    [junit] 10/15/2010 08:03:17 PM org.apache.solr.update.SolrIndexWriter finalize
    [junit] GRAVE: SolrIndexWriter was not closed prior to finalize(), indicates a bug -- POSSIBLE RESOURCE LEAK!!!
    [junit] ------------- ---------------- ---------------
    [junit] Testsuite: org.apache.solr.spelling.suggest.SuggesterTest
    [junit] Tests run: 2, Failures: 0, Errors: 0, Time elapsed: 0.177 sec
    [junit]
    [junit] Testsuite: org.apache.solr.update.DocumentBuilderTest
    [junit] Tests run: 3, Failures: 0, Errors: 0, Time elapsed: 0.509 sec
    [junit]
    [junit] Testsuite: org.apache.solr.search.TestExtendedDismaxParser
    [junit] Tests run: 1, Failures: 0, Errors: 0, Time elapsed: 1.05 sec
    [junit]
    [junit] Testsuite: org.apache.solr.handler.component.SpellCheckComponentTest
    [junit] Tests run: 8, Failures: 0, Errors: 0, Time elapsed: 1.321 sec
    [junit]
    [junit] Testsuite: org.apache.solr.util.SolrPluginUtilsTest
    [junit] Tests run: 7, Failures: 0, Errors: 0, Time elapsed: 0.743 sec
    [junit]
    [junit] Testsuite: org.apache.solr.servlet.CacheHeaderTest
    [junit] Tests run: 5, Failures: 0, Errors: 0, Time elapsed: 1.017 sec
    [junit]
    [junit] Tests FAILED
    [junit] Testsuite: org.apache.solr.spelling.DirectSolrSpellCheckerTest
    [junit] Tests run: 1, Failures: 0, Errors: 0, Time elapsed: 0.709 sec
    [junit]
    [junit] Testsuite: org.apache.solr.handler.component.StatsComponentTest
    [junit] Tests run: 1, Failures: 0, Errors: 0, Time elapsed: 3.241 sec
    [junit]
    [junit] Testsuite: org.apache.solr.schema.TestBinaryField
    [junit] Tests run: 1, Failures: 0, Errors: 0, Time elapsed: 0.41 sec
    [junit]
    [junit] Testsuite: org.apache.solr.search.TestLRUCache
    [junit] Tests run: 3, Failures: 0, Errors: 0, Time elapsed: 0.01 sec
    [junit]
    [junit] Testsuite: org.apache.solr.update.processor.SignatureUpdateProcessorFactoryTest
    [junit] Tests run: 4, Failures: 0, Errors: 0, Time elapsed: 3.788 sec
    [junit]
    [junit] Testsuite: org.apache.solr.util.PrimUtilsTest
    [junit] Tests run: 2, Failures: 0, Errors: 0, Time elapsed: 0.026 sec
    [junit]
    [junit] Testsuite: org.apache.solr.search.TestSort
    [junit] Tests run: 1, Failures: 0, Errors: 0, Time elapsed: 1.761 sec
    [junit]
    [junit] Testsuite: org.apache.solr.spelling.IndexBasedSpellCheckerTest
    [junit] Tests run: 5, Failures: 0, Errors: 0, Time elapsed: 0.573 sec
    [junit]
    [junit] Testsuite: org.apache.solr.update.AutoCommitTest
    [junit] Tests run: 1, Failures: 0, Errors: 0, Time elapsed: 4.268 sec
    [junit]
    [junit] Testsuite: org.apache.solr.util.DateMathParserTest
    [junit] Tests run: 7, Failures: 0, Errors: 0, Time elapsed: 0.067 sec
    [junit]
    [junit] Testsuite: org.apache.solr.handler.TestReplicationHandler
    [junit] Tests run: 7, Failures: 0, Errors: 0, Time elapsed: 26.997 sec
    [junit]
    [junit] ------------- Standard Error -----------------
    [junit] 2010-10-15 18.03.39 org.apache.solr.handler.SnapPuller fetchLatestIndex
    [junit] SEVERE: Master at: http://localhost:17794/solr/replication is not available. Index fetch failed. Exception: The host did not accept the connection within timeout of 5000 ms
    [junit] ------------- ---------------- ---------------
    [junit] Testsuite: org.apache.solr.handler.component.QueryElevationComponentTest
    [junit] Tests run: 3, Failures: 0, Errors: 0, Time elapsed: 0.784 sec
    [junit]
    [junit] Testsuite: org.apache.solr.request.TestWriterPerf
    [junit] Tests run: 1, Failures: 0, Errors: 0, Time elapsed: 0.539 sec
    [junit]
    [junit] Testsuite: org.apache.solr.schema.CopyFieldTest
    [junit] Tests run: 6, Failures: 0, Errors: 0, Time elapsed: 0.641 sec
    [junit]
    [junit] Testsuite: org.apache.solr.schema.NumericFieldsTest
    [junit] Tests run: 1, Failures: 0, Errors: 0, Time elapsed: 0.531 sec
    [junit]
    [junit] Testsuite: org.apache.solr.search.TestRangeQuery
    [junit] Tests run: 2, Failures: 0, Errors: 0, Time elapsed: 12.548 sec
    [junit]
    [junit] ------------- Standard Error -----------------
    [junit] 10-15-2010 05:03:43 PM org.apache.solr.handler.SnapPuller fetchLatestIndex
    [junit] GRAVE: Master at: http://localhost:17804/solr/replication is not available. Index fetch failed. Exception: The host did not accept the connection within timeout of 5000 ms
    [junit] 10-15-2010 05:03:44 PM org.apache.solr.handler.SnapPuller fetchLatestIndex
    [junit] GRAVE: Master at: http://localhost:17794/solr/replication is not available. Index fetch failed. Exception: The host did not accept the connection within timeout of 5000 ms
    [junit] 10-15-2010 05:03:49 PM org.apache.solr.handler.SnapPuller fetchLatestIndex
    [junit] GRAVE: Master at: http://localhost:17794/solr/replication is not available. Index fetch failed. Exception: The host did not accept the connection within timeout of 5000 ms
    [junit] 10-15-2010 05:03:54 PM org.apache.solr.handler.SnapPuller fetchLatestIndex
    [junit] GRAVE: Master at: http://localhost:17794/solr/replication is not available. Index fetch failed. Exception: The host did not accept the connection within timeout of 5000 ms
    [junit] ------------- ---------------- ---------------
    [junit] Testsuite: org.apache.solr.search.function.SortByFunctionTest
    [junit] Tests run: 2, Failures: 0, Errors: 0, Time elapsed: 1.061 sec
    [junit]
    [junit] Testsuite: org.apache.solr.servlet.DirectSolrConnectionTest
    [junit] Tests run: 2, Failures: 0, Errors: 0, Time elapsed: 0.237 sec
    [junit]
    [junit] Testsuite: org.apache.solr.spelling.SpellingQueryConverterTest
    [junit] Tests run: 4, Failures: 0, Errors: 0, Time elapsed: 0.011 sec
    [junit]
    [junit] Testsuite: org.apache.solr.update.processor.UpdateRequestProcessorFactoryTest
    [junit] Tests run: 1, Failures: 0, Errors: 0, Time elapsed: 0.395 sec
    [junit]
    [junit] Testsuite: org.apache.solr.TestDistributedSearch
    [junit] Tests run: 1, Failures: 0, Errors: 0, Time elapsed: 99.523 sec
    [junit]
    [junit] Testsuite: org.apache.solr.analysis.TestCzechStemFilterFactory
    [junit] Tests run: 1, Failures: 0, Errors: 0, Time elapsed: 0.016 sec
    [junit]
    [junit] Testsuite: org.apache.solr.analysis.TestDelimitedPayloadTokenFilterFactory
    [junit] Tests run: 2, Failures: 0, Errors: 0, Time elapsed: 0.013 sec
    [junit]
    [junit] Testsuite: org.apache.solr.analysis.TestEnglishMinimalStemFilterFactory
    [junit] Tests run: 1, Failures: 0, Errors: 0, Time elapsed: 0.008 sec
    [junit]
    [junit] Testsuite: org.apache.solr.analysis.TestHindiFilters
    [junit] Tests run: 4, Failures: 0, Errors: 0, Time elapsed: 0.022 sec
    [junit]
    [junit] Testsuite: org.apache.solr.analysis.TestPortugueseLightStemFilterFactory
    [junit] Tests run: 1, Failures: 0, Errors: 0, Time elapsed: 0.008 sec
    [junit]
    [junit] Testsuite: org.apache.solr.analysis.TestReverseStringFilterFactory
    [junit] Tests run: 1, Failures: 0, Errors: 0, Time elapsed: 0.007 sec
    [junit]
    [junit] Testsuite: org.apache.solr.analysis.TestRussianFilters
    [junit] Tests run: 3, Failures: 0, Errors: 0, Time elapsed: 0.012 sec
    [junit]
    [junit] Testsuite: org.apache.solr.analysis.TestWikipediaTokenizerFactory
    [junit] Tests run: 1, Failures: 0, Errors: 0, Time elapsed: 0.01 sec
    [junit]
    [junit] Testsuite: org.apache.solr.client.solrj.embedded.LargeVolumeEmbeddedTest
    [junit] Tests run: 1, Failures: 0, Errors: 0, Time elapsed: 0.733 sec
    [junit]
    [junit] Testsuite: org.apache.solr.client.solrj.request.TestUpdateRequestCodec
    [junit] Tests run: 2, Failures: 0, Errors: 0, Time elapsed: 0.019 sec
    [junit]
    [junit] Testsuite: org.apache.solr.client.solrj.response.QueryResponseTest
    [junit] Tests run: 1, Failures: 0, Errors: 0, Time elapsed: 0.037 sec
    [junit]
    [junit] Testsuite: org.apache.solr.handler.component.DistributedSpellCheckComponentTest
    [junit] Tests run: 1, Failures: 0, Errors: 0, Time elapsed: 85.956 sec
    [junit]
    [junit] Testsuite: org.apache.solr.highlight.HighlighterTest
    [junit] Tests run: 23, Failures: 0, Errors: 0, Time elapsed: 2.693 sec
    [junit]
    [junit] Testsuite: org.apache.solr.request.TestFaceting
    [junit] Tests run: 3, Failures: 0, Errors: 0, Time elapsed: 4.427 sec
    [junit]
    [junit] Testsuite: org.apache.solr.schema.NotRequiredUniqueKeyTest
    [junit] Tests run: 1, Failures: 0, Errors: 0, Time elapsed: 0.156 sec
    [junit]
    [junit] Testsuite: org.apache.solr.search.TestDocSet
    [junit] Tests run: 2, Failures: 0, Errors: 0, Time elapsed: 0.451 sec
    [junit]
    [junit] Testsuite: org.apache.solr.cloud.BasicZkTest
    [junit] Tests run: 1, Failures: 0, Errors: 0, Time elapsed: 11.017 sec
    [junit]
    [junit] Testsuite: org.apache.solr.common.params.SolrParamTest
    [junit] Tests run: 1, Failures: 0, Errors: 0, Time elapsed: 0.014 sec
    [junit]
    [junit] Testsuite: org.apache.solr.common.util.DOMUtilTest
    [junit] Tests run: 1, Failures: 0, Errors: 0, Time elapsed: 0.018 sec
    [junit]
    [junit] Testsuite: org.apache.solr.search.TestSolrQueryParser
    [junit] Tests run: 1, Failures: 0, Errors: 0, Time elapsed: 0.508 sec
    [junit]
    [junit] Testsuite: org.apache.solr.core.TestQuerySenderListener
    [junit] Tests run: 2, Failures: 0, Errors: 0, Time elapsed: 0.436 sec
    [junit]
    [junit] Testsuite: org.apache.solr.spelling.FileBasedSpellCheckerTest
    [junit] Tests run: 3, Failures: 0, Errors: 0, Time elapsed: 0.588 sec
    [junit]
    [junit] Testsuite: org.apache.solr.core.TestSolrDeletionPolicy2
    [junit] Tests run: 1, Failures: 0, Errors: 0, Time elapsed: 0.479 sec
    [junit]
    [junit] Testsuite: org.apache.solr.handler.DocumentAnalysisRequestHandlerTest
    [junit] Tests run: 2, Failures: 0, Errors: 0, Time elapsed: 0.503 sec
    [junit]
    [junit] Testsuite: org.apache.solr.update.TestIndexingPerformance
    [junit] Tests run: 1, Failures: 0, Errors: 0, Time elapsed: 1.051 sec
    [junit]
    [junit] Testsuite: org.apache.solr.handler.MoreLikeThisHandlerTest
    [junit] Tests run: 1, Failures: 0, Errors: 0, Time elapsed: 0.546 sec
    [junit]
    [junit] Testsuite: org.apache.solr.util.TestNumberUtils
    [junit] Tests run: 1, Failures: 0, Errors: 0, Time elapsed: 0.485 sec
    [junit]
    [junit] Testsuite: org.apache.solr.handler.component.DistributedTermsComponentTest
    [junit] Tests run: 1, Failures: 0, Errors: 0, Time elapsed: 5.844 sec
    [junit]
    [junit] Testsuite: org.apache.solr.schema.IndexSchemaTest
    [junit] Tests run: 5, Failures: 0, Errors: 0, Time elapsed: 0.711 sec
    [junit]
    [junit] Testsuite: org.apache.solr.schema.PolyFieldTest
    [junit] Tests run: 4, Failures: 0, Errors: 0, Time elapsed: 0.822 sec
    [junit]
    [junit] Testsuite: org.apache.solr.search.TestQueryUtils
    [junit] Tests run: 1, Failures: 0, Errors: 0, Time elapsed: 0.589 sec
    [junit]
    [junit] Testsuite: org.apache.solr.search.function.distance.DistanceFunctionTest
    [junit] Tests run: 3, Failures: 0, Errors: 0, Time elapsed: 0.647 sec
    [junit]
    [junit] ------------- Standard Error -----------------
    [junit] 15 oct. 2010 14:04:47 org.apache.solr.SolrTestCaseJ4 assertQ
    [junit] GRAVE: REQUEST FAILED: fl=*,score&q={!func}sqedist(x_td,+y_td,+z_td,+w_td,+0,+0,+0)&fq=id:1
    [junit] ------------- ---------------- ---------------
    [junit] Testsuite: org.apache.solr.servlet.SolrRequestParserTest
    [junit] Tests run: 4, Failures: 0, Errors: 0, Time elapsed: 0.948 sec
    [junit]
    [junit] Testsuite: org.apache.solr.spelling.SpellPossibilityIteratorTest
    [junit] Tests run: 1, Failures: 0, Errors: 0, Time elapsed: 0.016 sec
    [junit]
    [junit] Testsuite: org.apache.solr.update.DirectUpdateHandlerTest
    [junit] Tests run: 7, Failures: 0, Errors: 0, Time elapsed: 1.993 sec
    [junit]
    [junit] Testsuite: org.apache.solr.velocity.VelocityResponseWriterTest
    [junit] Tests run: 1, Failures: 0, Errors: 0, Time elapsed: 0.547 sec
    [junit]

BUILD FAILED
/usr<https://hudson.apache.org/hudson/job/Lucene-Solr-tests-only-trunk/ws/checkout/build.xml>:23: The following error occurred while executing this line:
/usr<https://hudson.apache.org/hudson/job/Lucene-Solr-tests-only-trunk/ws/checkout/solr/build.xml>:386:
The following error occurred while executing this line:
/usr<https://hudson.apache.org/hudson/job/Lucene-Solr-tests-only-trunk/ws/checkout/solr/build.xml>:482: Tests failed!
The following error occurred while executing this line:
/usr<https://hudson.apache.org/hudson/job/Lucene-Solr-tests-only-trunk/ws/checkout/solr/build.xml>:482: Tests failed!
The following error occurred while executing this line:
/usr<https://hudson.apache.org/hudson/job/Lucene-Solr-tests-only-trunk/ws/checkout/solr/build.xml>:482: Tests failed!
The following error occurred while executing this line:
/usr<https://hudson.apache.org/hudson/job/Lucene-Solr-tests-only-trunk/ws/checkout/solr/build.xml>:482: Tests failed!
The following error occurred while executing this line:
/usr<https://hudson.apache.org/hudson/job/Lucene-Solr-tests-only-trunk/ws/checkout/solr/build.xml>:482: Tests failed!
The following error occurred while executing this line:
/usr<https://hudson.apache.org/hudson/job/Lucene-Solr-tests-only-trunk/ws/checkout/solr/build.xml>:482: Tests failed!

Total time: 10 minutes 17 seconds
Recording test results


---------------------------------------------------------------------
To unsubscribe, e-mail: [hidden email]
For additional commands, e-mail: [hidden email]

Reply | Threaded
Open this post in threaded view
|

Build failed in Hudson: Lucene-Solr-tests-only-trunk #114

Apache Jenkins Server
See <https://hudson.apache.org/hudson/job/Lucene-Solr-tests-only-trunk/114/changes>

Changes:

[rmuir] LUCENE-2709: if a test has methods with @ignore, we should print out a notice

------------------------------------------
[...truncated 7897 lines...]
    [junit] Tests run: 1, Failures: 0, Errors: 0, Time elapsed: 0.693 sec
    [junit]
    [junit] Testsuite: org.apache.solr.core.TestLegacyMergeSchedulerPolicyConfig
    [junit] Tests run: 1, Failures: 0, Errors: 0, Time elapsed: 0.522 sec
    [junit]
    [junit] ------------- Standard Error -----------------
    [junit] 15/10/2010 01:29:54 ? org.apache.solr.update.SolrIndexWriter finalize
    [junit] SEVERE: SolrIndexWriter was not closed prior to finalize(), indicates a bug -- POSSIBLE RESOURCE LEAK!!!
    [junit] ------------- ---------------- ---------------
    [junit] Testsuite: org.apache.solr.search.function.TestFunctionQuery
    [junit] Tests run: 7, Failures: 0, Errors: 0, Time elapsed: 1.671 sec
    [junit]
    [junit] ------------- Standard Error -----------------
    [junit] 15 DFómh 2010 23:59:54 org.apache.solr.SolrTestCaseJ4 assertQ
    [junit] SEVERE: REQUEST FAILED: fl=*,score&q={!func}10+wow+dude+ignore_exception
    [junit] ------------- ---------------- ---------------
    [junit] Testsuite: org.apache.solr.spelling.suggest.SuggesterTest
    [junit] Tests run: 2, Failures: 0, Errors: 0, Time elapsed: 0.236 sec
    [junit]
    [junit] Testsuite: org.apache.solr.handler.FieldAnalysisRequestHandlerTest
    [junit] Tests run: 3, Failures: 0, Errors: 0, Time elapsed: 0.547 sec
    [junit]
    [junit] ------------- Standard Error -----------------
    [junit] 2010-10-16 2:29:54 org.apache.solr.update.SolrIndexWriter finalize
    [junit] SEVERE: SolrIndexWriter was not closed prior to finalize(), indicates a bug -- POSSIBLE RESOURCE LEAK!!!
    [junit] ------------- ---------------- ---------------
    [junit] Testsuite: org.apache.solr.update.DocumentBuilderTest
    [junit] Tests run: 3, Failures: 0, Errors: 0, Time elapsed: 0.752 sec
    [junit]
    [junit] Testsuite: org.apache.solr.update.processor.SignatureUpdateProcessorFactoryTest
    [junit] Tests run: 4, Failures: 0, Errors: 0, Time elapsed: 1.963 sec
    [junit]
    [junit] Testsuite: org.apache.solr.handler.component.SpellCheckComponentTest
    [junit] Tests run: 8, Failures: 0, Errors: 0, Time elapsed: 1.158 sec
    [junit]
    [junit] Testsuite: org.apache.solr.util.PrimUtilsTest
    [junit] Tests run: 2, Failures: 0, Errors: 0, Time elapsed: 0.038 sec
    [junit]
    [junit] Testsuite: org.apache.solr.util.SolrPluginUtilsTest
    [junit] Tests run: 7, Failures: 0, Errors: 0, Time elapsed: 0.66 sec
    [junit]
    [junit] Tests FAILED
    [junit] Testsuite: org.apache.solr.handler.component.StatsComponentTest
    [junit] Tests run: 1, Failures: 0, Errors: 0, Time elapsed: 3.149 sec
    [junit]
    [junit] Testsuite: org.apache.solr.schema.TestBinaryField
    [junit] Tests run: 1, Failures: 0, Errors: 0, Time elapsed: 0.405 sec
    [junit]
    [junit] Testsuite: org.apache.solr.search.TestLRUCache
    [junit] Tests run: 3, Failures: 0, Errors: 0, Time elapsed: 0.017 sec
    [junit]
    [junit] Testsuite: org.apache.solr.search.TestSort
    [junit] Tests run: 1, Failures: 0, Errors: 0, Time elapsed: 1.692 sec
    [junit]
    [junit] Testsuite: org.apache.solr.spelling.IndexBasedSpellCheckerTest
    [junit] Tests run: 5, Failures: 0, Errors: 0, Time elapsed: 0.571 sec
    [junit]
    [junit] Testsuite: org.apache.solr.update.AutoCommitTest
    [junit] Tests run: 1, Failures: 0, Errors: 0, Time elapsed: 4.271 sec
    [junit]
    [junit] Testsuite: org.apache.solr.util.DateMathParserTest
    [junit] Tests run: 7, Failures: 0, Errors: 0, Time elapsed: 0.074 sec
    [junit]
    [junit] Testsuite: org.apache.solr.handler.TestReplicationHandler
    [junit] Tests run: 7, Failures: 0, Errors: 0, Time elapsed: 27.208 sec
    [junit]
    [junit] ------------- Standard Error -----------------
    [junit] 16/10/2010 07:15:14 org.apache.solr.handler.SnapPuller fetchLatestIndex
    [junit] GRAVE: Master at: http://localhost:53395/solr/replication is not available. Index fetch failed. Exception: The host did not accept the connection within timeout of 5000 ms
    [junit] ------------- ---------------- ---------------
    [junit] Testsuite: org.apache.solr.handler.component.QueryElevationComponentTest
    [junit] Tests run: 3, Failures: 0, Errors: 0, Time elapsed: 0.809 sec
    [junit]
    [junit] Testsuite: org.apache.solr.request.TestWriterPerf
    [junit] Tests run: 1, Failures: 0, Errors: 0, Time elapsed: 0.588 sec
    [junit]
    [junit] ------------- Standard Error -----------------
    [junit] 15/10/2010 07:30:15 ? org.apache.solr.common.util.ConcurrentLRUCache finalize
    [junit] SEVERE: ConcurrentLRUCache was not destroyed prior to finalize(), indicates a bug -- POSSIBLE RESOURCE LEAK!!!
    [junit] 15/10/2010 07:30:15 ? org.apache.solr.common.util.ConcurrentLRUCache finalize
    [junit] SEVERE: ConcurrentLRUCache was not destroyed prior to finalize(), indicates a bug -- POSSIBLE RESOURCE LEAK!!!
    [junit] ------------- ---------------- ---------------
    [junit] Testsuite: org.apache.solr.schema.CopyFieldTest
    [junit] Tests run: 6, Failures: 0, Errors: 0, Time elapsed: 0.51 sec
    [junit]
    [junit] Testsuite: org.apache.solr.schema.NumericFieldsTest
    [junit] Tests run: 1, Failures: 0, Errors: 0, Time elapsed: 0.528 sec
    [junit]
    [junit] Testsuite: org.apache.solr.search.TestRangeQuery
    [junit] Tests run: 2, Failures: 0, Errors: 0, Time elapsed: 10.976 sec
    [junit]
    [junit] ------------- Standard Error -----------------
    [junit] 15.10.2010 22:30: org.apache.solr.handler.SnapPuller fetchLatestIndex
    [junit] SEVERE: Master at: http://localhost:53406/solr/replication is not available. Index fetch failed. Exception: The host did not accept the connection within timeout of 5000 ms
    [junit] 15.10.2010 22:30: org.apache.solr.handler.SnapPuller fetchLatestIndex
    [junit] SEVERE: Master at: http://localhost:53395/solr/replication is not available. Index fetch failed. Exception: The host did not accept the connection within timeout of 5000 ms
    [junit] 15.10.2010 22:30: org.apache.solr.handler.SnapPuller fetchLatestIndex
    [junit] SEVERE: Master at: http://localhost:53395/solr/replication is not available. Index fetch failed. Exception: The host did not accept the connection within timeout of 5000 ms
    [junit] ------------- ---------------- ---------------
    [junit] Testsuite: org.apache.solr.search.function.SortByFunctionTest
    [junit] Tests run: 2, Failures: 0, Errors: 0, Time elapsed: 0.984 sec
    [junit]
    [junit] Testsuite: org.apache.solr.servlet.DirectSolrConnectionTest
    [junit] Tests run: 2, Failures: 0, Errors: 0, Time elapsed: 0.243 sec
    [junit]
    [junit] Testsuite: org.apache.solr.spelling.SpellingQueryConverterTest
    [junit] Tests run: 4, Failures: 0, Errors: 0, Time elapsed: 0.011 sec
    [junit]
    [junit] Testsuite: org.apache.solr.update.processor.UpdateRequestProcessorFactoryTest
    [junit] Tests run: 1, Failures: 0, Errors: 0, Time elapsed: 0.393 sec
    [junit]
    [junit] ------------- Standard Error -----------------
    [junit] 15 DFómh 2010 19:30:29 org.apache.solr.handler.SnapPuller fetchLatestIndex
    [junit] SEVERE: Master at: http://localhost:53395/solr/replication is not available. Index fetch failed. Exception: The host did not accept the connection within timeout of 5000 ms
    [junit] ------------- ---------------- ---------------
    [junit] Testsuite: org.apache.solr.TestDistributedSearch
    [junit] Tests run: 1, Failures: 0, Errors: 0, Time elapsed: 103.37 sec
    [junit]
    [junit] Testsuite: org.apache.solr.analysis.TestCzechStemFilterFactory
    [junit] Tests run: 1, Failures: 0, Errors: 0, Time elapsed: 0.018 sec
    [junit]
    [junit] Testsuite: org.apache.solr.analysis.TestDelimitedPayloadTokenFilterFactory
    [junit] Tests run: 2, Failures: 0, Errors: 0, Time elapsed: 0.018 sec
    [junit]
    [junit] Testsuite: org.apache.solr.analysis.TestEnglishMinimalStemFilterFactory
    [junit] Tests run: 1, Failures: 0, Errors: 0, Time elapsed: 0.008 sec
    [junit]
    [junit] Testsuite: org.apache.solr.analysis.TestHindiFilters
    [junit] Tests run: 4, Failures: 0, Errors: 0, Time elapsed: 0.026 sec
    [junit]
    [junit] Testsuite: org.apache.solr.analysis.TestPortugueseLightStemFilterFactory
    [junit] Tests run: 1, Failures: 0, Errors: 0, Time elapsed: 0.008 sec
    [junit]
    [junit] Testsuite: org.apache.solr.analysis.TestReverseStringFilterFactory
    [junit] Tests run: 1, Failures: 0, Errors: 0, Time elapsed: 0.01 sec
    [junit]
    [junit] Testsuite: org.apache.solr.analysis.TestRussianFilters
    [junit] Tests run: 3, Failures: 0, Errors: 0, Time elapsed: 0.019 sec
    [junit]
    [junit] Testsuite: org.apache.solr.analysis.TestWikipediaTokenizerFactory
    [junit] Tests run: 1, Failures: 0, Errors: 0, Time elapsed: 0.021 sec
    [junit]
    [junit] Testsuite: org.apache.solr.client.solrj.embedded.LargeVolumeEmbeddedTest
    [junit] Tests run: 1, Failures: 0, Errors: 0, Time elapsed: 0.934 sec
    [junit]
    [junit] Testsuite: org.apache.solr.client.solrj.request.TestUpdateRequestCodec
    [junit] Tests run: 2, Failures: 0, Errors: 0, Time elapsed: 0.011 sec
    [junit]
    [junit] Testsuite: org.apache.solr.client.solrj.response.QueryResponseTest
    [junit] Tests run: 1, Failures: 0, Errors: 0, Time elapsed: 0.054 sec
    [junit]
    [junit] Testsuite: org.apache.solr.handler.component.DistributedSpellCheckComponentTest
    [junit] Tests run: 1, Failures: 0, Errors: 0, Time elapsed: 86.616 sec
    [junit]
    [junit] Testsuite: org.apache.solr.highlight.HighlighterTest
    [junit] Tests run: 23, Failures: 0, Errors: 0, Time elapsed: 3.812 sec
    [junit]
    [junit] Testsuite: org.apache.solr.request.TestFaceting
    [junit] Tests run: 3, Failures: 0, Errors: 0, Time elapsed: 4.191 sec
    [junit]
    [junit] Testsuite: org.apache.solr.schema.NotRequiredUniqueKeyTest
    [junit] Tests run: 1, Failures: 0, Errors: 0, Time elapsed: 0.15 sec
    [junit]
    [junit] Testsuite: org.apache.solr.search.TestDocSet
    [junit] Tests run: 2, Failures: 0, Errors: 0, Time elapsed: 0.477 sec
    [junit]
    [junit] Testsuite: org.apache.solr.search.TestSolrQueryParser
    [junit] Tests run: 1, Failures: 0, Errors: 0, Time elapsed: 0.579 sec
    [junit]
    [junit] Testsuite: org.apache.solr.spelling.FileBasedSpellCheckerTest
    [junit] Tests run: 3, Failures: 0, Errors: 0, Time elapsed: 0.708 sec
    [junit]
    [junit] Testsuite: org.apache.solr.update.TestIndexingPerformance
    [junit] Tests run: 1, Failures: 0, Errors: 0, Time elapsed: 0.692 sec
    [junit]
    [junit] Testsuite: org.apache.solr.cloud.BasicZkTest
    [junit] Tests run: 1, Failures: 0, Errors: 0, Time elapsed: 11.846 sec
    [junit]
    [junit] Testsuite: org.apache.solr.common.params.SolrParamTest
    [junit] Tests run: 1, Failures: 0, Errors: 0, Time elapsed: 0.021 sec
    [junit]
    [junit] Testsuite: org.apache.solr.common.util.DOMUtilTest
    [junit] Tests run: 1, Failures: 0, Errors: 0, Time elapsed: 0.027 sec
    [junit]
    [junit] Testsuite: org.apache.solr.util.TestNumberUtils
    [junit] Tests run: 1, Failures: 0, Errors: 0, Time elapsed: 0.542 sec
    [junit]
    [junit] Testsuite: org.apache.solr.core.TestQuerySenderListener
    [junit] Tests run: 2, Failures: 0, Errors: 0, Time elapsed: 0.617 sec
    [junit]
    [junit] Testsuite: org.apache.solr.core.TestSolrDeletionPolicy2
    [junit] Tests run: 1, Failures: 0, Errors: 0, Time elapsed: 0.461 sec
    [junit]
    [junit] Testsuite: org.apache.solr.handler.DocumentAnalysisRequestHandlerTest
    [junit] Tests run: 2, Failures: 0, Errors: 0, Time elapsed: 0.461 sec
    [junit]
    [junit] Testsuite: org.apache.solr.handler.MoreLikeThisHandlerTest
    [junit] Tests run: 1, Failures: 0, Errors: 0, Time elapsed: 0.521 sec
    [junit]
    [junit] Testsuite: org.apache.solr.handler.component.DistributedTermsComponentTest
    [junit] Tests run: 1, Failures: 0, Errors: 0, Time elapsed: 6.376 sec
    [junit]
    [junit] Testsuite: org.apache.solr.schema.IndexSchemaTest
    [junit] Tests run: 5, Failures: 0, Errors: 0, Time elapsed: 0.686 sec
    [junit]
    [junit] Testsuite: org.apache.solr.schema.PolyFieldTest
    [junit] Tests run: 4, Failures: 0, Errors: 0, Time elapsed: 0.931 sec
    [junit]
    [junit] Testsuite: org.apache.solr.search.TestQueryUtils
    [junit] Tests run: 1, Failures: 0, Errors: 0, Time elapsed: 0.743 sec
    [junit]
    [junit] Testsuite: org.apache.solr.search.function.distance.DistanceFunctionTest
    [junit] Tests run: 3, Failures: 0, Errors: 0, Time elapsed: 0.689 sec
    [junit]
    [junit] ------------- Standard Error -----------------
    [junit] 15/10/2010 12:31:25 ? org.apache.solr.SolrTestCaseJ4 assertQ
    [junit] SEVERE: REQUEST FAILED: fl=*,score&q={!func}sqedist(x_td,+y_td,+z_td,+w_td,+0,+0,+0)&fq=id:1
    [junit] ------------- ---------------- ---------------
    [junit] Testsuite: org.apache.solr.servlet.SolrRequestParserTest
    [junit] Tests run: 4, Failures: 0, Errors: 0, Time elapsed: 0.708 sec
    [junit]
    [junit] Testsuite: org.apache.solr.spelling.SpellPossibilityIteratorTest
    [junit] Tests run: 1, Failures: 0, Errors: 0, Time elapsed: 0.014 sec
    [junit]
    [junit] Testsuite: org.apache.solr.update.DirectUpdateHandlerTest
    [junit] Tests run: 7, Failures: 0, Errors: 0, Time elapsed: 2.465 sec
    [junit]
    [junit] Testsuite: org.apache.solr.velocity.VelocityResponseWriterTest
    [junit] Tests run: 1, Failures: 0, Errors: 0, Time elapsed: 0.877 sec
    [junit]

BUILD FAILED
/usr<https://hudson.apache.org/hudson/job/Lucene-Solr-tests-only-trunk/ws/checkout/build.xml>:23: The following error occurred while executing this line:
/usr<https://hudson.apache.org/hudson/job/Lucene-Solr-tests-only-trunk/ws/checkout/solr/build.xml>:386:
The following error occurred while executing this line:
/usr<https://hudson.apache.org/hudson/job/Lucene-Solr-tests-only-trunk/ws/checkout/solr/build.xml>:482: Tests failed!
The following error occurred while executing this line:
/usr<https://hudson.apache.org/hudson/job/Lucene-Solr-tests-only-trunk/ws/checkout/solr/build.xml>:482: Tests failed!
The following error occurred while executing this line:
/usr<https://hudson.apache.org/hudson/job/Lucene-Solr-tests-only-trunk/ws/checkout/solr/build.xml>:482: Tests failed!
The following error occurred while executing this line:
/usr<https://hudson.apache.org/hudson/job/Lucene-Solr-tests-only-trunk/ws/checkout/solr/build.xml>:482: Tests failed!
The following error occurred while executing this line:
/usr<https://hudson.apache.org/hudson/job/Lucene-Solr-tests-only-trunk/ws/checkout/solr/build.xml>:482: Tests failed!
The following error occurred while executing this line:
/usr<https://hudson.apache.org/hudson/job/Lucene-Solr-tests-only-trunk/ws/checkout/solr/build.xml>:482: Tests failed!

Total time: 6 minutes 50 seconds
Recording test results


---------------------------------------------------------------------
To unsubscribe, e-mail: [hidden email]
For additional commands, e-mail: [hidden email]

Reply | Threaded
Open this post in threaded view
|

Build failed in Hudson: Lucene-Solr-tests-only-trunk #115

Apache Jenkins Server
See <https://hudson.apache.org/hudson/job/Lucene-Solr-tests-only-trunk/115/changes>

Changes:

[yonik] tests: consolidate tests

------------------------------------------
[...truncated 7125 lines...]
    [javac]          ^
    [javac] /usr<https://hudson.apache.org/hudson/job/Lucene-Solr-tests-only-trunk/ws/checkout/solr/src/test/org/apache/solr/common/util/TestNamedListCodec.java>:49: warning: [unchecked] unchecked call to add(java.lang.String,T) as a member of the raw type org.apache.solr.common.util.NamedList
    [javac]     r.add("params",p);
    [javac]          ^
    [javac] /usr<https://hudson.apache.org/hudson/job/Lucene-Solr-tests-only-trunk/ws/checkout/solr/src/test/org/apache/solr/common/util/TestNamedListCodec.java>:50: warning: [unchecked] unchecked call to add(java.lang.String,T) as a member of the raw type org.apache.solr.common.util.NamedList
    [javac]     p.add("rows",10);
    [javac]          ^
    [javac] /usr<https://hudson.apache.org/hudson/job/Lucene-Solr-tests-only-trunk/ws/checkout/solr/src/test/org/apache/solr/common/util/TestNamedListCodec.java>:51: warning: [unchecked] unchecked call to add(java.lang.String,T) as a member of the raw type org.apache.solr.common.util.NamedList
    [javac]     p.add("start",0);
    [javac]          ^
    [javac] /usr<https://hudson.apache.org/hudson/job/Lucene-Solr-tests-only-trunk/ws/checkout/solr/src/test/org/apache/solr/common/util/TestNamedListCodec.java>:52: warning: [unchecked] unchecked call to add(java.lang.String,T) as a member of the raw type org.apache.solr.common.util.NamedList
    [javac]     p.add("indent","on");
    [javac]          ^
    [javac] /usr<https://hudson.apache.org/hudson/job/Lucene-Solr-tests-only-trunk/ws/checkout/solr/src/test/org/apache/solr/common/util/TestNamedListCodec.java>:53: warning: [unchecked] unchecked call to add(java.lang.String,T) as a member of the raw type org.apache.solr.common.util.NamedList
    [javac]     p.add("q","ipod");
    [javac]          ^
    [javac] /usr<https://hudson.apache.org/hudson/job/Lucene-Solr-tests-only-trunk/ws/checkout/solr/src/test/org/apache/solr/common/util/TestNamedListCodec.java>:57: warning: [unchecked] unchecked call to add(java.lang.String,T) as a member of the raw type org.apache.solr.common.util.NamedList
    [javac]     nl.add("response", list );
    [javac]           ^
    [javac] /usr<https://hudson.apache.org/hudson/job/Lucene-Solr-tests-only-trunk/ws/checkout/solr/src/test/org/apache/solr/common/util/TestNamedListCodec.java>:76: warning: [unchecked] unchecked call to add(java.lang.String,T) as a member of the raw type org.apache.solr.common.util.NamedList
    [javac]     nl.add("zzz",doc);
    [javac]           ^
    [javac] /usr<https://hudson.apache.org/hudson/job/Lucene-Solr-tests-only-trunk/ws/checkout/solr/src/test/org/apache/solr/common/util/TestNamedListCodec.java>:107: warning: [unchecked] unchecked call to add(E) as a member of the raw type java.util.List
    [javac]     list.add(doc);
    [javac]             ^
    [javac] /usr<https://hudson.apache.org/hudson/job/Lucene-Solr-tests-only-trunk/ws/checkout/solr/src/test/org/apache/solr/common/util/TestNamedListCodec.java>:114: warning: [unchecked] unchecked call to add(E) as a member of the raw type java.util.List
    [javac]     list.add(doc);
    [javac]             ^
    [javac] /usr<https://hudson.apache.org/hudson/job/Lucene-Solr-tests-only-trunk/ws/checkout/solr/src/test/org/apache/solr/common/util/TestNamedListCodec.java>:116: warning: [unchecked] unchecked call to add(java.lang.String,T) as a member of the raw type org.apache.solr.common.util.NamedList
    [javac]     nl.add("zzz",list.iterator());
    [javac]           ^
    [javac] /usr<https://hudson.apache.org/hudson/job/Lucene-Solr-tests-only-trunk/ws/checkout/solr/src/test/org/apache/solr/common/util/TestNamedListCodec.java>:136: warning: [unchecked] unchecked call to add(java.lang.String,T) as a member of the raw type org.apache.solr.common.util.NamedList
    [javac]     r.add("keys", map.keySet());
    [javac]          ^
    [javac] /usr<https://hudson.apache.org/hudson/job/Lucene-Solr-tests-only-trunk/ws/checkout/solr/src/test/org/apache/solr/common/util/TestNamedListCodec.java>:137: warning: [unchecked] unchecked call to add(java.lang.String,T) as a member of the raw type org.apache.solr.common.util.NamedList
    [javac]     r.add("more", "less");
    [javac]          ^
    [javac] /usr<https://hudson.apache.org/hudson/job/Lucene-Solr-tests-only-trunk/ws/checkout/solr/src/test/org/apache/solr/common/util/TestNamedListCodec.java>:138: warning: [unchecked] unchecked call to add(java.lang.String,T) as a member of the raw type org.apache.solr.common.util.NamedList
    [javac]     r.add("values", map.values());
    [javac]          ^
    [javac] /usr<https://hudson.apache.org/hudson/job/Lucene-Solr-tests-only-trunk/ws/checkout/solr/src/test/org/apache/solr/common/util/TestNamedListCodec.java>:139: warning: [unchecked] unchecked call to add(java.lang.String,T) as a member of the raw type org.apache.solr.common.util.NamedList
    [javac]     r.add("finally", "the end");
    [javac]          ^
    [javac] /usr<https://hudson.apache.org/hudson/job/Lucene-Solr-tests-only-trunk/ws/checkout/solr/src/test/org/apache/solr/common/util/TestNamedListCodec.java>:188: warning: [unchecked] unchecked call to add(java.lang.String,T) as a member of the raw type org.apache.solr.common.util.NamedList
    [javac]       nl.add(rStr(2), makeRandom(lev-1));
    [javac]             ^
    [javac] /usr<https://hudson.apache.org/hudson/job/Lucene-Solr-tests-only-trunk/ws/checkout/solr/src/test/org/apache/solr/common/util/TestNamedListCodec.java>:197: warning: [unchecked] unchecked call to add(E) as a member of the raw type java.util.ArrayList
    [javac]       lst.add(makeRandom(lev-1));
    [javac]              ^
    [javac] /usr<https://hudson.apache.org/hudson/job/Lucene-Solr-tests-only-trunk/ws/checkout/solr/src/test/org/apache/solr/core/IndexReaderFactoryTest.java>:43: package AlternateIndexReaderTest does not exist
    [javac]     assertTrue("readerFactory is not an instanceof " + AlternateIndexReaderTest.TestIndexReaderFactory.class, readerFactory instanceof StandardIndexReaderFactory);
    [javac]                                                                                ^
    [javac] /usr<https://hudson.apache.org/hudson/job/Lucene-Solr-tests-only-trunk/ws/checkout/solr/src/test/org/apache/solr/handler/AnalysisRequestHandlerTest.java>:59: warning: [unchecked] unchecked cast
    [javac] found   : java.lang.Object
    [javac] required: org.apache.solr.common.util.NamedList<org.apache.solr.common.util.NamedList<org.apache.solr.common.util.NamedList<java.lang.Object>>>
    [javac]     NamedList<NamedList<NamedList<Object>>> theTokens = (NamedList<NamedList<NamedList<Object>>>) result.get("12345");
    [javac]                                                                                                             ^
    [javac] /usr<https://hudson.apache.org/hudson/job/Lucene-Solr-tests-only-trunk/ws/checkout/solr/src/test/org/apache/solr/handler/AnalysisRequestHandlerTest.java>:87: warning: [unchecked] unchecked cast
    [javac] found   : java.lang.Object
    [javac] required: org.apache.solr.common.util.NamedList<org.apache.solr.common.util.NamedList<org.apache.solr.common.util.NamedList<java.lang.Object>>>
    [javac]     theTokens = (NamedList<NamedList<NamedList<Object>>>) result.get("12346");
    [javac]                                                                     ^
    [javac] /usr<https://hudson.apache.org/hudson/job/Lucene-Solr-tests-only-trunk/ws/checkout/solr/src/test/org/apache/solr/handler/DocumentAnalysisRequestHandlerTest.java>:128: warning: [unchecked] unchecked cast
    [javac] found   : java.lang.Object
    [javac] required: org.apache.solr.common.util.NamedList<org.apache.solr.common.util.NamedList<org.apache.solr.common.util.NamedList<java.lang.Object>>>
    [javac]     NamedList<NamedList<NamedList<Object>>> documentResult = (NamedList<NamedList<NamedList<Object>>>) result.get("1");
    [javac]                                                                                                                  ^
    [javac] /usr<https://hudson.apache.org/hudson/job/Lucene-Solr-tests-only-trunk/ws/checkout/solr/src/test/org/apache/solr/handler/DocumentAnalysisRequestHandlerTest.java>:164: warning: [unchecked] unchecked cast
    [javac] found   : java.lang.Object
    [javac] required: java.util.List<org.apache.solr.common.util.NamedList>
    [javac]     tokenList = (List<NamedList>) queryResult.get("org.apache.lucene.analysis.core.WhitespaceTokenizer");
    [javac]                                                  ^
    [javac] /usr<https://hudson.apache.org/hudson/job/Lucene-Solr-tests-only-trunk/ws/checkout/solr/src/test/org/apache/solr/handler/DocumentAnalysisRequestHandlerTest.java>:170: warning: [unchecked] unchecked cast
    [javac] found   : java.lang.Object
    [javac] required: org.apache.solr.common.util.NamedList<java.util.List<org.apache.solr.common.util.NamedList>>
    [javac]     valueResult = (NamedList<List<NamedList>>) indexResult.get("Jumping Jack");
    [javac]                                                               ^
    [javac] /usr<https://hudson.apache.org/hudson/job/Lucene-Solr-tests-only-trunk/ws/checkout/solr/src/test/org/apache/solr/handler/DocumentAnalysisRequestHandlerTest.java>:180: warning: [unchecked] unchecked cast
    [javac] found   : java.lang.Object
    [javac] required: java.util.List<org.apache.solr.common.util.NamedList>
    [javac]     tokenList = (List<NamedList>) queryResult.get("org.apache.lucene.analysis.standard.StandardTokenizer");
    [javac]                                                  ^
    [javac] /usr<https://hudson.apache.org/hudson/job/Lucene-Solr-tests-only-trunk/ws/checkout/solr/src/test/org/apache/solr/handler/DocumentAnalysisRequestHandlerTest.java>:184: warning: [unchecked] unchecked cast
    [javac] found   : java.lang.Object
    [javac] required: java.util.List<org.apache.solr.common.util.NamedList>
    [javac]     tokenList = (List<NamedList>) queryResult.get("org.apache.lucene.analysis.standard.StandardFilter");
    [javac]                                                  ^
    [javac] /usr<https://hudson.apache.org/hudson/job/Lucene-Solr-tests-only-trunk/ws/checkout/solr/src/test/org/apache/solr/handler/DocumentAnalysisRequestHandlerTest.java>:188: warning: [unchecked] unchecked cast
    [javac] found   : java.lang.Object
    [javac] required: java.util.List<org.apache.solr.common.util.NamedList>
    [javac]     tokenList = (List<NamedList>) queryResult.get("org.apache.lucene.analysis.core.LowerCaseFilter");
    [javac]                                                  ^
    [javac] /usr<https://hudson.apache.org/hudson/job/Lucene-Solr-tests-only-trunk/ws/checkout/solr/src/test/org/apache/solr/handler/DocumentAnalysisRequestHandlerTest.java>:192: warning: [unchecked] unchecked cast
    [javac] found   : java.lang.Object
    [javac] required: java.util.List<org.apache.solr.common.util.NamedList>
    [javac]     tokenList = (List<NamedList>) queryResult.get("org.apache.lucene.analysis.core.StopFilter");
    [javac]                                                  ^
    [javac] /usr<https://hudson.apache.org/hudson/job/Lucene-Solr-tests-only-trunk/ws/checkout/solr/src/test/org/apache/solr/handler/DocumentAnalysisRequestHandlerTest.java>:196: warning: [unchecked] unchecked cast
    [javac] found   : java.lang.Object
    [javac] required: java.util.List<org.apache.solr.common.util.NamedList>
    [javac]     tokenList = (List<NamedList>) queryResult.get("org.apache.lucene.analysis.en.PorterStemFilter");
    [javac]                                                  ^
    [javac] /usr<https://hudson.apache.org/hudson/job/Lucene-Solr-tests-only-trunk/ws/checkout/solr/src/test/org/apache/solr/handler/DocumentAnalysisRequestHandlerTest.java>:202: warning: [unchecked] unchecked cast
    [javac] found   : java.lang.Object
    [javac] required: org.apache.solr.common.util.NamedList<java.util.List<org.apache.solr.common.util.NamedList>>
    [javac]     valueResult = (NamedList<List<NamedList>>) indexResult.get("The Fox Jumped Over The Dogs");
    [javac]                                                               ^
    [javac] /usr<https://hudson.apache.org/hudson/job/Lucene-Solr-tests-only-trunk/ws/checkout/solr/src/test/org/apache/solr/handler/FieldAnalysisRequestHandlerTest.java>:121: warning: [unchecked] unchecked conversion
    [javac] found   : org.apache.solr.common.util.NamedList
    [javac] required: org.apache.solr.common.util.NamedList<org.apache.solr.common.util.NamedList>
    [javac]     NamedList<NamedList> fieldTypes = result.get("field_types");
    [javac]                                                 ^
    [javac] /usr<https://hudson.apache.org/hudson/job/Lucene-Solr-tests-only-trunk/ws/checkout/solr/src/test/org/apache/solr/handler/FieldAnalysisRequestHandlerTest.java>:123: warning: [unchecked] unchecked conversion
    [javac] found   : org.apache.solr.common.util.NamedList
    [javac] required: org.apache.solr.common.util.NamedList<org.apache.solr.common.util.NamedList>
    [javac]     NamedList<NamedList> textType = fieldTypes.get("text");
    [javac]                                                   ^
    [javac] /usr<https://hudson.apache.org/hudson/job/Lucene-Solr-tests-only-trunk/ws/checkout/solr/src/test/org/apache/solr/handler/FieldAnalysisRequestHandlerTest.java>:126: warning: [unchecked] unchecked conversion
    [javac] found   : org.apache.solr.common.util.NamedList
    [javac] required: org.apache.solr.common.util.NamedList<java.util.List<org.apache.solr.common.util.NamedList>>
    [javac]     NamedList<List<NamedList>> indexPart = textType.get("index");
    [javac]                                                        ^
    [javac] /usr<https://hudson.apache.org/hudson/job/Lucene-Solr-tests-only-trunk/ws/checkout/solr/src/test/org/apache/solr/handler/FieldAnalysisRequestHandlerTest.java>:191: warning: [unchecked] unchecked conversion
    [javac] found   : org.apache.solr.common.util.NamedList
    [javac] required: org.apache.solr.common.util.NamedList<java.util.List<org.apache.solr.common.util.NamedList>>
    [javac]     NamedList<List<NamedList>> queryPart = textType.get("query");
    [javac]                                                        ^
    [javac] /usr<https://hudson.apache.org/hudson/job/Lucene-Solr-tests-only-trunk/ws/checkout/solr/src/test/org/apache/solr/handler/FieldAnalysisRequestHandlerTest.java>:220: warning: [unchecked] unchecked conversion
    [javac] found   : org.apache.solr.common.util.NamedList
    [javac] required: org.apache.solr.common.util.NamedList<org.apache.solr.common.util.NamedList>
    [javac]     NamedList<NamedList> nameTextType = fieldTypes.get("nametext");
    [javac]                                                       ^
    [javac] /usr<https://hudson.apache.org/hudson/job/Lucene-Solr-tests-only-trunk/ws/checkout/solr/src/test/org/apache/solr/handler/FieldAnalysisRequestHandlerTest.java>:223: warning: [unchecked] unchecked conversion
    [javac] found   : org.apache.solr.common.util.NamedList
    [javac] required: org.apache.solr.common.util.NamedList<java.util.List<org.apache.solr.common.util.NamedList>>
    [javac]     indexPart = nameTextType.get("index");
    [javac]                                 ^
    [javac] /usr<https://hudson.apache.org/hudson/job/Lucene-Solr-tests-only-trunk/ws/checkout/solr/src/test/org/apache/solr/handler/FieldAnalysisRequestHandlerTest.java>:240: warning: [unchecked] unchecked conversion
    [javac] found   : org.apache.solr.common.util.NamedList
    [javac] required: org.apache.solr.common.util.NamedList<java.util.List<org.apache.solr.common.util.NamedList>>
    [javac]     queryPart = nameTextType.get("query");
    [javac]                                 ^
    [javac] /usr<https://hudson.apache.org/hudson/job/Lucene-Solr-tests-only-trunk/ws/checkout/solr/src/test/org/apache/solr/handler/FieldAnalysisRequestHandlerTest.java>:246: warning: [unchecked] unchecked conversion
    [javac] found   : org.apache.solr.common.util.NamedList
    [javac] required: org.apache.solr.common.util.NamedList<org.apache.solr.common.util.NamedList>
    [javac]     NamedList<NamedList> fieldNames = result.get("field_names");
    [javac]                                                 ^
    [javac] /usr<https://hudson.apache.org/hudson/job/Lucene-Solr-tests-only-trunk/ws/checkout/solr/src/test/org/apache/solr/handler/FieldAnalysisRequestHandlerTest.java>:249: warning: [unchecked] unchecked conversion
    [javac] found   : org.apache.solr.common.util.NamedList
    [javac] required: org.apache.solr.common.util.NamedList<org.apache.solr.common.util.NamedList>
    [javac]     NamedList<NamedList> whitetok = fieldNames.get("whitetok");
    [javac]                                                   ^
    [javac] /usr<https://hudson.apache.org/hudson/job/Lucene-Solr-tests-only-trunk/ws/checkout/solr/src/test/org/apache/solr/handler/FieldAnalysisRequestHandlerTest.java>:252: warning: [unchecked] unchecked conversion
    [javac] found   : org.apache.solr.common.util.NamedList
    [javac] required: org.apache.solr.common.util.NamedList<java.util.List<org.apache.solr.common.util.NamedList>>
    [javac]     indexPart = whitetok.get("index");
    [javac]                             ^
    [javac] /usr<https://hudson.apache.org/hudson/job/Lucene-Solr-tests-only-trunk/ws/checkout/solr/src/test/org/apache/solr/handler/FieldAnalysisRequestHandlerTest.java>:269: warning: [unchecked] unchecked conversion
    [javac] found   : org.apache.solr.common.util.NamedList
    [javac] required: org.apache.solr.common.util.NamedList<java.util.List<org.apache.solr.common.util.NamedList>>
    [javac]     queryPart = whitetok.get("query");
    [javac]                             ^
    [javac] /usr<https://hudson.apache.org/hudson/job/Lucene-Solr-tests-only-trunk/ws/checkout/solr/src/test/org/apache/solr/handler/FieldAnalysisRequestHandlerTest.java>:278: warning: [unchecked] unchecked conversion
    [javac] found   : org.apache.solr.common.util.NamedList
    [javac] required: org.apache.solr.common.util.NamedList<org.apache.solr.common.util.NamedList>
    [javac]     NamedList<NamedList> keywordtok = fieldNames.get("keywordtok");
    [javac]                                                     ^
    [javac] /usr<https://hudson.apache.org/hudson/job/Lucene-Solr-tests-only-trunk/ws/checkout/solr/src/test/org/apache/solr/handler/FieldAnalysisRequestHandlerTest.java>:281: warning: [unchecked] unchecked conversion
    [javac] found   : org.apache.solr.common.util.NamedList
    [javac] required: org.apache.solr.common.util.NamedList<java.util.List<org.apache.solr.common.util.NamedList>>
    [javac]     indexPart = keywordtok.get("index");
    [javac]                               ^
    [javac] /usr<https://hudson.apache.org/hudson/job/Lucene-Solr-tests-only-trunk/ws/checkout/solr/src/test/org/apache/solr/handler/FieldAnalysisRequestHandlerTest.java>:289: warning: [unchecked] unchecked conversion
    [javac] found   : org.apache.solr.common.util.NamedList
    [javac] required: org.apache.solr.common.util.NamedList<java.util.List<org.apache.solr.common.util.NamedList>>
    [javac]     queryPart = keywordtok.get("query");
    [javac]                               ^
    [javac] /usr<https://hudson.apache.org/hudson/job/Lucene-Solr-tests-only-trunk/ws/checkout/solr/src/test/org/apache/solr/handler/FieldAnalysisRequestHandlerTest.java>:310: warning: [unchecked] unchecked conversion
    [javac] found   : org.apache.solr.common.util.NamedList
    [javac] required: org.apache.solr.common.util.NamedList<org.apache.solr.common.util.NamedList>
    [javac]     NamedList<NamedList> fieldTypes = result.get("field_types");
    [javac]                                                 ^
    [javac] /usr<https://hudson.apache.org/hudson/job/Lucene-Solr-tests-only-trunk/ws/checkout/solr/src/test/org/apache/solr/handler/FieldAnalysisRequestHandlerTest.java>:312: warning: [unchecked] unchecked conversion
    [javac] found   : org.apache.solr.common.util.NamedList
    [javac] required: org.apache.solr.common.util.NamedList<org.apache.solr.common.util.NamedList>
    [javac]     NamedList<NamedList> textType = fieldTypes.get("charfilthtmlmap");
    [javac]                                                   ^
    [javac] /usr<https://hudson.apache.org/hudson/job/Lucene-Solr-tests-only-trunk/ws/checkout/solr/src/test/org/apache/solr/handler/FieldAnalysisRequestHandlerTest.java>:321: warning: [unchecked] unchecked cast
    [javac] found   : java.lang.Object
    [javac] required: java.util.List<org.apache.solr.common.util.NamedList>
    [javac]     List<NamedList> tokenList = (List<NamedList>)indexPart.get("org.apache.lucene.analysis.core.WhitespaceTokenizer");
    [javac]                                                               ^
    [javac] /usr<https://hudson.apache.org/hudson/job/Lucene-Solr-tests-only-trunk/ws/checkout/solr/src/test/org/apache/solr/handler/component/SpellCheckComponentTest.java>:143: warning: [unchecked] unchecked call to add(java.lang.String,T) as a member of the raw type org.apache.solr.common.util.NamedList
    [javac]     spellchecker.add(AbstractLuceneSpellChecker.DICTIONARY_NAME, "default");
    [javac]                     ^
    [javac] /usr<https://hudson.apache.org/hudson/job/Lucene-Solr-tests-only-trunk/ws/checkout/solr/src/test/org/apache/solr/handler/component/SpellCheckComponentTest.java>:144: warning: [unchecked] unchecked call to add(java.lang.String,T) as a member of the raw type org.apache.solr.common.util.NamedList
    [javac]     spellchecker.add(AbstractLuceneSpellChecker.FIELD, "lowerfilt");
    [javac]                     ^
    [javac] /usr<https://hudson.apache.org/hudson/job/Lucene-Solr-tests-only-trunk/ws/checkout/solr/src/test/org/apache/solr/handler/component/SpellCheckComponentTest.java>:145: warning: [unchecked] unchecked call to add(java.lang.String,T) as a member of the raw type org.apache.solr.common.util.NamedList
    [javac]     spellchecker.add(AbstractLuceneSpellChecker.INDEX_DIR, "spellchecker1");
    [javac]                     ^
    [javac] /usr<https://hudson.apache.org/hudson/job/Lucene-Solr-tests-only-trunk/ws/checkout/solr/src/test/org/apache/solr/handler/component/SpellCheckComponentTest.java>:146: warning: [unchecked] unchecked call to add(java.lang.String,T) as a member of the raw type org.apache.solr.common.util.NamedList
    [javac]     args.add("spellchecker", spellchecker);
    [javac]             ^
    [javac] /usr<https://hudson.apache.org/hudson/job/Lucene-Solr-tests-only-trunk/ws/checkout/solr/src/test/org/apache/solr/handler/component/SpellCheckComponentTest.java>:159: warning: [unchecked] unchecked call to ArrayList(java.util.Collection<? extends E>) as a member of the raw type java.util.ArrayList
    [javac]     rb.components = new ArrayList(h.getCore().getSearchComponents().values());
    [javac]                     ^
    [javac] /usr<https://hudson.apache.org/hudson/job/Lucene-Solr-tests-only-trunk/ws/checkout/solr/src/test/org/apache/solr/handler/component/SpellCheckComponentTest.java>:159: warning: [unchecked] unchecked conversion
    [javac] found   : java.util.ArrayList
    [javac] required: java.util.List<org.apache.solr.handler.component.SearchComponent>
    [javac]     rb.components = new ArrayList(h.getCore().getSearchComponents().values());
    [javac]                     ^
    [javac] /usr<https://hudson.apache.org/hudson/job/Lucene-Solr-tests-only-trunk/ws/checkout/solr/src/test/org/apache/solr/highlight/DummyHighlighter.java>:34: warning: [unchecked] unchecked call to add(java.lang.String,T) as a member of the raw type org.apache.solr.common.util.NamedList
    [javac] fragments.add("dummy", "thing1");
    [javac]             ^
    [javac] /usr<https://hudson.apache.org/hudson/job/Lucene-Solr-tests-only-trunk/ws/checkout/solr/src/test/org/apache/solr/highlight/DummyHighlighter.java>:35: warning: [unchecked] unchecked conversion
    [javac] found   : org.apache.solr.common.util.NamedList
    [javac] required: org.apache.solr.common.util.NamedList<java.lang.Object>
    [javac] return fragments;
    [javac]       ^
    [javac] /usr<https://hudson.apache.org/hudson/job/Lucene-Solr-tests-only-trunk/ws/checkout/solr/src/test/org/apache/solr/request/JSONWriterTest.java>:93: warning: [unchecked] unchecked call to add(java.lang.String,T) as a member of the raw type org.apache.solr.common.util.NamedList
    [javac]     nl.add("data1", "hello");
    [javac]           ^
    [javac] /usr<https://hudson.apache.org/hudson/job/Lucene-Solr-tests-only-trunk/ws/checkout/solr/src/test/org/apache/solr/request/JSONWriterTest.java>:94: warning: [unchecked] unchecked call to add(java.lang.String,T) as a member of the raw type org.apache.solr.common.util.NamedList
    [javac]     nl.add(null, 42);
    [javac]           ^
    [javac] /usr<https://hudson.apache.org/hudson/job/Lucene-Solr-tests-only-trunk/ws/checkout/solr/src/test/org/apache/solr/search/TestFastLRUCache.java>:54: warning: [unchecked] unchecked conversion
    [javac] found   : org.apache.solr.common.util.NamedList
    [javac] required: org.apache.solr.common.util.NamedList<java.io.Serializable>
    [javac]     NamedList<Serializable> nl = fastCache.getStatistics();
    [javac]                                                         ^
    [javac] /usr<https://hudson.apache.org/hudson/job/Lucene-Solr-tests-only-trunk/ws/checkout/solr/src/test/org/apache/solr/search/TestFastLRUCache.java>:67: warning: [unchecked] unchecked conversion
    [javac] found   : org.apache.solr.common.util.NamedList
    [javac] required: org.apache.solr.common.util.NamedList<java.io.Serializable>
    [javac]     nl = fastCacheNew.getStatistics();
    [javac]                                    ^
    [javac] Note: Some input files use or override a deprecated API.
    [javac] Note: Recompile with -Xlint:deprecation for details.
    [javac] Note: Some input files additionally use unchecked or unsafe operations.
    [javac] 1 error
    [javac] 100 warnings

BUILD FAILED
/usr<https://hudson.apache.org/hudson/job/Lucene-Solr-tests-only-trunk/ws/checkout/build.xml>:23: The following error occurred while executing this line:
/usr<https://hudson.apache.org/hudson/job/Lucene-Solr-tests-only-trunk/ws/checkout/solr/build.xml>:363: The following error occurred while executing this line:
/usr<https://hudson.apache.org/hudson/job/Lucene-Solr-tests-only-trunk/ws/checkout/solr/common-build.xml>:258: Compile failed; see the compiler error output for details.

Total time: 7 minutes 55 seconds
Recording test results


---------------------------------------------------------------------
To unsubscribe, e-mail: [hidden email]
For additional commands, e-mail: [hidden email]

Reply | Threaded
Open this post in threaded view
|

Hudson build is back to normal : Lucene-Solr-tests-only-trunk #116

Apache Jenkins Server
See <https://hudson.apache.org/hudson/job/Lucene-Solr-tests-only-trunk/116/changes>



---------------------------------------------------------------------
To unsubscribe, e-mail: [hidden email]
For additional commands, e-mail: [hidden email]