Build failed in Hudson: Lucene-Solr-tests-only-trunk #74

classic Classic list List threaded Threaded
4 messages Options
Reply | Threaded
Open this post in threaded view
|

Build failed in Hudson: Lucene-Solr-tests-only-trunk #74

Apache Jenkins Server
See <https://hudson.apache.org/hudson/job/Lucene-Solr-tests-only-trunk/74/>

------------------------------------------
[...truncated 7922 lines...]
    [junit]
    [junit] Testsuite: org.apache.solr.schema.TestBinaryField
    [junit] Tests run: 1, Failures: 0, Errors: 0, Time elapsed: 0.319 sec
    [junit]
    [junit] Testsuite: org.apache.solr.search.TestQueryUtils
    [junit] Tests run: 1, Failures: 0, Errors: 0, Time elapsed: 0.596 sec
    [junit]
    [junit] Testsuite: org.apache.solr.search.function.distance.DistanceFunctionTest
    [junit] Tests run: 3, Failures: 0, Errors: 0, Time elapsed: 0.681 sec
    [junit]
    [junit] Testsuite: org.apache.solr.spelling.SpellPossibilityIteratorTest
    [junit] Tests run: 1, Failures: 0, Errors: 0, Time elapsed: 0.009 sec
    [junit]
    [junit] Testsuite: org.apache.solr.update.DirectUpdateHandlerTest
    [junit] Tests run: 7, Failures: 0, Errors: 0, Time elapsed: 2.16 sec
    [junit]
    [junit] Testsuite: org.apache.solr.util.DateMathParserTest
    [junit] Tests run: 7, Failures: 0, Errors: 0, Time elapsed: 0.086 sec
    [junit]
    [junit] Testsuite: org.apache.solr.velocity.VelocityResponseWriterTest
    [junit] Tests run: 1, Failures: 0, Errors: 0, Time elapsed: 0.789 sec
    [junit]
    [junit] Tests FAILED
    [junit] Testsuite: org.apache.solr.handler.TestReplicationHandler
    [junit] Tests run: 7, Failures: 0, Errors: 0, Time elapsed: 27.962 sec
    [junit]
    [junit] ------------- Standard Error -----------------
    [junit] 15.10.2010. 06.01.21 org.apache.solr.handler.SnapPuller fetchLatestIndex
    [junit] SEVERE: Master at: http://localhost:49729/solr/replication is not available. Index fetch failed. Exception: The host did not accept the connection within timeout of 5000 ms
    [junit] ------------- ---------------- ---------------
    [junit] Testsuite: org.apache.solr.TestDistributedSearch
    [junit] Tests run: 1, Failures: 0, Errors: 0, Time elapsed: 100.295 sec
    [junit]
    [junit] Testsuite: org.apache.solr.analysis.TestCzechStemFilterFactory
    [junit] Tests run: 1, Failures: 0, Errors: 0, Time elapsed: 0.025 sec
    [junit]
    [junit] Testsuite: org.apache.solr.analysis.TestDelimitedPayloadTokenFilterFactory
    [junit] Tests run: 2, Failures: 0, Errors: 0, Time elapsed: 0.018 sec
    [junit]
    [junit] Testsuite: org.apache.solr.analysis.TestEnglishMinimalStemFilterFactory
    [junit] Tests run: 1, Failures: 0, Errors: 0, Time elapsed: 0.011 sec
    [junit]
    [junit] Testsuite: org.apache.solr.analysis.TestHindiFilters
    [junit] Tests run: 4, Failures: 0, Errors: 0, Time elapsed: 0.031 sec
    [junit]
    [junit] Testsuite: org.apache.solr.analysis.TestPortugueseLightStemFilterFactory
    [junit] Tests run: 1, Failures: 0, Errors: 0, Time elapsed: 0.025 sec
    [junit]
    [junit] Testsuite: org.apache.solr.analysis.TestReverseStringFilterFactory
    [junit] Tests run: 1, Failures: 0, Errors: 0, Time elapsed: 0.01 sec
    [junit]
    [junit] Testsuite: org.apache.solr.analysis.TestRussianFilters
    [junit] Tests run: 3, Failures: 0, Errors: 0, Time elapsed: 0.02 sec
    [junit]
    [junit] Testsuite: org.apache.solr.analysis.TestWikipediaTokenizerFactory
    [junit] Tests run: 1, Failures: 0, Errors: 0, Time elapsed: 0.015 sec
    [junit]
    [junit] Testsuite: org.apache.solr.client.solrj.embedded.LargeVolumeEmbeddedTest
    [junit] Tests run: 1, Failures: 0, Errors: 0, Time elapsed: 0.755 sec
    [junit]
    [junit] Testsuite: org.apache.solr.client.solrj.request.TestUpdateRequestCodec
    [junit] Tests run: 2, Failures: 0, Errors: 0, Time elapsed: 0.018 sec
    [junit]
    [junit] Testsuite: org.apache.solr.client.solrj.response.QueryResponseTest
    [junit] Tests run: 1, Failures: 0, Errors: 0, Time elapsed: 0.025 sec
    [junit]
    [junit] Testsuite: org.apache.solr.handler.component.DistributedSpellCheckComponentTest
    [junit] Tests run: 1, Failures: 0, Errors: 0, Time elapsed: 85.325 sec
    [junit]
    [junit] Testsuite: org.apache.solr.handler.component.SpellCheckComponentTest
    [junit] Tests run: 10, Failures: 0, Errors: 0, Time elapsed: 0.962 sec
    [junit]
    [junit] Testsuite: org.apache.solr.schema.NotRequiredUniqueKeyTest
    [junit] Tests run: 1, Failures: 0, Errors: 0, Time elapsed: 0.139 sec
    [junit]
    [junit] Testsuite: org.apache.solr.search.TestFastLRUCache
    [junit] Tests run: 6, Failures: 0, Errors: 0, Time elapsed: 0.022 sec
    [junit]
    [junit] Testsuite: org.apache.solr.search.function.TestFunctionQuery
    [junit] Tests run: 7, Failures: 0, Errors: 0, Time elapsed: 1.543 sec
    [junit]
    [junit] Testsuite: org.apache.solr.spelling.suggest.SuggesterTest
    [junit] Tests run: 2, Failures: 0, Errors: 0, Time elapsed: 0.174 sec
    [junit]
    [junit] Testsuite: org.apache.solr.update.DocumentBuilderTest
    [junit] Tests run: 3, Failures: 0, Errors: 0, Time elapsed: 0.475 sec
    [junit]
    [junit] Testsuite: org.apache.solr.util.TestNumberUtils
    [junit] Tests run: 1, Failures: 0, Errors: 0, Time elapsed: 0.519 sec
    [junit]
    [junit] Testsuite: org.apache.solr.handler.component.DistributedTermsComponentTest
    [junit] Tests run: 1, Failures: 0, Errors: 0, Time elapsed: 83.544 sec
    [junit]
    [junit] Testsuite: org.apache.solr.request.TestWriterPerf
    [junit] Tests run: 1, Failures: 0, Errors: 0, Time elapsed: 0.531 sec
    [junit]
    [junit] Testsuite: org.apache.solr.schema.DateFieldTest
    [junit] Tests run: 6, Failures: 0, Errors: 0, Time elapsed: 0.023 sec
    [junit]
    [junit] Testsuite: org.apache.solr.cloud.BasicZkTest
    [junit] Tests run: 1, Failures: 0, Errors: 0, Time elapsed: 10.236 sec
    [junit]
    [junit] Testsuite: org.apache.solr.common.util.ContentStreamTest
    [junit] Tests run: 3, Failures: 0, Errors: 0, Time elapsed: 0.049 sec
    [junit]
    [junit] Testsuite: org.apache.solr.common.util.TestXMLEscaping
    [junit] Tests run: 7, Failures: 0, Errors: 0, Time elapsed: 0.02 sec
    [junit]
    [junit] Testsuite: org.apache.solr.core.TestQuerySenderListener
    [junit] Tests run: 2, Failures: 0, Errors: 0, Time elapsed: 0.709 sec
    [junit]
    [junit] Testsuite: org.apache.solr.core.TestSolrDeletionPolicy2
    [junit] Tests run: 1, Failures: 0, Errors: 0, Time elapsed: 0.542 sec
    [junit]
    [junit] Testsuite: org.apache.solr.handler.DocumentAnalysisRequestHandlerTest
    [junit] Tests run: 2, Failures: 0, Errors: 0, Time elapsed: 0.532 sec
    [junit]
    [junit] Testsuite: org.apache.solr.handler.MoreLikeThisHandlerTest
    [junit] Tests run: 1, Failures: 0, Errors: 0, Time elapsed: 0.576 sec
    [junit]
    [junit] Testsuite: org.apache.solr.handler.component.QueryElevationComponentTest
    [junit] Tests run: 4, Failures: 0, Errors: 0, Time elapsed: 0.583 sec
    [junit]
    [junit] Testsuite: org.apache.solr.request.TestBinaryResponseWriter
    [junit] Tests run: 1, Failures: 0, Errors: 0, Time elapsed: 0.523 sec
    [junit]
    [junit] Testsuite: org.apache.solr.schema.IndexSchemaTest
    [junit] Tests run: 5, Failures: 0, Errors: 0, Time elapsed: 0.551 sec
    [junit]
    [junit] Testsuite: org.apache.solr.schema.PolyFieldTest
    [junit] Tests run: 4, Failures: 0, Errors: 0, Time elapsed: 0.668 sec
    [junit]
    [junit] Testsuite: org.apache.solr.search.SpatialFilterTest
    [junit] Tests run: 3, Failures: 0, Errors: 0, Time elapsed: 0.768 sec
    [junit]
    [junit] Testsuite: org.apache.solr.search.TestExtendedDismaxParser
    [junit] Tests run: 1, Failures: 0, Errors: 0, Time elapsed: 0.576 sec
    [junit]
    [junit] Testsuite: org.apache.solr.servlet.SolrRequestParserTest
    [junit] Tests run: 4, Failures: 0, Errors: 0, Time elapsed: 0.533 sec
    [junit]
    [junit] Testsuite: org.apache.solr.spelling.DirectSolrSpellCheckerTest
    [junit] Tests run: 1, Failures: 0, Errors: 0, Time elapsed: 0.542 sec
    [junit]
    [junit] Testsuite: org.apache.solr.update.processor.SignatureUpdateProcessorFactoryTest
    [junit] Tests run: 4, Failures: 0, Errors: 0, Time elapsed: 1.477 sec
    [junit]
    [junit] Testsuite: org.apache.solr.search.TestRangeQuery
    [junit] Tests run: 2, Failures: 0, Errors: 0, Time elapsed: 13.619 sec
    [junit]
    [junit] Testsuite: org.apache.solr.search.function.SortByFunctionTest
    [junit] Tests run: 2, Failures: 0, Errors: 0, Time elapsed: 0.974 sec
    [junit]
    [junit] Testsuite: org.apache.solr.spelling.SpellingQueryConverterTest
    [junit] Tests run: 4, Failures: 0, Errors: 0, Time elapsed: 0.011 sec
    [junit]
    [junit] Testsuite: org.apache.solr.update.processor.UpdateRequestProcessorFactoryTest
    [junit] Tests run: 1, Failures: 0, Errors: 0, Time elapsed: 0.38 sec
    [junit]
    [junit] Testsuite: org.apache.solr.util.SolrPluginUtilsTest
    [junit] Tests run: 7, Failures: 0, Errors: 0, Time elapsed: 0.433 sec
    [junit]
    [junit] Testsuite: org.apache.solr.handler.component.DistributedSpellCollatorTest
    [junit] Tests run: 1, Failures: 0, Errors: 0, Time elapsed: 82.674 sec
    [junit]
    [junit] ------------- Standard Error -----------------
    [junit] 2010.10.14. 20:01:25 org.apache.solr.handler.SnapPuller fetchLatestIndex
    [junit] SEVERE: Master at: http://localhost:49743/solr/replication is not available. Index fetch failed. Exception: The host did not accept the connection within timeout of 5000 ms
    [junit] 2010.10.14. 20:01:26 org.apache.solr.handler.SnapPuller fetchLatestIndex
    [junit] SEVERE: Master at: http://localhost:49729/solr/replication is not available. Index fetch failed. Exception: The host did not accept the connection within timeout of 5000 ms
    [junit] 2010.10.14. 20:01:31 org.apache.solr.handler.SnapPuller fetchLatestIndex
    [junit] SEVERE: Master at: http://localhost:49729/solr/replication is not available. Index fetch failed. Exception: The host did not accept the connection within timeout of 5000 ms
    [junit] 2010.10.14. 20:01:36 org.apache.solr.handler.SnapPuller fetchLatestIndex
    [junit] SEVERE: Master at: http://localhost:49729/solr/replication is not available. Index fetch failed. Exception: The host did not accept the connection within timeout of 5000 ms
    [junit] 2010.10.14. 20:01:41 org.apache.solr.handler.SnapPuller fetchLatestIndex
    [junit] SEVERE: Master at: http://localhost:49729/solr/replication is not available. Index fetch failed. Exception: The host did not accept the connection within timeout of 5000 ms
    [junit] 2010.10.14. 20:01:46 org.apache.solr.handler.SnapPuller fetchLatestIndex
    [junit] SEVERE: Master at: http://localhost:49729/solr/replication is not available. Index fetch failed. Exception: The host did not accept the connection within timeout of 5000 ms
    [junit] 2010.10.14. 20:01:51 org.apache.solr.handler.SnapPuller fetchLatestIndex
    [junit] SEVERE: Master at: http://localhost:49729/solr/replication is not available. Index fetch failed. Exception: The host did not accept the connection within timeout of 5000 ms
    [junit] 2010.10.14. 20:01:56 org.apache.solr.handler.SnapPuller fetchLatestIndex
    [junit] SEVERE: Master at: http://localhost:49729/solr/replication is not available. Index fetch failed. Exception: The host did not accept the connection within timeout of 5000 ms
    [junit] 2010.10.14. 20:02:01 org.apache.solr.handler.SnapPuller fetchLatestIndex
    [junit] SEVERE: Master at: http://localhost:49729/solr/replication is not available. Index fetch failed. Exception: The host did not accept the connection within timeout of 5000 ms
    [junit] 2010.10.14. 20:02:06 org.apache.solr.handler.SnapPuller fetchLatestIndex
    [junit] SEVERE: Master at: http://localhost:49729/solr/replication is not available. Index fetch failed. Exception: The host did not accept the connection within timeout of 5000 ms
    [junit] 2010.10.14. 20:02:11 org.apache.solr.handler.SnapPuller fetchLatestIndex
    [junit] SEVERE: Master at: http://localhost:49729/solr/replication is not available. Index fetch failed. Exception: The host did not accept the connection within timeout of 5000 ms
    [junit] 2010.10.14. 20:02:16 org.apache.solr.handler.SnapPuller fetchLatestIndex
    [junit] SEVERE: Master at: http://localhost:49729/solr/replication is not available. Index fetch failed. Exception: The host did not accept the connection within timeout of 5000 ms
    [junit] 2010.10.14. 20:02:21 org.apache.solr.handler.SnapPuller fetchLatestIndex
    [junit] SEVERE: Master at: http://localhost:49729/solr/replication is not available. Index fetch failed. Exception: The host did not accept the connection within timeout of 5000 ms
    [junit] 2010.10.14. 20:02:26 org.apache.solr.handler.SnapPuller fetchLatestIndex
    [junit] SEVERE: Master at: http://localhost:49729/solr/replication is not available. Index fetch failed. Exception: The host did not accept the connection within timeout of 5000 ms
    [junit] 2010.10.14. 20:02:31 org.apache.solr.handler.SnapPuller fetchLatestIndex
    [junit] SEVERE: Master at: http://localhost:49729/solr/replication is not available. Index fetch failed. Exception: The host did not accept the connection within timeout of 5000 ms
    [junit] 2010.10.14. 20:02:36 org.apache.solr.handler.SnapPuller fetchLatestIndex
    [junit] SEVERE: Master at: http://localhost:49729/solr/replication is not available. Index fetch failed. Exception: The host did not accept the connection within timeout of 5000 ms
    [junit] 2010.10.14. 20:02:41 org.apache.solr.handler.SnapPuller fetchLatestIndex
    [junit] SEVERE: Master at: http://localhost:49729/solr/replication is not available. Index fetch failed. Exception: The host did not accept the connection within timeout of 5000 ms
    [junit] ------------- ---------------- ---------------
    [junit] Testsuite: org.apache.solr.highlight.HighlighterConfigTest
    [junit] Tests run: 1, Failures: 0, Errors: 0, Time elapsed: 0.595 sec
    [junit]
    [junit] Testsuite: org.apache.solr.request.SimpleFacetsTest
    [junit] Tests run: 22, Failures: 0, Errors: 0, Time elapsed: 5.66 sec
    [junit]
    [junit] ------------- Standard Error -----------------
    [junit] 2010 Okt 14 16:02:46 org.apache.solr.handler.SnapPuller fetchLatestIndex
    [junit] SEVERE: Master at: http://localhost:49729/solr/replication is not available. Index fetch failed. Exception: The host did not accept the connection within timeout of 5000 ms
    [junit] ------------- ---------------- ---------------
    [junit] Testsuite: org.apache.solr.schema.CopyFieldTest
    [junit] Tests run: 6, Failures: 0, Errors: 0, Time elapsed: 0.546 sec
    [junit]
    [junit] Testsuite: org.apache.solr.schema.NumericFieldsTest
    [junit] Tests run: 1, Failures: 0, Errors: 0, Time elapsed: 0.441 sec
    [junit]
    [junit] ------------- Standard Error -----------------
    [junit] 2010?10?15? ??10:02:51 org.apache.solr.handler.SnapPuller fetchLatestIndex
    [junit] ???: Master at: http://localhost:49729/solr/replication is not available. Index fetch failed. Exception: The host did not accept the connection within timeout of 5000 ms
    [junit] ------------- ---------------- ---------------
    [junit] Testsuite: org.apache.solr.search.FunctionQParserTest
    [junit] Tests run: 1, Failures: 0, Errors: 0, Time elapsed: 0.268 sec
    [junit]
    [junit] Testsuite: org.apache.solr.search.TestIndexSearcher
    [junit] Tests run: 1, Failures: 0, Errors: 0, Time elapsed: 0.484 sec
    [junit]
    [junit] Testsuite: org.apache.solr.servlet.DirectSolrConnectionTest
    [junit] Tests run: 2, Failures: 0, Errors: 0, Time elapsed: 0.296 sec
    [junit]

BUILD FAILED
/usr<https://hudson.apache.org/hudson/job/Lucene-Solr-tests-only-trunk/ws/checkout/build.xml>:23: The following error occurred while executing this line:
/usr<https://hudson.apache.org/hudson/job/Lucene-Solr-tests-only-trunk/ws/checkout/solr/build.xml>:386:
The following error occurred while executing this line:
/usr<https://hudson.apache.org/hudson/job/Lucene-Solr-tests-only-trunk/ws/checkout/solr/build.xml>:482: Tests failed!
The following error occurred while executing this line:
/usr<https://hudson.apache.org/hudson/job/Lucene-Solr-tests-only-trunk/ws/checkout/solr/build.xml>:482: Tests failed!
The following error occurred while executing this line:
/usr<https://hudson.apache.org/hudson/job/Lucene-Solr-tests-only-trunk/ws/checkout/solr/build.xml>:482: Tests failed!
The following error occurred while executing this line:
/usr<https://hudson.apache.org/hudson/job/Lucene-Solr-tests-only-trunk/ws/checkout/solr/build.xml>:482: Tests failed!
The following error occurred while executing this line:
/usr<https://hudson.apache.org/hudson/job/Lucene-Solr-tests-only-trunk/ws/checkout/solr/build.xml>:482: Tests failed!
The following error occurred while executing this line:
/usr<https://hudson.apache.org/hudson/job/Lucene-Solr-tests-only-trunk/ws/checkout/solr/build.xml>:482: Tests failed!

Total time: 8 minutes 21 seconds
Recording test results


---------------------------------------------------------------------
To unsubscribe, e-mail: [hidden email]
For additional commands, e-mail: [hidden email]

Reply | Threaded
Open this post in threaded view
|

Build failed in Hudson: Lucene-Solr-tests-only-trunk #75

Apache Jenkins Server
See <https://hudson.apache.org/hudson/job/Lucene-Solr-tests-only-trunk/75/>

------------------------------------------
[...truncated 7946 lines...]
    [junit]
    [junit] Testsuite: org.apache.solr.request.TestWriterPerf
    [junit] Tests run: 1, Failures: 0, Errors: 0, Time elapsed: 0.57 sec
    [junit]
    [junit] Testsuite: org.apache.solr.schema.DateFieldTest
    [junit] Tests run: 6, Failures: 0, Errors: 0, Time elapsed: 0.016 sec
    [junit]
    [junit] Testsuite: org.apache.solr.schema.IndexSchemaTest
    [junit] Tests run: 5, Failures: 0, Errors: 0, Time elapsed: 0.526 sec
    [junit]
    [junit] Testsuite: org.apache.solr.schema.PolyFieldTest
    [junit] Tests run: 4, Failures: 0, Errors: 0, Time elapsed: 0.637 sec
    [junit]
    [junit] Testsuite: org.apache.solr.search.SpatialFilterTest
    [junit] Tests run: 3, Failures: 0, Errors: 0, Time elapsed: 1.029 sec
    [junit]
    [junit] Testsuite: org.apache.solr.search.TestExtendedDismaxParser
    [junit] Tests run: 1, Failures: 0, Errors: 0, Time elapsed: 0.966 sec
    [junit]
    [junit] Testsuite: org.apache.solr.servlet.SolrRequestParserTest
    [junit] Tests run: 4, Failures: 0, Errors: 0, Time elapsed: 0.585 sec
    [junit]
    [junit] Testsuite: org.apache.solr.spelling.DirectSolrSpellCheckerTest
    [junit] Tests run: 1, Failures: 0, Errors: 0, Time elapsed: 0.729 sec
    [junit]
    [junit] Testsuite: org.apache.solr.update.processor.SignatureUpdateProcessorFactoryTest
    [junit] Tests run: 4, Failures: 0, Errors: 0, Time elapsed: 1.797 sec
    [junit]
    [junit] Testsuite: org.apache.solr.search.TestRangeQuery
    [junit] Tests run: 2, Failures: 0, Errors: 0, Time elapsed: 11.795 sec
    [junit]
    [junit] Testsuite: org.apache.solr.search.function.SortByFunctionTest
    [junit] Tests run: 2, Failures: 0, Errors: 0, Time elapsed: 0.984 sec
    [junit]
    [junit] Testsuite: org.apache.solr.spelling.SpellingQueryConverterTest
    [junit] Tests run: 4, Failures: 0, Errors: 0, Time elapsed: 0.018 sec
    [junit]
    [junit] Testsuite: org.apache.solr.update.processor.UpdateRequestProcessorFactoryTest
    [junit] Tests run: 1, Failures: 0, Errors: 0, Time elapsed: 0.396 sec
    [junit]
    [junit] Testsuite: org.apache.solr.util.SolrPluginUtilsTest
    [junit] Tests run: 7, Failures: 0, Errors: 0, Time elapsed: 0.431 sec
    [junit]
    [junit] Testsuite: org.apache.solr.handler.component.DistributedSpellCollatorTest
    [junit] Tests run: 1, Failures: 0, Errors: 0, Time elapsed: 83.189 sec
    [junit]
    [junit] ------------- Standard Error -----------------
    [junit] 14 Oct 2010 5:45:21 PM org.apache.solr.handler.SnapPuller fetchLatestIndex
    [junit] SEVERE: Master at: http://localhost:57241/solr/replication is not available. Index fetch failed. Exception: The host did not accept the connection within timeout of 5000 ms
    [junit] 14 Oct 2010 5:45:22 PM org.apache.solr.handler.SnapPuller fetchLatestIndex
    [junit] SEVERE: Master at: http://localhost:57231/solr/replication is not available. Index fetch failed. Exception: The host did not accept the connection within timeout of 5000 ms
    [junit] 14 Oct 2010 5:45:27 PM org.apache.solr.handler.SnapPuller fetchLatestIndex
    [junit] SEVERE: Master at: http://localhost:57231/solr/replication is not available. Index fetch failed. Exception: The host did not accept the connection within timeout of 5000 ms
    [junit] 14 Oct 2010 5:45:32 PM org.apache.solr.handler.SnapPuller fetchLatestIndex
    [junit] SEVERE: Master at: http://localhost:57231/solr/replication is not available. Index fetch failed. Exception: The host did not accept the connection within timeout of 5000 ms
    [junit] 14 Oct 2010 5:45:37 PM org.apache.solr.handler.SnapPuller fetchLatestIndex
    [junit] SEVERE: Master at: http://localhost:57231/solr/replication is not available. Index fetch failed. Exception: The host did not accept the connection within timeout of 5000 ms
    [junit] 14 Oct 2010 5:45:42 PM org.apache.solr.handler.SnapPuller fetchLatestIndex
    [junit] SEVERE: Master at: http://localhost:57231/solr/replication is not available. Index fetch failed. Exception: The host did not accept the connection within timeout of 5000 ms
    [junit] 14 Oct 2010 5:45:47 PM org.apache.solr.handler.SnapPuller fetchLatestIndex
    [junit] SEVERE: Master at: http://localhost:57231/solr/replication is not available. Index fetch failed. Exception: The host did not accept the connection within timeout of 5000 ms
    [junit] 14 Oct 2010 5:45:52 PM org.apache.solr.handler.SnapPuller fetchLatestIndex
    [junit] SEVERE: Master at: http://localhost:57231/solr/replication is not available. Index fetch failed. Exception: The host did not accept the connection within timeout of 5000 ms
    [junit] 14 Oct 2010 5:45:57 PM org.apache.solr.handler.SnapPuller fetchLatestIndex
    [junit] SEVERE: Master at: http://localhost:57231/solr/replication is not available. Index fetch failed. Exception: The host did not accept the connection within timeout of 5000 ms
    [junit] 14 Oct 2010 5:46:02 PM org.apache.solr.handler.SnapPuller fetchLatestIndex
    [junit] SEVERE: Master at: http://localhost:57231/solr/replication is not available. Index fetch failed. Exception: The host did not accept the connection within timeout of 5000 ms
    [junit] 14 Oct 2010 5:46:07 PM org.apache.solr.handler.SnapPuller fetchLatestIndex
    [junit] SEVERE: Master at: http://localhost:57231/solr/replication is not available. Index fetch failed. Exception: The host did not accept the connection within timeout of 5000 ms
    [junit] 14 Oct 2010 5:46:12 PM org.apache.solr.handler.SnapPuller fetchLatestIndex
    [junit] SEVERE: Master at: http://localhost:57231/solr/replication is not available. Index fetch failed. Exception: The host did not accept the connection within timeout of 5000 ms
    [junit] 14 Oct 2010 5:46:17 PM org.apache.solr.handler.SnapPuller fetchLatestIndex
    [junit] SEVERE: Master at: http://localhost:57231/solr/replication is not available. Index fetch failed. Exception: The host did not accept the connection within timeout of 5000 ms
    [junit] 14 Oct 2010 5:46:22 PM org.apache.solr.handler.SnapPuller fetchLatestIndex
    [junit] SEVERE: Master at: http://localhost:57231/solr/replication is not available. Index fetch failed. Exception: The host did not accept the connection within timeout of 5000 ms
    [junit] 14 Oct 2010 5:46:27 PM org.apache.solr.handler.SnapPuller fetchLatestIndex
    [junit] SEVERE: Master at: http://localhost:57231/solr/replication is not available. Index fetch failed. Exception: The host did not accept the connection within timeout of 5000 ms
    [junit] 14 Oct 2010 5:46:32 PM org.apache.solr.handler.SnapPuller fetchLatestIndex
    [junit] SEVERE: Master at: http://localhost:57231/solr/replication is not available. Index fetch failed. Exception: The host did not accept the connection within timeout of 5000 ms
    [junit] 14 Oct 2010 5:46:37 PM org.apache.solr.handler.SnapPuller fetchLatestIndex
    [junit] SEVERE: Master at: http://localhost:57231/solr/replication is not available. Index fetch failed. Exception: The host did not accept the connection within timeout of 5000 ms
    [junit] ------------- ---------------- ---------------
    [junit] Testsuite: org.apache.solr.highlight.HighlighterConfigTest
    [junit] Tests run: 1, Failures: 0, Errors: 0, Time elapsed: 0.609 sec
    [junit]
    [junit] Testsuite: org.apache.solr.request.SimpleFacetsTest
    [junit] Tests run: 22, Failures: 0, Errors: 0, Time elapsed: 4.808 sec
    [junit]
    [junit] ------------- Standard Error -----------------
    [junit] 2010.10.14. 17:46:42 org.apache.solr.handler.SnapPuller fetchLatestIndex
    [junit] SEVERE: Master at: http://localhost:57231/solr/replication is not available. Index fetch failed. Exception: The host did not accept the connection within timeout of 5000 ms
    [junit] ------------- ---------------- ---------------
    [junit] Testsuite: org.apache.solr.schema.CopyFieldTest
    [junit] Tests run: 6, Failures: 0, Errors: 0, Time elapsed: 0.397 sec
    [junit]
    [junit] Testsuite: org.apache.solr.schema.NumericFieldsTest
    [junit] Tests run: 1, Failures: 0, Errors: 0, Time elapsed: 0.336 sec
    [junit]
    [junit] Testsuite: org.apache.solr.search.FunctionQParserTest
    [junit] Tests run: 1, Failures: 0, Errors: 0, Time elapsed: 0.2 sec
    [junit]
    [junit] Testsuite: org.apache.solr.search.TestIndexSearcher
    [junit] Tests run: 1, Failures: 0, Errors: 0, Time elapsed: 0.418 sec
    [junit]
    [junit] ------------- Standard Error -----------------
    [junit] 15/10/2010 01:46:47 AM org.apache.solr.handler.SnapPuller fetchLatestIndex
    [junit] GRAVE: Master at: http://localhost:57231/solr/replication is not available. Index fetch failed. Exception: The host did not accept the connection within timeout of 5000 ms
    [junit] ------------- ---------------- ---------------
    [junit] Testsuite: org.apache.solr.servlet.DirectSolrConnectionTest
    [junit] Tests run: 2, Failures: 0, Errors: 0, Time elapsed: 0.236 sec
    [junit]
    [junit] Testsuite: org.apache.solr.cloud.BasicDistributedZkTest
    [junit] Testcase: testDistribSearch(org.apache.solr.cloud.BasicDistributedZkTest): Caused an ERROR
    [junit] Error executing query
    [junit] org.apache.solr.client.solrj.SolrServerException: Error executing query
    [junit] at org.apache.solr.client.solrj.request.QueryRequest.process(QueryRequest.java:95)
    [junit] at org.apache.solr.client.solrj.SolrServer.query(SolrServer.java:119)
    [junit] at org.apache.solr.BaseDistributedSearchTestCase.queryServer(BaseDistributedSearchTestCase.java:290)
    [junit] at org.apache.solr.cloud.BasicDistributedZkTest.queryServer(BasicDistributedZkTest.java:256)
    [junit] at org.apache.solr.BaseDistributedSearchTestCase.query(BaseDistributedSearchTestCase.java:305)
    [junit] at org.apache.solr.cloud.BasicDistributedZkTest.doTest(BasicDistributedZkTest.java:227)
    [junit] at org.apache.solr.BaseDistributedSearchTestCase.testDistribSearch(BaseDistributedSearchTestCase.java:562)
    [junit] at org.apache.lucene.util.LuceneTestCase$LuceneTestCaseRunner.runChild(LuceneTestCase.java:795)
    [junit] at org.apache.lucene.util.LuceneTestCase$LuceneTestCaseRunner.runChild(LuceneTestCase.java:768)
    [junit] Caused by: org.apache.solr.common.SolrException: org.apache.solr.client.solrj.SolrServerException: org.apache.commons.httpclient.NoHttpResponseException: The server 127.0.0.1 failed to respond  org.apache.solr.common.SolrException: org.apache.solr.client.solrj.SolrServerException: org.apache.commons.httpclient.NoHttpResponseException: The server 127.0.0.1 failed to respond at org.apache.solr.handler.component.SearchHandler.handleRequestBody(SearchHandler.java:318) at org.apache.solr.handler.RequestHandlerBase.handleRequest(RequestHandlerBase.java:131) at org.apache.solr.core.SolrCore.execute(SolrCore.java:1325) at org.apache.solr.servlet.SolrDispatchFilter.execute(SolrDispatchFilter.java:337) at org.apache.solr.servlet.SolrDispatchFilter.doFilter(SolrDispatchFilter.java:240) at org.mortbay.jetty.servlet.ServletHandler$CachedChain.doFilter(ServletHandler.java:1157) at org.mortbay.jetty.servlet.ServletHandler.handle(ServletHandler.java:388) at org.mortbay.jetty.servlet.SessionHandler.handle(SessionHandler.java:182) at org.mortbay.jetty.handler.ContextHandler.handle(ContextHandler.java:765) at org.mortbay.jetty.handler.HandlerWrapper.handle(HandlerWrapper.java:152) at org.mortbay.jetty.Server.handle(Server.java:326) at org.mortbay.jetty.HttpConnection.handleRequest(HttpConnection.java:542) at org.mortbay.jetty.HttpConnection$RequestHandler.headerComplete(HttpConnection.java:923) at org.mortbay.jetty.HttpParser.parseNext(HttpParser.java:547) at org.mortbay.jetty.HttpParser.parseAvailable(HttpParser.java:212) at org.mortbay.jetty.HttpConnection.handle(HttpConnection.java:404) at org.mortbay.io.nio.SelectChannelEndPoint.run(SelectChannelEndPoint.java:409) at org.mortbay.thread.QueuedThreadPool$PoolThread.run(QueuedThreadPool.java:582) Caused by: org.apache.solr.client.solrj.SolrServerException: org.apache.commons.httpclient.NoHttpResponseException: The server 127.0.0.1 failed to respond at org.apache.solr.client.solrj.impl.CommonsHttpSolrServer.request(CommonsHttpSolrServer.java:483) at org.apache.solr.client.solrj.impl.CommonsHttpSolrServer.reque
    [junit]
    [junit] org.apache.solr.client.solrj.SolrServerException: org.apache.commons.httpclient.NoHttpResponseException: The server 127.0.0.1 failed to respond  org.apache.solr.common.SolrException: org.apache.solr.client.solrj.SolrServerException: org.apache.commons.httpclient.NoHttpResponseException: The server 127.0.0.1 failed to respond at org.apache.solr.handler.component.SearchHandler.handleRequestBody(SearchHandler.java:318) at org.apache.solr.handler.RequestHandlerBase.handleRequest(RequestHandlerBase.java:131) at org.apache.solr.core.SolrCore.execute(SolrCore.java:1325) at org.apache.solr.servlet.SolrDispatchFilter.execute(SolrDispatchFilter.java:337) at org.apache.solr.servlet.SolrDispatchFilter.doFilter(SolrDispatchFilter.java:240) at org.mortbay.jetty.servlet.ServletHandler$CachedChain.doFilter(ServletHandler.java:1157) at org.mortbay.jetty.servlet.ServletHandler.handle(ServletHandler.java:388) at org.mortbay.jetty.servlet.SessionHandler.handle(SessionHandler.java:182) at org.mortbay.jetty.handler.ContextHandler.handle(ContextHandler.java:765) at org.mortbay.jetty.handler.HandlerWrapper.handle(HandlerWrapper.java:152) at org.mortbay.jetty.Server.handle(Server.java:326) at org.mortbay.jetty.HttpConnection.handleRequest(HttpConnection.java:542) at org.mortbay.jetty.HttpConnection$RequestHandler.headerComplete(HttpConnection.java:923) at org.mortbay.jetty.HttpParser.parseNext(HttpParser.java:547) at org.mortbay.jetty.HttpParser.parseAvailable(HttpParser.java:212) at org.mortbay.jetty.HttpConnection.handle(HttpConnection.java:404) at org.mortbay.io.nio.SelectChannelEndPoint.run(SelectChannelEndPoint.java:409) at org.mortbay.thread.QueuedThreadPool$PoolThread.run(QueuedThreadPool.java:582) Caused by: org.apache.solr.client.solrj.SolrServerException: org.apache.commons.httpclient.NoHttpResponseException: The server 127.0.0.1 failed to respond at org.apache.solr.client.solrj.impl.CommonsHttpSolrServer.request(CommonsHttpSolrServer.java:483) at org.apache.solr.client.solrj.impl.CommonsHttpSolrServer.reque
    [junit]
    [junit] request: http://localhost:57159/solr/select?q=*:*&rows=100&shards=shard3,shard4,shard5,shard6&distrib=true&wt=javabin&version=2
    [junit] at org.apache.solr.client.solrj.impl.CommonsHttpSolrServer.request(CommonsHttpSolrServer.java:435)
    [junit] at org.apache.solr.client.solrj.impl.CommonsHttpSolrServer.request(CommonsHttpSolrServer.java:244)
    [junit] at org.apache.solr.client.solrj.request.QueryRequest.process(QueryRequest.java:89)
    [junit]
    [junit]
    [junit] Tests run: 1, Failures: 0, Errors: 1, Time elapsed: 249.281 sec
    [junit]
    [junit] ------------- Standard Output ---------------
    [junit] NOTE: reproduce with: ant test -Dtestcase=BasicDistributedZkTest -Dtestmethod=testDistribSearch -Dtests.seed=7581155515203828654:-2786059863405912356
    [junit] NOTE: test params are: codec=MockSep, locale=es_GT, timezone=America/Shiprock
    [junit] ------------- ---------------- ---------------
    [junit] ------------- Standard Error -----------------
    [junit] 14/10/2010 02:48:15 PM org.apache.solr.common.SolrException log
    [junit] GRAVE: org.apache.solr.common.SolrException: org.apache.solr.client.solrj.SolrServerException: org.apache.commons.httpclient.NoHttpResponseException: The server 127.0.0.1 failed to respond
    [junit] at org.apache.solr.handler.component.SearchHandler.handleRequestBody(SearchHandler.java:318)
    [junit] at org.apache.solr.handler.RequestHandlerBase.handleRequest(RequestHandlerBase.java:131)
    [junit] at org.apache.solr.core.SolrCore.execute(SolrCore.java:1325)
    [junit] at org.apache.solr.servlet.SolrDispatchFilter.execute(SolrDispatchFilter.java:337)
    [junit] at org.apache.solr.servlet.SolrDispatchFilter.doFilter(SolrDispatchFilter.java:240)
    [junit] at org.mortbay.jetty.servlet.ServletHandler$CachedChain.doFilter(ServletHandler.java:1157)
    [junit] at org.mortbay.jetty.servlet.ServletHandler.handle(ServletHandler.java:388)
    [junit] at org.mortbay.jetty.servlet.SessionHandler.handle(SessionHandler.java:182)
    [junit] at org.mortbay.jetty.handler.ContextHandler.handle(ContextHandler.java:765)
    [junit] at org.mortbay.jetty.handler.HandlerWrapper.handle(HandlerWrapper.java:152)
    [junit] at org.mortbay.jetty.Server.handle(Server.java:326)
    [junit] at org.mortbay.jetty.HttpConnection.handleRequest(HttpConnection.java:542)
    [junit] at org.mortbay.jetty.HttpConnection$RequestHandler.headerComplete(HttpConnection.java:923)
    [junit] at org.mortbay.jetty.HttpParser.parseNext(HttpParser.java:547)
    [junit] at org.mortbay.jetty.HttpParser.parseAvailable(HttpParser.java:212)
    [junit] at org.mortbay.jetty.HttpConnection.handle(HttpConnection.java:404)
    [junit] at org.mortbay.io.nio.SelectChannelEndPoint.run(SelectChannelEndPoint.java:409)
    [junit] at org.mortbay.thread.QueuedThreadPool$PoolThread.run(QueuedThreadPool.java:582)
    [junit] Caused by: org.apache.solr.client.solrj.SolrServerException: org.apache.commons.httpclient.NoHttpResponseException: The server 127.0.0.1 failed to respond
    [junit] at org.apache.solr.client.solrj.impl.CommonsHttpSolrServer.request(CommonsHttpSolrServer.java:483)
    [junit] at org.apache.solr.client.solrj.impl.CommonsHttpSolrServer.request(CommonsHttpSolrServer.java:244)
    [junit] at org.apache.solr.handler.component.HttpCommComponent$1.call(SearchHandler.java:511)
    [junit] at org.apache.solr.handler.component.HttpCommComponent$1.call(SearchHandler.java:478)
    [junit] at java.util.concurrent.FutureTask$Sync.innerRun(FutureTask.java:334)
    [junit] at java.util.concurrent.FutureTask.run(FutureTask.java:166)
    [junit] at java.util.concurrent.Executors$RunnableAdapter.call(Executors.java:471)
    [junit] at java.util.concurrent.FutureTask$Sync.innerRun(FutureTask.java:334)
    [junit] at java.util.concurrent.FutureTask.run(FutureTask.java:166)
    [junit] at java.util.concurrent.ThreadPoolExecutor.runWorker(ThreadPoolExecutor.java:1110)
    [junit] at java.util.concurrent.ThreadPoolExecutor$Worker.run(ThreadPoolExecutor.java:603)
    [junit] at java.lang.Thread.run(Thread.java:636)
    [junit] Caused by: org.apache.commons.httpclient.NoHttpResponseException: The server 127.0.0.1 failed to respond
    [junit] at org.apache.commons.httpclient.HttpMethodBase.readStatusLine(HttpMethodBase.java:1976)
    [junit] at org.apache.commons.httpclient.HttpMethodBase.readResponse(HttpMethodBase.java:1735)
    [junit] at org.apache.commons.httpclient.HttpMethodBase.execute(HttpMethodBase.java:1098)
    [junit] at org.apache.commons.httpclient.HttpMethodDirector.executeWithRetry(HttpMethodDirector.java:398)
    [junit] at org.apache.commons.httpclient.HttpMethodDirector.executeMethod(HttpMethodDirector.java:171)
    [junit] at org.apache.commons.httpclient.HttpClient.executeMethod(HttpClient.java:397)
    [junit] at org.apache.commons.httpclient.HttpClient.executeMethod(HttpClient.java:323)
    [junit] at org.apache.solr.client.solrj.impl.CommonsHttpSolrServer.request(CommonsHttpSolrServer.java:427)
    [junit] ... 11 more
    [junit]
    [junit] ------------- ---------------- ---------------
    [junit] TEST org.apache.solr.cloud.BasicDistributedZkTest FAILED
    [junit] Testsuite: org.apache.solr.common.params.SolrParamTest
    [junit] Tests run: 1, Failures: 0, Errors: 0, Time elapsed: 0.021 sec
    [junit]
    [junit] Testsuite: org.apache.solr.common.util.DOMUtilTest
    [junit] Tests run: 1, Failures: 0, Errors: 0, Time elapsed: 0.028 sec
    [junit]
    [junit] Testsuite: org.apache.solr.core.RequestHandlersTest
    [junit] Tests run: 2, Failures: 0, Errors: 0, Time elapsed: 1.225 sec
    [junit]
    [junit] Testsuite: org.apache.solr.core.TestConfig
    [junit] Tests run: 6, Failures: 0, Errors: 0, Time elapsed: 0.22 sec
    [junit]
    [junit] Testsuite: org.apache.solr.core.TestLegacyMergeSchedulerPolicyConfig
    [junit] Tests run: 1, Failures: 0, Errors: 0, Time elapsed: 0.447 sec
    [junit]
    [junit] ------------- Standard Error -----------------
    [junit] 15.10.2010 4:48:50 org.apache.solr.update.SolrIndexWriter finalize
    [junit] SEVERE: SolrIndexWriter was not closed prior to finalize(), indicates a bug -- POSSIBLE RESOURCE LEAK!!!
    [junit] ------------- ---------------- ---------------
    [junit] Testsuite: org.apache.solr.handler.FieldAnalysisRequestHandlerTest
    [junit] Tests run: 3, Failures: 0, Errors: 0, Time elapsed: 0.459 sec
    [junit]
    [junit] ------------- Standard Error -----------------
    [junit] 14.10.2010 22:48: org.apache.solr.update.SolrIndexWriter finalize
    [junit] SEVERE: SolrIndexWriter was not closed prior to finalize(), indicates a bug -- POSSIBLE RESOURCE LEAK!!!
    [junit] ------------- ---------------- ---------------
    [junit] Testsuite: org.apache.solr.handler.component.DebugComponentTest
    [junit] Tests run: 2, Failures: 0, Errors: 0, Time elapsed: 0.594 sec
    [junit]
    [junit] Testsuite: org.apache.solr.handler.component.StatsComponentTest
    [junit] Tests run: 1, Failures: 0, Errors: 0, Time elapsed: 2.937 sec
    [junit]
    [junit] Testsuite: org.apache.solr.schema.TestBinaryField
    [junit] Tests run: 1, Failures: 0, Errors: 0, Time elapsed: 0.402 sec
    [junit]
    [junit] Testsuite: org.apache.solr.search.TestQueryUtils
    [junit] Tests run: 1, Failures: 0, Errors: 0, Time elapsed: 0.92 sec
    [junit]
    [junit] Testsuite: org.apache.solr.search.function.distance.DistanceFunctionTest
    [junit] Tests run: 3, Failures: 0, Errors: 0, Time elapsed: 0.841 sec
    [junit]
    [junit] Testsuite: org.apache.solr.spelling.SpellPossibilityIteratorTest
    [junit] Tests run: 1, Failures: 0, Errors: 0, Time elapsed: 0.015 sec
    [junit]
    [junit] Testsuite: org.apache.solr.update.DirectUpdateHandlerTest
    [junit] Tests run: 7, Failures: 0, Errors: 0, Time elapsed: 1.825 sec
    [junit]
    [junit] Testsuite: org.apache.solr.util.DateMathParserTest
    [junit] Tests run: 7, Failures: 0, Errors: 0, Time elapsed: 0.049 sec
    [junit]
    [junit] Testsuite: org.apache.solr.velocity.VelocityResponseWriterTest
    [junit] Tests run: 1, Failures: 0, Errors: 0, Time elapsed: 0.618 sec
    [junit]
    [junit] Tests FAILED

BUILD FAILED
/usr<https://hudson.apache.org/hudson/job/Lucene-Solr-tests-only-trunk/ws/checkout/build.xml>:23: The following error occurred while executing this line:
/usr<https://hudson.apache.org/hudson/job/Lucene-Solr-tests-only-trunk/ws/checkout/solr/build.xml>:388: The following error occurred while executing this line:
/usr<https://hudson.apache.org/hudson/job/Lucene-Solr-tests-only-trunk/ws/checkout/solr/build.xml>:482: Tests failed!

Total time: 23 minutes 57 seconds
Recording test results


---------------------------------------------------------------------
To unsubscribe, e-mail: [hidden email]
For additional commands, e-mail: [hidden email]

Reply | Threaded
Open this post in threaded view
|

Build failed in Hudson: Lucene-Solr-tests-only-trunk #76

Apache Jenkins Server
See <https://hudson.apache.org/hudson/job/Lucene-Solr-tests-only-trunk/76/>

------------------------------------------
[...truncated 9291 lines...]
    [junit] ------------- ---------------- ---------------
    [junit] Testsuite: org.apache.solr.handler.dataimport.TestEvaluatorBag
    [junit] Tests run: 5, Failures: 0, Errors: 0, Time elapsed: 0.029 sec
    [junit]
    [junit] Testsuite: org.apache.solr.handler.dataimport.TestFieldReader
    [junit] Tests run: 1, Failures: 0, Errors: 0, Time elapsed: 0.016 sec
    [junit]
    [junit] Testsuite: org.apache.solr.handler.dataimport.TestFileListEntityProcessor
    [junit] Testcase: testNTOT(org.apache.solr.handler.dataimport.TestFileListEntityProcessor): Caused an ERROR
    [junit] Invalid expression for date
    [junit] org.apache.solr.handler.dataimport.DataImportHandlerException: Invalid expression for date
    [junit] at org.apache.solr.handler.dataimport.FileListEntityProcessor.getDate(FileListEntityProcessor.java:167)
    [junit] at org.apache.solr.handler.dataimport.FileListEntityProcessor.nextRow(FileListEntityProcessor.java:204)
    [junit] at org.apache.solr.handler.dataimport.TestFileListEntityProcessor.getFiles(TestFileListEntityProcessor.java:124)
    [junit] at org.apache.solr.handler.dataimport.TestFileListEntityProcessor.testNTOT(TestFileListEntityProcessor.java:163)
    [junit] at org.apache.lucene.util.LuceneTestCase$LuceneTestCaseRunner.runChild(LuceneTestCase.java:795)
    [junit] at org.apache.lucene.util.LuceneTestCase$LuceneTestCaseRunner.runChild(LuceneTestCase.java:768)
    [junit] Caused by: java.text.ParseException: Unparseable date: "2010-10-15 05:49:30"
    [junit] at java.text.DateFormat.parse(DateFormat.java:354)
    [junit] at org.apache.solr.handler.dataimport.FileListEntityProcessor.getDate(FileListEntityProcessor.java:165)
    [junit]
    [junit]
    [junit] Tests run: 4, Failures: 0, Errors: 1, Time elapsed: 0.024 sec
    [junit]
    [junit] ------------- Standard Output ---------------
    [junit] NOTE: reproduce with: ant test -Dtestcase=TestFileListEntityProcessor -Dtestmethod=testNTOT -Dtests.seed=-6481460198797717235:-3411236555527660432
    [junit] NOTE: test params are: codec=MockFixedIntBlock(blockSize=1863), locale=ms, timezone=Asia/Calcutta
    [junit] ------------- ---------------- ---------------
    [junit] TEST org.apache.solr.handler.dataimport.TestFileListEntityProcessor FAILED
    [junit] Testsuite: org.apache.solr.handler.dataimport.TestJdbcDataSource
    [junit] Tests run: 3, Failures: 0, Errors: 0, Time elapsed: 0.067 sec
    [junit]
    [junit] Testsuite: org.apache.solr.handler.dataimport.TestLineEntityProcessor
    [junit] Tests run: 4, Failures: 0, Errors: 0, Time elapsed: 0.024 sec
    [junit]
    [junit] Testsuite: org.apache.solr.handler.dataimport.TestNumberFormatTransformer
    [junit] Tests run: 9, Failures: 0, Errors: 0, Time elapsed: 0.027 sec
    [junit]
    [junit] Testsuite: org.apache.solr.handler.dataimport.TestPlainTextEntityProcessor
    [junit] Tests run: 1, Failures: 0, Errors: 0, Time elapsed: 0.017 sec
    [junit]
    [junit] Testsuite: org.apache.solr.handler.dataimport.TestRegexTransformer
    [junit] Tests run: 5, Failures: 0, Errors: 0, Time elapsed: 0.016 sec
    [junit]
    [junit] Testsuite: org.apache.solr.handler.dataimport.TestScriptTransformer
    [junit] Tests run: 0, Failures: 0, Errors: 0, Time elapsed: 0.009 sec
    [junit]
    [junit] Testsuite: org.apache.solr.handler.dataimport.TestSqlEntityProcessor
    [junit] Tests run: 4, Failures: 0, Errors: 0, Time elapsed: 0.016 sec
    [junit]
    [junit]  xml response was: <?xml version="1.0" encoding="UTF-8"?>
    [junit] <response>
    [junit] <lst name="responseHeader"><int name="status">0</int><int name="QTime">2</int><lst name="params"><str name="start">0</str><str name="q">id:5</str><str name="qt">standard</str><str name="rows">20</str><str name="version">2.2</str></lst></lst><result name="response" numFound="0" start="0"/>
    [junit] </response>
    [junit]
    [junit]  request was: start=0&q=id:5&qt=standard&rows=20&version=2.2)
    [junit] Testsuite: org.apache.solr.handler.dataimport.TestSqlEntityProcessor2
    [junit] Testcase: testLastIndexTime(org.apache.solr.handler.dataimport.TestSqlEntityProcessor2): FAILED
    [junit] query failed XPath: //*[@numFound='1']
    [junit]  xml response was: <?xml version="1.0" encoding="UTF-8"?>
    [junit] <response>
    [junit] <lst name="responseHeader"><int name="status">0</int><int name="QTime">2</int><lst name="params"><str name="start">0</str><str name="q">id:5</str><str name="qt">standard</str><str name="rows">20</str><str name="version">2.2</str></lst></lst><result name="response" numFound="0" start="0"/>
    [junit] </response>
    [junit]
    [junit]  request was: start=0&q=id:5&qt=standard&rows=20&version=2.2
    [junit] junit.framework.AssertionFailedError: query failed XPath: //*[@numFound='1']
    [junit]  xml response was: <?xml version="1.0" encoding="UTF-8"?>
    [junit] <response>
    [junit] <lst name="responseHeader"><int name="status">0</int><int name="QTime">2</int><lst name="params"><str name="start">0</str><str name="q">id:5</str><str name="qt">standard</str><str name="rows">20</str><str name="version">2.2</str></lst></lst><result name="response" numFound="0" start="0"/>
    [junit] </response>
    [junit]
    [junit]  request was: start=0&q=id:5&qt=standard&rows=20&version=2.2
    [junit] at org.apache.lucene.util.LuceneTestCase$LuceneTestCaseRunner.runChild(LuceneTestCase.java:795)
    [junit] at org.apache.lucene.util.LuceneTestCase$LuceneTestCaseRunner.runChild(LuceneTestCase.java:768)
    [junit]  xml response was: <?xml version="1.0" encoding="UTF-8"?>
    [junit] <response>
    [junit] <lst name="responseHeader"><int name="status">0</int><int name="QTime">2</int><lst name="params"><str name="start">0</str><str name="q">id:5</str><str name="qt">standard</str><str name="rows">20</str><str name="version">2.2</str></lst></lst><result name="response" numFound="0" start="0"/>
    [junit] </response>
    [junit]
    [junit]  request was: start=0&q=id:5&qt=standard&rows=20&version=2.2
    [junit] at org.apache.solr.SolrTestCaseJ4.assertQ(SolrTestCaseJ4.java:331)
    [junit] at org.apache.solr.SolrTestCaseJ4.assertQ(SolrTestCaseJ4.java:310)
    [junit] at org.apache.solr.handler.dataimport.TestSqlEntityProcessor2.testLastIndexTime(TestSqlEntityProcessor2.java:211)
    [junit]
    [junit]
    [junit] Tests run: 7, Failures: 1, Errors: 0, Time elapsed: 0.704 sec
    [junit]
    [junit] ------------- Standard Output ---------------
    [junit] NOTE: reproduce with: ant test -Dtestcase=TestSqlEntityProcessor2 -Dtestmethod=testLastIndexTime -Dtests.seed=1826041982336888278:8295580029828352249
    [junit] NOTE: test params are: codec=PreFlex, locale=ar_OM, timezone=Africa/Bissau
    [junit] ------------- ---------------- ---------------
    [junit] ------------- Standard Error -----------------
    [junit] 14/10/2010 09:05:20 ? org.apache.solr.handler.dataimport.JdbcDataSource finalize
    [junit] SEVERE: JdbcDataSource was not closed prior to finalize(), indicates a bug -- POSSIBLE RESOURCE LEAK!!!
    [junit] 14/10/2010 09:05:20 ? org.apache.solr.handler.dataimport.JdbcDataSource finalize
    [junit] SEVERE: JdbcDataSource was not closed prior to finalize(), indicates a bug -- POSSIBLE RESOURCE LEAK!!!
    [junit] 14/10/2010 09:05:20 ? org.apache.solr.handler.dataimport.JdbcDataSource finalize
    [junit] SEVERE: JdbcDataSource was not closed prior to finalize(), indicates a bug -- POSSIBLE RESOURCE LEAK!!!
    [junit] 14/10/2010 09:05:21 ? org.apache.solr.handler.dataimport.DocBuilder buildDocument
    [junit] SEVERE: Exception while processing: x document : SolrInputDocument[{}]
    [junit] org.apache.solr.handler.dataimport.DataImportHandlerException: java.text.ParseException: Unparseable date: "1970-01-01 08:45:00"
    [junit] at org.apache.solr.handler.dataimport.DataImportHandlerException.wrapAndThrow(DataImportHandlerException.java:64)
    [junit] at org.apache.solr.handler.dataimport.TestSqlEntityProcessor2$DateFormatValidatingEvaluator.evaluate(TestSqlEntityProcessor2.java:228)
    [junit] at org.apache.solr.handler.dataimport.EvaluatorBag$5.get(EvaluatorBag.java:218)
    [junit] at org.apache.solr.handler.dataimport.EvaluatorBag$5.get(EvaluatorBag.java:205)
    [junit] at org.apache.solr.handler.dataimport.VariableResolverImpl.resolve(VariableResolverImpl.java:116)
    [junit] at org.apache.solr.handler.dataimport.TemplateString.fillTokens(TemplateString.java:81)
    [junit] at org.apache.solr.handler.dataimport.TemplateString.replaceTokens(TemplateString.java:75)
    [junit] at org.apache.solr.handler.dataimport.VariableResolverImpl.replaceTokens(VariableResolverImpl.java:95)
    [junit] at org.apache.solr.handler.dataimport.ContextImpl.replaceTokens(ContextImpl.java:235)
    [junit] at org.apache.solr.handler.dataimport.SqlEntityProcessor.nextRow(SqlEntityProcessor.java:71)
    [junit] at org.apache.solr.handler.dataimport.EntityProcessorWrapper.nextRow(EntityProcessorWrapper.java:233)
    [junit] at org.apache.solr.handler.dataimport.DocBuilder.buildDocument(DocBuilder.java:579)
    [junit] at org.apache.solr.handler.dataimport.DocBuilder.doFullDump(DocBuilder.java:260)
    [junit] at org.apache.solr.handler.dataimport.DocBuilder.execute(DocBuilder.java:184)
    [junit] at org.apache.solr.handler.dataimport.DataImporter.doFullImport(DataImporter.java:334)
    [junit] at org.apache.solr.handler.dataimport.DataImporter.runCmd(DataImporter.java:392)
    [junit] at org.apache.solr.handler.dataimport.DataImportHandler.handleRequestBody(DataImportHandler.java:203)
    [junit] at org.apache.solr.handler.RequestHandlerBase.handleRequest(RequestHandlerBase.java:131)
    [junit] at org.apache.solr.core.SolrCore.execute(SolrCore.java:1325)
    [junit] at org.apache.solr.util.TestHarness.queryAndResponse(TestHarness.java:334)
    [junit] at org.apache.solr.util.TestHarness.query(TestHarness.java:321)
    [junit] at org.apache.solr.handler.dataimport.AbstractDataImportHandlerTestCase.runFullImport(AbstractDataImportHandlerTestCase.java:81)
    [junit] at org.apache.solr.handler.dataimport.TestSqlEntityProcessor2.testLastIndexTime(TestSqlEntityProcessor2.java:210)
    [junit] at sun.reflect.NativeMethodAccessorImpl.invoke0(Native Method)
    [junit] at sun.reflect.NativeMethodAccessorImpl.invoke(NativeMethodAccessorImpl.java:57)
    [junit] at sun.reflect.DelegatingMethodAccessorImpl.invoke(DelegatingMethodAccessorImpl.java:43)
    [junit] at java.lang.reflect.Method.invoke(Method.java:616)
    [junit] at org.junit.runners.model.FrameworkMethod$1.runReflectiveCall(FrameworkMethod.java:44)
    [junit] at org.junit.internal.runners.model.ReflectiveCallable.run(ReflectiveCallable.java:15)
    [junit] at org.junit.runners.model.FrameworkMethod.invokeExplosively(FrameworkMethod.java:41)
    [junit] at org.junit.internal.runners.statements.InvokeMethod.evaluate(InvokeMethod.java:20)
    [junit] at org.junit.rules.TestWatchman$1.evaluate(TestWatchman.java:48)
    [junit] at org.junit.internal.runners.statements.RunBefores.evaluate(RunBefores.java:28)
    [junit] at org.junit.internal.runners.statements.RunAfters.evaluate(RunAfters.java:31)
    [junit] at org.junit.runners.BlockJUnit4ClassRunner.runChild(BlockJUnit4ClassRunner.java:76)
    [junit] at org.apache.lucene.util.LuceneTestCase$LuceneTestCaseRunner.runChild(LuceneTestCase.java:795)
    [junit] at org.apache.lucene.util.LuceneTestCase$LuceneTestCaseRunner.runChild(LuceneTestCase.java:768)
    [junit] at org.junit.runners.ParentRunner$3.run(ParentRunner.java:193)
    [junit] at org.junit.runners.ParentRunner$1.schedule(ParentRunner.java:52)
    [junit] at org.junit.runners.ParentRunner.runChildren(ParentRunner.java:191)
    [junit] at org.junit.runners.ParentRunner.access$000(ParentRunner.java:42)
    [junit] at org.junit.runners.ParentRunner$2.evaluate(ParentRunner.java:184)
    [junit] at org.junit.internal.runners.statements.RunBefores.evaluate(RunBefores.java:28)
    [junit] at org.junit.internal.runners.statements.RunAfters.evaluate(RunAfters.java:31)
    [junit] at org.junit.runners.ParentRunner.run(ParentRunner.java:236)
    [junit] at junit.framework.JUnit4TestAdapter.run(JUnit4TestAdapter.java:39)
    [junit] at org.apache.tools.ant.taskdefs.optional.junit.JUnitTestRunner.run(JUnitTestRunner.java:421)
    [junit] at org.apache.tools.ant.taskdefs.optional.junit.JUnitTestRunner.launch(JUnitTestRunner.java:912)
    [junit] at org.apache.tools.ant.taskdefs.optional.junit.JUnitTestRunner.main(JUnitTestRunner.java:743)
    [junit] Caused by: java.text.ParseException: Unparseable date: "1970-01-01 08:45:00"
    [junit] at java.text.DateFormat.parse(DateFormat.java:354)
    [junit] at org.apache.solr.handler.dataimport.TestSqlEntityProcessor2$DateFormatValidatingEvaluator.evaluate(TestSqlEntityProcessor2.java:226)
    [junit] ... 47 more
    [junit] 14/10/2010 09:05:21 ? org.apache.solr.handler.dataimport.DataImporter doFullImport
    [junit] SEVERE: Full Import failed
    [junit] org.apache.solr.handler.dataimport.DataImportHandlerException: java.text.ParseException: Unparseable date: "1970-01-01 08:45:00"
    [junit] at org.apache.solr.handler.dataimport.DataImportHandlerException.wrapAndThrow(DataImportHandlerException.java:64)
    [junit] at org.apache.solr.handler.dataimport.TestSqlEntityProcessor2$DateFormatValidatingEvaluator.evaluate(TestSqlEntityProcessor2.java:228)
    [junit] at org.apache.solr.handler.dataimport.EvaluatorBag$5.get(EvaluatorBag.java:218)
    [junit] at org.apache.solr.handler.dataimport.EvaluatorBag$5.get(EvaluatorBag.java:205)
    [junit] at org.apache.solr.handler.dataimport.VariableResolverImpl.resolve(VariableResolverImpl.java:116)
    [junit] at org.apache.solr.handler.dataimport.TemplateString.fillTokens(TemplateString.java:81)
    [junit] at org.apache.solr.handler.dataimport.TemplateString.replaceTokens(TemplateString.java:75)
    [junit] at org.apache.solr.handler.dataimport.VariableResolverImpl.replaceTokens(VariableResolverImpl.java:95)
    [junit] at org.apache.solr.handler.dataimport.ContextImpl.replaceTokens(ContextImpl.java:235)
    [junit] at org.apache.solr.handler.dataimport.SqlEntityProcessor.nextRow(SqlEntityProcessor.java:71)
    [junit] at org.apache.solr.handler.dataimport.EntityProcessorWrapper.nextRow(EntityProcessorWrapper.java:233)
    [junit] at org.apache.solr.handler.dataimport.DocBuilder.buildDocument(DocBuilder.java:579)
    [junit] at org.apache.solr.handler.dataimport.DocBuilder.doFullDump(DocBuilder.java:260)
    [junit] at org.apache.solr.handler.dataimport.DocBuilder.execute(DocBuilder.java:184)
    [junit] at org.apache.solr.handler.dataimport.DataImporter.doFullImport(DataImporter.java:334)
    [junit] at org.apache.solr.handler.dataimport.DataImporter.runCmd(DataImporter.java:392)
    [junit] at org.apache.solr.handler.dataimport.DataImportHandler.handleRequestBody(DataImportHandler.java:203)
    [junit] at org.apache.solr.handler.RequestHandlerBase.handleRequest(RequestHandlerBase.java:131)
    [junit] at org.apache.solr.core.SolrCore.execute(SolrCore.java:1325)
    [junit] at org.apache.solr.util.TestHarness.queryAndResponse(TestHarness.java:334)
    [junit] at org.apache.solr.util.TestHarness.query(TestHarness.java:321)
    [junit] at org.apache.solr.handler.dataimport.AbstractDataImportHandlerTestCase.runFullImport(AbstractDataImportHandlerTestCase.java:81)
    [junit] at org.apache.solr.handler.dataimport.TestSqlEntityProcessor2.testLastIndexTime(TestSqlEntityProcessor2.java:210)
    [junit] at sun.reflect.NativeMethodAccessorImpl.invoke0(Native Method)
    [junit] at sun.reflect.NativeMethodAccessorImpl.invoke(NativeMethodAccessorImpl.java:57)
    [junit] at sun.reflect.DelegatingMethodAccessorImpl.invoke(DelegatingMethodAccessorImpl.java:43)
    [junit] at java.lang.reflect.Method.invoke(Method.java:616)
    [junit] at org.junit.runners.model.FrameworkMethod$1.runReflectiveCall(FrameworkMethod.java:44)
    [junit] at org.junit.internal.runners.model.ReflectiveCallable.run(ReflectiveCallable.java:15)
    [junit] at org.junit.runners.model.FrameworkMethod.invokeExplosively(FrameworkMethod.java:41)
    [junit] at org.junit.internal.runners.statements.InvokeMethod.evaluate(InvokeMethod.java:20)
    [junit] at org.junit.rules.TestWatchman$1.evaluate(TestWatchman.java:48)
    [junit] at org.junit.internal.runners.statements.RunBefores.evaluate(RunBefores.java:28)
    [junit] at org.junit.internal.runners.statements.RunAfters.evaluate(RunAfters.java:31)
    [junit] at org.junit.runners.BlockJUnit4ClassRunner.runChild(BlockJUnit4ClassRunner.java:76)
    [junit] at org.apache.lucene.util.LuceneTestCase$LuceneTestCaseRunner.runChild(LuceneTestCase.java:795)
    [junit] at org.apache.lucene.util.LuceneTestCase$LuceneTestCaseRunner.runChild(LuceneTestCase.java:768)
    [junit] at org.junit.runners.ParentRunner$3.run(ParentRunner.java:193)
    [junit] at org.junit.runners.ParentRunner$1.schedule(ParentRunner.java:52)
    [junit] at org.junit.runners.ParentRunner.runChildren(ParentRunner.java:191)
    [junit] at org.junit.runners.ParentRunner.access$000(ParentRunner.java:42)
    [junit] at org.junit.runners.ParentRunner$2.evaluate(ParentRunner.java:184)
    [junit] at org.junit.internal.runners.statements.RunBefores.evaluate(RunBefores.java:28)
    [junit] at org.junit.internal.runners.statements.RunAfters.evaluate(RunAfters.java:31)
    [junit] at org.junit.runners.ParentRunner.run(ParentRunner.java:236)
    [junit] at junit.framework.JUnit4TestAdapter.run(JUnit4TestAdapter.java:39)
    [junit] at org.apache.tools.ant.taskdefs.optional.junit.JUnitTestRunner.run(JUnitTestRunner.java:421)
    [junit] at org.apache.tools.ant.taskdefs.optional.junit.JUnitTestRunner.launch(JUnitTestRunner.java:912)
    [junit] at org.apache.tools.ant.taskdefs.optional.junit.JUnitTestRunner.main(JUnitTestRunner.java:743)
    [junit] Caused by: java.text.ParseException: Unparseable date: "1970-01-01 08:45:00"
    [junit] at java.text.DateFormat.parse(DateFormat.java:354)
    [junit] at org.apache.solr.handler.dataimport.TestSqlEntityProcessor2$DateFormatValidatingEvaluator.evaluate(TestSqlEntityProcessor2.java:226)
    [junit] ... 47 more
    [junit] ------------- ---------------- ---------------
    [junit] TEST org.apache.solr.handler.dataimport.TestSqlEntityProcessor2 FAILED
    [junit] Testsuite: org.apache.solr.handler.dataimport.TestSqlEntityProcessorDelta
    [junit] Tests run: 8, Failures: 0, Errors: 0, Time elapsed: 1.092 sec
    [junit]
    [junit] Testsuite: org.apache.solr.handler.dataimport.TestSqlEntityProcessorDelta2
    [junit] Tests run: 8, Failures: 0, Errors: 0, Time elapsed: 0.998 sec
    [junit]
    [junit] Testsuite: org.apache.solr.handler.dataimport.TestTemplateString
    [junit] Tests run: 1, Failures: 0, Errors: 0, Time elapsed: 0.007 sec
    [junit]
    [junit] Testsuite: org.apache.solr.handler.dataimport.TestTemplateTransformer
    [junit] Tests run: 1, Failures: 0, Errors: 0, Time elapsed: 0.008 sec
    [junit]
    [junit] Testsuite: org.apache.solr.handler.dataimport.TestThreaded
    [junit] Tests run: 1, Failures: 0, Errors: 0, Time elapsed: 0.327 sec
    [junit]
    [junit] Testsuite: org.apache.solr.handler.dataimport.TestURLDataSource
    [junit] Tests run: 1, Failures: 0, Errors: 0, Time elapsed: 0.008 sec
    [junit]
    [junit] Testsuite: org.apache.solr.handler.dataimport.TestVariableResolver
    [junit] Tests run: 9, Failures: 0, Errors: 0, Time elapsed: 0.021 sec
    [junit]
    [junit] Testsuite: org.apache.solr.handler.dataimport.TestXPathEntityProcessor
    [junit] Tests run: 8, Failures: 0, Errors: 0, Time elapsed: 0.492 sec
    [junit]
    [junit] Testsuite: org.apache.solr.handler.dataimport.TestXPathRecordReader
    [junit] Tests run: 21, Failures: 0, Errors: 0, Time elapsed: 0.029 sec
    [junit]
    [junit] Tests FAILED

BUILD FAILED
/usr<https://hudson.apache.org/hudson/job/Lucene-Solr-tests-only-trunk/ws/checkout/build.xml>:23: The following error occurred while executing this line:
/usr<https://hudson.apache.org/hudson/job/Lucene-Solr-tests-only-trunk/ws/checkout/solr/common-build.xml>:462: The following error occurred while executing this line:
/usr<https://hudson.apache.org/hudson/job/Lucene-Solr-tests-only-trunk/ws/checkout/solr/common-build.xml>:319: The following error occurred while executing this line:
/usr<https://hudson.apache.org/hudson/job/Lucene-Solr-tests-only-trunk/ws/checkout/solr/contrib/dataimporthandler/build.xml>:192: Tests failed!

Total time: 7 minutes 19 seconds
Recording test results


---------------------------------------------------------------------
To unsubscribe, e-mail: [hidden email]
For additional commands, e-mail: [hidden email]

Reply | Threaded
Open this post in threaded view
|

Hudson build is back to normal : Lucene-Solr-tests-only-trunk #77

Apache Jenkins Server
See <https://hudson.apache.org/hudson/job/Lucene-Solr-tests-only-trunk/77/changes>



---------------------------------------------------------------------
To unsubscribe, e-mail: [hidden email]
For additional commands, e-mail: [hidden email]