Build failed in Hudson: Lucene-Solr-tests-only-trunk #79

classic Classic list List threaded Threaded
2 messages Options
Reply | Threaded
Open this post in threaded view
|

Build failed in Hudson: Lucene-Solr-tests-only-trunk #79

Apache Jenkins Server
See <https://hudson.apache.org/hudson/job/Lucene-Solr-tests-only-trunk/79/changes>

Changes:

[uschindler] LUCENE-2671: remove last to warnings by a hack

[yonik] tests: fix resource leaks + simplify

------------------------------------------
[...truncated 8305 lines...]
    [junit]
    [junit] Testsuite: org.apache.solr.update.DocumentBuilderTest
    [junit] Tests run: 3, Failures: 0, Errors: 0, Time elapsed: 0.595 sec
    [junit]
    [junit] Testsuite: org.apache.solr.util.DateMathParserTest
    [junit] Tests run: 7, Failures: 0, Errors: 0, Time elapsed: 0.062 sec
    [junit]
    [junit] Testsuite: org.apache.solr.handler.TestReplicationHandler
    [junit] Tests run: 7, Failures: 0, Errors: 0, Time elapsed: 26.658 sec
    [junit]
    [junit] ------------- Standard Error -----------------
    [junit] 14/10/2010 06:30:06 ? org.apache.solr.handler.SnapPuller fetchLatestIndex
    [junit] SEVERE: Master at: http://localhost:35613/solr/replication is not available. Index fetch failed. Exception: The host did not accept the connection within timeout of 5000 ms
    [junit] ------------- ---------------- ---------------
    [junit] Testsuite: org.apache.solr.TestDistributedSearch
    [junit] Tests run: 1, Failures: 0, Errors: 0, Time elapsed: 99.56 sec
    [junit]
    [junit] Testsuite: org.apache.solr.analysis.TestCzechStemFilterFactory
    [junit] Tests run: 1, Failures: 0, Errors: 0, Time elapsed: 0.023 sec
    [junit]
    [junit] Testsuite: org.apache.solr.analysis.TestDelimitedPayloadTokenFilterFactory
    [junit] Tests run: 2, Failures: 0, Errors: 0, Time elapsed: 0.02 sec
    [junit]
    [junit] Testsuite: org.apache.solr.analysis.TestEnglishMinimalStemFilterFactory
    [junit] Tests run: 1, Failures: 0, Errors: 0, Time elapsed: 0.012 sec
    [junit]
    [junit] Testsuite: org.apache.solr.analysis.TestHindiFilters
    [junit] Tests run: 4, Failures: 0, Errors: 0, Time elapsed: 0.032 sec
    [junit]
    [junit] Testsuite: org.apache.solr.analysis.TestPortugueseLightStemFilterFactory
    [junit] Tests run: 1, Failures: 0, Errors: 0, Time elapsed: 0.012 sec
    [junit]
    [junit] Testsuite: org.apache.solr.analysis.TestReverseStringFilterFactory
    [junit] Tests run: 1, Failures: 0, Errors: 0, Time elapsed: 0.013 sec
    [junit]
    [junit] Testsuite: org.apache.solr.analysis.TestRussianFilters
    [junit] Tests run: 3, Failures: 0, Errors: 0, Time elapsed: 0.02 sec
    [junit]
    [junit] Testsuite: org.apache.solr.analysis.TestWikipediaTokenizerFactory
    [junit] Tests run: 1, Failures: 0, Errors: 0, Time elapsed: 0.017 sec
    [junit]
    [junit] Testsuite: org.apache.solr.handler.component.DistributedSpellCheckComponentTest
    [junit] Tests run: 1, Failures: 0, Errors: 0, Time elapsed: 85.69 sec
    [junit]
    [junit] Testsuite: org.apache.solr.client.solrj.embedded.LargeVolumeEmbeddedTest
    [junit] Tests run: 1, Failures: 0, Errors: 0, Time elapsed: 1.056 sec
    [junit]
    [junit] Testsuite: org.apache.solr.client.solrj.request.TestUpdateRequestCodec
    [junit] Tests run: 2, Failures: 0, Errors: 0, Time elapsed: 0.015 sec
    [junit]
    [junit] Testsuite: org.apache.solr.client.solrj.response.QueryResponseTest
    [junit] Tests run: 1, Failures: 0, Errors: 0, Time elapsed: 0.041 sec
    [junit]
    [junit] Testsuite: org.apache.solr.handler.component.SpellCheckComponentTest
    [junit] Tests run: 10, Failures: 0, Errors: 0, Time elapsed: 1.314 sec
    [junit]
    [junit] Testsuite: org.apache.solr.schema.NotRequiredUniqueKeyTest
    [junit] Tests run: 1, Failures: 0, Errors: 0, Time elapsed: 0.229 sec
    [junit]
    [junit] Testsuite: org.apache.solr.search.TestLRUCache
    [junit] Tests run: 3, Failures: 0, Errors: 0, Time elapsed: 0.012 sec
    [junit]
    [junit] Testsuite: org.apache.solr.search.TestSort
    [junit] Tests run: 1, Failures: 0, Errors: 0, Time elapsed: 1.923 sec
    [junit]
    [junit] Testsuite: org.apache.solr.spelling.IndexBasedSpellCheckerTest
    [junit] Tests run: 5, Failures: 0, Errors: 0, Time elapsed: 0.623 sec
    [junit]
    [junit] Testsuite: org.apache.solr.handler.component.DistributedTermsComponentTest
    [junit] Tests run: 1, Failures: 0, Errors: 0, Time elapsed: 84.624 sec
    [junit]
    [junit] Testsuite: org.apache.solr.schema.DateFieldTest
    [junit] Tests run: 6, Failures: 0, Errors: 0, Time elapsed: 0.021 sec
    [junit]
    [junit] Testsuite: org.apache.solr.search.TestQueryUtils
    [junit] Tests run: 1, Failures: 0, Errors: 0, Time elapsed: 0.914 sec
    [junit]
    [junit] Testsuite: org.apache.solr.search.function.distance.DistanceFunctionTest
    [junit] Tests run: 3, Failures: 0, Errors: 0, Time elapsed: 0.802 sec
    [junit]
    [junit] Testsuite: org.apache.solr.spelling.SpellPossibilityIteratorTest
    [junit] Tests run: 1, Failures: 0, Errors: 0, Time elapsed: 0.01 sec
    [junit]
    [junit] Testsuite: org.apache.solr.update.AutoCommitTest
    [junit] Tests run: 1, Failures: 0, Errors: 0, Time elapsed: 4.269 sec
    [junit]
    [junit] Testsuite: org.apache.solr.util.TestNumberUtils
    [junit] Tests run: 1, Failures: 0, Errors: 0, Time elapsed: 0.335 sec
    [junit]
    [junit] Testsuite: org.apache.solr.update.DirectUpdateHandlerTest
    [junit] Tests run: 7, Failures: 0, Errors: 0, Time elapsed: 2.011 sec
    [junit]
    [junit] Testsuite: org.apache.solr.util.SolrPluginUtilsTest
    [junit] Tests run: 7, Failures: 0, Errors: 0, Time elapsed: 0.508 sec
    [junit]
    [junit] Testsuite: org.apache.solr.velocity.VelocityResponseWriterTest
    [junit] Tests run: 1, Failures: 0, Errors: 0, Time elapsed: 0.591 sec
    [junit]
    [junit] Testsuite: org.apache.solr.cloud.BasicZkTest
    [junit] Tests run: 1, Failures: 0, Errors: 0, Time elapsed: 11.749 sec
    [junit]
    [junit] Testsuite: org.apache.solr.common.util.TestFastInputStream
    [junit] Tests run: 1, Failures: 0, Errors: 0, Time elapsed: 0.013 sec
    [junit]
    [junit] Testsuite: org.apache.solr.common.util.TestJavaBinCodec
    [junit] Tests run: 1, Failures: 0, Errors: 0, Time elapsed: 0.33 sec
    [junit]
    [junit] Testsuite: org.apache.solr.core.TestQuerySenderListener
    [junit] Tests run: 2, Failures: 0, Errors: 0, Time elapsed: 0.622 sec
    [junit]
    [junit] Testsuite: org.apache.solr.core.TestSolrDeletionPolicy2
    [junit] Tests run: 1, Failures: 0, Errors: 0, Time elapsed: 0.563 sec
    [junit]
    [junit] Testsuite: org.apache.solr.handler.DocumentAnalysisRequestHandlerTest
    [junit] Tests run: 2, Failures: 0, Errors: 0, Time elapsed: 0.594 sec
    [junit]
    [junit] Testsuite: org.apache.solr.handler.MoreLikeThisHandlerTest
    [junit] Tests run: 1, Failures: 0, Errors: 0, Time elapsed: 0.541 sec
    [junit]
    [junit] Testsuite: org.apache.solr.handler.component.QueryElevationComponentTest
    [junit] Tests run: 3, Failures: 0, Errors: 0, Time elapsed: 0.557 sec
    [junit]
    [junit] Testsuite: org.apache.solr.request.TestWriterPerf
    [junit] Tests run: 1, Failures: 0, Errors: 0, Time elapsed: 0.578 sec
    [junit]
    [junit] ------------- Standard Error -----------------
    [junit] 14/10/2010 06:31:12 PM org.apache.solr.common.util.ConcurrentLRUCache finalize
    [junit] GRAVE: ConcurrentLRUCache was not destroyed prior to finalize(), indicates a bug -- POSSIBLE RESOURCE LEAK!!!
    [junit] 14/10/2010 06:31:12 PM org.apache.solr.common.util.ConcurrentLRUCache finalize
    [junit] GRAVE: ConcurrentLRUCache was not destroyed prior to finalize(), indicates a bug -- POSSIBLE RESOURCE LEAK!!!
    [junit] 14/10/2010 06:31:12 PM org.apache.solr.common.util.ConcurrentLRUCache finalize
    [junit] GRAVE: ConcurrentLRUCache was not destroyed prior to finalize(), indicates a bug -- POSSIBLE RESOURCE LEAK!!!
    [junit] 14/10/2010 06:31:12 PM org.apache.solr.common.util.ConcurrentLRUCache finalize
    [junit] GRAVE: ConcurrentLRUCache was not destroyed prior to finalize(), indicates a bug -- POSSIBLE RESOURCE LEAK!!!
    [junit] 14/10/2010 06:31:12 PM org.apache.solr.common.util.ConcurrentLRUCache finalize
    [junit] GRAVE: ConcurrentLRUCache was not destroyed prior to finalize(), indicates a bug -- POSSIBLE RESOURCE LEAK!!!
    [junit] 14/10/2010 06:31:12 PM org.apache.solr.common.util.ConcurrentLRUCache finalize
    [junit] GRAVE: ConcurrentLRUCache was not destroyed prior to finalize(), indicates a bug -- POSSIBLE RESOURCE LEAK!!!
    [junit] 14/10/2010 06:31:12 PM org.apache.solr.common.util.ConcurrentLRUCache finalize
    [junit] GRAVE: ConcurrentLRUCache was not destroyed prior to finalize(), indicates a bug -- POSSIBLE RESOURCE LEAK!!!
    [junit] 14/10/2010 06:31:12 PM org.apache.solr.core.SolrCore finalize
    [junit] GRAVE: REFCOUNT ERROR: unreferenced org.apache.solr.core.SolrCore@fc4048c () has a reference count of 1
    [junit] 14/10/2010 06:31:12 PM org.apache.solr.core.CoreContainer finalize
    [junit] GRAVE: CoreContainer was not shutdown prior to finalize(), indicates a bug -- POSSIBLE RESOURCE LEAK!!!  instance=235309930
    [junit] ------------- ---------------- ---------------
    [junit] Testsuite: org.apache.solr.schema.IndexSchemaTest
    [junit] Tests run: 5, Failures: 0, Errors: 0, Time elapsed: 0.508 sec
    [junit]
    [junit] Testsuite: org.apache.solr.schema.PolyFieldTest
    [junit] Tests run: 4, Failures: 0, Errors: 0, Time elapsed: 0.775 sec
    [junit]
    [junit] Tests FAILED
    [junit] Testsuite: org.apache.solr.search.TestRangeQuery
    [junit] Tests run: 2, Failures: 0, Errors: 0, Time elapsed: 9.82 sec
    [junit]
    [junit] Testsuite: org.apache.solr.search.function.SortByFunctionTest
    [junit] Tests run: 2, Failures: 0, Errors: 0, Time elapsed: 1.175 sec
    [junit]
    [junit] Testsuite: org.apache.solr.servlet.SolrRequestParserTest
    [junit] Tests run: 4, Failures: 0, Errors: 0, Time elapsed: 0.875 sec
    [junit]
    [junit] Testsuite: org.apache.solr.spelling.SpellingQueryConverterTest
    [junit] Tests run: 4, Failures: 0, Errors: 0, Time elapsed: 0.015 sec
    [junit]
    [junit] Testsuite: org.apache.solr.update.processor.UpdateRequestProcessorFactoryTest
    [junit] Tests run: 1, Failures: 0, Errors: 0, Time elapsed: 0.64 sec
    [junit]
    [junit] Testsuite: org.apache.solr.handler.component.DistributedSpellCollatorTest
    [junit] Tests run: 1, Failures: 0, Errors: 0, Time elapsed: 83.268 sec
    [junit]
    [junit] ------------- Standard Error -----------------
    [junit] 2010.10.14 11:30:10 org.apache.solr.handler.SnapPuller fetchLatestIndex
    [junit] SEVERE: Master at: http://localhost:35623/solr/replication is not available. Index fetch failed. Exception: The host did not accept the connection within timeout of 5000 ms
    [junit] 2010.10.14 11:30:11 org.apache.solr.handler.SnapPuller fetchLatestIndex
    [junit] SEVERE: Master at: http://localhost:35613/solr/replication is not available. Index fetch failed. Exception: The host did not accept the connection within timeout of 5000 ms
    [junit] 2010.10.14 11:30:16 org.apache.solr.handler.SnapPuller fetchLatestIndex
    [junit] SEVERE: Master at: http://localhost:35613/solr/replication is not available. Index fetch failed. Exception: The host did not accept the connection within timeout of 5000 ms
    [junit] 2010.10.14 11:30:21 org.apache.solr.handler.SnapPuller fetchLatestIndex
    [junit] SEVERE: Master at: http://localhost:35613/solr/replication is not available. Index fetch failed. Exception: The host did not accept the connection within timeout of 5000 ms
    [junit] 2010.10.14 11:30:26 org.apache.solr.handler.SnapPuller fetchLatestIndex
    [junit] SEVERE: Master at: http://localhost:35613/solr/replication is not available. Index fetch failed. Exception: The host did not accept the connection within timeout of 5000 ms
    [junit] 2010.10.14 11:30:31 org.apache.solr.handler.SnapPuller fetchLatestIndex
    [junit] SEVERE: Master at: http://localhost:35613/solr/replication is not available. Index fetch failed. Exception: The host did not accept the connection within timeout of 5000 ms
    [junit] 2010.10.14 11:30:36 org.apache.solr.handler.SnapPuller fetchLatestIndex
    [junit] SEVERE: Master at: http://localhost:35613/solr/replication is not available. Index fetch failed. Exception: The host did not accept the connection within timeout of 5000 ms
    [junit] 2010.10.14 11:30:41 org.apache.solr.handler.SnapPuller fetchLatestIndex
    [junit] SEVERE: Master at: http://localhost:35613/solr/replication is not available. Index fetch failed. Exception: The host did not accept the connection within timeout of 5000 ms
    [junit] 2010.10.14 11:30:46 org.apache.solr.handler.SnapPuller fetchLatestIndex
    [junit] SEVERE: Master at: http://localhost:35613/solr/replication is not available. Index fetch failed. Exception: The host did not accept the connection within timeout of 5000 ms
    [junit] 2010.10.14 11:30:51 org.apache.solr.handler.SnapPuller fetchLatestIndex
    [junit] SEVERE: Master at: http://localhost:35613/solr/replication is not available. Index fetch failed. Exception: The host did not accept the connection within timeout of 5000 ms
    [junit] 2010.10.14 11:30:56 org.apache.solr.handler.SnapPuller fetchLatestIndex
    [junit] SEVERE: Master at: http://localhost:35613/solr/replication is not available. Index fetch failed. Exception: The host did not accept the connection within timeout of 5000 ms
    [junit] 2010.10.14 11:31:01 org.apache.solr.handler.SnapPuller fetchLatestIndex
    [junit] SEVERE: Master at: http://localhost:35613/solr/replication is not available. Index fetch failed. Exception: The host did not accept the connection within timeout of 5000 ms
    [junit] 2010.10.14 11:31:06 org.apache.solr.handler.SnapPuller fetchLatestIndex
    [junit] SEVERE: Master at: http://localhost:35613/solr/replication is not available. Index fetch failed. Exception: The host did not accept the connection within timeout of 5000 ms
    [junit] 2010.10.14 11:31:11 org.apache.solr.handler.SnapPuller fetchLatestIndex
    [junit] SEVERE: Master at: http://localhost:35613/solr/replication is not available. Index fetch failed. Exception: The host did not accept the connection within timeout of 5000 ms
    [junit] 2010.10.14 11:31:16 org.apache.solr.handler.SnapPuller fetchLatestIndex
    [junit] SEVERE: Master at: http://localhost:35613/solr/replication is not available. Index fetch failed. Exception: The host did not accept the connection within timeout of 5000 ms
    [junit] 2010.10.14 11:31:21 org.apache.solr.handler.SnapPuller fetchLatestIndex
    [junit] SEVERE: Master at: http://localhost:35613/solr/replication is not available. Index fetch failed. Exception: The host did not accept the connection within timeout of 5000 ms
    [junit] 2010.10.14 11:31:26 org.apache.solr.handler.SnapPuller fetchLatestIndex
    [junit] SEVERE: Master at: http://localhost:35613/solr/replication is not available. Index fetch failed. Exception: The host did not accept the connection within timeout of 5000 ms
    [junit] ------------- ---------------- ---------------
    [junit] Testsuite: org.apache.solr.request.TestBinaryResponseWriter
    [junit] Tests run: 1, Failures: 0, Errors: 0, Time elapsed: 0.666 sec
    [junit]
    [junit] Testsuite: org.apache.solr.schema.CopyFieldTest
    [junit] Tests run: 6, Failures: 0, Errors: 0, Time elapsed: 0.394 sec
    [junit]
    [junit] Testsuite: org.apache.solr.schema.NumericFieldsTest
    [junit] Tests run: 1, Failures: 0, Errors: 0, Time elapsed: 0.348 sec
    [junit]
    [junit] Testsuite: org.apache.solr.search.SpatialFilterTest
    [junit] Tests run: 3, Failures: 0, Errors: 0, Time elapsed: 0.826 sec
    [junit]
    [junit] ------------- Standard Error -----------------
    [junit] 14.10.2010 16:31:31 org.apache.solr.handler.SnapPuller fetchLatestIndex
    [junit] SEVERE: Master at: http://localhost:35613/solr/replication is not available. Index fetch failed. Exception: The host did not accept the connection within timeout of 5000 ms
    [junit] ------------- ---------------- ---------------
    [junit] Testsuite: org.apache.solr.search.TestExtendedDismaxParser
    [junit] Tests run: 1, Failures: 0, Errors: 0, Time elapsed: 0.569 sec
    [junit]
    [junit] Testsuite: org.apache.solr.servlet.DirectSolrConnectionTest
    [junit] Tests run: 2, Failures: 0, Errors: 0, Time elapsed: 0.231 sec
    [junit]
    [junit] Testsuite: org.apache.solr.spelling.DirectSolrSpellCheckerTest
    [junit] Tests run: 1, Failures: 0, Errors: 0, Time elapsed: 0.505 sec
    [junit]
    [junit] Testsuite: org.apache.solr.update.processor.SignatureUpdateProcessorFactoryTest
    [junit] Tests run: 4, Failures: 0, Errors: 0, Time elapsed: 1.563 sec
    [junit]

BUILD FAILED
/usr<https://hudson.apache.org/hudson/job/Lucene-Solr-tests-only-trunk/ws/checkout/build.xml>:23: The following error occurred while executing this line:
/usr<https://hudson.apache.org/hudson/job/Lucene-Solr-tests-only-trunk/ws/checkout/solr/build.xml>:386:
The following error occurred while executing this line:
/usr<https://hudson.apache.org/hudson/job/Lucene-Solr-tests-only-trunk/ws/checkout/solr/build.xml>:482: Tests failed!
The following error occurred while executing this line:
/usr<https://hudson.apache.org/hudson/job/Lucene-Solr-tests-only-trunk/ws/checkout/solr/build.xml>:482: Tests failed!
The following error occurred while executing this line:
/usr<https://hudson.apache.org/hudson/job/Lucene-Solr-tests-only-trunk/ws/checkout/solr/build.xml>:482: Tests failed!
The following error occurred while executing this line:
/usr<https://hudson.apache.org/hudson/job/Lucene-Solr-tests-only-trunk/ws/checkout/solr/build.xml>:482: Tests failed!

Total time: 7 minutes 15 seconds
Recording test results


---------------------------------------------------------------------
To unsubscribe, e-mail: [hidden email]
For additional commands, e-mail: [hidden email]

Reply | Threaded
Open this post in threaded view
|

Hudson build is back to normal : Lucene-Solr-tests-only-trunk #80

Apache Jenkins Server
See <https://hudson.apache.org/hudson/job/Lucene-Solr-tests-only-trunk/80/changes>



---------------------------------------------------------------------
To unsubscribe, e-mail: [hidden email]
For additional commands, e-mail: [hidden email]